<?xml version="1.0" encoding="UTF-8" standalone="no"?>
<!-- Created with Inkscape (http://www.inkscape.org/) -->

<svg
   xmlns:dc="http://purl.org/dc/elements/1.1/"
   xmlns:cc="http://creativecommons.org/ns#"
   xmlns:rdf="http://www.w3.org/1999/02/22-rdf-syntax-ns#"
   xmlns:svg="http://www.w3.org/2000/svg"
   xmlns="http://www.w3.org/2000/svg"
   xmlns:sodipodi="http://sodipodi.sourceforge.net/DTD/sodipodi-0.dtd"
   xmlns:inkscape="http://www.inkscape.org/namespaces/inkscape"
   width="1024"
   height="500"
   viewBox="0 0 270.93333 132.29167"
   version="1.1"
   id="svg827"
   sodipodi:docname="simple_cast_1024x500.svg"
   inkscape:version="0.92.3 (2405546, 2018-03-11)"
   inkscape:export-filename="/home/jerome/Téléchargements/simple_cast_1024x500.svg.png"
   inkscape:export-xdpi="96"
   inkscape:export-ydpi="96">
  <defs
     id="defs821" />
  <sodipodi:namedview
     id="base"
     pagecolor="#ffffff"
     bordercolor="#666666"
     borderopacity="1.0"
     inkscape:pageopacity="0.0"
     inkscape:pageshadow="2"
     inkscape:zoom="1.2"
     inkscape:cx="298.87759"
     inkscape:cy="197.06678"
     inkscape:document-units="mm"
     inkscape:current-layer="layer5"
     showgrid="false"
     units="px"
     inkscape:pagecheckerboard="false"
     inkscape:window-width="1920"
     inkscape:window-height="1043"
     inkscape:window-x="0"
     inkscape:window-y="0"
     inkscape:window-maximized="1"
     inkscape:snap-text-baseline="false" />
  <metadata
     id="metadata824">
    <rdf:RDF>
      <cc:Work
         rdf:about="">
        <dc:format>image/svg+xml</dc:format>
        <dc:type
           rdf:resource="http://purl.org/dc/dcmitype/StillImage" />
        <dc:title />
        <dc:creator>
          <cc:Agent>
            <dc:title>Jérôme Hencky</dc:title>
          </cc:Agent>
        </dc:creator>
      </cc:Work>
    </rdf:RDF>
  </metadata>
  <g
     inkscape:groupmode="layer"
     id="layer3"
     inkscape:label="Circle Shadow"
     transform="translate(0,119.59167)" />
  <g
     inkscape:label="Circle"
     inkscape:groupmode="layer"
     id="layer1"
     transform="translate(0,-164.70831)" />
  <g
     inkscape:groupmode="layer"
     id="layer4"
     inkscape:label="Icon Shadow"
     transform="translate(0,119.59167)" />
  <g
     inkscape:groupmode="layer"
     id="layer2"
     inkscape:label="Icon"
     transform="translate(0,119.59167)">
    <g
       id="g3743"
       transform="translate(0,0.15436399)">
      <circle
         r="39.092976"
         cy="-53.600201"
         cx="46.191845"
         id="path1372-3"
         style="opacity:1;fill:#b2b2b2;fill-opacity:1;stroke-width:1.66163671" />
      <ellipse
         ry="38.40057"
         rx="39.092976"
         cy="230.00781"
         cx="46.191845"
         id="path1372"
         style="opacity:1;fill:#26c6da;fill-opacity:1;stroke-width:1.64685559"
         transform="translate(0,-284.29998)" />
      <path
         inkscape:connector-curvature="0"
         id="path2218"
         d="m 27.688119,-68.485556 -1.304981,2.263946 0.08897,28.722791 21.423459,21.548695 a 39.092974,38.400571 0 0 0 36.921775,-32.743202 l -19.762571,-19.79223 z"
         style="opacity:0.1;fill:#000000;fill-opacity:1;fill-rule:evenodd;stroke:none;stroke-width:0.06351065;stroke-linecap:butt;stroke-linejoin:miter;stroke-miterlimit:4;stroke-dasharray:none;stroke-opacity:1" />
      <path
         id="path6"
         d="M 62.326168,-69.734517 H 30.05752 c -1.971974,0 -3.585406,1.613433 -3.585406,3.585406 v 5.378108 h 3.585406 v -5.378108 H 62.326168 V -41.05127 H 49.77725 v 3.585406 h 12.548918 c 1.971981,0 3.585408,-1.613433 3.585408,-3.585406 v -25.097841 c 0,-1.971973 -1.613427,-3.585406 -3.585408,-3.585406 z m -35.854054,26.890544 v 5.378109 h 5.378109 c 0,-2.975888 -2.402223,-5.378109 -5.378109,-5.378109 z m 0,-7.170812 v 3.585406 c 4.947859,0 8.963514,4.015654 8.963514,8.963515 h 3.585406 c 0,-6.93776 -5.61116,-12.548921 -12.54892,-12.548921 z m 0,-7.170811 v 3.585405 c 8.909733,0 16.134325,7.224593 16.134325,16.134327 h 3.585406 c 0,-10.899635 -8.838026,-19.719732 -19.719731,-19.719732 z"
         inkscape:connector-curvature="0"
         style="fill:#37474f;fill-opacity:1;stroke-width:1.79270267" />
    </g>
  </g>
  <g
     inkscape:groupmode="layer"
     id="layer5"
     inkscape:label="Title 1">
    <flowRoot
       xml:space="preserve"
       id="flowRoot3745"
       style="font-style:normal;font-weight:normal;font-size:40px;line-height:1.25;font-family:sans-serif;letter-spacing:0px;word-spacing:0px;opacity:0.98999999;fill:#000000;fill-opacity:1;stroke:none"
       transform="matrix(0.26458333,0,0,0.26458333,-14.81667,19.37091)"><flowRegion
         id="flowRegion3747"><rect
           id="rect3749"
           width="650.83331"
           height="117.49999"
           x="400"
           y="118.33334" /></flowRegion><flowPara
         id="flowPara3751"
         style="font-style:normal;font-variant:normal;font-weight:bold;font-stretch:normal;font-size:96px;font-family:serif;-inkscape-font-specification:'serif Bold';text-align:center;text-anchor:middle;fill:#37474f;fill-opacity:1">Simple Cast</flowPara></flowRoot>  </g>
</svg>
