<?xml version="1.0" encoding="UTF-8" standalone="no"?>
<!-- Created with Inkscape (http://www.inkscape.org/) -->

<svg
   xmlns:dc="http://purl.org/dc/elements/1.1/"
   xmlns:cc="http://creativecommons.org/ns#"
   xmlns:rdf="http://www.w3.org/1999/02/22-rdf-syntax-ns#"
   xmlns:svg="http://www.w3.org/2000/svg"
   xmlns="http://www.w3.org/2000/svg"
   xmlns:sodipodi="http://sodipodi.sourceforge.net/DTD/sodipodi-0.dtd"
   xmlns:inkscape="http://www.inkscape.org/namespaces/inkscape"
   width="48"
   height="48"
   viewBox="0 0 12.7 12.7"
   version="1.1"
   id="svg827"
   sodipodi:docname="ic_cast2.svg"
   inkscape:version="0.92.3 (2405546, 2018-03-11)">
  <defs
     id="defs821" />
  <sodipodi:namedview
     id="base"
     pagecolor="#ffffff"
     bordercolor="#666666"
     borderopacity="1.0"
     inkscape:pageopacity="0.0"
     inkscape:pageshadow="2"
     inkscape:zoom="16"
     inkscape:cx="15.24595"
     inkscape:cy="21.241944"
     inkscape:document-units="mm"
     inkscape:current-layer="layer2"
     showgrid="false"
     units="px"
     inkscape:pagecheckerboard="false"
     inkscape:window-width="1920"
     inkscape:window-height="1043"
     inkscape:window-x="0"
     inkscape:window-y="0"
     inkscape:window-maximized="1" />
  <metadata
     id="metadata824">
    <rdf:RDF>
      <cc:Work
         rdf:about="">
        <dc:format>image/svg+xml</dc:format>
        <dc:type
           rdf:resource="http://purl.org/dc/dcmitype/StillImage" />
        <dc:title></dc:title>
        <dc:creator>
          <cc:Agent>
            <dc:title>Jérôme Hencky</dc:title>
          </cc:Agent>
        </dc:creator>
      </cc:Work>
    </rdf:RDF>
  </metadata>
  <g
     inkscape:groupmode="layer"
     id="layer3"
     inkscape:label="Circle Shadow" />
  <g
     inkscape:label="Circle"
     inkscape:groupmode="layer"
     id="layer1"
     transform="translate(0,-284.29998)" />
  <g
     inkscape:groupmode="layer"
     id="layer4"
     inkscape:label="Icon Shadow" />
  <g
     inkscape:groupmode="layer"
     id="layer2"
     inkscape:label="Icon">
    <circle
       style="opacity:1;fill:#b2b2b2;fill-opacity:1;stroke-width:0.13184136"
       id="path1372-3"
       cx="6.3499999"
       cy="6.3500032"
       r="3.1018038" />
    <ellipse
       style="opacity:1;fill:#26c6da;fill-opacity:1;stroke-width:0.13066857"
       id="path1372"
       cx="6.3499999"
       cy="6.2950592"
       rx="3.1018038"
       ry="3.0468659" />
    <path
       style="opacity:0.1;fill:#000000;fill-opacity:1;fill-rule:evenodd;stroke:none;stroke-width:0.00503921;stroke-linecap:butt;stroke-linejoin:miter;stroke-miterlimit:4;stroke-dasharray:none;stroke-opacity:1"
       d="m 4.8818355,5.1689345 -0.1035429,0.1796312 0.00706,2.2789892 1.6998289,1.7097647 A 3.1018039,3.0468656 0 0 0 9.4147124,6.7393348 L 7.8466654,5.1689345 Z"
       id="path2218"
       inkscape:connector-curvature="0" />
    <path
       style="fill:#37474f;fill-opacity:1;stroke-width:0.1422407"
       inkscape:connector-curvature="0"
       d="M 7.6301665,5.0698367 H 5.0698337 c -0.1564648,0 -0.2844813,0.1280166 -0.2844813,0.2844814 V 5.7810402 H 5.0698337 V 5.3543181 H 7.6301665 V 7.3456882 H 6.6344816 v 0.2844814 h 0.9956849 c 0.1564654,0 0.2844816,-0.1280166 0.2844816,-0.2844814 V 5.3543181 c 0,-0.1564648 -0.1280162,-0.2844814 -0.2844816,-0.2844814 z M 4.7853524,7.2034474 v 0.4267222 h 0.4267221 c 0,-0.2361196 -0.1906026,-0.4267222 -0.4267221,-0.4267222 z m 0,-0.5689628 v 0.2844815 c 0.3925843,0 0.7112035,0.3186192 0.7112035,0.7112035 h 0.2844815 c 0,-0.5504715 -0.4452135,-0.995685 -0.995685,-0.995685 z m 0,-0.5689629 v 0.2844815 c 0.7069363,0 1.2801664,0.57323 1.2801664,1.2801664 h 0.2844814 c 0,-0.8648236 -0.7012468,-1.5646479 -1.5646478,-1.5646479 z"
       id="path6" />
  </g>
</svg>
