2020-11-15 10:56:06,813 p=19662 u=rikmeg n=ansible | [WARNING]: provided hosts list is empty, only localhost is available. Note that the implicit localhost does not match 'all'

2020-11-15 10:56:07,201 p=19662 u=rikmeg n=ansible | PLAY [Playbook to run roles outside of the Operator Container] **************************************************************************************************************
2020-11-15 10:56:07,217 p=19662 u=rikmeg n=ansible | TASK [Gathering Facts] ******************************************************************************************************************************************************
2020-11-15 10:56:16,632 p=19662 u=rikmeg n=ansible | ok: [localhost]
2020-11-15 10:56:16,687 p=19662 u=rikmeg n=ansible | TASK [webinarapp : create Role] *********************************************************************************************************************************************
2020-11-15 10:56:16,710 p=19662 u=rikmeg n=ansible | ok: [localhost] => {
    "msg": "This is where the Role resource for the application gets created"
}
2020-11-15 10:56:16,764 p=19662 u=rikmeg n=ansible | TASK [webinarapp : create Role Binding] *************************************************************************************************************************************
2020-11-15 10:56:16,786 p=19662 u=rikmeg n=ansible | ok: [localhost] => {
    "msg": "This is where the Role Binding resource for the application gets created"
}
2020-11-15 10:56:16,838 p=19662 u=rikmeg n=ansible | TASK [webinarapp : create Service Account and bind to Role] *****************************************************************************************************************
2020-11-15 10:56:16,855 p=19662 u=rikmeg n=ansible | ok: [localhost] => {
    "msg": "This is where the Service Account resource for the application gets created and bound to the Role"
}
2020-11-15 10:56:16,908 p=19662 u=rikmeg n=ansible | TASK [webinarapp : create Secret for flask app with credentials for backend database] ***************************************************************************************
2020-11-15 10:56:16,925 p=19662 u=rikmeg n=ansible | ok: [localhost] => {
    "msg": "This is where the Secret resource for the application gets created"
}
2020-11-15 10:56:16,979 p=19662 u=rikmeg n=ansible | TASK [webinarapp : create Deployment for flask app] *************************************************************************************************************************
2020-11-15 10:56:16,998 p=19662 u=rikmeg n=ansible | ok: [localhost] => {
    "msg": "This is where the Role resource for the application gets created"
}
2020-11-15 10:56:17,050 p=19662 u=rikmeg n=ansible | TASK [webinarapp : create Service for flask app] ****************************************************************************************************************************
2020-11-15 10:56:17,068 p=19662 u=rikmeg n=ansible | ok: [localhost] => {
    "msg": "This is where the Role resource for the application gets created"
}
2020-11-15 10:56:17,119 p=19662 u=rikmeg n=ansible | TASK [webinarapp : create Route for flask app] ******************************************************************************************************************************
2020-11-15 10:56:17,136 p=19662 u=rikmeg n=ansible | ok: [localhost] => {
    "msg": "This is where the Role resource for the application gets created"
}
2020-11-15 10:56:17,190 p=19662 u=rikmeg n=ansible | TASK [webinarapp : create PersistentVolumeClaim for backend MariaDB if cluster would have PersistentVolumes] ****************************************************************
2020-11-15 10:56:17,212 p=19662 u=rikmeg n=ansible | ok: [localhost] => {
    "msg": "This is where the Role resource for the application gets created"
}
2020-11-15 10:56:17,264 p=19662 u=rikmeg n=ansible | TASK [webinarapp : create Deployment for backend MariaDB] *******************************************************************************************************************
2020-11-15 10:56:17,286 p=19662 u=rikmeg n=ansible | ok: [localhost] => {
    "msg": "This is where the Role resource for the application gets created"
}
2020-11-15 10:56:17,337 p=19662 u=rikmeg n=ansible | TASK [webinarapp : create Service for backend MariaDB] **********************************************************************************************************************
2020-11-15 10:56:17,353 p=19662 u=rikmeg n=ansible | ok: [localhost] => {
    "msg": "This is where the Role resource for the application gets created"
}
2020-11-15 10:56:17,355 p=19662 u=rikmeg n=ansible | PLAY RECAP ******************************************************************************************************************************************************************
2020-11-15 10:56:17,356 p=19662 u=rikmeg n=ansible | localhost                  : ok=11   changed=0    unreachable=0    failed=0    skipped=0    rescued=0    ignored=0   
2020-11-15 11:00:44,049 p=21046 u=rikmeg n=ansible | [WARNING]: provided hosts list is empty, only localhost is available. Note that the implicit localhost does not match 'all'

2020-11-15 11:00:44,324 p=21046 u=rikmeg n=ansible | PLAY [Playbook to run roles outside of the Operator Container] **************************************************************************************************************
2020-11-15 11:00:44,336 p=21046 u=rikmeg n=ansible | TASK [Gathering Facts] ******************************************************************************************************************************************************
2020-11-15 11:00:50,728 p=21046 u=rikmeg n=ansible | ok: [localhost]
2020-11-15 11:00:50,790 p=21046 u=rikmeg n=ansible | TASK [webinarapp : create Role] *********************************************************************************************************************************************
2020-11-15 11:00:50,807 p=21046 u=rikmeg n=ansible | ok: [localhost] => {
    "msg": "This is where the Role resource for the application gets created"
}
2020-11-15 11:00:50,859 p=21046 u=rikmeg n=ansible | TASK [webinarapp : create Role Binding] *************************************************************************************************************************************
2020-11-15 11:00:50,880 p=21046 u=rikmeg n=ansible | ok: [localhost] => {
    "msg": "This is where the Role Binding resource for the application gets created"
}
2020-11-15 11:00:50,933 p=21046 u=rikmeg n=ansible | TASK [webinarapp : create Service Account and bind to Role] *****************************************************************************************************************
2020-11-15 11:00:50,955 p=21046 u=rikmeg n=ansible | ok: [localhost] => {
    "msg": "This is where the Service Account resource for the application gets created and bound to the Role"
}
2020-11-15 11:00:51,051 p=21046 u=rikmeg n=ansible | TASK [webinarapp : create Secret for flask app with credentials for backend database] ***************************************************************************************
2020-11-15 11:00:51,069 p=21046 u=rikmeg n=ansible | ok: [localhost] => {
    "msg": "This is where the Secret resource for the application gets created"
}
2020-11-15 11:00:51,140 p=21046 u=rikmeg n=ansible | TASK [webinarapp : create Deployment for flask app] *************************************************************************************************************************
2020-11-15 11:00:51,164 p=21046 u=rikmeg n=ansible | ok: [localhost] => {
    "msg": "This is where the Role resource for the application gets created"
}
2020-11-15 11:00:51,215 p=21046 u=rikmeg n=ansible | TASK [webinarapp : create Service for flask app] ****************************************************************************************************************************
2020-11-15 11:00:51,232 p=21046 u=rikmeg n=ansible | ok: [localhost] => {
    "msg": "This is where the Role resource for the application gets created"
}
2020-11-15 11:00:51,285 p=21046 u=rikmeg n=ansible | TASK [webinarapp : create Route for flask app] ******************************************************************************************************************************
2020-11-15 11:00:51,309 p=21046 u=rikmeg n=ansible | ok: [localhost] => {
    "msg": "This is where the Role resource for the application gets created"
}
2020-11-15 11:00:51,378 p=21046 u=rikmeg n=ansible | TASK [webinarapp : create PersistentVolumeClaim for backend MariaDB if cluster would have PersistentVolumes] ****************************************************************
2020-11-15 11:00:51,399 p=21046 u=rikmeg n=ansible | ok: [localhost] => {
    "msg": "This is where the Role resource for the application gets created"
}
2020-11-15 11:00:51,466 p=21046 u=rikmeg n=ansible | TASK [webinarapp : create Deployment for backend MariaDB] *******************************************************************************************************************
2020-11-15 11:00:51,489 p=21046 u=rikmeg n=ansible | ok: [localhost] => {
    "msg": "This is where the Role resource for the application gets created"
}
2020-11-15 11:00:51,561 p=21046 u=rikmeg n=ansible | TASK [webinarapp : create Service for backend MariaDB] **********************************************************************************************************************
2020-11-15 11:00:51,585 p=21046 u=rikmeg n=ansible | ok: [localhost] => {
    "msg": "This is where the Role resource for the application gets created"
}
2020-11-15 11:00:51,587 p=21046 u=rikmeg n=ansible | PLAY RECAP ******************************************************************************************************************************************************************
2020-11-15 11:00:51,588 p=21046 u=rikmeg n=ansible | localhost                  : ok=11   changed=0    unreachable=0    failed=0    skipped=0    rescued=0    ignored=0   
2020-11-15 11:00:51,588 p=21046 u=rikmeg n=ansible | Playbook run took 0 days, 0 hours, 0 minutes, 7 seconds
2020-11-15 11:01:55,972 p=21862 u=rikmeg n=ansible | [WARNING]: provided hosts list is empty, only localhost is available. Note that the implicit localhost does not match 'all'

2020-11-15 11:01:56,249 p=21862 u=rikmeg n=ansible | PLAY [Playbook to run roles outside of the Operator Container] **************************************************************************************************************
2020-11-15 11:01:56,261 p=21862 u=rikmeg n=ansible | TASK [Gathering Facts] ******************************************************************************************************************************************************
2020-11-15 11:01:56,261 p=21862 u=rikmeg n=ansible | Sunday 15 November 2020  11:01:56 +0100 (0:00:00.033)       0:00:00.033 ******* 
2020-11-15 11:01:56,261 p=21862 u=rikmeg n=ansible | Sunday 15 November 2020  11:01:56 +0100 (0:00:00.033)       0:00:00.033 ******* 
2020-11-15 11:02:01,019 p=21862 u=rikmeg n=ansible | ok: [localhost]
2020-11-15 11:02:01,103 p=21862 u=rikmeg n=ansible | TASK [webinarapp : create Role] *********************************************************************************************************************************************
2020-11-15 11:02:01,103 p=21862 u=rikmeg n=ansible | Sunday 15 November 2020  11:02:01 +0100 (0:00:04.841)       0:00:04.875 ******* 
2020-11-15 11:02:01,103 p=21862 u=rikmeg n=ansible | Sunday 15 November 2020  11:02:01 +0100 (0:00:04.841)       0:00:04.875 ******* 
2020-11-15 11:02:01,125 p=21862 u=rikmeg n=ansible | ok: [localhost] => {
    "msg": "This is where the Role resource for the application gets created"
}
2020-11-15 11:02:01,180 p=21862 u=rikmeg n=ansible | TASK [webinarapp : create Role Binding] *************************************************************************************************************************************
2020-11-15 11:02:01,180 p=21862 u=rikmeg n=ansible | Sunday 15 November 2020  11:02:01 +0100 (0:00:00.077)       0:00:04.952 ******* 
2020-11-15 11:02:01,181 p=21862 u=rikmeg n=ansible | Sunday 15 November 2020  11:02:01 +0100 (0:00:00.077)       0:00:04.952 ******* 
2020-11-15 11:02:01,200 p=21862 u=rikmeg n=ansible | ok: [localhost] => {
    "msg": "This is where the Role Binding resource for the application gets created"
}
2020-11-15 11:02:01,252 p=21862 u=rikmeg n=ansible | TASK [webinarapp : create Service Account and bind to Role] *****************************************************************************************************************
2020-11-15 11:02:01,252 p=21862 u=rikmeg n=ansible | Sunday 15 November 2020  11:02:01 +0100 (0:00:00.071)       0:00:05.024 ******* 
2020-11-15 11:02:01,252 p=21862 u=rikmeg n=ansible | Sunday 15 November 2020  11:02:01 +0100 (0:00:00.071)       0:00:05.024 ******* 
2020-11-15 11:02:01,271 p=21862 u=rikmeg n=ansible | ok: [localhost] => {
    "msg": "This is where the Service Account resource for the application gets created and bound to the Role"
}
2020-11-15 11:02:01,327 p=21862 u=rikmeg n=ansible | TASK [webinarapp : create Secret for flask app with credentials for backend database] ***************************************************************************************
2020-11-15 11:02:01,328 p=21862 u=rikmeg n=ansible | Sunday 15 November 2020  11:02:01 +0100 (0:00:00.075)       0:00:05.100 ******* 
2020-11-15 11:02:01,328 p=21862 u=rikmeg n=ansible | Sunday 15 November 2020  11:02:01 +0100 (0:00:00.075)       0:00:05.100 ******* 
2020-11-15 11:02:01,344 p=21862 u=rikmeg n=ansible | ok: [localhost] => {
    "msg": "This is where the Secret resource for the application gets created"
}
2020-11-15 11:02:01,396 p=21862 u=rikmeg n=ansible | TASK [webinarapp : create Deployment for flask app] *************************************************************************************************************************
2020-11-15 11:02:01,396 p=21862 u=rikmeg n=ansible | Sunday 15 November 2020  11:02:01 +0100 (0:00:00.067)       0:00:05.168 ******* 
2020-11-15 11:02:01,396 p=21862 u=rikmeg n=ansible | Sunday 15 November 2020  11:02:01 +0100 (0:00:00.067)       0:00:05.168 ******* 
2020-11-15 11:02:01,418 p=21862 u=rikmeg n=ansible | ok: [localhost] => {
    "msg": "This is where the Role resource for the application gets created"
}
2020-11-15 11:02:01,470 p=21862 u=rikmeg n=ansible | TASK [webinarapp : create Service for flask app] ****************************************************************************************************************************
2020-11-15 11:02:01,471 p=21862 u=rikmeg n=ansible | Sunday 15 November 2020  11:02:01 +0100 (0:00:00.074)       0:00:05.242 ******* 
2020-11-15 11:02:01,471 p=21862 u=rikmeg n=ansible | Sunday 15 November 2020  11:02:01 +0100 (0:00:00.074)       0:00:05.242 ******* 
2020-11-15 11:02:01,489 p=21862 u=rikmeg n=ansible | ok: [localhost] => {
    "msg": "This is where the Role resource for the application gets created"
}
2020-11-15 11:02:01,539 p=21862 u=rikmeg n=ansible | TASK [webinarapp : create Route for flask app] ******************************************************************************************************************************
2020-11-15 11:02:01,541 p=21862 u=rikmeg n=ansible | Sunday 15 November 2020  11:02:01 +0100 (0:00:00.070)       0:00:05.313 ******* 
2020-11-15 11:02:01,541 p=21862 u=rikmeg n=ansible | Sunday 15 November 2020  11:02:01 +0100 (0:00:00.070)       0:00:05.312 ******* 
2020-11-15 11:02:01,560 p=21862 u=rikmeg n=ansible | ok: [localhost] => {
    "msg": "This is where the Role resource for the application gets created"
}
2020-11-15 11:02:01,618 p=21862 u=rikmeg n=ansible | TASK [webinarapp : create PersistentVolumeClaim for backend MariaDB if cluster would have PersistentVolumes] ****************************************************************
2020-11-15 11:02:01,620 p=21862 u=rikmeg n=ansible | Sunday 15 November 2020  11:02:01 +0100 (0:00:00.078)       0:00:05.392 ******* 
2020-11-15 11:02:01,620 p=21862 u=rikmeg n=ansible | Sunday 15 November 2020  11:02:01 +0100 (0:00:00.078)       0:00:05.391 ******* 
2020-11-15 11:02:01,637 p=21862 u=rikmeg n=ansible | ok: [localhost] => {
    "msg": "This is where the Role resource for the application gets created"
}
2020-11-15 11:02:01,698 p=21862 u=rikmeg n=ansible | TASK [webinarapp : create Deployment for backend MariaDB] *******************************************************************************************************************
2020-11-15 11:02:01,698 p=21862 u=rikmeg n=ansible | Sunday 15 November 2020  11:02:01 +0100 (0:00:00.078)       0:00:05.470 ******* 
2020-11-15 11:02:01,698 p=21862 u=rikmeg n=ansible | Sunday 15 November 2020  11:02:01 +0100 (0:00:00.078)       0:00:05.470 ******* 
2020-11-15 11:02:01,717 p=21862 u=rikmeg n=ansible | ok: [localhost] => {
    "msg": "This is where the Role resource for the application gets created"
}
2020-11-15 11:02:01,772 p=21862 u=rikmeg n=ansible | TASK [webinarapp : create Service for backend MariaDB] **********************************************************************************************************************
2020-11-15 11:02:01,772 p=21862 u=rikmeg n=ansible | Sunday 15 November 2020  11:02:01 +0100 (0:00:00.073)       0:00:05.544 ******* 
2020-11-15 11:02:01,772 p=21862 u=rikmeg n=ansible | Sunday 15 November 2020  11:02:01 +0100 (0:00:00.073)       0:00:05.544 ******* 
2020-11-15 11:02:01,790 p=21862 u=rikmeg n=ansible | ok: [localhost] => {
    "msg": "This is where the Role resource for the application gets created"
}
2020-11-15 11:02:01,794 p=21862 u=rikmeg n=ansible | PLAY RECAP ******************************************************************************************************************************************************************
2020-11-15 11:02:01,795 p=21862 u=rikmeg n=ansible | localhost                  : ok=11   changed=0    unreachable=0    failed=0    skipped=0    rescued=0    ignored=0   
2020-11-15 11:02:01,795 p=21862 u=rikmeg n=ansible | Sunday 15 November 2020  11:02:01 +0100 (0:00:00.022)       0:00:05.567 ******* 
2020-11-15 11:02:01,795 p=21862 u=rikmeg n=ansible | =============================================================================== 
2020-11-15 11:02:01,795 p=21862 u=rikmeg n=ansible | gather_facts ------------------------------------------------------------ 4.84s
2020-11-15 11:02:01,795 p=21862 u=rikmeg n=ansible | webinarapp -------------------------------------------------------------- 0.69s
2020-11-15 11:02:01,796 p=21862 u=rikmeg n=ansible | ~~~~~~~~~~~~~~~~~~~~~~~~~~~~~~~~~~~~~~~~~~~~~~~~~~~~~~~~~~~~~~~~~~~~~~~~~~~~~~~ 
2020-11-15 11:02:01,796 p=21862 u=rikmeg n=ansible | total ------------------------------------------------------------------- 5.53s
2020-11-15 11:02:01,796 p=21862 u=rikmeg n=ansible | Sunday 15 November 2020  11:02:01 +0100 (0:00:00.023)       0:00:05.567 ******* 
2020-11-15 11:02:01,796 p=21862 u=rikmeg n=ansible | =============================================================================== 
2020-11-15 11:02:01,796 p=21862 u=rikmeg n=ansible | Gathering Facts ------------------------------------------------------------------------------------------------------------------------------------------------------ 4.84s
2020-11-15 11:02:01,796 p=21862 u=rikmeg n=ansible | webinarapp : create Route for flask app ------------------------------------------------------------------------------------------------------------------------------ 0.08s
2020-11-15 11:02:01,797 p=21862 u=rikmeg n=ansible | webinarapp : create PersistentVolumeClaim for backend MariaDB if cluster would have PersistentVolumes ---------------------------------------------------------------- 0.08s
2020-11-15 11:02:01,797 p=21862 u=rikmeg n=ansible | webinarapp : create Role --------------------------------------------------------------------------------------------------------------------------------------------- 0.08s
2020-11-15 11:02:01,797 p=21862 u=rikmeg n=ansible | webinarapp : create Service Account and bind to Role ----------------------------------------------------------------------------------------------------------------- 0.08s
2020-11-15 11:02:01,797 p=21862 u=rikmeg n=ansible | webinarapp : create Deployment for flask app ------------------------------------------------------------------------------------------------------------------------- 0.07s
2020-11-15 11:02:01,797 p=21862 u=rikmeg n=ansible | webinarapp : create Deployment for backend MariaDB ------------------------------------------------------------------------------------------------------------------- 0.07s
2020-11-15 11:02:01,797 p=21862 u=rikmeg n=ansible | webinarapp : create Role Binding ------------------------------------------------------------------------------------------------------------------------------------- 0.07s
2020-11-15 11:02:01,798 p=21862 u=rikmeg n=ansible | webinarapp : create Service for flask app ---------------------------------------------------------------------------------------------------------------------------- 0.07s
2020-11-15 11:02:01,798 p=21862 u=rikmeg n=ansible | webinarapp : create Secret for flask app with credentials for backend database --------------------------------------------------------------------------------------- 0.07s
2020-11-15 11:02:01,798 p=21862 u=rikmeg n=ansible | webinarapp : create Service for backend MariaDB ---------------------------------------------------------------------------------------------------------------------- 0.02s
2020-11-15 11:02:01,798 p=21862 u=rikmeg n=ansible | Playbook run took 0 days, 0 hours, 0 minutes, 5 seconds
2020-11-15 06:33:46,304 p=3608 u=student n=ansible | [WARNING]: provided hosts list is empty, only localhost is available. Note that
the implicit localhost does not match 'all'

2020-11-15 06:33:46,834 p=3608 u=student n=ansible | PLAY [Playbook to run roles outside of the Operator Container] *****************
2020-11-15 06:33:46,856 p=3608 u=student n=ansible | TASK [Gathering Facts] *********************************************************
2020-11-15 06:33:46,856 p=3608 u=student n=ansible | Sunday 15 November 2020  06:33:46 -0500 (0:00:00.043)       0:00:00.043 ******* 
2020-11-15 06:33:46,856 p=3608 u=student n=ansible | Sunday 15 November 2020  06:33:46 -0500 (0:00:00.043)       0:00:00.043 ******* 
2020-11-15 06:33:48,129 p=3608 u=student n=ansible | ok: [localhost]
2020-11-15 06:33:48,153 p=3608 u=student n=ansible | TASK [webinarapp : create Role] ************************************************
2020-11-15 06:33:48,153 p=3608 u=student n=ansible | Sunday 15 November 2020  06:33:48 -0500 (0:00:01.297)       0:00:01.341 ******* 
2020-11-15 06:33:48,154 p=3608 u=student n=ansible | Sunday 15 November 2020  06:33:48 -0500 (0:00:01.297)       0:00:01.340 ******* 
2020-11-15 06:33:48,173 p=3608 u=student n=ansible | ok: [localhost] => {
    "msg": "This is where the Role resource for the application gets created"
}
2020-11-15 06:33:48,185 p=3608 u=student n=ansible | TASK [webinarapp : create Role Binding] ****************************************
2020-11-15 06:33:48,185 p=3608 u=student n=ansible | Sunday 15 November 2020  06:33:48 -0500 (0:00:00.031)       0:00:01.372 ******* 
2020-11-15 06:33:48,185 p=3608 u=student n=ansible | Sunday 15 November 2020  06:33:48 -0500 (0:00:00.031)       0:00:01.371 ******* 
2020-11-15 06:33:48,202 p=3608 u=student n=ansible | ok: [localhost] => {
    "msg": "This is where the Role Binding resource for the application gets created"
}
2020-11-15 06:33:48,213 p=3608 u=student n=ansible | TASK [webinarapp : create Service Account and bind to Role] ********************
2020-11-15 06:33:48,214 p=3608 u=student n=ansible | Sunday 15 November 2020  06:33:48 -0500 (0:00:00.028)       0:00:01.401 ******* 
2020-11-15 06:33:48,214 p=3608 u=student n=ansible | Sunday 15 November 2020  06:33:48 -0500 (0:00:00.028)       0:00:01.400 ******* 
2020-11-15 06:33:48,232 p=3608 u=student n=ansible | ok: [localhost] => {
    "msg": "This is where the Service Account resource for the application gets created and bound to the Role"
}
2020-11-15 06:33:48,244 p=3608 u=student n=ansible | TASK [webinarapp : create Secret for flask app with credentials for backend database] ***
2020-11-15 06:33:48,244 p=3608 u=student n=ansible | Sunday 15 November 2020  06:33:48 -0500 (0:00:00.030)       0:00:01.431 ******* 
2020-11-15 06:33:48,244 p=3608 u=student n=ansible | Sunday 15 November 2020  06:33:48 -0500 (0:00:00.030)       0:00:01.430 ******* 
2020-11-15 06:33:48,260 p=3608 u=student n=ansible | ok: [localhost] => {
    "msg": "This is where the Secret resource for the application gets created"
}
2020-11-15 06:33:48,272 p=3608 u=student n=ansible | TASK [webinarapp : create Deployment for flask app] ****************************
2020-11-15 06:33:48,272 p=3608 u=student n=ansible | Sunday 15 November 2020  06:33:48 -0500 (0:00:00.027)       0:00:01.459 ******* 
2020-11-15 06:33:48,272 p=3608 u=student n=ansible | Sunday 15 November 2020  06:33:48 -0500 (0:00:00.027)       0:00:01.458 ******* 
2020-11-15 06:33:48,286 p=3608 u=student n=ansible | ok: [localhost] => {
    "msg": "This is where the Role resource for the application gets created"
}
2020-11-15 06:33:48,299 p=3608 u=student n=ansible | TASK [webinarapp : create Service for flask app] *******************************
2020-11-15 06:33:48,299 p=3608 u=student n=ansible | Sunday 15 November 2020  06:33:48 -0500 (0:00:00.027)       0:00:01.486 ******* 
2020-11-15 06:33:48,299 p=3608 u=student n=ansible | Sunday 15 November 2020  06:33:48 -0500 (0:00:00.027)       0:00:01.485 ******* 
2020-11-15 06:33:48,312 p=3608 u=student n=ansible | ok: [localhost] => {
    "msg": "This is where the Role resource for the application gets created"
}
2020-11-15 06:33:48,324 p=3608 u=student n=ansible | TASK [webinarapp : create Route for flask app] *********************************
2020-11-15 06:33:48,324 p=3608 u=student n=ansible | Sunday 15 November 2020  06:33:48 -0500 (0:00:00.025)       0:00:01.511 ******* 
2020-11-15 06:33:48,324 p=3608 u=student n=ansible | Sunday 15 November 2020  06:33:48 -0500 (0:00:00.025)       0:00:01.510 ******* 
2020-11-15 06:33:48,341 p=3608 u=student n=ansible | ok: [localhost] => {
    "msg": "This is where the Role resource for the application gets created"
}
2020-11-15 06:33:48,353 p=3608 u=student n=ansible | TASK [webinarapp : create PersistentVolumeClaim for backend MariaDB if cluster would have PersistentVolumes] ***
2020-11-15 06:33:48,354 p=3608 u=student n=ansible | Sunday 15 November 2020  06:33:48 -0500 (0:00:00.029)       0:00:01.541 ******* 
2020-11-15 06:33:48,354 p=3608 u=student n=ansible | Sunday 15 November 2020  06:33:48 -0500 (0:00:00.029)       0:00:01.540 ******* 
2020-11-15 06:33:48,370 p=3608 u=student n=ansible | ok: [localhost] => {
    "msg": "This is where the Role resource for the application gets created"
}
2020-11-15 06:33:48,381 p=3608 u=student n=ansible | TASK [webinarapp : create Deployment for backend MariaDB] **********************
2020-11-15 06:33:48,381 p=3608 u=student n=ansible | Sunday 15 November 2020  06:33:48 -0500 (0:00:00.027)       0:00:01.568 ******* 
2020-11-15 06:33:48,381 p=3608 u=student n=ansible | Sunday 15 November 2020  06:33:48 -0500 (0:00:00.027)       0:00:01.568 ******* 
2020-11-15 06:33:48,398 p=3608 u=student n=ansible | ok: [localhost] => {
    "msg": "This is where the Role resource for the application gets created"
}
2020-11-15 06:33:48,410 p=3608 u=student n=ansible | TASK [webinarapp : create Service for backend MariaDB] *************************
2020-11-15 06:33:48,410 p=3608 u=student n=ansible | Sunday 15 November 2020  06:33:48 -0500 (0:00:00.028)       0:00:01.597 ******* 
2020-11-15 06:33:48,410 p=3608 u=student n=ansible | Sunday 15 November 2020  06:33:48 -0500 (0:00:00.028)       0:00:01.597 ******* 
2020-11-15 06:33:48,423 p=3608 u=student n=ansible | ok: [localhost] => {
    "msg": "This is where the Role resource for the application gets created"
}
2020-11-15 06:33:48,431 p=3608 u=student n=ansible | PLAY RECAP *********************************************************************
2020-11-15 06:33:48,431 p=3608 u=student n=ansible | localhost                  : ok=11   changed=0    unreachable=0    failed=0    skipped=0    rescued=0    ignored=0   
2020-11-15 06:33:48,431 p=3608 u=student n=ansible | Sunday 15 November 2020  06:33:48 -0500 (0:00:00.020)       0:00:01.618 ******* 
2020-11-15 06:33:48,431 p=3608 u=student n=ansible | =============================================================================== 
2020-11-15 06:33:48,431 p=3608 u=student n=ansible | gather_facts ------------------------------------------------------------ 1.30s
2020-11-15 06:33:48,431 p=3608 u=student n=ansible | webinarapp -------------------------------------------------------------- 0.28s
2020-11-15 06:33:48,431 p=3608 u=student n=ansible | ~~~~~~~~~~~~~~~~~~~~~~~~~~~~~~~~~~~~~~~~~~~~~~~~~~~~~~~~~~~~~~~~~~~~~~~~~~~~~~~ 
2020-11-15 06:33:48,431 p=3608 u=student n=ansible | total ------------------------------------------------------------------- 1.57s
2020-11-15 06:33:48,431 p=3608 u=student n=ansible | Sunday 15 November 2020  06:33:48 -0500 (0:00:00.021)       0:00:01.618 ******* 
2020-11-15 06:33:48,431 p=3608 u=student n=ansible | =============================================================================== 
2020-11-15 06:33:48,431 p=3608 u=student n=ansible | Gathering Facts --------------------------------------------------------- 1.30s
2020-11-15 06:33:48,431 p=3608 u=student n=ansible | webinarapp : create Role ------------------------------------------------ 0.03s
2020-11-15 06:33:48,432 p=3608 u=student n=ansible | webinarapp : create Service Account and bind to Role -------------------- 0.03s
2020-11-15 06:33:48,432 p=3608 u=student n=ansible | webinarapp : create Route for flask app --------------------------------- 0.03s
2020-11-15 06:33:48,432 p=3608 u=student n=ansible | webinarapp : create Deployment for backend MariaDB ---------------------- 0.03s
2020-11-15 06:33:48,432 p=3608 u=student n=ansible | webinarapp : create Role Binding ---------------------------------------- 0.03s
2020-11-15 06:33:48,432 p=3608 u=student n=ansible | webinarapp : create Secret for flask app with credentials for backend database --- 0.03s
2020-11-15 06:33:48,432 p=3608 u=student n=ansible | webinarapp : create PersistentVolumeClaim for backend MariaDB if cluster would have PersistentVolumes --- 0.03s
2020-11-15 06:33:48,432 p=3608 u=student n=ansible | webinarapp : create Deployment for flask app ---------------------------- 0.03s
2020-11-15 06:33:48,432 p=3608 u=student n=ansible | webinarapp : create Service for flask app ------------------------------- 0.03s
2020-11-15 06:33:48,432 p=3608 u=student n=ansible | webinarapp : create Service for backend MariaDB ------------------------- 0.02s
2020-11-15 06:33:48,432 p=3608 u=student n=ansible | Playbook run took 0 days, 0 hours, 0 minutes, 1 seconds
