GTCBSA,NAME,ALAND,SQRT_ALAND,POP,LOG_POP,POP_DEN,L_POPDEN,POP15,L_POP15DEN,LOG_POP15,POP15_DEN,TUFINLWGT,AVG_TRTFAMILY,AVG_TRTNHFAMILY,AVG_TRTHHFAMILY,AVG_TRTFRIEND,AVG_TRTCCC,AVG_TRTSOCIAL,AVG_RATIO_NHFAMILY_SOCIAL,AVG_NHFAMILY_IX,RESP_COUNT
10180,"Abilene, TX",2743.4985275412,52.37841661926409,170669,5.23,62.21,1.79386020134267,136682,1.697403723200488,5.14,49.82,439091103.423083,195.33,30.47,164.86,17.26,20.73,68.46,0.24,0.3,35
10420,"Akron, OH",900.1930133196,30.003216716205614,703845,5.85,781.88,2.893140104291489,585501,2.813193887069551,5.77,650.42,831544598.995712,328.42,55.19,273.23,59.74,8.79,123.71,0.18,0.24,88
10580,"Albany-Schenectady-Troy, NY",2811.7268307414,53.0257185782654,880736,5.94,313.24,2.495877215295426,738712,2.419509665822141,5.87,262.73,868063878.51267,348.46,27.26,321.2,19.95,3.53,50.74,0.1,0.11,91
10740,"Albuquerque, NM",9283.3441123995,96.35011215561454,912108,5.96,98.25,1.992332559047464,743364,1.903524064471262,5.87,80.08,1085850503.928548,261.9,20.18,241.72,18.69,2.4,41.27,0.09,0.11,164
10900,"Allentown-Bethlehem-Easton, PA-NJ",1452.9758613084,38.117920474606166,837610,5.92,576.48,2.760784244778493,693420,2.678736837033605,5.84,477.24,1009460105.373612,241.33,15.8,225.53,45.0,16.86,77.66,0.11,0.15,86
11100,"Amarillo, TX",5150.9523532896,71.7701355250887,263776,5.42,51.21,1.709354775834396,206825,1.6036855496147,5.32,40.15,248974576.494336,306.73,32.36,274.37,42.83,3.35,78.53,0.13,0.14,28
11460,"Ann Arbor, MI",705.9991847337,26.570645169692437,367000,5.56,519.83,2.715861339533011,310358,2.643057683751453,5.49,439.6,535213258.335943,256.14,22.72,233.42,78.84,6.33,107.9,0.17,0.18,63
11540,"Appleton, WI",955.8019391778,30.916046629182716,235628,5.37,246.52,2.391852159058638,189484,2.297213195989642,5.28,198.25,268626818.26849,297.12,36.86,260.26,47.51,5.73,90.09,0.14,0.21,29
11700,"Asheville, NC",2032.6101110171999,45.08447749522223,454351,5.66,223.53,2.349335818117248,384385,2.276714494630292,5.58,189.11,525386505.731086,219.87,14.3,205.57,18.17,35.77,68.24,0.08,0.09,52
12020,"Athens-Clarke County, GA",1024.9441109622,32.01474833513767,208457,5.32,203.38,2.308308242998225,172939,2.227192306514036,5.24,168.73,241172118.702667,194.89,12.71,182.18,28.6,9.63,50.94,0.1,0.11,26
12060,"Atlanta-Sandy Springs-Alpharetta, GA",8685.6209008569,93.19667859348262,5862424,6.77,674.96,2.829278036099149,4669089,2.730435024186397,6.67,537.57,7388307735.91399,251.95,20.34,231.61,33.87,17.1,71.3,0.09,0.11,729
12100,"Atlantic City-Hammonton, NJ",555.5107834848,23.569276261370437,266105,5.43,479.03,2.680362712634758,219253,2.596256123102291,5.34,394.69,346120506.057587,231.82,83.25,148.57,25.63,7.11,115.99,0.34,0.36,33
12220,"Auburn-Opelika, AL",607.5391924602,24.648310133966586,161152,5.21,265.25,2.423655392573378,132430,2.338416648246358,5.12,217.98,206328233.948555,254.09,44.67,209.42,36.3,5.05,86.02,0.18,0.27,32
12260,"Augusta-Richmond County, GA-SC",3480.700021227,58.99745775223709,599616,5.78,172.27,2.236209653717059,484223,2.143389568994656,5.69,139.12,630648432.352212,327.6,34.69,292.91,19.96,7.32,61.97,0.17,0.19,72
12420,"Austin-Round Rock-Georgetown, TX",4219.4804623686,64.95752814238392,2114441,6.33,501.11,2.699933069478628,1701421,2.605552835812909,6.23,403.23,2302928712.501564,284.92,19.69,265.23,56.51,6.35,82.55,0.09,0.09,229
12540,"Bakersfield, CA",8134.599680064,90.19201561149413,887641,5.95,109.12,2.037904357312404,671039,1.916401303603876,5.83,82.49,1072708884.768799,331.99,13.19,318.79,24.74,3.71,41.64,0.09,0.1,85
12580,"Baltimore-Columbia-Towson, MD",2601.4955838299998,51.00485843358454,2796733,6.45,1075.05,3.031428663525221,2286511,2.943949347042262,6.36,878.92,3607388223.632899,232.13,20.5,211.63,41.97,10.92,73.39,0.1,0.12,315
12620,"Bangor, ME",3397.1779642086,58.2853151677899,151774,5.18,44.68,1.650113164443571,129234,1.580240508265376,5.11,38.04,181480366.073131,463.05,19.08,443.97,8.04,5.39,32.5,0.04,0.04,21
12700,"Barnstable Town, MA",394.2190026918,19.85494907300948,213496,5.33,541.57,2.733654598817204,187331,2.676876431973137,5.27,475.2,116993114.70648,386.45,54.07,332.38,71.01,0.0,125.07,0.19,0.24,15
12940,"Baton Rouge, LA",4370.6713335714,66.11105303632215,854318,5.93,195.47,2.291080112963527,686381,2.19601028659195,5.84,157.04,984417524.875998,262.65,47.58,215.07,76.32,8.18,132.08,0.18,0.2,110
12980,"Battle Creek, MI",706.2580474092,26.575515938720738,134212,5.13,190.03,2.278822168352688,108772,2.187548920861271,5.04,154.01,305953111.672738,322.27,24.04,298.24,30.74,3.05,57.83,0.07,0.08,38
13140,"Beaumont-Port Arthur, TX",2101.1235687585,45.83801445043731,395174,5.6,188.08,2.274342616116883,314987,2.175830604162249,5.5,149.91,442045987.626099,296.93,34.85,262.09,17.73,12.93,65.5,0.09,0.13,50
13460,"Bend, OR",3017.6005179177,54.932690794441335,186251,5.27,61.72,1.790425917391111,154982,1.710625015060797,5.19,51.36,339725696.96369797,319.05,5.78,313.27,9.15,8.82,23.75,0.03,0.03,43
13740,"Billings, MT",6477.9588621891,80.48576807230643,179071,5.25,27.64,1.441538038702161,144421,1.348110068480238,5.16,22.29,193047677.680408,217.29,5.41,211.88,50.0,5.42,60.83,0.04,0.08,22
13780,"Binghamton, NY",1224.3983250213,34.99140358747131,241874,5.38,197.55,2.295677034017465,202756,2.219060332448861,5.31,165.6,557243851.366028,389.56,40.55,349.01,49.55,6.05,96.15,0.24,0.24,63
13820,"Birmingham-Hoover, AL",4488.7127587731,66.99785637446246,1085330,6.04,241.79,2.383438335256656,877715,2.291235610848788,5.94,195.54,1448566913.764465,260.67,51.94,208.73,44.33,13.33,109.6,0.16,0.2,183
13980,"Blacksburg-Christiansburg, VA",1073.5807264182,32.76554175377236,166785,5.22,155.35,2.191311257590993,144722,2.129689892199301,5.16,134.8,170282742.030641,340.93,52.17,288.76,24.34,4.62,81.14,0.24,0.32,18
14010,"Bloomington, IL",1183.2410125107,34.39827048720183,172578,5.24,145.85,2.163906433457751,141515,2.077731179652392,5.15,119.6,279502807.130361,229.32,18.56,210.75,17.47,15.44,51.48,0.1,0.11,31
14020,"Bloomington, IN",779.8123549359,27.92512049993518,167296,5.22,214.53,2.331488032760532,144697,2.268460958684802,5.16,185.55,172387359.28328198,346.6,20.45,326.15,12.19,0.0,32.63,0.32,0.33,21
14260,"Boise City, ID",11766.5275601016,108.4736261037751,710743,5.85,60.4,1.781036938621132,561639,1.678791434366244,5.75,47.73,696224632.516344,361.63,20.85,340.79,40.79,7.38,69.03,0.09,0.11,103
14460,"Boston-Cambridge-Newton, MA-NH",3486.081344031,59.04304653412627,4832346,6.68,1386.18,3.141819628494412,4040437,3.06409093019543,6.61,1159.02,5563773705.895789,253.57,22.59,230.98,45.7,8.42,76.71,0.09,0.11,643
14500,"Boulder, CO",726.3792469791,26.951423839550667,322510,5.51,444.0,2.64738297011462,271539,2.572674150739064,5.43,373.83,502854649.410915,268.04,17.08,250.95,28.13,1.86,47.07,0.07,0.09,51
14540,"Bowling Green, KY",1615.0248189504,40.18737138642437,174498,5.24,108.05,2.03362477121926,141718,1.943247125137862,5.15,87.75,280773306.730783,342.77,14.97,327.8,2.55,8.64,26.15,0.04,0.04,31
14860,"Bridgeport-Stamford-Norwalk, CT",624.9661815969,24.99932362278828,943926,5.97,1510.36,3.179080475358847,769609,3.090413256366991,5.89,1231.44,950673602.879918,262.96,22.78,240.18,49.75,3.82,76.36,0.1,0.15,110
15180,"Brownsville-Harlingen, TX",891.7052862861,29.86143476603393,421666,5.62,472.88,2.674750946340831,314707,2.547688576129021,5.5,352.93,515782240.84231,273.94,6.8,267.13,13.98,8.36,29.15,0.03,0.03,44
15380,"Buffalo-Cheektowaga, NY",1565.0749090548,39.561027654180066,1130175,6.05,722.12,2.858609373480157,942004,2.779517127872229,5.97,601.89,1194314638.161883,253.23,36.88,216.35,45.47,5.63,87.98,0.18,0.19,134
15500,"Burlington, NC",423.4496827275,20.57789305851063,163324,5.21,385.7,2.586249638866042,133298,2.498020927582199,5.12,314.79,487281391.972603,333.92,40.5,293.42,36.61,3.98,81.09,0.22,0.23,45
15540,"Burlington-South Burlington, VT",1249.7217024006,35.35140311784809,218784,5.34,175.07,2.24321173174476,184986,2.17032039987338,5.27,148.02,151427001.201684,225.4,17.81,207.59,9.63,29.15,56.6,0.05,0.05,21
15680,"California-Lexington Park, MD",358.6135174479,18.93709369063532,112290,5.05,313.12,2.495710808313926,89645,2.397905263723669,4.95,249.98,405110885.441642,206.86,7.25,199.61,39.5,7.54,54.29,0.02,0.05,24
15940,"Canton-Massillon, OH",969.8719729841999,31.142767587101183,399736,5.6,412.15,2.615055304179721,329369,2.530967681571915,5.52,339.6,757400642.143306,317.97,11.29,306.68,66.09,4.43,81.8,0.05,0.05,45
15980,"Cape Coral-Fort Myers, FL",781.0042645548,27.946453523744296,737468,5.87,944.26,2.975091592834296,628913,2.905936126745815,5.8,805.26,406716508.987811,215.96,5.73,210.23,55.75,14.44,75.92,0.03,0.03,49
16060,"Carbondale-Marion, IL",1347.5075312556,36.70841226824718,137573,5.14,102.09,2.008983203815472,114691,1.929980590515515,5.06,85.11,295879386.299547,298.08,29.56,268.52,63.97,2.69,96.22,0.18,0.18,24
16300,"Cedar Rapids, IA",2008.7679201875999,44.819280674589145,270056,5.43,134.44,2.12852850379744,218031,2.035589817243457,5.34,108.54,184194970.794117,322.53,25.77,296.75,62.93,0.2,88.91,0.09,0.12,38
16540,"Chambersburg-Waynesboro, PA",772.2947979747,27.790192478187336,154147,5.19,199.6,2.300160536951352,125668,2.211440935578669,5.1,162.72,340091787.926805,396.18,29.97,366.21,49.12,2.8,81.9,0.11,0.11,36
16580,"Champaign-Urbana, IL",1435.283842707,37.8851401304918,226323,5.35,157.69,2.19780415317341,190349,2.12260902357599,5.28,132.62,359406176.004618,184.15,56.08,128.07,22.16,7.38,85.62,0.13,0.13,35
16620,"Charleston, WV",2646.5581078794,51.444709231167785,264113,5.42,99.79,1.999087022625888,219104,1.917977882592908,5.34,82.79,279092440.420823,371.69,24.4,347.29,21.41,2.05,47.86,0.17,0.19,35
16700,"Charleston-North Charleston, SC",2590.1788739112,50.89379995550735,774508,5.89,299.02,2.475700237151028,631687,2.387176186349882,5.8,243.88,795475920.481017,336.01,27.15,308.86,48.32,4.84,80.31,0.09,0.11,117
16740,"Charlotte-Concord-Gastonia, NC-SC",5597.3814354315,74.81564966924701,2545560,6.41,454.78,2.657801357333581,2041855,2.562042924490959,6.31,364.79,2806337499.573064,267.0,33.01,233.99,36.32,8.87,78.21,0.14,0.16,292
16820,"Charlottesville, VA",1644.5175168708,40.55265116944637,215445,5.33,131.01,2.117304446641003,180751,2.041037207867028,5.26,109.91,362043795.164178,280.47,28.19,252.29,42.08,0.53,70.8,0.15,0.19,37
16860,"Chattanooga, TN-GA",2088.7816884363,45.703191228144014,556209,5.75,266.28,2.425338548279633,458617,2.341553222109577,5.66,219.56,553631216.749222,298.78,41.51,257.27,41.48,27.16,110.15,0.13,0.16,67
16980,"Chicago-Naperville-Elgin, IL-IN-WI",7194.7414349811,84.82182169100767,9508605,6.98,1321.6,3.121100029976307,7705088,3.029761084643937,6.89,1070.93,12488589537.727327,246.9,23.26,223.64,48.3,16.81,88.37,0.1,0.12,1162
17020,"Chico, CA",1636.4804862978,40.45343602585323,225817,5.35,137.99,2.139847614646311,188065,2.06039561731991,5.27,114.92,491456397.916468,225.23,13.64,211.58,20.04,3.02,36.7,0.05,0.05,43
17140,"Cincinnati, OH-KY-IN",4546.4227910244,67.4271665652977,2201741,6.34,484.28,2.685096533739927,1771146,2.590585505352096,6.25,389.57,2511803543.044932,256.06,29.22,226.83,24.33,14.47,68.03,0.13,0.13,243
17300,"Clarksville, TN-KY",2157.9470374176,46.45370854321106,299470,5.48,138.78,2.142326883154263,231646,2.030802048772268,5.36,107.35,373282752.764592,284.42,19.26,265.16,30.31,10.33,59.9,0.05,0.07,49
17420,"Cleveland, TN",763.3628895321,27.62902259458521,122563,5.09,160.56,2.205637359479429,100823,2.120837060254737,5.0,132.08,339668772.453924,367.85,65.25,302.6,51.29,4.89,121.43,0.14,0.14,23
17460,"Cleveland-Elyria, OH",1998.7647147467999,44.70754650779664,2056898,6.31,1029.08,3.012449137841196,1698617,2.929332058130864,6.23,849.83,2945935122.483555,277.07,14.14,262.93,40.84,9.69,64.67,0.1,0.11,257
17660,"Coeur d'Alene, ID",1237.7724525738,35.1819904578152,157322,5.2,127.1,2.104145550554008,127441,2.01266853389633,5.11,102.96,285940847.888279,405.07,10.45,394.61,37.89,4.32,52.66,0.06,0.08,31
17780,"College Station-Bryan, TX",2100.363528978,45.82972320424813,258029,5.41,122.85,2.0893751608161,212720,2.00552369267328,5.33,101.28,261267330.472941,229.5,24.57,204.93,38.9,10.37,73.85,0.07,0.07,24
17820,"Colorado Springs, CO",2683.4757176799,51.80227521721319,723498,5.86,269.61,2.430735996410303,578310,2.333467426905371,5.76,215.51,567950279.0193679,272.62,30.21,242.42,51.69,15.81,97.71,0.08,0.08,65
17900,"Columbia, SC",3703.0399907787,60.852608742589666,824278,5.92,222.59,2.347505649475902,673002,2.259450523716499,5.83,181.74,796828698.96863,296.91,17.69,279.22,27.5,3.11,48.3,0.1,0.13,117
17980,"Columbus, GA-AL",2786.0446737981,52.78299606689734,319402,5.5,114.64,2.059336177389288,255489,1.962369335670021,5.41,91.7,184743347.349381,193.97,39.28,154.69,13.05,10.3,62.63,0.16,0.16,30
18140,"Columbus, OH",4796.547230475,69.25710960237224,2077761,6.32,433.18,2.636668396960324,1666859,2.540967306429246,6.22,347.51,2353897965.11288,275.21,22.94,252.28,58.67,13.93,95.53,0.11,0.13,231
18580,"Corpus Christi, TX",1532.4927663474,39.14706587149796,428548,5.63,279.64,2.44659929345697,339490,2.345432547499147,5.53,221.53,364509222.567079,303.14,15.86,287.27,52.89,4.19,72.94,0.1,0.11,49
19100,"Dallas-Fort Worth-Arlington, TX",8675.100394389,93.14021899474469,7320663,6.86,843.87,2.926275547773541,5725775,2.819557095781318,6.76,660.02,8717372364.108566,277.74,26.83,250.91,34.43,10.57,71.82,0.12,0.14,797
19300,"Daphne-Fairhope-Foley, AL",1589.8270584339,39.87263545884445,212830,5.33,133.87,2.12668326338829,174821,2.041234731171431,5.24,109.96,361866663.330022,353.77,24.87,328.9,31.75,2.6,59.22,0.13,0.15,46
19340,"Davenport-Moline-Rock Island, IA-IL",2269.8807135147,47.64326514329911,381175,5.58,167.93,2.225128287982087,308409,2.13312357540262,5.49,135.87,438102850.037283,319.05,39.87,279.18,30.9,28.56,99.32,0.12,0.21,53
19660,"Deltona-Daytona Beach-Ormond Beach, FL",1587.5042341158,39.84349676064841,646288,5.81,407.11,2.609711770253337,552718,2.541791347494252,5.74,348.17,854189834.34334,229.28,38.37,190.91,47.11,3.28,88.77,0.09,0.09,74
19740,"Denver-Aurora-Lakewood, CO",8344.6592792706,91.34910661451813,2892066,6.46,346.58,2.539803497384677,2342726,2.448319764933495,6.37,280.75,3371794617.369166,243.39,20.98,222.42,37.33,17.27,75.57,0.08,0.09,335
19780,"Des Moines-West Des Moines, IA",3612.3498772218,60.10282753100556,680439,5.83,188.36,2.274988681770685,536681,2.171931123355967,5.73,148.57,908027680.36908,298.1,34.59,263.51,35.77,10.02,80.38,0.11,0.14,120
19820,"Detroit-Warren-Dearborn, MI",3892.2137765081998,62.3876091584555,4317848,6.64,1109.36,3.045072502544747,3531037,2.957707828719117,6.55,907.21,5116362988.499377,267.76,41.27,226.49,56.25,9.1,106.62,0.13,0.15,535
20100,"Dover, DE",586.0577517795,24.208629696442962,176699,5.25,301.5,2.47928731647617,142783,2.386730765209831,5.15,243.63,213190290.186721,332.06,64.15,267.91,26.42,7.03,97.6,0.15,0.15,22
20500,"Durham-Chapel Hill, NC",2290.0805998785,47.85478659317686,626695,5.8,273.66,2.437211322624582,518781,2.355125724987688,5.71,226.53,758757051.6904761,207.78,24.39,183.39,30.09,7.53,62.0,0.15,0.18,80
20700,"East Stroudsburg, PA",608.3534244645,24.66482159806756,168032,5.23,276.21,2.441239397871148,141774,2.367449107268604,5.15,233.05,372224220.655955,192.22,32.2,160.02,78.03,12.46,122.69,0.14,0.17,37
21140,"Elkhart-Goshen, IN",463.1579275752,21.52110423689268,204558,5.31,441.66,2.645088068115283,157333,2.531095546870028,5.2,339.7,421625612.075071,311.69,8.6,303.09,27.05,4.46,40.11,0.05,0.06,45
21340,"El Paso, TX",5583.7279324826995,74.72434631686448,840477,5.92,150.52,2.177594209647827,648990,2.065318237803737,5.81,116.23,898642255.454576,304.55,72.28,232.27,40.3,3.86,116.44,0.23,0.24,106
21500,"Erie, PA",798.9083678862,28.26496714815356,273835,5.44,342.76,2.534990134158752,225437,2.450526229129723,5.35,282.18,407219070.250597,214.44,21.02,193.42,27.55,22.06,70.62,0.09,0.09,31
21660,"Eugene-Springfield, OR",4554.0657339606,67.48381831195238,373340,5.57,81.98,1.913707913980483,316180,1.841547165256553,5.5,69.43,486869840.729802,252.37,18.43,233.94,44.04,20.2,82.67,0.11,0.14,69
21780,"Evansville, IN-KY",1463.9473592172,38.261565038785335,314960,5.5,215.14,2.332721164289127,256527,2.243608460959357,5.41,175.23,313038678.890247,380.93,33.7,347.23,35.06,7.1,75.87,0.12,0.13,45
22020,"Fargo, ND-MN",2810.0947014855,53.01032636652504,240421,5.38,85.56,1.93227077589949,193374,1.837651557846393,5.29,68.81,257017507.264126,216.86,69.63,147.24,60.96,5.08,135.67,0.17,0.18,35
22140,"Farmington, NM",5517.200359242,74.27785914552196,126515,5.1,22.93,1.360404054729939,98229,1.250420002308894,4.99,17.8,156600311.96284398,189.17,25.78,163.4,16.92,0.0,42.7,0.15,0.15,16
22180,"Fayetteville, NC",1637.6334295464,40.46768376799443,519101,5.72,316.98,2.501031861070583,407179,2.39557099712082,5.61,248.64,557966692.799258,165.97,20.65,145.32,36.38,19.19,76.22,0.08,0.08,54
22220,"Fayetteville-Springdale-Rogers, AR",2623.4046538128,51.21918247895802,514259,5.71,196.03,2.292322539914915,404442,2.187999872404836,5.61,154.17,515085746.977571,287.72,55.98,231.74,59.64,6.55,122.17,0.17,0.23,71
22420,"Flint, MI",636.9382414395,25.237635416962103,407875,5.61,640.37,2.806430977932397,331786,2.716762694739537,5.52,520.91,469573787.738296,269.6,34.6,235.0,37.86,5.18,77.64,0.07,0.12,51
22500,"Florence, SC",1361.0861817696,36.89290150922803,205502,5.31,150.98,2.178919421035465,165819,2.085754244209699,5.22,121.83,114691675.357977,315.81,101.8,214.01,1.8,6.41,110.01,0.13,0.14,20
22520,"Florence-Muscle Shoals, AL",1260.9604954089,35.51000556757067,147327,5.17,116.84,2.067591548301512,122802,1.988514365833666,5.09,97.39,402787585.43164,205.84,43.83,162.02,21.23,14.86,79.92,0.17,0.2,35
22660,"Fort Collins, CO",2595.7557447822,50.94855979105003,344786,5.54,132.83,2.123296172645314,288130,2.045322978786658,5.46,111.0,465770099.053703,285.83,16.15,269.68,84.68,15.73,116.56,0.09,0.12,47
22900,"Fort Smith, AR-OK",2408.961193353,49.081169437504236,249777,5.4,103.69,2.01573687447745,199975,1.919130413860614,5.3,83.01,159486941.235769,221.85,39.94,181.91,32.54,14.29,86.77,0.1,0.12,19
23060,"Fort Wayne, IN",992.8632090663,31.509731973888638,406305,5.61,409.23,2.611967463644433,319877,2.508098577178079,5.5,322.18,588386219.802848,265.02,23.07,241.96,51.97,9.68,84.72,0.16,0.17,64
23420,"Fresno, CA",5958.3489806412,77.19034253480936,984521,5.99,165.23,2.218088902860845,748422,2.099024215610893,5.87,125.61,1165396149.766771,313.98,46.29,267.69,22.72,9.29,78.3,0.18,0.21,85
23540,"Gainesville, FL",2343.5389043352,48.41011159184825,323799,5.51,138.17,2.140413757591074,274179,2.068148740973294,5.44,116.99,279965980.510985,232.15,35.02,197.12,20.49,0.0,55.52,0.15,0.15,30
23580,"Gainesville, GA",392.98554909899997,19.823863122484475,198667,5.3,505.53,2.703746933315467,156768,2.600885810368248,5.2,398.92,386991680.631196,381.84,34.5,347.34,47.57,3.81,85.88,0.25,0.25,31
24020,"Glens Falls, NY",1698.3751371444,41.21134718914683,125892,5.1,74.12,1.86993541064686,106755,1.798374376681561,5.03,62.86,322159338.535517,353.41,34.08,319.33,26.54,13.85,74.48,0.24,0.27,33
24140,"Goldsboro, NC",553.9188047679,23.53547970124892,123603,5.09,223.14,2.348577428742616,99079,2.252537506990004,5.0,178.87,503838053.38519,370.5,23.65,346.85,91.91,3.33,118.89,0.12,0.16,47
24340,"Grand Rapids-Kentwood, MI",2689.0835275161,51.8563740297767,1062392,6.03,395.08,2.596685045096567,849685,2.499659594756,5.93,315.98,1650466734.25575,314.05,47.0,267.06,42.11,5.55,94.66,0.23,0.3,158
24540,"Greeley, CO",3984.9189811001997,63.12621469009685,305345,5.48,76.63,1.884398825556686,237777,1.775756037844098,5.38,59.67,442317169.519857,290.59,52.65,237.94,5.97,2.89,61.51,0.21,0.27,38
24580,"Green Bay, WI",1870.0164836495999,43.24368721154106,319401,5.5,170.8,2.232487866352986,257649,2.139186180416129,5.41,137.78,397675718.453417,242.32,71.29,171.03,22.6,8.49,102.38,0.27,0.28,38
24660,"Greensboro-High Point, NC",1993.8893103558,44.65298769797828,762063,5.88,382.2,2.582290682718994,622896,2.494711025205263,5.79,312.4,899623020.031723,291.22,34.67,256.54,61.83,14.52,111.02,0.15,0.19,97
24780,"Greenville, NC",652.3626715749,25.541391339840906,178433,5.25,273.52,2.436989087788538,146413,2.351080909463016,5.17,224.43,328383059.66109,320.36,51.78,268.57,33.9,11.04,96.72,0.19,0.19,33
24860,"Greenville-Anderson, SC",2709.5818896432,52.05364434545578,895942,5.95,330.66,2.519381661409114,728562,2.429558499461421,5.86,268.88,1015277769.9510651,262.74,24.1,238.64,38.35,4.96,67.4,0.14,0.17,135
25180,"Hagerstown-Martinsburg, MD-WV",1007.9741707893,31.74860895833548,283147,5.45,280.91,2.448567199748096,230973,2.360119861580805,5.36,229.15,127838867.015222,447.93,24.12,423.81,52.06,0.0,76.18,0.11,0.11,16
25260,"Hanford-Corcoran, CA",1390.9646024703,37.29563784774702,150691,5.18,108.34,2.034788831251184,115970,1.921009801497034,5.06,83.37,299836787.872394,248.21,39.99,208.22,35.38,11.27,86.64,0.13,0.15,30
25420,"Harrisburg-Carlisle, PA",1621.790084772,40.27145496219376,571013,5.76,352.09,2.546653690487701,469556,2.461693570341295,5.67,289.53,857989475.667765,263.61,24.07,239.54,24.39,6.07,54.53,0.09,0.1,81
25540,"Hartford-East Hartford-Middletown, CT",1514.5811757648,38.91762037644131,1207677,6.08,797.37,2.901659891873717,1009198,2.823682849076752,6.0,666.32,1279131547.933325,238.84,46.29,192.55,42.26,9.42,97.97,0.15,0.19,152
25860,"Hickory-Lenoir-Morganton, NC",1639.4742520299,40.49042173193433,366678,5.56,223.66,2.349588320562463,304602,2.269022334729234,5.48,185.79,462012350.55581,300.75,36.99,263.77,26.86,3.09,66.94,0.13,0.15,43
25940,"Hilton Head Island-Bluffton, SC",1231.190448345,35.08832353283639,214752,5.33,174.43,2.241621180791424,179841,2.164561029265557,5.25,146.07,221349488.763491,201.1,17.3,183.81,24.87,5.26,47.43,0.05,0.05,25
26420,"Houston-The Woodlands-Sugar Land, TX",8268.651929023199,90.93212814524468,6884138,6.84,832.56,2.920415541553666,5348578,2.810803582484866,6.73,646.85,8211268727.346655,275.63,24.21,251.43,36.47,11.51,72.19,0.11,0.13,734
26580,"Huntington-Ashland, WV-KY-OH",2499.9123078072,49.99912307038194,361832,5.56,144.74,2.160588568290035,298449,2.076931574555656,5.47,119.38,312344405.409309,248.65,15.9,232.74,16.58,5.15,37.64,0.14,0.16,33
26620,"Huntsville, AL",1361.5559797554,36.89926801110558,457003,5.66,335.65,2.525886651520939,373916,2.438732162810943,5.57,274.62,670241586.756187,230.51,34.39,196.12,41.56,6.22,82.18,0.18,0.2,80
26820,"Idaho Falls, ID",5196.1204706697,72.08412079417838,145507,5.16,28.0,1.447158031342219,107203,1.314499227973152,5.03,20.63,146374754.986487,352.13,21.14,330.99,3.86,3.06,28.06,0.11,0.13,21
26900,"Indianapolis-Carmel-Anderson, IN",4306.5307969398,65.62416320944443,2029472,6.31,471.25,2.673251363213849,1610839,2.572929659079372,6.21,374.05,2842271979.458404,315.39,40.91,274.48,26.14,8.54,75.59,0.15,0.16,296
26980,"Iowa City, IA",1181.8214247411,34.37762971382844,170677,5.23,144.42,2.159627340658674,140824,2.076130494543006,5.15,119.16,227512189.309499,306.9,19.57,287.33,18.74,4.52,42.83,0.11,0.13,31
27100,"Jackson, MI",701.8930649016,26.49326451952647,158636,5.2,226.01,2.354127655292264,130403,2.269022334729234,5.12,185.79,346297375.44565,271.52,41.19,230.33,59.24,10.27,110.7,0.11,0.15,29
27140,"Jackson, MS",5405.1307705395,73.51959446664202,597727,5.78,110.59,2.043715858061206,478128,1.946746935033585,5.68,88.46,748472637.2168,256.47,32.34,224.12,41.64,4.21,78.19,0.16,0.18,90
27260,"Jacksonville, FL",3201.7946136462,56.58440256507265,1503574,6.18,469.6,2.671728088239558,1221630,2.58155145789047,6.09,381.55,1649613471.152214,283.45,27.87,255.59,46.35,10.62,84.84,0.14,0.14,178
27340,"Jacksonville, NC",762.0707035656,27.605628113948068,195069,5.29,255.97,2.408189068444955,153391,2.303800623765175,5.19,201.28,364414574.833547,384.94,182.56,202.39,12.68,4.26,199.5,0.33,0.33,31
27500,"Janesville-Beloit, WI",718.1633683224,26.79857026638548,162152,5.21,225.79,2.353704703572165,131014,2.261096258132334,5.12,182.43,212854613.137019,271.22,9.03,262.19,179.49,1.86,190.39,0.06,0.06,18
27740,"Johnson City, TN",853.8076068093,29.219986427260707,202049,5.31,236.64,2.374088156652817,170408,2.300138778165712,5.23,199.59,372511020.452899,245.26,31.94,213.32,57.51,8.77,98.22,0.14,0.15,48
27780,"Johnstown, PA",687.5064132651,26.220343500135538,133009,5.12,193.47,2.286613631657004,112102,2.212347437988012,5.05,163.06,264903701.11142302,280.44,43.7,236.74,11.39,14.88,69.97,0.28,0.31,29
27980,"Kahului-Wailuku-Lahaina, HI",1161.5234902128,34.08113099961326,165979,5.22,142.9,2.15503222879097,135627,2.067331280208168,5.13,116.77,163825543.047575,296.86,45.13,251.73,14.16,23.31,82.6,0.32,0.34,15
28020,"Kalamazoo-Portage, MI",561.951939978,23.70552551575265,262745,5.42,467.56,2.66983734996128,215268,2.583278141686502,5.33,383.07,557337533.891886,213.61,35.08,178.53,42.06,5.44,82.58,0.12,0.13,48
28140,"Kansas City, MO-KS",7256.4683991228,85.18490710872906,2124518,6.33,292.78,2.466541406449534,1693777,2.368138064723547,6.23,233.42,2614874428.697272,248.48,27.1,221.38,49.28,12.4,88.79,0.12,0.17,307
28420,"Kennewick-Richland, WA",2941.7068409157,54.23750400705862,289527,5.46,98.42,1.993083360698062,219813,1.873436863222037,5.34,74.72,520886742.753264,273.99,17.14,256.85,10.65,8.8,36.59,0.11,0.11,44
28660,"Killeen-Temple, TX",2818.5911366184,53.09040531601167,444716,5.65,157.78,2.198051951724345,343820,2.086288629021682,5.54,121.98,366118522.386176,417.31,50.51,366.79,20.44,4.48,75.44,0.13,0.17,37
28700,"Kingsport-Bristol, TN-VA",2010.3780239829,44.837239254696534,306546,5.49,152.48,2.183212883294251,258397,2.109004507541385,5.41,128.53,313357484.99672997,272.92,8.85,264.06,55.35,9.55,73.75,0.03,0.05,33
28940,"Knoxville, TN",3220.3244182824,56.747902324952946,853337,5.93,264.98,2.423213095757849,707715,2.341968408179938,5.85,219.77,1031557678.180417,282.12,25.05,257.07,31.19,9.31,65.55,0.19,0.2,122
29180,"Lafayette, LA",3408.8454726183,58.38531898190075,489914,5.69,143.72,2.157517208532612,388742,2.057057208637422,5.59,114.04,441712927.82914203,295.28,28.36,266.92,17.27,5.36,50.99,0.16,0.16,60
29200,"Lafayette-West Lafayette, IN",1642.230504486,40.5244432964353,228541,5.36,139.16,2.143514420075551,188639,2.06020662106735,5.28,114.87,261980400.327699,293.39,48.05,245.34,20.36,7.48,75.89,0.09,0.11,29
29340,"Lake Charles, LA",2348.7094354581,48.46348558923615,208549,5.32,88.79,1.948364055988369,165100,1.846893543316625,5.22,70.29,165390234.617029,259.63,30.39,229.24,37.66,11.61,79.67,0.16,0.16,19
29460,"Lakeland-Winter Haven, FL",1797.7535667234,42.39992413582128,686218,5.84,381.71,2.581733537701078,559959,2.49343016602411,5.75,311.48,828049087.425861,313.27,27.95,285.32,18.56,4.14,50.64,0.12,0.14,80
29540,"Lancaster, PA",943.9186051152,30.723258373994124,540999,5.73,573.14,2.758260719351251,434487,2.663040974893974,5.64,460.3,742806544.677061,339.13,34.68,304.45,50.64,5.44,90.76,0.23,0.24,67
29620,"Lansing-East Lansing, MI",2228.590184535,47.20794620119583,546772,5.74,245.34,2.38976836093798,453939,2.30896970817825,5.66,203.69,421623513.648794,296.76,28.32,268.44,63.66,8.35,100.32,0.12,0.15,57
29700,"Laredo, TX",3361.4589084219,57.97808989973626,273526,5.44,81.37,1.910464315995614,197589,1.769229581736594,5.3,58.78,406941141.719777,384.77,26.99,357.77,37.08,16.14,80.22,0.19,0.21,34
29740,"Las Cruces, NM",3808.1675694348,61.71035220637458,216069,5.33,56.74,1.753889331459833,171446,1.653405490664501,5.23,45.02,361144412.086484,286.17,22.88,263.29,55.39,5.2,83.47,0.09,0.09,42
29820,"Las Vegas-Henderson-Paradise, NV",7891.6066690032,88.83471544955384,2182004,6.34,276.5,2.441695135640717,1756110,2.34738856792903,6.24,222.53,2323804472.074101,315.94,22.83,293.12,44.78,9.39,76.99,0.09,0.1,285
30340,"Lewiston-Auburn, ME",467.9495409303,21.63214138568579,107602,5.03,229.94,2.361614527024846,87983,2.274204048346953,4.94,188.02,188317231.018332,235.32,47.25,188.07,92.92,19.03,159.21,0.43,0.59,13
30460,"Lexington-Fayette, KY",1469.9091914793,38.33939477194834,510647,5.71,347.4,2.54082981411108,416644,2.452476461326989,5.62,283.45,647086954.969158,334.74,40.09,294.65,52.95,5.75,98.79,0.15,0.16,84
30780,"Little Rock-North Little Rock-Conway, AR",4083.7743374571,63.9044156334842,737015,5.87,180.47,2.256405018334166,592511,2.16163748070459,5.77,145.09,832316193.434533,279.62,29.81,249.82,83.76,8.64,122.21,0.09,0.11,108
30980,"Longview, TX",2680.6024255725,51.77453452782072,284796,5.45,106.24,2.026288062023942,225773,1.925415237084246,5.35,84.22,446258619.97589,263.92,61.37,202.55,28.73,1.15,91.24,0.18,0.18,41
31080,"Los Angeles-Long Beach-Anaheim, CA",4852.0957587102,69.65698643144276,13249614,7.12,2730.7,3.436273990326048,10834848,3.348892612838899,7.03,2233.02,12140098424.116796,287.92,23.18,264.74,48.36,9.1,80.64,0.09,0.12,1198
31140,"Louisville/Jefferson County, KY-IN",3236.9735016332997,56.89440659355979,1257088,6.1,388.35,2.589223309490553,1022007,2.49931584960033,6.01,315.73,1888918193.670652,269.45,34.26,235.18,37.94,7.24,79.45,0.14,0.16,221
31180,"Lubbock, TX",2687.6521482525,51.842570810604094,316474,5.5,117.75,2.070960915800934,252616,1.973081649601368,5.4,93.99,279402483.07243,408.27,80.35,327.92,51.8,17.35,149.5,0.15,0.2,30
31420,"Macon-Bibb County, GA",1723.580071785,41.516021868490725,229504,5.36,133.16,2.12437378648463,184576,2.029748918566837,5.27,107.09,242072919.867779,203.67,80.3,123.37,17.9,1.99,100.2,0.24,0.27,26
31540,"Madison, WI",3308.762112084,57.52184030508759,653725,5.82,197.57,2.295720999848835,540288,2.212959589036736,5.73,163.29,882472218.043806,248.32,24.91,223.42,25.17,16.72,66.8,0.12,0.16,80
31700,"Manchester-Nashua, NH",876.5207821655999,29.60609366609516,413035,5.62,471.22,2.673223714939716,343278,2.592887041895441,5.54,391.64,580694275.244085,296.55,51.38,245.17,45.9,11.79,109.07,0.14,0.15,57
32580,"McAllen-Edinburg-Mission, TX",1570.9477885101,39.635183719898414,855176,5.93,544.37,2.735894183405916,619974,2.596212107141384,5.79,394.65,1037734467.691409,307.79,17.77,290.02,59.78,12.0,89.55,0.11,0.13,89
32780,"Medford, OR",2783.2366881891,52.75639002233852,216574,5.34,77.81,1.891035415315311,179188,1.808750972349595,5.25,64.38,363698931.420281,262.27,22.75,239.52,32.33,17.36,72.45,0.06,0.1,43
32820,"Memphis, TN-MS-AR",4575.204521316,67.64025814051865,1339623,6.13,292.8,2.466571072386354,1061635,2.36556285679556,6.03,232.04,1508949867.117694,262.05,41.18,220.87,34.08,15.2,90.47,0.15,0.18,180
33100,"Miami-Fort Lauderdale-Pompano Beach, FL",5066.9050365648,71.18219606449917,6090660,6.78,1202.05,3.079922532785249,5059913,2.999400259698921,6.7,998.62,6732628115.71582,258.74,19.12,239.61,40.06,11.85,71.03,0.1,0.12,678
33340,"Milwaukee-Waukesha, WI",1454.8562100072,38.142577390721776,1575223,6.2,1082.73,3.034520170263935,1272745,2.941923667610981,6.1,874.83,1928785551.23893,294.0,21.1,272.9,35.71,9.55,66.36,0.09,0.1,187
33460,"Minneapolis-St. Paul-Bloomington, MN-WI",7047.638404092,83.95021384184795,3573609,6.55,507.06,2.70505935208908,2865293,2.609124647706294,6.46,406.56,4998460549.167333,280.7,21.61,259.09,48.29,5.99,75.9,0.1,0.11,528
33660,"Mobile, AL",2309.5641336768,48.0579247749713,430655,5.63,186.47,2.270608970823178,346782,2.176525336535,5.54,150.15,496444264.53539,257.65,36.79,220.86,43.19,7.04,87.03,0.15,0.17,60
33700,"Modesto, CA",1496.0090422133999,38.678276101881785,543194,5.73,363.1,2.560026248912892,420302,2.448629036430919,5.62,280.95,558032042.22623,346.56,27.5,319.06,40.47,7.5,75.47,0.18,0.19,44
33740,"Monroe, LA",2282.1854726385,47.77222490776937,203457,5.31,89.15,1.950121347511373,161869,1.850829959848531,5.21,70.93,201176155.052485,266.62,7.74,258.88,2.94,19.01,29.68,0.12,0.12,24
33780,"Monroe, MI",549.3501085644,23.438218971679568,149727,5.18,272.55,2.435446186363715,123597,2.352163215705443,5.09,224.99,367172495.420652,276.61,11.29,265.32,60.43,8.4,80.13,0.11,0.12,34
33860,"Montgomery, AL",2714.3901605106,52.09980960148127,373544,5.57,137.62,2.138681553510374,301413,2.04547945311078,5.48,111.04,563787221.035523,235.81,27.56,208.25,63.72,21.87,113.15,0.18,0.19,63
34060,"Morgantown, WV",1008.8998494003,31.763183867495083,139157,5.14,137.93,2.139658736208177,119110,2.072102778885176,5.08,118.06,168185678.743251,390.53,44.78,345.74,0.0,29.43,74.21,0.25,0.25,19
34580,"Mount Vernon-Anacortes, WA",1730.2364272908,41.59611072312891,125612,5.1,72.6,1.860936620700094,102580,1.772981450344964,5.01,59.29,378908698.834482,321.61,26.43,295.18,32.7,17.64,76.77,0.11,0.12,42
34740,"Muskegon, MI",503.9107524594,22.44795653192958,173297,5.24,343.9,2.536432175822013,140060,2.443966678374579,5.15,277.95,276249168.162108,267.2,29.9,237.3,22.94,6.62,59.46,0.12,0.16,31
34820,"Myrtle Beach-Conway-North Myrtle Beach, SC-NC",1983.3771702888,44.535122883953065,463987,5.67,233.94,2.369104485571629,396702,2.301051709845226,5.6,200.01,387205357.338113,325.41,41.06,284.36,25.39,1.9,68.34,0.12,0.13,59
34940,"Naples-Marco Island, FL",1996.9387196616,44.68712028830679,371453,5.57,186.01,2.269536292755967,318351,2.202542804793921,5.5,159.42,355276586.707905,227.99,8.83,219.16,63.1,8.88,80.82,0.04,0.04,39
34980,"Nashville-Davidson--Murfreesboro--Franklin, TN",5689.4140993833,75.42820493279221,1871903,6.27,329.02,2.517222298027907,1507868,2.423295036567116,6.18,265.03,2629801740.032772,265.76,32.88,232.88,56.34,8.73,97.94,0.13,0.13,278
35300,"New Haven-Milford, CT",604.3017995586,24.582550713028134,857513,5.93,1419.01,3.151985456013863,715373,3.073278335635835,5.85,1183.8,963416409.634016,267.87,51.77,216.1,56.23,11.86,119.86,0.21,0.27,113
35380,"New Orleans-Metairie, LA",3203.4429633492,56.598966097882034,1267777,6.1,395.75,2.597420923534393,1031378,2.507801918719564,6.01,321.96,1301287219.697081,319.3,42.23,277.07,31.94,6.17,80.35,0.14,0.15,171
35620,"New York-Newark-Jersey City, NY-NJ-PA",6684.2647381224,81.75735280769797,19294236,7.29,2886.52,3.46037457096666,15831221,3.374460553487459,7.2,2368.43,21985517297.502167,247.44,28.67,218.77,45.03,9.01,82.7,0.11,0.13,2033
35660,"Niles, MI",567.7777129167,23.828086639860533,154133,5.19,271.47,2.433721842932839,126247,2.347037133784954,5.1,222.35,230435998.90684,280.03,42.25,237.79,69.44,9.33,121.02,0.17,0.17,26
35840,"North Port-Sarasota-Bradenton, FL",1298.7566730567,36.03826678763423,803709,5.91,618.83,2.791571359517702,696023,2.729091860988937,5.84,535.91,544898338.8473899,380.89,14.27,366.62,34.6,3.82,52.7,0.1,0.14,62
35980,"Norwich-New London, CT",665.0616198798,25.788788647003177,267390,5.43,402.05,2.604280066452104,224773,2.528878151719388,5.35,337.97,418272131.768075,235.29,33.86,201.43,107.57,8.13,149.57,0.17,0.21,36
36100,"Ocala, FL",1588.4130606201,39.85490008292707,353526,5.55,222.57,2.347466625800622,298910,2.274573464196471,5.48,188.18,337610207.420197,348.6,14.79,333.81,64.41,0.29,79.49,0.13,0.14,45
36220,"Odessa, TX",897.8527110267,29.964190478414398,160579,5.21,178.85,2.252488944484988,119303,2.123459619443338,5.08,132.88,209610057.875349,301.17,32.83,268.35,52.92,3.01,88.76,0.11,0.17,18
36260,"Ogden-Clearfield, UT",7230.0638371104,85.02978205964308,662875,5.82,91.68,1.962274604623315,490935,1.831869774280502,5.69,67.9,886916478.578918,293.32,21.45,271.88,41.67,3.62,66.74,0.14,0.18,97
36420,"Oklahoma City, OK",5511.7060577864995,74.24086514707719,1382841,6.14,250.89,2.399483351504452,1096254,2.298634783124435,6.04,198.9,1818543906.59058,289.18,23.52,265.66,45.55,8.47,77.54,0.12,0.14,207
36540,"Omaha-Council Bluffs, NE-IA",4346.2896401925,65.92639562567106,931779,5.97,214.38,2.331184266586083,731051,2.225825991461893,5.86,168.2,1125063033.848035,303.26,25.51,277.75,41.31,6.6,73.42,0.11,0.13,145
36740,"Orlando-Kissimmee-Sanford, FL",3490.4805071994,59.08028865196412,2508970,6.4,718.8,2.856608068436936,2052496,2.769399483392635,6.31,588.03,2447275604.201786,273.05,29.48,243.57,49.17,15.54,94.19,0.11,0.12,262
36780,"Oshkosh-Neenah, WI",434.694457197,20.849327499873947,170411,5.23,392.02,2.593308224336954,141454,2.512430894876464,5.15,325.41,232792588.438204,251.31,35.54,215.78,51.96,13.73,101.23,0.15,0.2,25
37100,"Oxnard-Thousand Oaks-Ventura, CA",1840.7789128872,42.9042994685521,847263,5.93,460.27,2.663012668878219,685317,2.570893036218392,5.84,372.3,854765562.888666,322.67,57.73,264.94,27.2,6.3,91.23,0.13,0.15,86
37340,"Palm Bay-Melbourne-Titusville, FL",1014.9652498986,31.858519267200727,585507,5.77,576.87,2.761077954154481,497541,2.690373306916059,5.7,490.2,516917734.81537,203.54,12.33,191.21,23.88,1.21,37.42,0.04,0.04,45
37460,"Panama City, FL",758.6378645274,27.5433815013226,182161,5.26,240.12,2.380428334683836,149476,2.29453235734187,5.17,197.03,234869381.726324,208.6,4.02,204.58,8.57,13.15,25.74,0.06,0.06,30
37860,"Pensacola-Ferry Pass-Brent, FL",1669.3844495328,40.85810139412746,488246,5.69,292.47,2.466081325110001,401449,2.381078963242833,5.6,240.48,454247665.670805,223.94,35.17,188.76,64.92,3.05,103.14,0.17,0.18,53
37900,"Peoria, IL",3333.3145620489,57.7348643546419,406883,5.61,122.07,2.086608944572948,328913,1.994185128202317,5.52,98.67,600409094.857041,324.13,42.68,281.45,30.58,8.3,81.55,0.18,0.2,55
37980,"Philadelphia-Camden-Wilmington, PA-NJ-DE-MD",4603.1789570481,67.84673136598475,6079130,6.78,1320.64,3.120784447197322,4981024,3.034259370081267,6.7,1082.08,7201620087.336206,257.97,26.97,231.0,37.11,11.27,75.36,0.1,0.12,679
38060,"Phoenix-Mesa-Chandler, AZ",14567.7568140819,120.69696273760123,4761603,6.68,326.86,2.514361776370574,3810976,2.41763773965223,6.58,261.6,4991903987.730326,293.89,31.37,262.53,45.42,6.56,83.34,0.11,0.13,535
38220,"Pine Bluff, AR",2029.7307988386,45.052533767132346,90865,4.96,44.77,1.650987094383445,75062,1.567966906823154,4.88,36.98,423743978.868103,228.63,34.5,194.13,18.74,14.09,67.32,0.17,0.19,49
38300,"Pittsburgh, PA",5282.9067715281,72.6836073095447,2331447,6.37,441.32,2.644753609506606,1966787,2.570881370886279,6.29,372.29,2937854888.981431,270.56,24.8,245.76,38.08,9.48,72.36,0.12,0.14,295
38860,"Portland-South Portland, ME",2081.3667456581998,45.621998483825756,532075,5.73,255.64,2.407628808876518,449950,2.334815512506212,5.65,216.18,588643935.675279,261.44,13.44,248.0,34.82,4.48,52.74,0.07,0.08,67
38900,"Portland-Vancouver-Hillsboro, OR-WA",6687.4708549935,81.77695797101713,2445761,6.39,365.72,2.563148711095859,2005731,2.477005427413494,6.3,299.92,3307297225.556049,281.18,21.79,259.39,34.85,8.93,65.57,0.11,0.13,388
38940,"Port St. Lucie, FL",1115.4757053726,33.39873808054131,472012,5.67,423.15,2.626494345211047,399161,2.5536888851646,5.6,357.84,448444634.581867,249.29,42.03,207.26,35.82,19.11,96.96,0.13,0.13,50
39300,"Providence-Warwick, RI-MA",1586.9917261341,39.83706472789003,1618268,6.21,1019.71,3.008476678323536,1352992,2.930719858734711,6.13,852.55,1637499051.274731,283.51,43.29,240.22,67.12,3.95,114.35,0.16,0.18,192
39340,"Provo-Orem, UT",5395.7287502118,73.45562436064239,616791,5.79,114.31,2.058084224750925,441152,1.912540882790638,5.64,81.76,785434262.62738,312.82,20.14,292.68,24.06,8.9,53.09,0.13,0.14,86
39540,"Racine, WI",332.6396743098,18.23841205559848,195602,5.29,588.03,2.769399483392635,158122,2.677022634459589,5.2,475.36,330299405.587173,255.19,13.51,241.68,79.97,1.99,95.47,0.07,0.07,38
39580,"Raleigh-Cary, NC",2118.3940395189,46.026014812482956,1332311,6.12,628.93,2.798602311096355,1064319,2.701066919178094,6.03,502.42,1393446838.786352,296.13,28.96,267.18,56.14,6.7,91.8,0.14,0.16,172
39740,"Reading, PA",856.3977196632,29.264273776453088,418025,5.62,488.12,2.688526602599545,341000,2.600079442261521,5.53,398.18,483558899.06583303,265.62,33.06,232.56,44.89,4.35,82.29,0.18,0.19,48
39820,"Redding, CA",3775.4987634936,61.445087382911254,179212,5.25,47.47,1.67641923171836,147221,1.590953235187986,5.17,38.99,352730569.021739,308.71,23.65,285.06,54.69,2.88,81.23,0.17,0.17,28
40060,"Richmond, VA",4364.3424723327,66.06317031699811,1269530,6.1,290.89,2.46372879165109,1041472,2.377725041243148,6.02,238.63,1594301185.831017,229.88,23.6,206.28,53.02,12.21,88.83,0.13,0.18,167
40140,"Riverside-San Bernardino-Ontario, CA",27277.1271958185,165.15788566041434,4560470,6.66,167.19,2.223210297775863,3580658,2.118165485243124,6.55,131.27,4502928614.667431,291.81,22.47,269.34,35.45,9.97,67.9,0.09,0.13,397
40220,"Roanoke, VA",1867.557846726,43.21525016387155,313009,5.5,167.6,2.224274014294258,260604,2.144698718643125,5.42,139.54,376793099.668839,220.71,54.45,166.26,8.72,5.11,68.28,0.21,0.22,37
40380,"Rochester, NY",3265.9944571683,57.14887975427252,1072877,6.03,328.5,2.516535373895799,890434,2.435589573086606,5.95,272.64,1511685433.378861,305.7,44.04,261.66,36.76,14.01,94.81,0.18,0.2,142
40420,"Rockford, IL",793.7857598813999,28.17420380208463,338356,5.53,426.26,2.629674580607889,272325,2.535382742526886,5.44,343.07,402636439.191848,187.31,22.21,165.1,84.82,7.73,114.76,0.16,0.19,42
40900,"Sacramento-Roseville-Folsom, CA",5094.8992394586,71.37856288451457,2315980,6.36,454.57,2.657600770446638,1873714,2.565564490742253,6.27,367.76,2579054021.089683,312.06,36.99,275.07,44.06,10.04,91.09,0.13,0.15,251
40980,"Saginaw, MI",800.7921088596,28.29827042169892,191821,5.28,239.54,2.379378045219338,157981,2.295083059251656,5.2,197.28,204694916.156714,224.01,32.82,191.19,29.12,3.01,64.95,0.14,0.17,26
41100,"St. George, UT",2427.4250007579,49.268905008716196,165811,5.22,68.31,1.834484285334805,129334,1.726564216162245,5.11,53.28,191498949.215645,483.07,52.37,430.71,3.36,1.38,57.11,0.21,0.21,23
41180,"St. Louis, MO-IL",7863.6231684153,88.67707239425138,2805190,6.45,356.73,2.552339633831198,2287614,2.463758650329817,6.36,290.91,3226438485.022638,262.2,26.53,235.67,38.21,9.77,74.5,0.13,0.15,366
41420,"Salem, OR",1922.0101996095,43.84073675942844,422678,5.63,219.91,2.34224497854712,336861,2.243682807357193,5.53,175.26,544096320.711977,346.35,42.53,303.82,20.49,7.73,70.75,0.13,0.13,63
41500,"Salinas, CA",3281.7044526552,57.28616283759281,433410,5.64,132.07,2.120804177840797,337504,2.012162067970823,5.53,102.84,373164844.47601,250.13,19.19,230.93,40.23,4.24,63.67,0.07,0.07,37
41540,"Salisbury, MD-DE",2098.724719806,45.81184038876849,404417,5.61,192.7,2.284881714655453,339326,2.208656300507247,5.53,161.68,320434904.583428,299.82,17.74,282.08,29.94,7.11,54.79,0.11,0.13,33
41620,"Salt Lake City, UT",7683.9729874479,87.65827392464388,1201043,6.08,156.3,2.193958978019187,921631,2.078964044501761,5.96,119.94,1515792601.7604501,301.79,31.14,270.65,34.49,12.18,77.81,0.18,0.21,188
41700,"San Antonio-New Braunfels, TX",7313.1422281632,85.51691194239417,2468193,6.39,337.5,2.528273777167044,1947806,2.42543639540901,6.29,266.34,2731336700.1615562,277.09,32.93,244.16,49.74,7.64,90.31,0.13,0.14,275
41740,"San Diego-Chula Vista-Carlsbad, CA",4210.2101747277,64.88613237609174,3316073,6.52,787.63,2.896322249602097,2710720,2.808777954703796,6.43,643.84,3196748196.799463,302.46,30.88,271.58,47.01,8.44,86.33,0.13,0.15,318
41860,"San Francisco-Oakland-Berkeley, CA",2470.3352875773,49.70246762060511,4701332,6.67,1903.11,3.279463891288785,3921140,3.200656280185128,6.59,1587.29,4966446425.512478,274.68,18.98,255.69,51.67,7.42,78.07,0.07,0.1,501
41940,"San Jose-Sunnyvale-Santa Clara, CA",2679.7207967244,51.76601971104597,1987846,6.3,741.81,2.870292683556552,1616945,2.78060530583897,6.21,603.4,2026011226.281151,275.49,16.47,259.02,36.4,15.89,68.76,0.08,0.09,190
42020,"San Luis Obispo-Paso Robles, CA",3300.8356304352,57.452899234374584,282165,5.45,85.48,1.931864513492032,240564,1.862608363964942,5.38,72.88,229917868.533003,295.05,20.11,274.94,59.92,7.87,87.9,0.05,0.07,30
42100,"Santa Cruz-Watsonville, CA",445.1051857824,21.097516104565486,273962,5.44,615.5,2.789228057267335,230034,2.713330908436722,5.36,516.81,344639664.770914,224.42,24.02,200.39,62.46,10.57,97.05,0.12,0.13,39
42140,"Santa Fe, NM",1910.3692429107,43.70777096707975,149293,5.17,78.15,1.892928982355206,126817,1.822037248072585,5.1,66.38,234502200.935476,204.05,29.52,174.53,55.41,25.64,110.57,0.1,0.1,30
42200,"Santa Maria-Santa Barbara, CA",2733.9201977373,52.28690273612791,444829,5.65,162.71,2.211414245077976,361625,2.121461353545985,5.56,132.27,319010432.804336,263.1,23.19,239.91,63.2,18.61,105.0,0.13,0.15,33
42220,"Santa Rosa-Petaluma, CA",1575.6209498601,39.694092127923774,499772,5.7,317.19,2.501319486926531,418178,2.423917281991123,5.62,265.41,449227076.448016,272.36,37.53,234.83,29.91,10.88,78.32,0.14,0.14,47
42340,"Savannah, GA",1349.5025674844999,36.735576318937746,386036,5.59,286.06,2.456457134303779,311359,2.363085243039335,5.49,230.72,443243838.24470997,313.37,26.59,286.78,9.69,3.09,39.36,0.08,0.08,45
42540,"Scranton--Wilkes-Barre, PA",1746.0418964274,41.785666159909425,555642,5.74,318.23,2.502741118806208,464770,2.425175420725635,5.67,266.18,611980614.902139,306.28,29.78,276.5,85.95,9.65,125.38,0.14,0.18,63
42660,"Seattle-Tacoma-Bellevue, WA",5869.6839500013,76.61386264900955,3871323,6.59,659.55,2.819247724675388,3169859,2.73242592859317,6.5,540.04,5329900501.161691,250.91,27.94,222.98,35.47,9.98,73.39,0.1,0.11,543
43300,"Sherman-Denison, TX",932.8305470913,30.54227475305826,131014,5.12,140.45,2.147521743537597,105118,2.051885378889872,5.02,112.69,224772089.381888,397.87,8.61,389.26,46.47,10.15,65.23,0.1,0.13,21
43340,"Shreveport-Bossier City, LA",2595.4226879724,50.94529112658402,399619,5.6,153.97,2.187436109773708,318404,2.088773767310448,5.5,122.68,440515487.091238,237.04,37.46,199.58,18.31,4.62,60.4,0.19,0.19,61
43620,"Sioux Falls, SD",2575.3861840707,50.74826286751794,259348,5.41,100.7,2.003029470553618,202099,1.89470365260923,5.31,78.47,409963926.655078,285.98,102.93,183.05,25.74,16.78,145.45,0.3,0.31,46
43780,"South Bend-Mishawaka, IN-MI",947.879874513,30.787657827658798,321739,5.51,339.43,2.530750224129781,260073,2.438336623263845,5.42,274.37,401335094.589471,249.51,54.37,195.14,116.81,3.22,174.4,0.1,0.12,36
43900,"Spartanburg, SC",808.3684229049,28.431820604824093,307617,5.49,380.54,2.580400313843089,248451,2.487633217456876,5.4,307.35,260035890.29795,220.31,12.12,208.19,66.23,7.65,86.0,0.12,0.12,34
44060,"Spokane-Spokane Valley, WA",4241.2936305168,65.12521501320974,550160,5.74,129.72,2.113006940000935,448883,2.024649831179445,5.65,105.84,610512374.71735,302.08,33.09,268.99,28.82,6.42,68.33,0.13,0.14,78
44100,"Springfield, IL",1182.6409799061,34.38954753854868,209167,5.32,176.86,2.247629620679114,170607,2.159145927854047,5.23,144.26,328953768.608874,276.94,34.19,242.75,59.08,3.92,97.18,0.1,0.1,38
44140,"Springfield, MA",1843.432998264,42.93521862368934,699480,5.84,379.44,2.579143111643815,587338,2.503259402590862,5.77,318.61,808028897.582353,197.55,40.21,157.35,38.1,8.19,86.5,0.21,0.25,84
44180,"Springfield, MO",3006.9424934406,54.835595131635074,462434,5.67,153.79,2.186928096934767,375684,2.096701501610003,5.57,124.94,780864692.485255,336.45,21.61,314.85,10.81,2.85,35.27,0.09,0.09,66
44700,"Stockton, CA",1392.3625080222,37.314374013538,742603,5.87,533.34,2.727004156583357,574484,2.615529223637133,5.76,412.6,715710779.242738,231.67,19.18,212.49,24.83,9.64,53.64,0.08,0.09,70
45060,"Syracuse, NY",2384.8753039254,48.83518510178292,652416,5.81,273.56,2.437052595060992,539494,2.354511799744273,5.73,226.21,729551579.466223,269.3,38.89,230.41,32.8,5.68,77.37,0.21,0.22,72
45220,"Tallahassee, FL",2389.2887408247,48.880351275586186,382197,5.58,159.96,2.204011395461484,321454,2.128851423346783,5.51,134.54,459633338.798627,231.39,15.28,216.11,82.28,9.28,106.84,0.09,0.14,48
45300,"Tampa-St. Petersburg-Clearwater, FL",2515.1646663,50.15141739073782,3097859,6.49,1231.67,3.090494363366782,2586099,3.012077599531015,6.41,1028.2,3121492614.778521,276.74,30.63,246.11,52.64,9.48,92.75,0.14,0.17,349
45460,"Terre Haute, IN",1909.9571966046,43.7030570624596,186908,5.27,97.86,1.990605211423919,154521,1.907948521612272,5.19,80.9,376577390.149134,301.57,20.76,280.81,18.58,13.01,52.34,0.1,0.1,38
45780,"Toledo, OH",1616.9672938419,40.21153185147141,644137,5.81,398.36,2.600275723698921,524985,2.511442161011648,5.72,324.67,533260618.856179,271.66,44.34,227.32,71.39,13.46,129.2,0.18,0.24,69
45820,"Topeka, KS",3232.6952545602,56.85679602791736,232778,5.37,72.01,1.857392810920901,187073,1.762453482363547,5.27,57.87,298518317.033139,284.14,47.31,236.82,38.25,1.09,86.66,0.15,0.17,37
45940,"Trenton-Princeton, NJ",224.4390678387,14.981290593226607,367922,5.57,1639.3,3.214658438879918,303257,3.130713208237078,5.48,1351.18,410622968.073427,299.63,38.78,260.85,49.21,29.91,117.9,0.14,0.28,47
46060,"Tucson, AZ",9188.638564248,95.85738659199926,1027207,6.01,111.79,2.04840295615274,847479,1.964872208637775,5.93,92.23,1212835308.112176,322.55,14.38,308.17,36.8,12.89,64.07,0.1,0.11,156
46140,"Tulsa, OK",6270.1913143584,79.18453961701363,990544,6.0,157.98,2.198602109489712,786377,2.098366796439331,5.9,125.42,1304300293.331548,284.17,30.68,253.49,44.63,11.92,87.24,0.1,0.11,153
46340,"Tyler, TX",921.4679159829,30.35569000999483,227449,5.36,246.83,2.392397943216372,180770,2.292654730197987,5.26,196.18,297602065.362984,233.32,5.5,227.82,50.89,15.11,71.5,0.05,0.05,29
46520,"Urban Honolulu, HI",600.6220348986,24.507591372850168,984821,5.99,1639.67,3.214756450730583,807474,3.12852850379744,5.91,1344.4,829063154.867701,357.46,32.74,324.73,17.88,15.81,66.43,0.15,0.16,91
46540,"Utica-Rome, NY",2623.855866489,51.22358701310364,292016,5.47,111.29,2.046456142412592,241031,1.963126441081905,5.38,91.86,329418819.53870803,185.66,13.76,171.89,74.29,4.3,92.35,0.09,0.12,32
46700,"Vallejo, CA",821.8245384063,28.667482247422775,441829,5.65,537.62,2.730475416534002,359655,2.641107085692552,5.56,437.63,306016188.270591,322.0,47.14,274.87,100.7,9.71,157.55,0.16,0.23,39
47220,"Vineland-Bridgeton, NJ",483.35791393889997,21.985402291950447,151906,5.18,314.27,2.497302925540968,121649,2.400831449116225,5.09,251.67,129891113.81012401,351.23,20.51,330.72,22.58,0.0,43.1,0.07,0.1,15
47260,"Virginia Beach-Norfolk-Newport News, VA-NC",3530.3744337147,59.416954093210634,1761729,6.25,499.02,2.698117951867031,1436659,2.609530380749014,6.16,406.94,2256235949.461038,222.71,34.71,188.0,32.38,9.54,76.63,0.14,0.16,204
47300,"Visalia, CA",4823.8719541155,69.45409962065234,461898,5.66,95.75,1.98113878264066,342228,1.850891184135924,5.53,70.94,663647957.674276,294.28,38.64,255.64,48.09,10.75,97.48,0.19,0.2,57
47380,"Waco, TX",1802.140124499,42.45162098788455,268361,5.43,148.91,2.172923863628545,213687,2.073974819866658,5.33,118.57,266302831.683547,319.65,45.44,274.2,13.5,3.61,62.56,0.33,0.37,25
47580,"Warner Robins, GA",526.3272350622,22.94182283651846,180652,5.26,343.23,2.535585240321913,143043,2.434217494305148,5.16,271.78,173860254.380656,334.3,66.17,268.13,35.38,4.9,106.45,0.16,0.16,23
47900,"Washington-Arlington-Alexandria, DC-VA-MD-WV",6567.6491809929,81.0410339333902,6196585,6.79,943.5,2.97474190450095,5003364,2.881852369973158,6.7,761.82,8364512953.992022,255.86,25.73,230.13,47.19,12.07,85.0,0.11,0.12,824
47940,"Waterloo-Cedar Falls, IA",1503.082852128,38.769612483593384,169556,5.23,112.81,2.052347599224664,138464,1.964353929292193,5.14,92.12,484882336.596077,279.68,30.35,249.33,40.02,21.02,91.38,0.15,0.15,57
48060,"Watertown-Fort Drum, NY",1268.6972031162,35.61877599126898,112842,5.05,88.94,1.949097125112916,89439,1.848189116991399,4.95,70.5,445375287.230832,214.13,28.89,185.25,59.59,6.89,95.36,0.09,0.1,38
48140,"Wausau-Weston, WI",2423.8849490856,49.23296608051967,163140,5.21,67.31,1.828079590556746,133422,1.740678425227455,5.13,55.04,177923520.815667,242.05,4.58,237.47,37.57,11.91,54.06,0.01,0.01,20
48620,"Wichita, KS",4148.0427538836,64.40530066604457,637690,5.8,153.73,2.186758627181614,501171,2.082138831393447,5.7,120.82,860206666.051182,317.56,22.27,295.29,24.9,5.63,52.8,0.16,0.18,97
48660,"Wichita Falls, TX",2619.626720139,51.18228912562431,150715,5.18,57.53,1.759894374025499,122538,1.670060217473134,5.09,46.78,276258016.248447,267.88,36.27,231.61,69.66,0.0,105.93,0.04,0.06,29
48700,"Williamsport, PA",1228.9125849858,35.0558495116835,114330,5.06,93.03,1.968623020956989,94860,1.887561040930009,4.98,77.19,279643063.699061,292.32,13.0,279.32,35.22,5.79,54.01,0.13,0.15,26
49020,"Winchester, VA-WV",1062.7236048429,32.599441787289855,137621,5.14,129.5,2.112269768417271,112263,2.023828392534886,5.05,105.64,336322418.688705,343.7,17.38,326.33,47.91,3.09,68.37,0.08,0.09,37
49180,"Winston-Salem, NC",2009.0036284461,44.8219101383029,666216,5.82,331.62,2.520640714965419,543638,2.432327792261604,5.74,270.6,701717148.979776,307.65,40.13,267.51,40.89,3.64,84.67,0.18,0.19,84
49340,"Worcester, MA-CT",2023.5907211949,44.984338621290185,941338,5.97,465.18,2.667621034353151,779325,2.585596072930955,5.89,385.12,1173001027.700756,236.28,33.34,202.94,37.56,10.07,80.97,0.13,0.14,134
49620,"York-Hanover, PA",904.3604747892,30.072586765843738,445565,5.65,492.69,2.692573747602913,364186,2.604981629607432,5.56,402.7,715540521.757544,295.82,64.16,231.66,19.77,1.66,85.6,0.22,0.23,56
49660,"Youngstown-Warren-Boardman, OH-PA",1702.0994071653,41.256507452343804,541846,5.73,318.34,2.502891211941244,453138,2.425240679100198,5.66,266.22,677770802.242129,300.69,50.46,250.22,22.81,1.28,74.55,0.16,0.18,75
49740,"Yuma, AZ",5513.8071460329,74.2550142820867,209468,5.32,37.99,1.57966929355472,164945,1.475816413031318,5.22,29.91,334083850.249534,446.17,56.03,390.14,31.53,3.33,90.89,0.2,0.2,37
