GESTFIPS,NAME,ALAND,SQRT_ALAND,POP,LOG_POP,POP_DEN,L_POPDEN,POP15,L_POP15DEN,LOG_POP15,POP15_DEN,TUFINLWGT,AVG_TRTFAMILY,AVG_TRTNHFAMILY,AVG_TRTHHFAMILY,AVG_TRTFRIEND,AVG_TRTCCC,AVG_TRTSOCIAL,AVG_RATIO_NHFAMILY_SOCIAL,AVG_NHFAMILY_IX,RESP_COUNT
1,AL,50646.8453588955,225.04854000614068,4876250,6.69,96.28,1.983536081602992,3971543,1.894426837964188,6.6,78.42,6037043857.033162,270.7,37.73,232.97,35.81,10.21,83.75,0.16,0.19,753
2,AK,571019.1625470618,755.6580989753645,737068,5.87,1.29,0.110589710299249,581752,0.008600171761918,5.76,1.02,641441295.184542,295.78,22.52,273.26,68.53,10.18,101.23,0.14,0.14,71
4,AZ,113652.7787312775,337.1242778728306,7050299,6.85,62.03,1.792601781164966,5694029,1.699837725867246,6.76,50.1,7666202030.204549,306.42,29.38,277.04,39.8,7.25,76.43,0.12,0.14,837
5,AR,51992.5543784361,228.01875883013682,2999370,6.48,57.69,1.761100538958142,2415056,1.666985718329661,6.38,46.45,3707567116.518712,273.94,32.46,241.48,46.69,8.59,87.74,0.15,0.17,453
6,CA,155857.4487902718,394.7878528909822,39283497,7.59,252.05,2.401486701774169,31788280,2.309545003295436,7.5,203.96,38841306460.15386,289.84,25.77,264.08,43.45,9.85,79.06,0.1,0.13,3729
8,CO,103636.4782028004,321.9261999322211,5610349,6.75,54.13,1.733438027091061,4562111,1.643650038217329,6.66,44.02,6369744863.202282,249.21,24.17,225.04,40.05,13.61,77.83,0.09,0.11,663
9,CT,4842.3459360276,69.58696671092655,3575074,6.55,738.29,2.868226986024752,2971941,2.787984428992206,6.47,613.74,4111323048.870032,244.37,37.17,207.2,58.39,7.66,103.22,0.15,0.19,463
10,DE,1948.5430545438,44.1423045903111,957248,5.98,491.26,2.691311403893644,788438,2.607058079006844,5.9,404.63,979910068.209705,266.27,43.74,222.53,17.16,9.91,70.8,0.18,0.21,112
11,DC,61.1258554764,7.818302595602193,692683,5.84,11332.08,4.054309631806387,584437,3.98051285703239,5.77,9561.21,993158212.864372,134.94,20.89,114.05,72.88,17.37,111.13,0.1,0.13,106
12,FL,53651.8707955659,231.62873482270263,20901636,7.32,389.58,2.5905966532564,17443274,2.512043686267806,7.24,325.12,21236868125.25434,270.95,25.13,245.82,43.45,9.92,78.5,0.11,0.13,2234
13,GA,57716.6353033842,240.24286733092453,10403847,7.02,180.26,2.255899366730459,8332312,2.159476956474234,6.92,144.37,12522033531.64476,280.31,30.24,250.07,32.62,13.89,76.75,0.12,0.14,1261
15,HI,6422.4442207926,80.14015361098704,1422094,6.15,221.43,2.34523646004688,1164785,2.258541507118461,6.07,181.36,1140377378.889493,328.33,37.42,290.91,22.08,14.96,74.46,0.17,0.18,130
16,ID,82644.6754618056,287.47986966360895,1717750,6.23,20.78,1.317645543221159,1351951,1.213783299335304,6.13,16.36,1993651744.791057,363.82,36.27,327.56,33.75,6.23,76.24,0.14,0.16,272
17,IL,55512.8638125633,235.61168012762715,12770631,7.11,230.05,2.361822237600815,10384870,2.272004146243442,7.02,187.07,16786464592.145676,257.66,26.87,230.79,43.87,13.54,84.28,0.12,0.14,1577
18,IN,35825.8322146725,189.2771307228438,6665703,6.82,186.06,2.26965301662097,5366022,2.175453826250483,6.73,149.78,9029911243.787533,296.69,32.59,264.1,34.28,9.95,76.82,0.14,0.15,980
19,IA,55853.1058642128,236.33261701299887,3139508,6.5,56.21,1.749813585292938,2533414,1.65667304588485,6.4,45.36,4341507598.374283,304.01,36.37,267.64,38.43,9.85,84.65,0.15,0.18,580
20,KS,81758.1336371514,285.9337924015827,2910652,6.46,35.6,1.551449997972875,2318822,1.452706226511029,6.37,28.36,4046320188.349838,289.89,34.98,254.9,28.47,7.36,70.81,0.14,0.16,477
21,KY,39491.387566487996,198.7244010344175,4449052,6.65,112.66,2.051769746899332,3611642,1.961183709812436,6.56,91.45,5601722841.663073,307.59,41.34,266.26,35.47,6.91,83.72,0.17,0.19,696
22,LA,43209.9859115925,207.87011788997594,4664362,6.67,107.95,2.03322264667025,3743565,1.937718443617264,6.57,86.64,4786162260.356538,284.77,36.91,247.87,37.22,6.4,80.53,0.17,0.18,613
23,ME,30844.9224260892,175.6272257541216,1335492,6.13,43.3,1.636487896353365,1129226,1.563599728881531,6.05,36.61,1772769620.599343,254.51,16.54,237.97,47.14,5.6,69.27,0.12,0.14,181
24,MD,9711.146954866499,98.54515185876218,6018848,6.78,619.79,2.792244564836703,4905915,2.7034461485706,6.69,505.18,7922821321.892455,251.04,23.71,227.34,39.16,9.37,72.23,0.11,0.12,715
25,MA,7800.9176423178,88.32280363710042,6850553,6.84,878.17,2.943578596675224,5727991,2.86585578464168,6.76,734.27,7636196783.727976,252.14,26.45,225.68,42.92,8.45,77.82,0.11,0.13,887
26,MI,56607.8987098053,237.92414486513405,9965265,7.0,176.04,2.245611359890908,8179772,2.159867847092567,6.91,144.5,12542506253.13141,280.74,36.71,244.03,50.13,7.55,94.38,0.14,0.17,1291
27,MN,79626.236037777,282.18121134791556,5563378,6.75,69.87,1.844290743254343,4483169,1.750508394851346,6.65,56.3,7610211970.918082,301.59,25.29,276.3,39.67,6.77,71.73,0.11,0.12,804
28,MS,46923.693541510496,216.61877467456623,2984418,6.47,63.6,1.803457115648414,2394166,1.707740454273771,6.38,51.02,3590114344.420164,290.47,40.62,249.86,34.26,6.63,81.51,0.16,0.18,446
29,MO,68746.0948349175,262.19476507916306,6104910,6.79,88.8,1.948412965778601,4960348,1.858236335429513,6.7,72.15,7140042227.550008,265.05,31.77,233.29,38.86,10.14,80.76,0.13,0.16,760
30,MT,145549.5354908595,381.5095483613215,1050649,6.02,7.22,0.858537197569639,860460,0.771587480881255,5.93,5.91,1133249615.284128,289.03,17.03,272.0,40.95,5.58,63.57,0.09,0.11,151
31,NE,76817.4419203191,277.1595964788503,1914571,6.28,24.92,1.396548037987132,1517797,1.295786940251609,6.18,19.76,2408734130.956536,304.1,22.08,282.03,38.16,7.54,67.77,0.13,0.15,303
32,NV,109859.8377246084,331.4511091014909,2972382,6.47,27.06,1.432327792261604,2404930,1.340245761567932,6.38,21.89,2913781275.364187,304.43,22.24,282.19,44.57,9.16,75.97,0.09,0.11,366
33,NH,8953.7030069058,94.62400861782278,1348124,6.13,150.57,2.177738450401719,1137354,2.103906298088718,6.06,127.03,1564253226.578767,277.6,33.03,244.57,39.46,10.01,82.5,0.11,0.13,178
34,NJ,7354.7176085955,85.75965023596761,8878503,6.95,1207.18,3.081772031636992,7262559,2.99452391034167,6.86,987.47,10880572781.484423,255.51,33.12,222.4,41.41,10.08,84.61,0.12,0.14,1061
35,NM,121312.0643770035,348.29881477978574,2092454,6.32,17.25,1.236789099409293,1687437,1.143327129992046,6.23,13.91,2553148917.724398,257.53,25.88,231.65,29.59,5.46,60.93,0.11,0.13,356
36,NY,47123.3200044321,217.07906394775176,19572319,7.29,415.34,2.618403758566513,16166313,2.535370083279166,7.21,343.06,20953215277.684425,264.17,30.21,233.96,44.97,8.19,83.38,0.13,0.15,1950
37,NC,48622.7412455499,220.5056490105183,10264876,7.01,211.11,2.324508805747058,8366125,2.235679918564692,6.92,172.06,11456849404.601873,281.74,40.11,241.64,40.78,9.06,89.94,0.17,0.19,1224
38,ND,68995.4742280089,262.669895930251,756717,5.88,10.97,1.040206627574711,606809,0.943988875073772,5.78,8.79,914781160.704437,280.13,42.64,237.49,41.5,8.0,92.13,0.17,0.19,120
39,OH,40858.5306101544,202.13493169206157,11655397,7.07,285.26,2.455240877870955,9508298,2.366815046163848,6.98,232.71,15494350604.348022,281.1,27.8,253.31,39.79,10.29,77.87,0.13,0.14,1412
40,OK,68596.1439385365,261.90865571518725,3932870,6.59,57.33,1.758381941774675,3133998,1.659821158055705,6.5,45.69,5135004226.512404,285.48,27.72,257.76,40.24,8.38,76.33,0.12,0.14,591
41,OR,95995.4356121904,309.83130185988375,4129803,6.62,43.02,1.633670406051444,3409883,1.550472957106563,6.53,35.52,5294064482.30828,281.08,30.22,250.86,41.24,9.99,81.45,0.12,0.14,659
42,PA,44742.014742496496,211.52308323796836,12791530,7.11,285.9,2.456214155357989,10599727,2.374583392732725,7.03,236.91,16263828877.846577,274.81,27.75,247.06,38.99,10.06,76.8,0.13,0.15,1530
44,RI,1033.8828344559,32.1540484924667,1057231,6.02,1022.58,3.009697294380565,887349,2.933623932445513,5.95,858.27,1158491248.974945,265.44,54.48,210.97,82.39,2.46,139.33,0.18,0.2,129
45,SC,30064.1137845048,173.39006253100206,5020806,6.7,167.0,2.222716471147583,4106800,2.135450699345514,6.61,136.6,5325560015.849863,293.37,31.53,261.83,38.17,5.16,74.86,0.14,0.16,759
46,SD,75809.1876216246,275.3346829253892,870638,5.94,11.48,1.059941888061955,690320,0.959518376972998,5.84,9.11,1227943086.531715,295.88,60.52,235.36,33.45,11.9,105.87,0.17,0.19,141
47,TN,41232.2546182833,203.0572693066744,6709356,6.83,162.72,2.211440935578669,5462105,2.122117536313263,6.74,132.47,8335427070.663092,280.49,33.13,247.36,45.16,11.32,89.61,0.13,0.15,954
48,TX,261266.3753796954,511.14222617554833,28260856,7.45,108.17,2.034106829707644,22146454,1.928242183157309,7.35,84.77,31932199878.994835,289.23,28.41,260.82,37.79,9.36,75.56,0.12,0.14,3033
49,UT,82376.38817874179,287.0128711029207,3096848,6.49,37.59,1.575072325713812,2323671,1.450403086155366,6.37,28.21,4090550775.797337,315.08,26.31,288.77,34.02,9.41,69.74,0.15,0.18,458
50,VT,9217.396722748499,96.0072743220455,624313,5.8,67.73,1.830781075606361,529189,1.758987546867619,5.72,57.41,769408860.842612,301.23,28.27,272.96,33.14,11.83,73.23,0.15,0.15,80
51,VA,39481.8835134438,198.70048694817987,8454463,6.93,214.14,2.330697798339304,6904475,2.242740144605627,6.84,174.88,11279280860.47517,260.36,29.26,231.1,41.76,9.38,80.4,0.12,0.15,1110
53,WA,66454.7444173899,257.78817741973717,7404107,6.87,111.42,2.046963154123424,6031108,1.957894487212898,6.78,90.76,9396449067.87801,276.71,24.13,252.58,40.73,8.39,73.25,0.1,0.11,966
54,WV,24041.0171809665,155.0516597169037,1817305,6.26,75.59,1.878464345341469,1512469,1.798719685185006,6.18,62.91,2645242048.35961,305.02,35.12,269.9,36.86,6.8,78.78,0.17,0.19,268
55,WI,54166.8364446924,232.73769880423842,5790716,6.76,106.91,2.029018329546481,4734360,1.941511432634403,6.68,87.4,7672982257.269082,286.04,38.02,248.02,42.8,8.09,88.91,0.15,0.17,769
56,WY,97088.20881014969,311.58980857876224,581024,5.76,5.98,0.776701183988411,466549,0.682145076373832,5.67,4.81,816854470.334523,272.47,35.98,236.49,36.48,5.11,77.58,0.16,0.17,85
