Division,WeightClassKg,Place,Name,Team,BodyweightKg,Best3SquatKg,Best3BenchKg,Best3DeadliftKg,TotalKg,Equipment,Event,Sex,BirthDate
Girls,44.23,1,Leah Mancillas,Andrews,35.38,61.23,29.48,56.7,147.42,Unlimited,SBD,F,
Girls,51.94,1,Brynlee Dutton,Midland Greenwood,50.17,83.91,47.63,81.65,213.19,Unlimited,SBD,F,
Girls,51.94,2,Mica Shyrock,Andrews,47.94,77.11,31.75,90.72,199.58,Unlimited,SBD,F,
Girls,56.02,1,Analucia Arguello,Andrews,55.11,47.63,29.48,70.31,147.42,Unlimited,SBD,F,
Girls,56.02,DQ,Isabella Rodriguez,Andrews,54.84,,43.09,88.45,,Unlimited,SBD,F,
Girls,60.1,1,Kim Olivas,Midland Greenwood,59.83,99.79,40.82,111.13,251.74,Unlimited,SBD,F,
Girls,60.1,2,Juanita Cuellar,Big Spring,59.87,81.65,43.09,102.06,226.8,Unlimited,SBD,F,
Girls,60.1,3,Neela Driver,Andrews,56.06,79.38,38.56,92.99,210.92,Unlimited,SBD,F,
Girls,67.36,1,Myka Ditmore,Midland Greenwood,65.86,120.2,70.31,136.08,326.59,Unlimited,SBD,F,
Girls,67.36,2,Lyleanna Chavarria,Andrews,65.63,90.72,47.63,90.72,229.06,Unlimited,SBD,F,
Girls,67.36,3,Arielle Viera,Big Spring,67.31,81.65,31.75,95.25,208.65,Unlimited,SBD,F,
Girls,67.36,DQ,Elena Urquidez,Andrews,62.78,,52.16,127.01,,Unlimited,SBD,F,
Girls,75.07,1,Tara Porter,Big Spring,72.44,99.79,56.7,108.86,265.35,Unlimited,SBD,F,
Girls,75.07,2,Zoe Cigarroa,Big Spring,71.71,106.59,52.16,97.52,256.28,Unlimited,SBD,F,
Girls,75.07,3,Allison Hillhouse,Big Spring,73.94,90.72,49.9,111.13,251.74,Unlimited,SBD,F,
Girls,75.07,4,Hazel Rangel,Big Spring,71.3,83.91,61.23,88.45,233.6,Unlimited,SBD,F,
Girls,75.07,5,Elena Bentley,Midland Greenwood,72.67,83.91,34.02,113.4,231.33,Unlimited,SBD,F,
Girls,82.33,1,Angel Smith,Midland Greenwood,77.47,136.08,68.04,136.08,340.19,Unlimited,SBD,F,
Girls,82.33,2,Angel Evans,Big Spring,76.25,106.59,54.43,106.59,267.62,Unlimited,SBD,F,
Girls,90.04,1,Rilee Gonzales,Big Spring,83.91,106.59,58.97,111.13,276.69,Unlimited,SBD,F,
Girls,90.04,2,JoJo Gonzalez,Big Spring,89.13,99.79,52.16,111.13,263.08,Unlimited,SBD,F,
Girls,90.04,3,Daliyah O'Hara,Big Spring,89.13,52.16,47.63,102.06,201.85,Unlimited,SBD,F,
Girls,100.02,1,Nina Garcia,Andrews,90.85,113.4,58.97,111.13,283.5,Unlimited,SBD,F,
Girls,110,DQ,Cloey Hughes,Andrews,108.18,,58.97,92.99,,Unlimited,SBD,F,
Girls,110,DQ,Alexsandra Gallegos,Andrews,105.55,,68.04,106.59,,Unlimited,SBD,F,
