Division,WeightClassKg,Place,Name,Team,BodyweightKg,Best3SquatKg,Best3BenchKg,Best3DeadliftKg,TotalKg,Equipment,Event,Sex,BirthDate
Girls,44.23,1,Payton Wells,Troup,44.18,92.99,52.16,117.93,263.08,Unlimited,SBD,F,
Girls,44.23,2,Madison Bradshaw,Tyler Chapel Hill,43.45,74.84,49.9,102.06,226.8,Unlimited,SBD,F,
Girls,44.23,3,Ella Reese,Whitehouse,42.59,61.23,40.82,61.23,163.29,Unlimited,SBD,F,
Girls,47.85,1,Kamerin Ortiz,Bullard,45.09,49.9,20.41,74.84,145.15,Unlimited,SBD,F,
Girls,47.85,2,Landry Henington,Lindale,47.85,49.9,20.41,68.04,138.35,Unlimited,SBD,F,
Girls,47.85,DQ,Lyric Garrigan,Arp,47.26,52.16,,79.38,,Unlimited,SBD,F,
Girls,51.94,1,Jaycee Eastman,Troup,51.94,99.79,49.9,111.13,260.82,Unlimited,SBD,F,
Girls,51.94,2,Drue Bowers,Bullard,50.21,104.33,63.5,83.91,251.74,Unlimited,SBD,F,
Girls,51.94,3,Jennifer Diaz,New London West Rusk,50.08,90.72,31.75,102.06,224.53,Unlimited,SBD,F,
Girls,51.94,4,Chloe Cheney,Bullard,51.21,61.23,34.02,79.38,174.63,Unlimited,SBD,F,
Girls,56.02,1,Jalynn Gateley,Lindale,55.25,108.86,56.7,113.4,278.96,Unlimited,SBD,F,
Girls,56.02,2,Laila Nguyen,Whitehouse,55.34,113.4,61.23,97.52,272.16,Unlimited,SBD,F,
Girls,56.02,3,Braylee Glasscock,Whitehouse,55.38,90.72,54.43,102.06,247.21,Unlimited,SBD,F,
Girls,56.02,4,Sterling Czurak,Whitehouse,53.39,74.84,52.16,102.06,229.06,Unlimited,SBD,F,
Girls,56.02,5,Reece Lovelady,Troup,52.8,77.11,52.16,90.72,219.99,Unlimited,SBD,F,
Girls,56.02,6,Halia Horney,Tyler Chapel Hill,52.93,61.23,34.02,68.04,163.29,Unlimited,SBD,F,
Girls,56.02,7,Lilly Valdez,Jacksonville,53.07,63.5,31.75,61.23,156.49,Unlimited,SBD,F,
Girls,56.02,8,Jazlynn Servin,Jacksonville,53.39,61.23,34.02,61.23,156.49,Unlimited,SBD,F,
Girls,56.02,9,Beonka Lewis,Tyler Chapel Hill,54.39,61.23,31.75,61.23,154.22,Unlimited,SBD,F,
Girls,60.1,1,Sarah Neel,Troup,57.88,113.4,63.5,127.01,303.91,Unlimited,SBD,F,
Girls,60.1,2,Rylie Francis,Whitehouse,59.83,117.93,65.77,117.93,301.64,Unlimited,SBD,F,
Girls,60.1,3,Mersaydez Lewis,Tyler Chapel Hill,59.74,102.06,47.63,102.06,251.74,Unlimited,SBD,F,
Girls,60.1,4,Emerson Moore,Bullard,58.6,92.99,56.7,99.79,249.48,Unlimited,SBD,F,
Girls,60.1,5,Kate Flanagan,Whitehouse,59.47,90.72,52.16,88.45,231.33,Unlimited,SBD,F,
Girls,60.1,6,Skylar King,Arp,59.01,83.91,45.36,90.72,219.99,Unlimited,SBD,F,
Girls,60.1,DQ,Lauren Mcalpine,Whitehouse,57.61,95.25,,74.84,,Unlimited,SBD,F,
Girls,67.36,1,Tara Wells,Troup,63.64,145.15,77.11,140.61,362.87,Unlimited,SBD,F,
Girls,67.36,2,Violet Eason,Troup,65.54,115.67,61.23,115.67,292.57,Unlimited,SBD,F,
Girls,67.36,3,Noelle Feiden,Whitehouse,62.46,113.4,58.97,115.67,288.03,Unlimited,SBD,F,
Girls,67.36,4,Christiana Ussery,Lindale,64,102.06,52.16,115.67,269.89,Unlimited,SBD,F,
Girls,67.36,5,Jenna McElfish,Whitehouse,65.95,92.99,49.9,97.52,240.4,Unlimited,SBD,F,
Girls,67.36,6,Emily Netro,New London West Rusk,66.77,95.25,43.09,97.52,235.87,Unlimited,SBD,F,
Girls,67.36,7,Chesni Speaker,Jacksonville,61.92,86.18,54.43,90.72,231.33,Unlimited,SBD,F,
Girls,67.36,8,Riley Wilbur,Bullard,66.27,83.91,38.56,108.86,231.33,Unlimited,SBD,F,
Girls,67.36,9,Yarahi Yanez,Troup,61.87,83.91,47.63,95.25,226.8,Unlimited,SBD,F,
Girls,67.36,10,Sydney Savage,Bullard,61.69,81.65,49.9,74.84,206.38,Unlimited,SBD,F,
Girls,67.36,11,Mackenzie Ballow,Bullard,65.5,79.38,40.82,79.38,199.58,Unlimited,SBD,F,
Girls,67.36,12,Jalah Newton,New London West Rusk,61.19,61.23,40.82,90.72,192.78,Unlimited,SBD,F,
Girls,67.36,13,Grace Moye,Lindale,65.32,70.31,31.75,86.18,188.24,Unlimited,SBD,F,
Girls,67.36,14,Bethany Fussel,Bullard,61.46,74.84,40.82,68.04,183.7,Unlimited,SBD,F,
Girls,75.07,1,Kristen Gonzales,Jacksonville,68.99,131.54,61.23,124.74,317.51,Unlimited,SBD,F,
Girls,75.07,2,Grace O'Bannon,Bullard,71.12,117.93,74.84,124.74,317.51,Unlimited,SBD,F,
Girls,75.07,3,Taylar Ragland,Lindale,67.95,117.93,61.23,115.67,294.84,Unlimited,SBD,F,
Girls,75.07,4,Kathleen Goodwin,Lindale,72.89,106.59,63.5,124.74,294.84,Unlimited,SBD,F,
Girls,75.07,5,Lisa Hawkins,Bullard,69.81,92.99,70.31,117.93,281.23,Unlimited,SBD,F,
Girls,75.07,6,Trinity Roberts,Whitehouse,73.44,92.99,58.97,108.86,260.82,Unlimited,SBD,F,
Girls,75.07,7,Janiah Jean-Louis,Lindale,73.84,95.25,54.43,104.33,254.01,Unlimited,SBD,F,
Girls,75.07,8,Emligh Morphis,Lindale,69.13,86.18,47.63,106.59,240.4,Unlimited,SBD,F,
Girls,75.07,9,Haleigh Wilson,Whitehouse,71.08,88.45,54.43,97.52,240.4,Unlimited,SBD,F,
Girls,82.33,1,Estefanie Diaz,New London West Rusk,78.83,102.06,40.82,115.67,258.55,Unlimited,SBD,F,
Girls,82.33,2,Taniya Crumpton,Tyler Chapel Hill,78.47,88.45,58.97,106.59,254.01,Unlimited,SBD,F,
Girls,82.33,3,Dixie Dowling,Jacksonville,80.38,90.72,58.97,97.52,247.21,Unlimited,SBD,F,
Girls,82.33,4,Jimaya Chandler,Lindale,78.65,90.72,52.16,99.79,242.67,Unlimited,SBD,F,
Girls,82.33,5,Gabriela Ramirez,New London West Rusk,80.06,83.91,29.48,97.52,210.92,Unlimited,SBD,F,
Girls,90.04,1,Reagan Schofner,Troup,82.92,115.67,65.77,133.81,315.25,Unlimited,SBD,F,
Girls,90.04,2,Brooklyn McGee,Tyler Chapel Hill,84.1,113.4,45.36,133.81,292.57,Unlimited,SBD,F,
Girls,90.04,3,Emma Thomas,Whitehouse,85.28,111.13,61.23,117.93,290.3,Unlimited,SBD,F,
Girls,90.04,4,Tiana Foutz,Arp,82.78,97.52,45.36,113.4,256.28,Unlimited,SBD,F,
Girls,90.04,5,Landry Bridges,Bullard,83.51,70.31,38.56,83.91,192.78,Unlimited,SBD,F,
Girls,100.02,1,Zaniya Mumphrey,Lindale,96.75,165.56,92.99,158.76,417.3,Unlimited,SBD,F,
Girls,100.02,2,Camille Dworaczyk,Whitehouse,99.97,122.47,95.25,108.86,326.59,Unlimited,SBD,F,
Girls,117.71,1,Gabby Cabrera,Lindale,110.81,142.88,99.79,147.42,390.09,Unlimited,SBD,F,
Girls,117.71,2,Jakaya Cooper,Lindale,112.31,129.27,81.65,163.29,374.21,Unlimited,SBD,F,
Girls,117.71,3,Kirstin Millerd,Arp,100.97,161.03,70.31,115.67,347,Unlimited,SBD,F,
Girls,117.71,4,Layney Santos,Bullard,117.57,111.13,83.91,113.4,308.44,Unlimited,SBD,F,
Girls,117.71+,1,Jocelyn Stafford,Whitehouse,136.08,129.27,83.91,124.74,337.93,Unlimited,SBD,F,
Girls,117.71+,2,Mackenzie Piper,Whitehouse,122.97,158.76,61.23,113.4,333.39,Unlimited,SBD,F,
