Place,Name,Sex,Event,Division,WeightClassKg,Equipment,BirthYear,Team,State,BodyweightKg,Squat1Kg,Squat2Kg,Squat3Kg,Best3SquatKg,Bench1Kg,Bench2Kg,Bench3Kg,Best3BenchKg,Deadlift1Kg,Deadlift2Kg,Deadlift3Kg,Best3DeadliftKg,TotalKg,Age,BirthDate
1,Gretchen Patsios,F,B,F-M,84,Single-ply,1966,Team Rohr,GA,73.72,,,,,-95,95,100,100,,,,,100,,
G,Kimba Reams,F,B,FR-G,72,Raw,1976,,SC,70.38,,,,,-80,85,-92.5,85,,,,,85,,
1,Valerie Smith #1,F,B,FR-M,72,Raw,1973,Elite Iron,GA,68.65,,,,,85,90,92.5,92.5,,,,,92.5,,
1,Teresa Simpson,F,B,FR-M,84+,Raw,1964,Team Rohr,GA,112.4,,,,,62.5,-65,-65,62.5,,,,,62.5,,
1,Adaku Taylor,F,B,FR-O,72,Raw,1986,Team Rohr,GA,69.8,,,,,87.5,92.5,97.5,97.5,,,,,97.5,,
1,Teresa Simpson,F,B,FR-O,84+,Raw,1964,Team Rohr,GA,112.4,,,,,62.5,-65,-65,62.5,,,,,62.5,,
1,Anna Fournaris,F,B,FR-T,84,Raw,2001,,GA,72.7,,,,,57.5,-60,62.5,62.5,,,,,62.5,,
1,William Thacker,M,B,M-M,105,Single-ply,1972,Elite Iron,GA,105,,,,,-250,250,257.5,257.5,,,,,257.5,,
1,Steven Phillips #2,M,B,M-M,120,Single-ply,1950,,GA,105.32,,,,,152.5,157.5,-160,157.5,,,,,157.5,,
1,Austin Brown #1,M,B,M-O,93,Single-ply,1990,Elite Iron,GA,92.3,,,,,245,-250,250,250,,,,,250,,
1,William Thacker,M,B,M-O,105,Single-ply,1972,Elite Iron,GA,105,,,,,-250,250,257.5,257.5,,,,,257.5,,
1,Colin Kopel,M,B,M-O,120,Single-ply,1986,Team Rohr,GA,105.44,,,,,172.5,-175,-175,172.5,,,,,172.5,,
1,Brad Dunn,M,B,MR-M,74,Raw,1968,,GA,73.84,,,,,140,145,-147.5,145,,,,,145,,
1,Darrell Allen,M,B,MR-M,105,Raw,1961,,GA,99.86,,,,,140,147.5,-152.5,147.5,,,,,147.5,,
1,Dale McLaren,M,B,MR-M,120,Raw,1976,Elite Iron,GA,106.46,,,,,162.5,170,175,175,,,,,175,,
1,Justin Davis,M,B,MR-O,66,Raw,1987,Elite Iron,GA,65.3,,,,,-150,150,-155,150,,,,,150,,
1,Mark Burkhalter,M,B,MR-O,93,Raw,1981,,GA,90.45,,,,,160,177.5,-182.5,177.5,,,,,177.5,,
1,Jon Paul Burkhalter,M,B,MR-O,105,Raw,1979,,GA,98.04,,,,,167.5,177.5,-185,177.5,,,,,177.5,,
1,Dale McLaren,M,B,MR-O,120,Raw,1976,Elite Iron,GA,106.46,,,,,162.5,170,175,175,,,,,175,,
1,Ashley Hanna,F,SBD,F-Jr,72,Single-ply,1996,Team Rohr,GA,71.02,-157.5,-157.5,157.5,157.5,-105,105,-110,105,145,157.5,-165,157.5,420,,
1,Alicia Webb,F,SBD,F-M,84+,Single-ply,1971,Team Rohr,GA,93.34,197.5,212.5,222.5,222.5,160,-175,-175,160,180,197.5,210,210,592.5,,
DQ,Serena Thomas,F,SBD,F-O,63,Single-ply,1985,Team Rohr,GA,62.5,82.5,-100,115,115,60,65,-72.5,65,-150,-150,-150,,,,
1,Ashley Hanna,F,SBD,F-O,72,Single-ply,1996,Team Rohr,GA,71.02,-157.5,-157.5,157.5,157.5,-105,105,-110,105,145,157.5,-165,157.5,420,,
1,Alicia Webb,F,SBD,F-O,84+,Single-ply,1971,Team Rohr,GA,93.34,197.5,212.5,222.5,222.5,160,-175,-175,160,180,197.5,210,210,592.5,,
1,Karen Vu,F,SBD,FR-Jr,52,Raw,1996,Dual Impact Training,GA,52,95,100,102.5,102.5,50,57.5,-60,57.5,140,147.5,155,155,315,,
1,Jenny Tran,F,SBD,FR-Jr,63,Raw,1997,Dual Impact Training,GA,60.25,82.5,87.5,-97.5,87.5,42.5,50,-52.5,50,87.5,95,102.5,102.5,240,,
1,Elnaz Bahramyan,F,SBD,FR-Jr,84,Raw,1997,Team DA Fitness,GA,81.86,-102.5,102.5,112.5,112.5,67.5,70,75,75,127.5,140,152.5,152.5,340,,
2,Caylin Jackson,F,SBD,FR-Jr,84,Raw,1996,,GA,72.72,82.5,92.5,100,100,47.5,52.5,55,55,92.5,107.5,115,115,270,,
1,Stacie Metcalfe,F,SBD,FR-M1,57,Raw,1970,,GA,55.62,55,57.5,60,60,32.5,35,-40,35,70,72.5,77.5,77.5,172.5,,
1,Sonya McMillan,F,SBD,FR-M1,63,Raw,1979,Team Rohr,GA,61.75,127.5,142.5,147.5,147.5,77.5,82.5,-87.5,82.5,152.5,162.5,-172.5,162.5,392.5,,
1,Valerie Smith #1,F,SBD,FR-M1,72,Raw,1973,Elite Iron,GA,68.65,115,122.5,-125,122.5,85,90,92.5,92.5,167.5,177.5,182.5,182.5,397.5,,
2,Jessica Osborne,F,SBD,FR-M1,72,Raw,1979,,GA,71.95,110,120,127.5,127.5,50,55,57.5,57.5,112.5,117.5,122.5,122.5,307.5,,
DQ,Trish Footit,F,SBD,FR-M1,72,Raw,1979,Elite Iron,GA,70.95,-137.5,-142.5,-142.5,,87.5,90,-92.5,90,175,182.5,,182.5,,,
1,Andrea Pettyjohn,F,SBD,FR-M1,84+,Raw,1979,,GA,106.26,127.5,137.5,142.5,142.5,70,75,77.5,77.5,160,167.5,177.5,177.5,397.5,,
1,Patricia Duboise,F,SBD,FR-M2,52,Raw,1966,,GA,51.64,80,82.5,85,85,52.5,55,-57.5,55,120,122.5,-125,122.5,262.5,,
1,Cathy Mele,F,SBD,FR-M2,63,Raw,1966,Elite Iron,GA,62.26,105,-110,-110,105,70,72.5,-75,72.5,160,167.5,-176,167.5,345,,
2,Sandra Hommel,F,SBD,FR-M2,63,Raw,1968,Team Rohr,GA,61.12,70,75,82.5,82.5,37.5,45,47.5,47.5,92.5,102.5,107.5,107.5,237.5,,
1,Amy Pancake,F,SBD,FR-M2,84,Raw,1967,Team Rohr,GA,80.9,-102.5,102.5,112.5,112.5,62.5,67.5,-70,67.5,115,122.5,-127.5,122.5,302.5,,
2,June Knapp,F,SBD,FR-M2,84,Raw,1968,,GA,83.46,-50,50,-60,50,-42.5,-42.5,42.5,42.5,92.5,100,107.5,107.5,200,,
1,Kathy Wilbanks,F,SBD,FR-M2,84+,Raw,1963,,GA,136.28,-82.5,-82.5,82.5,82.5,47.5,52.5,-55,52.5,92.5,-102.5,102.5,102.5,237.5,,
1,Karen Ward,F,SBD,FR-M3,47,Raw,1957,,GA,44.82,75,77.5,80,80,40,42.5,-45,42.5,92.5,-95,95,95,217.5,,
1,Bianca White,F,SBD,FR-M3,84,Raw,1959,,GA,77.74,100,107.5,110,110,-47.5,47.5,50,50,110,120,-122.5,120,280,,
1,Amy Gambow,F,SBD,FR-O,47,Raw,1987,Elite Iron,GA,45.84,80,87.5,92.5,92.5,47.5,50,52.5,52.5,100,107.5,115,115,260,,
1,Karen Vu,F,SBD,FR-O,52,Raw,1996,Dual Impact Training,GA,52,95,100,102.5,102.5,50,57.5,-60,57.5,140,147.5,155,155,315,,
2,Heather Griffin,F,SBD,FR-O,52,Raw,1987,Elite Iron,GA,51.16,107.5,-110,-110,107.5,70,-72.5,72.5,72.5,125,-127.5,-127.5,125,305,,
3,Olivia Rogowski,F,SBD,FR-O,52,Raw,2002,,GA,50.78,100,105,-112.5,105,57.5,62.5,65,65,97.5,105,112.5,112.5,282.5,,
4,Patricia Duboise,F,SBD,FR-O,52,Raw,1966,,GA,51.64,80,82.5,85,85,52.5,55,-57.5,55,120,122.5,-125,122.5,262.5,,
1,Jordan Sandoval #1,F,SBD,FR-O,57,Raw,1990,Team Rohr,GA,55.56,90,-97.5,-97.5,90,45,-50,-50,45,115,122.5,-132.5,122.5,257.5,,
1,Reyna Rochin,F,SBD,FR-O,63,Raw,1990,,GA,63,132.5,140,145,145,85,92.5,97.5,97.5,155,165,-170,165,407.5,,
2,Sonya McMillan,F,SBD,FR-O,63,Raw,1979,Team Rohr,GA,61.75,127.5,142.5,147.5,147.5,77.5,82.5,-87.5,82.5,152.5,162.5,-172.5,162.5,392.5,,
3,Vanessa Gale,F,SBD,FR-O,63,Raw,1988,Elite Iron,GA,62.2,127.5,135,-142.5,135,67.5,72.5,-75,72.5,155,165,170,170,377.5,,
1,Adaku Taylor,F,SBD,FR-O,72,Raw,1986,Team Rohr,GA,69.8,130,142.5,-147.5,142.5,87.5,92.5,97.5,97.5,155,170,182.5,182.5,422.5,,
2,Valerie Smith #1,F,SBD,FR-O,72,Raw,1973,Elite Iron,GA,68.65,115,122.5,-125,122.5,85,90,92.5,92.5,167.5,177.5,182.5,182.5,397.5,,
3,Sheryll Donerson,F,SBD,FR-O,72,Raw,1986,Team DA Fitness,GA,71.45,120,130,-137.5,130,60,62.5,65,65,132.5,142.5,-152.5,142.5,337.5,,
4,Caitlyn Kavan,F,SBD,FR-O,72,Raw,1993,Team DA Fitness,GA,67.75,112.5,120,122.5,122.5,47.5,50,-52.5,50,-142.5,142.5,152.5,152.5,325,,
5,Jessica Osborne,F,SBD,FR-O,72,Raw,1979,,GA,71.95,110,120,127.5,127.5,50,55,57.5,57.5,112.5,117.5,122.5,122.5,307.5,,
6,Sharon Derr,F,SBD,FR-O,72,Raw,1980,,GA,67.6,100,105,107.5,107.5,60,62.5,65,65,120,125,130,130,302.5,,
DQ,Trish Footit,F,SBD,FR-O,72,Raw,1979,Elite Iron,GA,70.95,-137.5,-142.5,-142.5,,87.5,90,-92.5,90,175,182.5,,182.5,,,
1,Sarah Santowski,F,SBD,FR-O,84,Raw,1985,Elite Iron,GA,80.98,132.5,137.5,-142.5,137.5,60,65,70,70,152.5,160,165,165,372.5,,
2,Elnaz Bahramyan,F,SBD,FR-O,84,Raw,1997,Team DA Fitness,GA,81.86,-102.5,102.5,112.5,112.5,67.5,70,75,75,127.5,140,152.5,152.5,340,,
3,Amy Pancake,F,SBD,FR-O,84,Raw,1967,Team Rohr,GA,80.9,-102.5,102.5,112.5,112.5,62.5,67.5,-70,67.5,115,122.5,-127.5,122.5,302.5,,
4,Lauren Hughes,F,SBD,FR-O,84,Raw,1984,,GA,74.3,87.5,92.5,97.5,97.5,45,50,52.5,52.5,110,117.5,122.5,122.5,272.5,,
1,Rebecca Holcomb,F,SBD,FR-O,84+,Raw,1987,Elite Iron,GA,162,190,205,215,215,115,125,127.5,127.5,210,227.5,237.5,237.5,580,,
2,Milena Schaefer,F,SBD,FR-O,84+,Raw,1990,Elite Iron,GA,119.04,197.5,207.5,-220,207.5,90,-102.5,-102.5,90,180,192.5,-200,192.5,490,,
3,Andrea Pettyjohn,F,SBD,FR-O,84+,Raw,1979,,GA,106.26,127.5,137.5,142.5,142.5,70,75,77.5,77.5,160,167.5,177.5,177.5,397.5,,
4,Erica Pellicer,F,SBD,FR-O,84+,Raw,1986,Team DA Fitness,GA,90.96,102.5,110,117.5,117.5,57.5,-60,60,60,115,125,-137.5,125,302.5,,
5,Aubrey Kinnaman,F,SBD,FR-O,84+,Raw,1983,Elite Iron,GA,95.94,90,95,-100,95,52.5,55,60,60,105,112.5,-115,112.5,267.5,,
1,Olivia Rogowski,F,SBD,FR-T,52,Raw,2002,,GA,50.78,100,105,-112.5,105,57.5,62.5,65,65,97.5,105,112.5,112.5,282.5,,
1,Jessica Jewell,F,SBD,FR-T,57,Raw,2003,,GA,54.98,-65,72.5,-80,72.5,37.5,40,-42.5,40,107.5,112.5,115,115,227.5,,
1,Taylor Doyle,F,SBD,FR-T,63,Raw,2004,,GA,57.66,-30,30,35,35,20,22.5,25,25,62.5,67.5,72.5,72.5,132.5,,
1,Anna Fournaris,F,SBD,FR-T,84,Raw,2001,,GA,72.7,82.5,87.5,92.5,92.5,57.5,-60,62.5,62.5,90,95,-100,95,250,,
1,Daniel Elmore,M,SBD,M-M,93,Single-ply,1975,Team Rohr,GA,91,225,240,-245,240,145,152.5,157.5,157.5,-210,210,-230,210,607.5,,
1,Joseph Hwang,M,SBD,M-O,74,Single-ply,1989,,GA,67.05,200,217.5,-225,217.5,110,117.5,-120,117.5,210,222.5,-227.5,222.5,557.5,,
1,Daniel Elmore,M,SBD,M-O,93,Single-ply,1975,Team Rohr,GA,91,225,240,-245,240,145,152.5,157.5,157.5,-210,210,-230,210,607.5,,
1,Colin Kopel,M,SBD,M-O,120,Single-ply,1986,Team Rohr,GA,105.44,205,220,225,225,172.5,-175,-175,172.5,190,202.5,-212.5,202.5,600,,
G,Carson Poling,M,SBD,MR-G,83,Raw,2000,Elite Iron,GA,80.45,170,180,-187.5,180,-117.5,117.5,130,130,187.5,215,-227.5,215,525,,
G,Frank Walker,M,SBD,MR-G,105,Raw,1994,,FL,103.1,170,-185,197.5,197.5,127.5,137.5,145,145,212.5,232.5,250,250,592.5,,
1,Lane Emert,M,SBD,MR-Jr,66,Raw,1995,Team Roswell Barbell,GA,64.45,165,-170,-172.5,165,117.5,-122.5,-122.5,117.5,225,230,-240,230,512.5,,
1,Jeffery Yang,M,SBD,MR-Jr,74,Raw,1998,Elite Iron,GA,71,175,-187.5,187.5,187.5,102.5,-112.5,112.5,112.5,192.5,205,-212.5,205,505,,
2,Arnold Ramos,M,SBD,MR-Jr,74,Raw,1997,Elite Iron,GA,73.85,170,185,-195,185,102.5,112.5,-125,112.5,200,-207.5,,200,497.5,,
3,Daniel Hodsdon,M,SBD,MR-Jr,74,Raw,1997,Team Rohr,GA,71.15,137.5,150,-155,150,107.5,115,-120,115,135,150,-165,150,415,,
1,Jacky Cheng,M,SBD,MR-Jr,83,Raw,1996,Dual Impact Training,GA,82.4,195,202.5,-212.5,202.5,142.5,150,-155,150,240,250,-265,250,602.5,,
DQ,Micah Nibbs,M,SBD,MR-Jr,83,Raw,1996,,GA,80.96,212.5,-217.5,217.5,217.5,-137.5,-137.5,-137.5,,260,265,272.5,272.5,,,
1,Carlton Beasley,M,SBD,MR-Jr,120,Raw,1997,Elite Iron,GA,112.2,270,280,-287.5,280,140,147.5,150,150,257.5,272.5,280,280,710,,
1,Eric Levy,M,SBD,MR-M1,105,Raw,1972,Team Roswell Barbell,GA,99.62,210,225,230,230,120,-125,-125,120,245,255,260,260,610,,
2,Benjamin Thoele,M,SBD,MR-M1,105,Raw,1977,,GA,104,165,177.5,182.5,182.5,142.5,157.5,,157.5,232.5,255,-257.5,255,595,,
3,David Cogdell,M,SBD,MR-M1,105,Raw,1979,Dual Impact Training,GA,103.4,155,165,175,175,112.5,120,127.5,127.5,192.5,202.5,215,215,517.5,,
1,Kevin Cregan,M,SBD,MR-M1,120,Raw,1970,,GA,108.12,-147.5,155,-160,155,117.5,122.5,127.5,127.5,180,192.5,202.5,202.5,485,,
1,Troy Williams #1,M,SBD,MR-M1,120+,Raw,1978,Elite Iron,GA,170.2,220,-242.5,242.5,242.5,142.5,147.5,155,155,220,240,-252.5,240,637.5,,
1,Darrell Allen,M,SBD,MR-M2,105,Raw,1961,,GA,99.86,182.5,-205,205,205,140,147.5,-152.5,147.5,182.5,202.5,-205,202.5,555,,
1,John Lampe,M,SBD,MR-M2,120,Raw,1967,Team Rohr,GA,118.08,200,215,225,225,152.5,160,-165,160,205,225,245,245,630,,
2,James Jones,M,SBD,MR-M2,120,Raw,1963,Elite Iron,GA,112.64,120,132.5,140,140,-137.5,137.5,150,150,200,215,227.5,227.5,517.5,,
1,Don McKinney,M,SBD,MR-M2,120+,Raw,1962,Elite Iron,GA,128.2,227.5,245,250,250,165,177.5,-182.5,177.5,227.5,240,255,255,682.5,,
1,Calvin Forrester,M,SBD,MR-M3,105,Raw,1959,,GA,100.16,-137.5,137.5,142.5,142.5,-122.5,122.5,-125,122.5,152.5,157.5,162.5,162.5,427.5,,
1,Bob Coleman,M,SBD,MR-M4,66,Raw,1948,,GA,62.7,82.5,90,97.5,97.5,55,57.5,60,60,-102.5,102.5,110,110,267.5,,
1,Lane Emert,M,SBD,MR-O,66,Raw,1995,Team Roswell Barbell,GA,64.45,165,-170,-172.5,165,117.5,-122.5,-122.5,117.5,225,230,-240,230,512.5,,
2,Julio Zavala,M,SBD,MR-O,66,Raw,1992,Elite Iron,GA,61.85,150,-160,-160,150,125,127.5,132.5,132.5,205,215,-220,215,497.5,,
3,Michael Knapp,M,SBD,MR-O,66,Raw,1981,,GA,65.5,-97.5,97.5,102.5,102.5,95,-100,100,100,135,150,-177.5,150,352.5,,
1,Thomas Matthews,M,SBD,MR-O,74,Raw,1994,Elite Iron,GA,73.65,200,212.5,-220,212.5,145,152.5,-155,152.5,230,240,-250,240,605,,
2,Gregory Luu,M,SBD,MR-O,74,Raw,1992,Dual Impact Training,GA,69.75,172.5,182.5,192.5,192.5,112.5,120,-125,120,190,200,-210,200,512.5,,
3,Jeffery Yang,M,SBD,MR-O,74,Raw,1998,Elite Iron,GA,71,175,-187.5,187.5,187.5,102.5,-112.5,112.5,112.5,192.5,205,-212.5,205,505,,
4,Taquwon Foreman,M,SBD,MR-O,74,Raw,1992,,GA,72.65,137.5,147.5,160,160,120,125,137.5,137.5,185,195,207.5,207.5,505,,
5,Arnold Ramos,M,SBD,MR-O,74,Raw,1997,Elite Iron,GA,73.85,170,185,-195,185,102.5,112.5,-125,112.5,200,-207.5,,200,497.5,,
6,Gabriel Popa,M,SBD,MR-O,74,Raw,2001,,GA,71.95,155,-175,-175,155,100,107.5,-112.5,107.5,205,215,-227.5,215,477.5,,
7,Christopher Weitzen,M,SBD,MR-O,74,Raw,1985,Team Rohr,GA,71.9,102.5,110,115,115,87.5,95,-100,95,157.5,165,182.5,182.5,392.5,,
1,Bao Vu,M,SBD,MR-O,83,Raw,1993,Dual Impact Training,GA,82.18,220,230,240,240,137.5,147.5,155,155,235,252.5,-265,252.5,647.5,,
2,Viet Phi Phan,M,SBD,MR-O,83,Raw,1992,Dual Impact Training,GA,82.5,210,217.5,227.5,227.5,137.5,142.5,-147.5,142.5,252.5,262.5,272.5,272.5,642.5,,
3,Jonathan Lee,M,SBD,MR-O,83,Raw,1991,Dual Impact Training,GA,82.06,222.5,230,237.5,237.5,135,142.5,145,145,222.5,235,247.5,247.5,630,,
4,Austin Newton,M,SBD,MR-O,83,Raw,1994,,GA,81.34,-210,210,225,225,140,142.5,-150,142.5,232.5,242.5,257.5,257.5,625,,
5,David Waters,M,SBD,MR-O,83,Raw,1999,,GA,81,205,-230,-230,205,115,120,130,130,235,245,255,255,590,,
6,Ben Chu #1,M,SBD,MR-O,83,Raw,1984,,GA,79.62,172.5,185,192.5,192.5,117.5,122.5,125,125,212.5,227.5,232.5,232.5,550,,
7,Joseph Woodcock,M,SBD,MR-O,83,Raw,2001,,GA,81.48,167.5,-180,187.5,187.5,105,-115,-122.5,105,205,220,227.5,227.5,520,,
8,Logan Cunningham,M,SBD,MR-O,83,Raw,1991,,GA,80.5,180,-197.5,-197.5,180,97.5,105,-112.5,105,182.5,200,215,215,500,,
9,Juwan Hope,M,SBD,MR-O,83,Raw,1993,Elite Iron,GA,80.48,115,-127.5,142.5,142.5,102.5,115,125,125,127.5,160,185,185,452.5,,
DQ,Micah Nibbs,M,SBD,MR-O,83,Raw,1996,,GA,80.96,212.5,-217.5,217.5,217.5,-137.5,-137.5,-137.5,,260,265,272.5,272.5,,,
1,Matthew Treherne,M,SBD,MR-O,93,Raw,1989,Team Rohr,GA,92.9,282.5,300,307.5,307.5,175,185,-190,185,307.5,322.5,-330,322.5,815,,
2,Chris Dunn,M,SBD,MR-O,93,Raw,1984,,GA,92.2,265,282.5,285,285,185,197.5,-202.5,197.5,282.5,292.5,297.5,297.5,780,,
3,Jamal Mitchell,M,SBD,MR-O,93,Raw,1994,,GA,90.8,225,240,-255,240,152.5,162.5,-170,162.5,267.5,287.5,307.5,307.5,710,,
4,Wali Butt,M,SBD,MR-O,93,Raw,1994,Dual Impact Training,GA,91.9,217.5,220,222.5,222.5,-147.5,155,160,160,250,260,-265,260,642.5,,
5,Jonas Broccard,M,SBD,MR-O,93,Raw,1989,,GA,86.55,197.5,210,-212.5,210,132.5,140,-145,140,240,252.5,262.5,262.5,612.5,,
6,Nicholas Tang,M,SBD,MR-O,93,Raw,1980,Elite Iron,GA,92.4,182.5,192.5,-197.5,192.5,-137.5,-137.5,137.5,137.5,225,240,-247.5,240,570,,
7,John Hunsucker,M,SBD,MR-O,93,Raw,1993,Team Rohr,GA,89.35,145,152.5,157.5,157.5,90,100,-107.5,100,200,210,227.5,227.5,485,,
8,Adam Keating,M,SBD,MR-O,93,Raw,1984,Team Roswell Barbell,GA,88.36,175,-180,180,180,-112.5,115,-117.5,115,177.5,-185,-185,177.5,472.5,,
9,Jordan Kummer,M,SBD,MR-O,93,Raw,1989,Elite Iron,GA,92.6,130,140,142.5,142.5,102.5,110,112.5,112.5,190,205,212.5,212.5,467.5,,
DQ,Evan Parker,M,SBD,MR-O,93,Raw,1992,,GA,91.3,-155,-155,-170,,107.5,115,-120,115,190,197.5,205,205,,,
1,Steven Ridges,M,SBD,MR-O,105,Raw,1992,Elite Iron,GA,103.34,230,242.5,255,255,160,167.5,175,175,292.5,310,-312.5,310,740,,
2,Nikita Koba,M,SBD,MR-O,105,Raw,1993,Elite Iron,GA,104.86,245,255,,255,165,170,-172.5,170,285,-295,,285,710,,
3,Michael Wall,M,SBD,MR-O,105,Raw,1992,Team Roswell Barbell,GA,103.3,240,252.5,-265,252.5,165,175,-185,175,255,-270,-270,255,682.5,,
4,Eric Levy,M,SBD,MR-O,105,Raw,1972,Team Roswell Barbell,GA,99.62,210,225,230,230,120,-125,-125,120,245,255,260,260,610,,
5,Jason Ly,M,SBD,MR-O,105,Raw,1989,,GA,103.98,200,207.5,212.5,212.5,130,137.5,142.5,142.5,240,245,252.5,252.5,607.5,,
6,Feli Bitti,M,SBD,MR-O,105,Raw,1990,,GA,95.9,190,200,210,210,115,122.5,132.5,132.5,202.5,215,225,225,567.5,,
7,Allan Nguyen,M,SBD,MR-O,105,Raw,1994,,GA,102.66,-192.5,197.5,-215,197.5,120,-130,-130,120,197.5,220,230,230,547.5,,
1,Solomon Kim,M,SBD,MR-O,120,Raw,1988,,GA,112.68,250,262.5,,262.5,187.5,195,205,205,250,265,-272.5,265,732.5,,
2,Kevin Bear,M,SBD,MR-O,120,Raw,1986,Team Roswell Barbell,GA,110.28,240,250,,250,150,160,170,170,265,275,285,285,705,,
3,Eric Flynn,M,SBD,MR-O,120,Raw,1990,Team Rohr,GA,114.6,-202.5,202.5,225,225,162.5,167.5,175,175,215,235,250,250,650,,
4,Kyle Ray,M,SBD,MR-O,120,Raw,1992,Team Roswell Barbell,GA,119.54,205,215,225,225,147.5,155,-160,155,235,240,247.5,247.5,627.5,,
5,Mike Hammond,M,SBD,MR-O,120,Raw,1981,Team Rohr,GA,110.28,182.5,195,215,215,132.5,142.5,157.5,157.5,182.5,202.5,217.5,217.5,590,,
1,Darryl Richey,M,SBD,MR-O,120+,Raw,1990,Elite Iron,GA,120.18,262.5,-272.5,275,275,177.5,-187.5,-187.5,177.5,290,300,315,315,767.5,,
2,Logan Barrett,M,SBD,MR-O,120+,Raw,1985,Team Roswell Barbell,GA,126.12,290,-300,-300,290,157.5,-165,-165,157.5,290,300,-307.5,300,747.5,,
3,Charles Saylor,M,SBD,MR-O,120+,Raw,1987,Team DA Fitness,GA,154.72,227.5,237.5,252.5,252.5,170,177.5,190,190,237.5,260,-280,260,702.5,,
4,Joshua de Leon,M,SBD,MR-O,120+,Raw,1993,Team Roswell Barbell,GA,142.6,237.5,245,252.5,252.5,155,-165,-165,155,210,225,242.5,242.5,650,,
5,Troy Williams #1,M,SBD,MR-O,120+,Raw,1978,Elite Iron,GA,170.2,220,-242.5,242.5,242.5,142.5,147.5,155,155,220,240,-252.5,240,637.5,,
6,Naman Johri,M,SBD,MR-O,120+,Raw,1992,Team Roswell Barbell,GA,133.6,165,172.5,-182.5,172.5,85,92.5,-95,92.5,205,-215,-215,205,470,,
1,Gabriel Popa,M,SBD,MR-T2,74,Raw,2001,,GA,71.95,155,-175,-175,155,100,107.5,-112.5,107.5,205,215,-227.5,215,477.5,,
1,Joseph Woodcock,M,SBD,MR-T2,83,Raw,2001,,GA,81.48,167.5,-180,187.5,187.5,105,-115,-122.5,105,205,220,227.5,227.5,520,,
1,Jordan Holley #1,M,SBD,MR-T2,105,Raw,2002,,GA,96.95,227.5,,,227.5,102.5,,,102.5,227.5,,,227.5,557.5,,
1,Triston Valadez,M,SBD,MR-T3,74,Raw,1999,,GA,74,175,185,-187.5,185,117.5,-125,125,125,205,220,230,230,540,,
1,David Waters,M,SBD,MR-T3,83,Raw,1999,,GA,81,205,-230,-230,205,115,120,130,130,235,245,255,255,590,,
2,Frederick Nelthrope II,M,SBD,MR-T3,83,Raw,1999,,GA,82.3,165,172.5,187.5,187.5,107.5,115,120,120,187.5,202.5,215,215,522.5,,
1,Gregg Ramsdell,M,BD,M-M,120,Single-ply,1958,Elite Iron,GA,108.36,,,,,100,107.5,115,115,135,145,152.5,152.5,267.5,,
