Division,WeightClassKg,Place,Name,Team,BodyweightKg,Best3SquatKg,Best3BenchKg,Best3DeadliftKg,TotalKg,Equipment,Event,Sex,BirthDate
Boys,51.71,1,Dakota Brown,Quitman,51.26,108.86,65.77,111.13,285.76,Unlimited,SBD,M,
Boys,51.71,2,Konner Youmans,Harleton,49.44,72.57,36.29,77.11,185.97,Unlimited,SBD,M,
Boys,59.87,1,Bryce Miller,Quitman,58.97,147.42,83.91,151.95,383.29,Unlimited,SBD,M,
Boys,59.87,2,Hunter Caraway,Harleton,58.51,163.29,74.84,136.08,374.21,Unlimited,SBD,M,
Boys,59.87,3,Hunter McCarty,Harleton,58.51,129.27,77.11,145.15,351.53,Unlimited,SBD,M,
Boys,67.13,1,Nathan Heitritter,Harleton,65.77,165.56,102.06,151.95,419.57,Unlimited,SBD,M,
Boys,67.13,2,Lucas Townlin,Harleton,63.05,140.61,79.38,142.88,362.87,Unlimited,SBD,M,
Boys,67.13,3,Ethan Isabelle,Grand Saline,66.22,136.08,68.04,142.88,347,Unlimited,SBD,M,
Boys,67.13,4,Jj Sanders,Quitman,65.77,140.61,72.57,127.01,340.19,Unlimited,SBD,M,
Boys,67.13,5,Trace Knopp,Harleton,66.22,111.13,63.5,106.59,281.23,Unlimited,SBD,M,
Boys,74.84,1,Cambren Ivy,Grand Saline,74.39,231.33,115.67,197.31,544.31,Unlimited,SBD,M,
Boys,74.84,2,Preston Parker,Harleton,73.94,172.37,108.86,167.83,449.06,Unlimited,SBD,M,
Boys,74.84,3,Logan Olive,Big Sandy,73.03,158.76,95.25,181.44,435.45,Unlimited,SBD,M,
Boys,74.84,4,Lucas Duncan,Harleton,73.48,183.7,90.72,156.49,430.91,Unlimited,SBD,M,
Boys,74.84,5,Preston Flores,Quitman,73.48,161.03,106.59,161.03,428.64,Unlimited,SBD,M,
Boys,74.84,6,Jason Oquinn,Harleton,73.48,158.76,106.59,142.88,408.23,Unlimited,SBD,M,
Boys,74.84,7,Alex Holt,Harleton,74.39,167.83,90.72,140.61,399.16,Unlimited,SBD,M,
Boys,74.84,8,Luke Roberts,Harleton,71.67,151.95,97.52,140.61,390.09,Unlimited,SBD,M,
Boys,74.84,9,Gabriel Dubois,Big Sandy,73.94,136.08,65.77,136.08,337.93,Unlimited,SBD,M,
Boys,82.1,1,Devin Robertson,Quitman,80.74,215.46,131.54,235.87,582.87,Unlimited,SBD,M,
Boys,82.1,2,Ben Boisclair,Quitman,81.19,188.24,108.86,188.24,485.34,Unlimited,SBD,M,
Boys,82.1,3,Cade Wright,Harleton,80.29,181.44,108.86,170.1,460.4,Unlimited,SBD,M,
Boys,82.1,4,Kaison Bolin,Grand Saline,81.19,183.7,102.06,161.03,446.79,Unlimited,SBD,M,
Boys,82.1,5,Myles Khron,Harleton,79.83,147.42,102.06,181.44,430.91,Unlimited,SBD,M,
Boys,89.81,1,Gannon Cook,Big Sandy,88.9,210.92,129.27,190.51,530.7,Unlimited,SBD,M,
Boys,89.81,2,Landen Hartman,Big Sandy,88.9,102.06,92.99,151.95,347,Unlimited,SBD,M,
Boys,89.81,DQ,Tony Hernandez,Big Sandy,88,156.49,,,,Unlimited,SBD,M,
Boys,89.81,DQ,Logan Brown,Big Sandy,88.45,,,,,Unlimited,SBD,M,
Boys,89.81,DQ,Levi Cloyd,Harleton,88.9,,,,,Unlimited,SBD,M,
Boys,99.79,1,Gabe Lewis,Grand Saline,98.88,226.8,151.95,219.99,598.74,Unlimited,SBD,M,
Boys,99.79,DQ,Will Sims,Grand Saline,98.88,265.35,,,,Unlimited,SBD,M,
Boys,99.79,DQ,Aiden Aiken,Big Sandy,97.98,147.42,,,,Unlimited,SBD,M,
Boys,99.79,DQ,Tyson Tapley,Big Sandy,98.43,,,,,Unlimited,SBD,M,
Boys,109.77,1,Kameron Powell,Big Sandy,108.86,131.54,79.38,142.88,353.8,Unlimited,SBD,M,
Boys,124.74,1,Jack Floyd,Harleton,121.56,215.46,102.06,174.63,492.15,Unlimited,SBD,M,
Boys,124.74,2,Kayden Johnson,Harleton,124.74,201.85,115.67,174.63,492.15,Unlimited,SBD,M,
Boys,124.74,3,Raylyn Hawkins,Big Sandy,121.11,179.17,102.06,183.7,464.93,Unlimited,SBD,M,
Boys,139.71,1,Colton Fugler,Harleton,135.17,195.04,106.59,149.69,451.32,Unlimited,SBD,M,
Boys,139.71+,1,Zane Sears,Harleton,152.86,204.12,131.54,165.56,501.22,Unlimited,SBD,M,
