Division,WeightClassKg,Place,Name,Team,BodyweightKg,Best3SquatKg,Best3BenchKg,Best3DeadliftKg,TotalKg,Equipment,Event,Sex,BirthDate
Girls,44.23,1,Nevaeh Kerby,Coahoma,41.91,97.52,49.9,97.52,244.94,Unlimited,SBD,F,
Girls,44.23,2,Brisa Sierra,Eldorado,40.46,72.57,38.56,77.11,188.24,Unlimited,SBD,F,
Girls,47.85,1,Alex De La Cruz,Big Lake Reagan County,47.17,106.59,54.43,102.06,263.08,Unlimited,SBD,F,
Girls,47.85,2,Addy Diaz DeLeon,Water Valley,47.63,97.52,52.16,86.18,235.87,Unlimited,SBD,F,
Girls,47.85,3,Mari Barrera,Midland Greenwood,47.54,79.38,47.63,81.65,208.65,Unlimited,SBD,F,
Girls,47.85,4,Madison Bose,Coahoma,46.63,65.77,36.29,77.11,179.17,Unlimited,SBD,F,
Girls,47.85,DQ,Savannah Sanchez,Big Lake Reagan County,47.81,,,,,Unlimited,SBD,F,
Girls,51.94,1,Alejandra Alegria,Eldorado,50.26,131.54,79.38,122.47,333.39,Unlimited,SBD,F,
Girls,51.94,2,Macayla Valencia,Coahoma,51.8,99.79,45.36,102.06,247.21,Unlimited,SBD,F,
Girls,51.94,3,Madeline Valeriano,Eldorado,51.53,95.25,43.09,106.59,244.94,Unlimited,SBD,F,
Girls,51.94,4,Audi Cota,Monahans,51.44,90.72,45.36,92.99,229.06,Unlimited,SBD,F,
Girls,51.94,5,Abigail Bose,Coahoma,48.63,83.91,43.09,90.72,217.72,Unlimited,SBD,F,
Girls,51.94,6,Kayleigh Doty-Estrada,Water Valley,51.89,88.45,36.29,90.72,215.46,Unlimited,SBD,F,
Girls,51.94,7,Layla Ortiz,Big Spring,51.48,72.57,40.82,97.52,210.92,Unlimited,SBD,F,
Girls,51.94,8,Leslie Espadas,Monahans,48.17,79.38,40.82,83.91,204.12,Unlimited,SBD,F,
Girls,51.94,9,Paisley Osborne,Coahoma,48.26,86.18,36.29,77.11,199.58,Unlimited,SBD,F,
Girls,51.94,10,Kaydence Sanchez,Monahans,48.63,65.77,34.02,74.84,174.63,Unlimited,SBD,F,
Girls,51.94,11,Belle Holleman,Coahoma,50.62,65.77,31.75,77.11,174.63,Unlimited,SBD,F,
Girls,51.94,DQ,Viviana Mendoza,Monahans,51.53,81.65,45.36,,,Unlimited,SBD,F,
Girls,56.02,1,Alexis Martinez,Eldorado,54.43,115.67,63.5,122.47,301.64,Unlimited,SBD,F,
Girls,56.02,2,Minelly Montes,Eldorado,53.52,113.4,61.23,122.47,297.1,Unlimited,SBD,F,
Girls,56.02,3,Nivea Marmolejo,Monahans,53.07,92.99,52.16,92.99,238.14,Unlimited,SBD,F,
Girls,56.02,4,Monse Holguin,Big Spring,55.34,88.45,47.63,99.79,235.87,Unlimited,SBD,F,
Girls,56.02,5,Simealai Tino,Big Spring,55.7,86.18,47.63,102.06,235.87,Unlimited,SBD,F,
Girls,56.02,6,Angel Bowerman,Water Valley,55.79,97.52,43.09,92.99,233.6,Unlimited,SBD,F,
Girls,56.02,7,Lynlee Peavy,Water Valley,55.79,70.31,38.56,79.38,188.24,Unlimited,SBD,F,
Girls,60.1,1,Mya Rostro,Big Lake Reagan County,60.06,151.95,63.5,138.35,353.8,Unlimited,SBD,F,
Girls,60.1,2,Aubrey Ledesma,Monahans,59.06,102.06,61.23,127.01,290.3,Unlimited,SBD,F,
Girls,60.1,3,Kalyssa Quintana,Water Valley,59.87,81.65,34.02,90.72,206.38,Unlimited,SBD,F,
Girls,60.1,4,Neela Driver,Andrews,56.25,77.11,36.29,77.11,190.51,Unlimited,SBD,F,
Girls,60.1,5,Claire Wegner,Coahoma,57.88,52.16,31.75,70.31,154.22,Unlimited,SBD,F,
Girls,60.1,DQ,Alie Gallegos,Big Lake Reagan County,56.52,,,,,Unlimited,SBD,F,
Girls,67.36,1,Myka Ditmore,Midland Greenwood,65.05,136.08,102.06,142.88,381.02,Unlimited,SBD,F,
Girls,67.36,2,Karly Perez,Snyder,66.22,136.08,52.16,129.27,317.51,Unlimited,SBD,F,
Girls,67.36,3,Heidi Estrada,Eldorado,65.32,113.4,72.57,124.74,310.71,Unlimited,SBD,F,
Girls,67.36,4,Madison Lee,Monahans,64.95,117.93,70.31,117.93,306.17,Unlimited,SBD,F,
Girls,67.36,5,Amy Coffey,Monahans,62.14,115.67,61.23,108.86,285.76,Unlimited,SBD,F,
Girls,67.36,6,Elena Urquidez,Andrews,62.87,111.13,52.16,120.2,283.5,Unlimited,SBD,F,
Girls,67.36,7,Maddie Cervantes,Coahoma,64.5,106.59,43.09,115.67,265.35,Unlimited,SBD,F,
Girls,67.36,8,Mia Pence,Hermleigh,66.04,106.59,52.16,106.59,265.35,Unlimited,SBD,F,
Girls,67.36,9,Alondra De Luna,Andrews,62.78,102.06,43.09,113.4,258.55,Unlimited,SBD,F,
Girls,67.36,10,Hallie Ellerbe,Hermleigh,65.5,102.06,43.09,106.59,251.74,Unlimited,SBD,F,
Girls,67.36,11,Amaiya Hernandez,Big Spring,63.5,106.59,47.63,95.25,249.48,Unlimited,SBD,F,
Girls,67.36,12,Lillian Orosco,Coahoma,63.96,81.65,56.7,90.72,229.06,Unlimited,SBD,F,
Girls,67.36,13,Lyleanna Chavarria,Andrews,64.77,81.65,40.82,86.18,208.65,Unlimited,SBD,F,
Girls,67.36,14,Kimberly Fortenberry,Coahoma,60.69,79.38,34.02,70.31,183.7,Unlimited,SBD,F,
Girls,67.36,DQ,Carmen Mata,Eldorado,60.6,106.59,,,,Unlimited,SBD,F,
Girls,67.36,DQ,Destiny Dominguez,Eldorado,62.69,95.25,52.16,,,Unlimited,SBD,F,
Girls,75.07,1,Faith Franks,Snyder,73.94,142.88,83.91,142.88,369.68,Unlimited,SBD,F,
Girls,75.07,2,Mari Cruz Esparza,Eldorado,74.39,138.35,83.91,124.74,347,Unlimited,SBD,F,
Girls,75.07,3,Mimi Martinez,Eldorado,74.48,133.81,79.38,133.81,347,Unlimited,SBD,F,
Girls,75.07,4,Hailly May,Andrews,68.49,113.4,68.04,124.74,306.17,Unlimited,SBD,F,
Girls,75.07,5,Leilene Renteria,Monahans,68.22,108.86,45.36,117.93,272.16,Unlimited,SBD,F,
Girls,75.07,6,Tara Porter,Big Spring,72.67,92.99,58.97,115.67,267.62,Unlimited,SBD,F,
Girls,75.07,7,Katie Puente,Snyder,75.02,111.13,43.09,102.06,256.28,Unlimited,SBD,F,
Girls,75.07,8,Elena Bentley,Midland Greenwood,70.22,102.06,43.09,102.06,247.21,Unlimited,SBD,F,
Girls,75.07,9,Shaylee Odaniel,Coahoma,71.12,61.23,24.95,77.11,163.29,Unlimited,SBD,F,
Girls,75.07,DQ,Gabriella Rivero,Big Lake Reagan County,72.12,111.13,49.9,,,Unlimited,SBD,F,
Girls,75.07,DQ,Milli Murillo,Snyder,68.67,120.2,,,,Unlimited,SBD,F,
Girls,75.07,DQ,Ebony DeLeon,Big Lake Reagan County,75.02,124.74,56.7,,,Unlimited,SBD,F,
Girls,82.33,1,Nyomi Aranda,Eldorado,78.38,151.95,102.06,145.15,399.16,Unlimited,SBD,F,
Girls,82.33,2,Yasmn Marquez,Monahans,81.47,113.4,52.16,129.27,294.84,Unlimited,SBD,F,
Girls,82.33,3,Angel Smith,Midland Greenwood,77.56,115.67,65.77,106.59,288.03,Unlimited,SBD,F,
Girls,82.33,4,Alandra Juarez,Big Spring,79.11,113.4,58.97,115.67,288.03,Unlimited,SBD,F,
Girls,82.33,5,Ashley Sears,Water Valley,82.1,97.52,47.63,83.91,229.06,Unlimited,SBD,F,
Girls,90.04,1,Izabella Montoya,Andrews,85.82,142.88,102.06,147.42,392.36,Unlimited,SBD,F,
Girls,90.04,2,Yazmin Heredia,Andrews,85.37,142.88,102.06,129.27,374.21,Unlimited,SBD,F,
Girls,90.04,3,Lupe Esparza,Eldorado,82.74,140.61,83.91,138.35,362.87,Unlimited,SBD,F,
Girls,90.04,4,Esperanza Perales,Andrews,86.55,158.76,63.5,124.74,347,Unlimited,SBD,F,
Girls,90.04,5,Dayanara Vasquez,Andrews,86.18,122.47,68.04,122.47,312.98,Unlimited,SBD,F,
Girls,90.04,6,Cloe Viasana,Big Spring,85.18,120.2,52.16,113.4,285.76,Unlimited,SBD,F,
Girls,100.02,1,Rebecca Rodriguez,Big Spring,99.7,181.44,86.18,170.1,437.72,Unlimited,SBD,F,
Girls,100.02,2,Joslynn Juarez,Midland Greenwood,96.98,115.67,65.77,104.33,285.76,Unlimited,SBD,F,
Girls,100.02,3,Alliana Chavarria,Big Spring,91.99,113.4,56.7,106.59,276.69,Unlimited,SBD,F,
Girls,100.02,4,Nina Garcia,Andrews,90.9,115.67,52.16,92.99,260.82,Unlimited,SBD,F,
Girls,100.02,5,Gloria Hinojos,Andrews,95.16,95.25,61.23,102.06,258.55,Unlimited,SBD,F,
Girls,100.02,DQ,Mckenzie Harris,Hermleigh,98.43,,,,,Unlimited,SBD,F,
Girls,110,1,Lily Bell,Andrews,109.23,183.7,102.06,133.81,419.57,Unlimited,SBD,F,
Girls,110,2,Lynette Wittrein,Garden City,101.42,81.65,49.9,111.13,242.67,Unlimited,SBD,F,
Girls,110,3,Reagan Bollinger,Hermleigh,105.69,83.91,40.82,102.06,226.8,Unlimited,SBD,F,
Girls,110+,1,Quasett Woodruff,Big Spring,125.19,197.31,97.52,165.56,460.4,Unlimited,SBD,F,
Girls,110+,2,Violet Calderon,Big Spring,123.42,181.44,79.38,158.76,419.57,Unlimited,SBD,F,
Girls,110+,3,Giselle Ramirez,Big Lake Reagan County,116.21,158.76,70.31,136.08,365.14,Unlimited,SBD,F,
Girls,110+,4,Micaela Tedder,Midland Greenwood,124.1,117.93,77.11,108.86,303.91,Unlimited,SBD,F,
Girls,110+,5,Idealia Villegas,Monahans,110.31,108.86,58.97,124.74,292.57,Unlimited,SBD,F,
Girls,110+,6,Skylar Gandy,Water Valley,117.48,97.52,49.9,102.06,249.48,Unlimited,SBD,F,
