<?xml version="1.0" encoding="utf-8"?>
<!-- Generator: Adobe Illustrator 22.0.1, SVG Export Plug-In . SVG Version: 6.00 Build 0)  -->
<svg version="1.1" id="Calque_1" xmlns="http://www.w3.org/2000/svg" xmlns:xlink="http://www.w3.org/1999/xlink" x="0px" y="0px"
	 viewBox="0 0 1196 50" style="enable-background:new 0 0 1196 50;" xml:space="preserve">
<style type="text/css">
	.rollingSvg{fill:#F5EE9E;}
</style>
<path class="rollingSvg" d="M42.1,28.7c-0.4-6.8-0.8-14.9-0.7-20.9h-0.2c-1.7,5.7-3.7,11.7-6.1,18.4l-8.5,23.5h-4.7l-7.8-23.1
	c-2.3-6.8-4.2-13.1-5.6-18.8H8.2C8,13.9,7.7,22,7.3,29.2L6,50H0L3.4,1.6h8L19.6,25c2,6,3.7,11.3,4.9,16.3h0.2
	c1.2-4.9,2.9-10.2,5.1-16.3l8.6-23.4h8l3,48.4h-6.1L42.1,28.7z"/>
<path class="rollingSvg" d="M66.2,34.8l-5,15.2h-6.5L71.1,1.6h7.5L95.2,50h-6.7l-5.2-15.2H66.2z M82.1,29.9L77.3,16c-1.1-3.2-1.8-6-2.5-8.8
	h-0.1c-0.7,2.9-1.5,5.8-2.4,8.8l-4.7,14H82.1z"/>
<path class="rollingSvg" d="M108.6,1.6V50h-6.3V1.6H108.6z"/>
<path class="rollingSvg" d="M119.5,1.6h6.3v43.2h20.7V50h-26.9V1.6z"/>
<path class="rollingSvg" d="M167,20.2c0-2.7,1.8-4.5,4.3-4.5c2.5,0,4.2,1.9,4.2,4.5c0,2.5-1.7,4.5-4.3,4.5C168.7,24.6,167,22.7,167,20.2z
	 M167,45.5c0-2.7,1.8-4.5,4.3-4.5c2.5,0,4.2,1.9,4.2,4.5c0,2.5-1.7,4.5-4.3,4.5C168.7,50,167,48.1,167,45.5z"/>
<path class="rollingSvg" d="M208.7,0.8h6.3v32.4c0,12.9-6.3,16.8-14.7,16.8c-2.3,0-5.1-0.5-6.7-1.1l0.9-5.1c1.3,0.5,3.2,0.9,5.2,0.9
	c5.6,0,8.9-2.5,8.9-12V0.8z"/>
<path class="rollingSvg" d="M250.5,27.3h-18.8v17.5h21V50h-27.2V1.6h26.1v5.2h-19.9v15.3h18.8V27.3z"/>
<path class="rollingSvg" d="M260.8,2.2c3.2-0.6,7.7-1,12-1c6.7,0,11,1.2,14,3.9c2.4,2.2,3.8,5.5,3.8,9.2c0,6.4-4,10.6-9.1,12.4v0.2
	c3.7,1.3,6,4.7,7.1,9.8c1.6,6.8,2.7,11.4,3.7,13.3h-6.5c-0.8-1.4-1.9-5.5-3.2-11.6c-1.4-6.7-4-9.2-9.7-9.4H267v21h-6.3V2.2z
	 M267,24.3h6.4c6.7,0,10.9-3.7,10.9-9.2c0-6.2-4.5-9-11.1-9c-3,0-5.2,0.3-6.2,0.6V24.3z"/>
<path class="rollingSvg" d="M324.5,27.3h-18.8v17.5h21V50h-27.2V1.6h26.2v5.2h-19.9v15.3h18.8V27.3z"/>
<path class="rollingSvg" d="M375.6,28.7c-0.4-6.8-0.8-14.9-0.7-20.9h-0.2c-1.6,5.7-3.7,11.7-6.1,18.4L360,49.7h-4.7l-7.8-23.1
	c-2.3-6.8-4.2-13.1-5.6-18.8h-0.1c-0.1,6-0.5,14.1-0.9,21.4L339.5,50h-6l3.4-48.4h8l8.3,23.4c2,6,3.7,11.3,4.9,16.3h0.2
	c1.2-4.9,2.9-10.2,5.1-16.3l8.6-23.4h8l3,48.4h-6.1L375.6,28.7z"/>
<path class="rollingSvg" d="M403.4,50V29.5L388.1,1.6h7.1l6.8,13.4c1.9,3.7,3.3,6.6,4.8,10h0.1c1.4-3.2,3-6.3,4.9-10l7-13.4h7.1l-16.2,27.8
	V50H403.4z"/>
<path class="rollingSvg" d="M422.9,45.5c0-2.7,1.8-4.5,4.3-4.5c2.5,0,4.2,1.9,4.2,4.5c0,2.6-1.6,4.5-4.3,4.5
	C424.6,50,422.9,48.1,422.9,45.5z"/>
<path class="rollingSvg" d="M480.3,28.7c-0.4-6.8-0.8-14.9-0.7-20.9h-0.2c-1.6,5.7-3.7,11.7-6.1,18.4l-8.6,23.5H460l-7.8-23.1
	c-2.3-6.8-4.2-13.1-5.6-18.8h-0.1c-0.1,6-0.5,14.1-0.9,21.4L444.2,50h-6l3.4-48.4h8l8.3,23.4c2,6,3.7,11.3,4.9,16.3h0.2
	c1.2-4.9,2.9-10.2,5.1-16.3l8.6-23.4h8l3,48.4h-6.1L480.3,28.7z"/>
<path class="rollingSvg" d="M538.7,24.5c0,16.7-10.1,25.5-22.5,25.5c-12.8,0-21.8-9.9-21.8-24.6C494.4,10.1,504,0,516.9,0
	C530.1,0,538.7,10.1,538.7,24.5z M501.1,25.3c0,10.3,5.6,19.6,15.4,19.6c9.9,0,15.5-9.1,15.5-20.1c0-9.6-5-19.7-15.4-19.7
	C506.3,5.1,501.1,14.7,501.1,25.3z"/>
<path class="rollingSvg" d="M546.8,50V1.6h6.8l15.5,24.5c3.6,5.7,6.4,10.8,8.7,15.7l0.1-0.1c-0.6-6.5-0.7-12.4-0.7-19.9V1.6h5.9V50h-6.3
	l-15.4-24.6c-3.4-5.4-6.6-10.9-9.1-16.2l-0.2,0.1c0.4,6.1,0.5,11.9,0.5,20V50H546.8z"/>
<path class="rollingSvg" d="M601.9,34.8l-5,15.2h-6.5l16.4-48.4h7.5L631,50h-6.7l-5.2-15.2H601.9z M617.8,29.9L613.1,16
	c-1.1-3.2-1.8-6-2.5-8.8h-0.1c-0.7,2.9-1.5,5.8-2.4,8.8l-4.7,14H617.8z"/>
<path class="rollingSvg" d="M641.8,6.9H627V1.6h35.8v5.3h-14.8V50h-6.3V6.9z"/>
<path class="rollingSvg" d="M680.2,6.9h-14.7V1.6h35.8v5.3h-14.8V50h-6.3V6.9z"/>
<path class="rollingSvg" d="M731.8,27.3H713v17.5h21V50h-27.2V1.6h26.2v5.2H713v15.3h18.8V27.3z"/>
<path class="rollingSvg" d="M774.3,47.1c-3.9,2.1-8,2.9-12.8,2.9c-11.8,0-21.8-8.6-21.8-22.4C739.7,12.8,750,0,766,0
	c12.5,0,20.9,8.8,20.9,20.8c0,10.8-6,17.1-12.8,17.1c-2.9,0-5.5-1.9-5.3-6.3h-0.3c-2.5,4.2-5.8,6.3-10.1,6.3c-4.2,0-7.8-3.4-7.8-9.1
	c0-8.9,7-17,17-17c3.1,0,5.8,0.6,7.7,1.5l-2.4,13c-1.1,5.5-0.2,8,2.2,8c3.7,0.1,7.8-4.8,7.8-13.1c0-10.4-6.3-17.9-17.4-17.9
	c-11.7,0-21.6,9.3-21.6,23.9c0,12,7.8,19.4,18.5,19.4c4.1,0,7.9-0.9,10.9-2.5L774.3,47.1z M770.3,16.1c-0.7-0.2-1.9-0.5-3.6-0.5
	c-6.3,0-11.4,6-11.4,12.9c0,3.2,1.6,5.5,4.7,5.5c4.2,0,8-5.3,8.8-9.8L770.3,16.1z"/>
<path class="rollingSvg" d="M831.9,47.3c-2.8,1-8.3,2.7-14.9,2.7c-7.3,0-13.4-1.9-18.1-6.4c-4.2-4-6.8-10.5-6.8-18c0.1-14.4,10-25,26.2-25
	c5.6,0,10,1.2,12.1,2.2L829,7.9c-2.6-1.1-5.8-2.1-10.7-2.1c-11.8,0-19.5,7.3-19.5,19.5c0,12.3,7.4,19.5,18.7,19.5
	c4.1,0,6.9-0.6,8.3-1.3V29.1H816v-5h16V47.3z"/>
<path class="rollingSvg" d="M882.3,28.7c-0.4-6.8-0.8-14.9-0.7-20.9h-0.2c-1.6,5.7-3.7,11.7-6.1,18.4l-8.6,23.5H862l-7.8-23.1
	c-2.3-6.8-4.2-13.1-5.6-18.8h-0.1c-0.1,6-0.5,14.1-0.9,21.4L846.2,50h-6l3.4-48.4h8l8.3,23.4c2,6,3.7,11.3,4.9,16.3h0.2
	c1.2-4.9,2.9-10.2,5.1-16.3l8.6-23.4h8l3,48.4h-6.1L882.3,28.7z"/>
<path class="rollingSvg" d="M906.4,34.8l-5,15.2h-6.5l16.4-48.4h7.5L935.4,50h-6.7l-5.2-15.2H906.4z M922.3,29.9L917.6,16
	c-1.1-3.2-1.8-6-2.5-8.8h-0.1c-0.7,2.9-1.5,5.8-2.4,8.8l-4.7,14H922.3z"/>
<path class="rollingSvg" d="M948.8,1.6V50h-6.3V1.6H948.8z"/>
<path class="rollingSvg" d="M959.8,1.6h6.3v43.2h20.7V50h-26.9V1.6z"/>
<path class="rollingSvg" d="M992,45.5c0-2.7,1.8-4.5,4.3-4.5c2.5,0,4.2,1.9,4.2,4.5c0,2.6-1.6,4.5-4.3,4.5C993.7,50,992,48.1,992,45.5z"/>
<path class="rollingSvg" d="M1042.4,47.7c-2.3,1.1-6.9,2.3-12.8,2.3c-13.7,0-23.9-8.6-23.9-24.5c0-15.2,10.3-25.4,25.3-25.4
	c6,0,9.8,1.3,11.5,2.2l-1.5,5.1c-2.4-1.2-5.7-2-9.8-2c-11.3,0-18.9,7.3-18.9,20c0,11.9,6.8,19.5,18.6,19.5c3.8,0,7.7-0.8,10.2-2
	L1042.4,47.7z"/>
<path class="rollingSvg" d="M1090.1,24.5c0,16.7-10.1,25.5-22.5,25.5c-12.8,0-21.8-9.9-21.8-24.6c0-15.4,9.6-25.4,22.5-25.4
	C1081.6,0,1090.1,10.1,1090.1,24.5z M1052.5,25.3c0,10.3,5.6,19.6,15.4,19.6c9.9,0,15.5-9.1,15.5-20.1c0-9.6-5-19.7-15.4-19.7
	C1057.7,5.1,1052.5,14.7,1052.5,25.3z"/>
<path class="rollingSvg" d="M1139.1,28.7c-0.4-6.8-0.8-14.9-0.7-20.9h-0.2c-1.6,5.7-3.7,11.7-6.1,18.4l-8.6,23.5h-4.7l-7.8-23.1
	c-2.3-6.8-4.2-13.1-5.6-18.8h-0.1c-0.1,6-0.5,14.1-0.9,21.4l-1.3,20.8h-6l3.4-48.4h8l8.3,23.4c2,6,3.7,11.3,4.9,16.3h0.2
	c1.2-4.9,2.9-10.2,5.1-16.3l8.6-23.4h8l3,48.4h-6.1L1139.1,28.7z"/>
</svg>
