module github.com/jmc171144/zone

go 1.15

require (
	github.com/cosmos/cosmos-sdk v0.42.1
	github.com/ethereum/go-ethereum v1.9.21
	github.com/gogo/protobuf v1.3.3
	github.com/golang/protobuf v1.4.3
	github.com/gorilla/mux v1.8.0
	github.com/grpc-ecosystem/grpc-gateway v1.16.0
	github.com/spf13/cast v1.3.1
	github.com/spf13/cobra v1.1.1
	github.com/spf13/pflag v1.0.5
	github.com/spf13/viper v1.7.1
	github.com/stretchr/testify v1.7.0
	github.com/tendermint/tendermint v0.34.8
	github.com/tendermint/tm-db v0.6.4
	golang.org/x/net v0.0.0-20210316092652-d523dce5a7f4 // indirect
	golang.org/x/sys v0.0.0-20210320140829-1e4c9ba3b0c4 // indirect
	golang.org/x/text v0.3.5 // indirect
	google.golang.org/genproto v0.0.0-20210207032614-bba0dbe2a9ea
	google.golang.org/grpc v1.37.0
	google.golang.org/protobuf v1.26.0-rc.1 // indirect
	gopkg.in/yaml.v3 v3.0.0-20210107192922-496545a6307b // indirect
)

replace github.com/gogo/protobuf => github.com/regen-network/protobuf v1.3.2-alpha.regen.4

replace github.com/gogo/grpc => google.golang.org/grpc v1.33.2
