Pseudocódigo.

Inicio
    mensaje1 = “El número ingresado tiene que ser mayor o igual a 0”
    mensaje2 = “La base del triangulo no es diferente a los lados”
    lados = 0
    base = 0
    leer “Ingresa el tamaño de los lados”, lados
    leer “Ingresa el tamaño de la base”, base
    if (lados >= 0 and base >=0) then
        if(base != lados) then
	    print base+(lados*2)
        else
	    print mensaje2
	end-if
    else
        print mensaje1
    end-if
fin


