Sex,Division,AgeRange,Name,WeightClassKg,Best3SquatKg,Best3BenchKg,Best3DeadliftKg,TotalKg,Event,Equipment,Place
F,Teen 14-15,14-15,S. Jeffrey,48,80,37.5,90,207.5,SBD,Single-ply,1
F,Teen 14-15,14-15,J. Greene #6,52,117.5,55,127.5,300,SBD,Single-ply,1
F,Teen 16-17,16-17,M. Helminski,56,85,50,112.5,247.5,SBD,Single-ply,1
F,Teen 18-19,18-19,M. Wilson,52,102.5,50,110,262.5,SBD,Single-ply,1
F,Teen 18-19,18-19,Donna Secreto,56,102.5,65,130,297.5,SBD,Single-ply,1
F,Teen 18-19,18-19,Amy Hoffman,60,125,72.5,142.5,340,SBD,Single-ply,1
F,Teen 18-19,18-19,G. Grizzle,67.5,132.5,75,145,352.5,SBD,Single-ply,1
F,Teen 18-19,18-19,Katherine Oyler,75,197.5,97.5,185,480,SBD,Single-ply,1
M,Teen 14-15,14-15,Pat Boarman,52,122.5,57.5,142.5,322.5,SBD,Single-ply,1
M,Teen 14-15,14-15,T. Perry,52,52.5,37.5,92.5,182.5,SBD,Single-ply,2
M,Teen 14-15,14-15,Chris Edwards,56,162.5,77.5,142.5,382.5,SBD,Single-ply,1
M,Teen 14-15,14-15,S. Barker,56,82.5,52.5,102.5,237.5,SBD,Single-ply,2
M,Teen 14-15,14-15,J. Campbell,60,167.5,85,170,422.5,SBD,Single-ply,1
M,Teen 14-15,14-15,E. Spahn,60,137.5,75,167.5,380,SBD,Single-ply,2
M,Teen 14-15,14-15,J. McCoy,60,137.5,70,145,352.5,SBD,Single-ply,3
M,Teen 14-15,14-15,J. Easterling,60,85,60,100,245,SBD,Single-ply,4
M,Teen 14-15,14-15,Chris Howard,67.5,135,77.5,170,382.5,SBD,Single-ply,1
M,Teen 14-15,14-15,Ty Cook,67.5,137.5,85,160,382.5,SBD,Single-ply,2
M,Teen 14-15,14-15,Robert Theverkauf,67.5,132.5,80,142.5,355,SBD,Single-ply,3
M,Teen 14-15,14-15,D. Boyd,75,165,72.5,170,407.5,SBD,Single-ply,1
M,Teen 14-15,14-15,M. Laughter,75,92.5,67.5,112.5,272.5,SBD,Single-ply,2
M,Teen 14-15,14-15,Josh Egli,82.5,180,92.5,175,447.5,SBD,Single-ply,1
M,Teen 14-15,14-15,Kevin Marcum,82.5,170,92.5,175,437.5,SBD,Single-ply,2
M,Teen 14-15,14-15,John Carl,82.5,137.5,72.5,155,365,SBD,Single-ply,3
M,Teen 14-15,14-15,D. Finch,82.5,105,77.5,150,332.5,SBD,Single-ply,4
M,Teen 14-15,14-15,P. Thomas,82.5,117.5,62.5,142.5,322.5,SBD,Single-ply,5
M,Teen 14-15,14-15,Andy Meadows,90,175,137.5,165,477.5,SBD,Single-ply,1
M,Teen 14-15,14-15,Tony Marcum,90,172.5,105,180,457.5,SBD,Single-ply,2
M,Teen 14-15,14-15,C. Johnson,100,167.5,77.5,175,420,SBD,Single-ply,1
M,Teen 16-17,16-17,Pat Bone,52,85,50,102.5,237.5,SBD,Single-ply,1
M,Teen 16-17,16-17,Eric Gill,56,137.5,97.5,172.5,407.5,SBD,Single-ply,1
M,Teen 16-17,16-17,W. Kannapel,56,120,67.5,127.5,315,SBD,Single-ply,2
M,Teen 16-17,16-17,Mike DeLoach,60,165,95,167.5,427.5,SBD,Single-ply,1
M,Teen 16-17,16-17,G. Vance,60,150,107.5,167.5,425,SBD,Single-ply,2
M,Teen 16-17,16-17,Brian Tincher,67.5,212.5,132.5,212.5,557.5,SBD,Single-ply,1
M,Teen 16-17,16-17,K. Nance,67.5,212.5,102.5,170,485,SBD,Single-ply,2
M,Teen 16-17,16-17,J. Brown,67.5,75,62.5,160,297.5,SBD,Single-ply,3
M,Teen 16-17,16-17,B. Hetrick,67.5,172.5,85,,,SBD,Single-ply,DQ
M,Teen 16-17,16-17,Jim Stratman,75,200,115,195,510,SBD,Single-ply,1
M,Teen 16-17,16-17,J. Hopkins,75,155,105,170,430,SBD,Single-ply,2
M,Teen 16-17,16-17,B. Hay,75,70,72.5,77.5,220,SBD,Single-ply,3
M,Teen 16-17,16-17,C. Poston,82.5,190,105,195,490,SBD,Single-ply,1
M,Teen 16-17,16-17,Bernard Barthelome,82.5,160,112.5,205,477.5,SBD,Single-ply,2
M,Teen 16-17,16-17,T. Justice,82.5,160,110,200,470,SBD,Single-ply,3
M,Teen 16-17,16-17,Thomas Henderson,82.5,165,95,202.5,462.5,SBD,Single-ply,4
M,Teen 16-17,16-17,T. Sheckell,82.5,167,90,190,447,SBD,Single-ply,5
M,Teen 16-17,16-17,E. Boze,82.5,157.5,92.5,142.5,392.5,SBD,Single-ply,6
M,Teen 16-17,16-17,C. Wright,82.5,137.5,97.5,155,390,SBD,Single-ply,7
M,Teen 16-17,16-17,R. Kowalczyk,90,235,132.5,240,607.5,SBD,Single-ply,1
M,Teen 16-17,16-17,D. Yates,90,205,142.5,237.5,585,SBD,Single-ply,2
M,Teen 16-17,16-17,N. Sodrel,90,207,107.5,215,529.5,SBD,Single-ply,3
M,Teen 16-17,16-17,E. Hicks,90,187.5,102.5,192.5,482.5,SBD,Single-ply,4
M,Teen 16-17,16-17,M. Howard,90,160,110,185,455,SBD,Single-ply,5
M,Teen 16-17,16-17,Andy Vale,100,237.5,132.5,217.5,587.5,SBD,Single-ply,1
M,Teen 16-17,16-17,J. Gatch,100,227.5,125,227.5,580,SBD,Single-ply,2
M,Teen 16-17,16-17,Nick Coleman,100,205,117.5,227.5,550,SBD,Single-ply,3
M,Teen 16-17,16-17,B. Goforth,100,137.5,95,137.5,370,SBD,Single-ply,4
M,Teen 16-17,16-17,Gregory Vale,110,272.5,150,227.5,650,SBD,Single-ply,1
M,Teen 16-17,16-17,J Taite,110,220,120,245,585,SBD,Single-ply,2
M,Teen 16-17,16-17,M. Marshall,110,215,122.5,237.5,575,SBD,Single-ply,3
M,Teen 16-17,16-17,J. Gollihue,110,210,125,190,525,SBD,Single-ply,4
M,Teen 16-17,16-17,K. Young,110,155,92.5,160,407.5,SBD,Single-ply,5
M,Teen 16-17,16-17,Jeff Maynard,125,230,150,237.5,617.5,SBD,Single-ply,1
M,Teen 16-17,16-17,S. Brown,125,192.5,102.5,230,525,SBD,Single-ply,2
M,Teen 16-17,16-17,David Fenton,140,220,120,232.5,572.5,SBD,Single-ply,1
M,Teen 16-17,16-17,S. Wilson,140,137.5,120,182.5,440,SBD,Single-ply,2
M,Teen 18-19,18-19,Mike Stagg,56,157.5,92.5,192.5,442.5,SBD,Single-ply,1
M,Teen 18-19,18-19,Ray Crane,60,170,80,170,420,SBD,Single-ply,1
M,Teen 18-19,18-19,Bruce Gibson,67.5,147.5,92.5,155,395,SBD,Single-ply,1
M,Teen 18-19,18-19,George Farrell,75,245,100,215,560,SBD,Single-ply,1
M,Teen 18-19,18-19,G. Tush,75,197.5,127.5,217.5,542.5,SBD,Single-ply,2
M,Teen 18-19,18-19,John Daywalt,75,140,105,192.5,437.5,SBD,Single-ply,3
M,Teen 18-19,18-19,K. van der Linden,75,137.5,120,177.5,435,SBD,Single-ply,4
M,Teen 18-19,18-19,Richard Gregory,82.5,250,147.5,272.5,670,SBD,Single-ply,1
M,Teen 18-19,18-19,Jeff Beach,82.5,252.5,155,247.5,655,SBD,Single-ply,2
M,Teen 18-19,18-19,T. Papalios,82.5,255,125,257.4,637.4,SBD,Single-ply,3
M,Teen 18-19,18-19,A. Watson,82.5,207.5,117.5,220,545,SBD,Single-ply,4
M,Teen 18-19,18-19,Todd Helpbringer,90,287.5,195,265,747.5,SBD,Single-ply,1
M,Teen 18-19,18-19,Adam Beckler,90,285,182.5,280,747.5,SBD,Single-ply,2
M,Teen 18-19,18-19,John Wardell,90,290,167.5,252.5,710,SBD,Single-ply,3
M,Teen 18-19,18-19,M. Fessenden,90,250,182.5,272.5,705,SBD,Single-ply,4
M,Teen 18-19,18-19,W. Travis,90,262.5,150,262.5,675,SBD,Single-ply,5
M,Teen 18-19,18-19,G. Castro,100,265,192.5,230,687.5,SBD,Single-ply,1
M,Teen 18-19,18-19,Mark Carl,100,172.5,125,220,517.5,SBD,Single-ply,2
M,Teen 18-19,18-19,G. Held,100,185,110,175,470,SBD,Single-ply,3
M,Teen 18-19,18-19,Ronald Szolack,110,252.5,207.5,250,710,SBD,Single-ply,1
M,Teen 18-19,18-19,Tony Niemeier,110,225,140,230,595,SBD,Single-ply,2
M,Teen 18-19,18-19,Fred Clary,125,322.5,205,355,882.5,SBD,Single-ply,1
M,Teen 18-19,18-19,Bill Cook,140,242.5,127.5,260,630,SBD,Single-ply,1
