Division,WeightClassKg,Place,Name,Team,BodyweightKg,Best3SquatKg,Best3BenchKg,Best3DeadliftKg,TotalKg,Equipment,Event,Sex
Boys,51.71,1,Matt Perez,Ralls,50.39,117.93,58.97,136.08,312.98,Single-ply,SBD,M
Boys,51.71,2,Cody Henson,Abernathy,49.44,104.33,65.77,117.93,288.03,Single-ply,SBD,M
Boys,51.71,3,Jordan Garcia #4,Slaton,48.04,97.52,52.16,129.27,278.96,Single-ply,SBD,M
Boys,51.71,4,Juan Trejo,Friona,44.32,102.06,47.63,115.67,265.35,Single-ply,SBD,M
Boys,51.71,5,Nathan Flores,Friona,49.03,83.91,56.7,106.59,247.21,Single-ply,SBD,M
Boys,55.79,1,Carlos Rodriguez #1,Olton,54.84,142.88,79.38,147.42,369.68,Single-ply,SBD,M
Boys,55.79,2,Juan Yebra,Olton,55.79,106.59,79.38,140.61,326.59,Single-ply,SBD,M
Boys,55.79,3,Alfredo Lozano,Brownfield,54.57,108.86,61.23,142.88,312.98,Single-ply,SBD,M
Boys,55.79,4,Jose Perez #6,Sundown,54.48,111.13,52.16,127.01,290.3,Single-ply,SBD,M
Boys,55.79,5,John Lopez,Ralls,54.02,108.86,56.7,115.67,281.23,Single-ply,SBD,M
Boys,55.79,6,Jakeum DeLaCruz,Abernathy,55.79,102.06,63.5,95.25,260.82,Single-ply,SBD,M
Boys,55.79,7,Truman Richerson,Abernathy,52.62,79.38,56.7,99.79,235.87,Single-ply,SBD,M
Boys,59.87,1,Luis Trejo,Friona,59.06,190.51,104.33,172.37,467.2,Single-ply,SBD,M
Boys,59.87,2,Miguel Vasquez,Farwell,59.28,154.22,102.06,176.9,433.18,Single-ply,SBD,M
Boys,59.87,3,Mario Hernandez,Friona,59.74,142.88,83.91,149.69,376.48,Single-ply,SBD,M
Boys,59.87,4,Santos Yanez,Slaton,58.47,138.35,77.11,147.42,362.87,Single-ply,SBD,M
Boys,59.87,5,Marin Santiago,Friona,59.74,142.88,61.23,156.49,360.61,Single-ply,SBD,M
Boys,59.87,6,Cade Conway,Sundown,59.78,142.88,74.84,136.08,353.8,Single-ply,SBD,M
Boys,59.87,7,Brandon Ureste,Abernathy,59.87,108.86,58.97,117.93,285.76,Single-ply,SBD,M
Boys,59.87,8,Devan Perez,Floydada,58.11,95.25,61.23,117.93,274.42,Single-ply,SBD,M
Boys,59.87,9,Anthony Padilla,Friona,57.7,86.18,49.9,111.13,247.21,Single-ply,SBD,M
Boys,67.13,1,Johnny Hernandez,Sundown,63.73,199.58,90.72,163.29,453.59,Single-ply,SBD,M
Boys,67.13,2,Bryan de la Torre,Bovina,61.33,156.49,83.91,176.9,417.3,Single-ply,SBD,M
Boys,67.13,3,John Lugo,Ralls,67.13,170.1,90.72,142.88,403.7,Single-ply,SBD,M
Boys,67.13,4,Isiah Zavala,Ralls,61.51,147.42,99.79,151.95,399.16,Single-ply,SBD,M
Boys,67.13,5,Isaac Hernandez,Sundown,64.23,149.69,83.91,163.29,396.89,Single-ply,SBD,M
Boys,67.13,6,Zach Ponciano,Abernathy,65.32,158.76,83.91,147.42,390.09,Single-ply,SBD,M
Boys,67.13,7,Rock Thoms,Sundown,65.59,142.88,77.11,165.56,385.55,Single-ply,SBD,M
Boys,67.13,8,Julian Cotto,Tahoka,67,138.35,88.45,158.76,385.55,Single-ply,SBD,M
Boys,67.13,9,Peyton Lowdermilk,Tahoka,63.68,127.01,70.31,142.88,340.19,Single-ply,SBD,M
Boys,67.13,10,Donald Gibbens,Floydada,66.68,111.13,88.45,131.54,331.12,Single-ply,SBD,M
Boys,67.13,11,J-Lee Moreno,Abernathy,61.23,136.08,65.77,127.01,328.85,Single-ply,SBD,M
Boys,67.13,12,Daniel Aguirre,Abernathy,63.5,104.33,77.11,124.74,306.17,Single-ply,SBD,M
Boys,67.13,DQ,Jeremiah Diaz,Friona,65.14,,,,,Single-ply,SBD,M
Boys,74.84,1,Noah Baker,Sudan,74.53,163.29,90.72,170.1,424.11,Single-ply,SBD,M
Boys,74.84,2,Alexander Herevia,Tahoka,68.45,136.08,86.18,165.56,387.82,Single-ply,SBD,M
Boys,74.84,3,Brendyn Rodriguez,Brownfield,74.66,124.74,92.99,156.49,374.21,Single-ply,SBD,M
Boys,74.84,4,Matthew Diaz,Tahoka,69.08,145.15,70.31,147.42,362.87,Single-ply,SBD,M
Boys,74.84,5,Austin Calloway,Abernathy,73.94,124.74,72.57,142.88,340.19,Single-ply,SBD,M
Boys,74.84,6,Seth Rennels,Slaton,70.81,117.93,77.11,136.08,331.12,Single-ply,SBD,M
Boys,74.84,7,Alex Conley,Sudan,71.71,102.06,92.99,113.4,308.44,Single-ply,SBD,M
Boys,74.84,8,Michael Trevino,Abernathy,68.95,124.74,68.04,113.4,306.17,Single-ply,SBD,M
Boys,74.84,9,Chris Vargas,Tahoka,74.07,115.67,61.23,124.74,301.64,Single-ply,SBD,M
Boys,74.84,10,Abel Tinajero,Sudan,71.26,99.79,81.65,106.59,288.03,Single-ply,SBD,M
Boys,74.84,11,Jeremy Flores,Ralls,70.08,102.06,70.31,113.4,285.76,Single-ply,SBD,M
Boys,74.84,12,Ryan Scoggins,Tahoka,68.86,90.72,56.7,136.08,283.5,Single-ply,SBD,M
Boys,74.84,13,Miguel Granados,Tahoka,71.49,99.79,56.7,120.2,276.69,Single-ply,SBD,M
Boys,74.84,DQ,Osvaldo Snyder,Bovina,74.84,161.03,,,,Single-ply,SBD,M
Boys,82.1,1,Link Wilkes,Sundown,81.6,204.12,129.27,249.48,582.87,Single-ply,SBD,M
Boys,82.1,2,Jayton Grisham,Abernathy,82.1,199.58,113.4,190.51,503.49,Single-ply,SBD,M
Boys,82.1,3,Brayden Castillon,Tahoka,78.56,181.44,111.13,192.78,485.34,Single-ply,SBD,M
Boys,82.1,4,Pedro Villarreal,Ralls,78.52,170.1,117.93,176.9,464.93,Single-ply,SBD,M
Boys,82.1,5,Marco Sanchez,Bovina,80.29,127.01,111.13,181.44,419.57,Single-ply,SBD,M
Boys,82.1,6,Hunter Graves,Post,75.25,151.95,83.91,161.03,396.89,Single-ply,SBD,M
Boys,82.1,7,Lorenzo Garza,Brownfield,75.93,127.01,81.65,149.69,358.34,Single-ply,SBD,M
Boys,82.1,8,David Moreno,Floydada,77.61,122.47,74.84,151.95,349.27,Single-ply,SBD,M
Boys,82.1,9,Saige Rodriguez,Slaton,81.96,136.08,79.38,120.2,335.66,Single-ply,SBD,M
Boys,82.1,10,Zach Gonzales,Sudan,77.93,106.59,83.91,120.2,310.71,Single-ply,SBD,M
Boys,82.1,11,Ezra Stephens,Friona,80.2,117.93,58.97,111.13,288.03,Single-ply,SBD,M
Boys,82.1,12,Ethan Rodriguez,Floydada,75.43,102.06,65.77,111.13,278.96,Single-ply,SBD,M
Boys,82.1,13,Adrian Sital,Sudan,78.06,104.33,61.23,113.4,278.96,Single-ply,SBD,M
Boys,82.1,14,Jesus Huerta,Sudan,75.75,90.72,52.16,88.45,231.33,Single-ply,SBD,M
Boys,89.81,1,Ladd Wilkes,Sundown,83.91,215.46,138.35,226.8,580.6,Single-ply,SBD,M
Boys,89.81,2,Cade Barkowsky,Lamesa Klondike,89.36,174.63,131.54,201.85,508.02,Single-ply,SBD,M
Boys,89.81,3,Jeremy L Hernandez,Sundown,87,170.1,97.52,199.58,467.2,Single-ply,SBD,M
Boys,89.81,4,Bryce Spencer,Sundown,83.19,172.37,108.86,176.9,458.13,Single-ply,SBD,M
Boys,89.81,5,Ariel Jaramillo,Friona,89.81,165.56,88.45,170.1,424.11,Single-ply,SBD,M
Boys,89.81,6,Jesus Jaramillo,Friona,89.49,136.08,95.25,172.37,403.7,Single-ply,SBD,M
Boys,89.81,7,Brody Black,Sundown,85.23,147.42,83.91,154.22,385.55,Single-ply,SBD,M
Boys,89.81,8,Stephen Cortez,Abernathy,88.9,131.54,74.84,124.74,331.12,Single-ply,SBD,M
Boys,89.81,9,Jacob McMinn,Abernathy,83.46,124.74,68.04,133.81,326.59,Single-ply,SBD,M
Boys,89.81,10,Bryan Valentin,Brownfield,86.82,111.13,61.23,145.15,317.51,Single-ply,SBD,M
Boys,99.79,1,Nathan Sullivan,Abernathy,93.89,235.87,136.08,217.72,589.67,Single-ply,SBD,M
Boys,99.79,2,Valente Perez,Post,99.47,229.06,129.27,231.33,589.67,Single-ply,SBD,M
Boys,99.79,3,JR Paiz,Sundown,96.3,188.24,111.13,163.29,462.66,Single-ply,SBD,M
Boys,99.79,4,Tristan Castillo,Friona,99.74,181.44,117.93,156.49,455.86,Single-ply,SBD,M
Boys,99.79,5,Michael Muse,Olton,93.08,181.44,99.79,172.37,453.59,Single-ply,SBD,M
Boys,99.79,6,Gabriel Chavez,Olton,98.66,188.24,102.06,163.29,453.59,Single-ply,SBD,M
Boys,99.79,7,Devin Salazar,Ralls,92.94,140.61,92.99,172.37,405.97,Single-ply,SBD,M
Boys,99.79,8,Blake Harmon,Tahoka,93.49,142.88,95.25,149.69,387.82,Single-ply,SBD,M
Boys,99.79,9,Nicodemus Ayala,Tahoka,94.35,142.88,83.91,147.42,374.21,Single-ply,SBD,M
Boys,99.79,10,Sergio Flores,Friona,91.04,149.69,83.91,136.08,369.68,Single-ply,SBD,M
Boys,99.79,11,Rafael Vicencio,Brownfield,91.94,129.27,68.04,138.35,335.66,Single-ply,SBD,M
Boys,99.79,12,Jared Bella,Friona,98.25,120.2,83.91,115.67,319.78,Single-ply,SBD,M
Boys,109.77,1,Diego Garcia,Brownfield,106.59,204.12,136.08,204.12,544.31,Single-ply,SBD,M
Boys,109.77,2,Ian Ponce,Abernathy,107.5,206.38,117.93,176.9,501.22,Single-ply,SBD,M
Boys,109.77,3,Javier Olvera,Floydada,104.24,185.97,113.4,183.7,483.08,Single-ply,SBD,M
Boys,109.77,4,EJ Salinas,Abernathy,107.5,183.7,117.93,181.44,483.08,Single-ply,SBD,M
Boys,124.74,1,Even Ybarra,Floydada,118.66,213.19,129.27,206.38,548.85,Single-ply,SBD,M
Boys,124.74,2,Steven Romero,Floydada,114.94,204.12,106.59,204.12,514.83,Single-ply,SBD,M
Boys,124.74,3,Jonah Lopez,Abernathy,110.22,188.24,113.4,192.78,494.42,Single-ply,SBD,M
Boys,124.74,4,Aj Castro,Sundown,114.85,192.78,122.47,170.1,485.34,Single-ply,SBD,M
Boys,124.74,5,Isaiah Montes,Sudan,120.25,181.44,113.4,183.7,478.54,Single-ply,SBD,M
Boys,124.74,6,Miguel Davila,Friona,119.07,183.7,111.13,140.61,435.45,Single-ply,SBD,M
Boys,124.74,7,Ulysses Saucedo,Friona,120.11,90.72,61.23,111.13,263.08,Single-ply,SBD,M
Boys,124.74+,1,Alek Garcia,Slaton,174.18,294.84,124.74,238.14,657.71,Single-ply,SBD,M
Boys,124.74+,2,Price Cooper,Lamesa Klondike,135.58,247.21,142.88,226.8,616.89,Single-ply,SBD,M
Boys,124.74+,3,Francisco Saenz,Olton,131.77,226.8,131.54,226.8,585.13,Single-ply,SBD,M
Boys,124.74+,4,Justin Perez,Farwell,127.5,226.8,138.35,192.78,557.92,Single-ply,SBD,M
Boys,124.74+,5,Gerardo Carrillo,Bovina,136.71,183.7,138.35,190.51,512.56,Single-ply,SBD,M
Boys,124.74+,6,Josh Salas,Slaton,144.92,204.12,102.06,192.78,498.95,Single-ply,SBD,M
Boys,124.74+,7,Cameron Hastings,Sundown,138.39,158.76,111.13,158.76,428.64,Single-ply,SBD,M
Boys,124.74+,DQ,Victor Soto,Slaton,148.32,,,,,Single-ply,SBD,M
Boys,124.74+,DQ,Jeff Davis,Brownfield,142.07,90.72,,,,Single-ply,SBD,M
