Place,Name,Sex,BirthDate,Age,Equipment,Division,BodyweightKg,WeightClassKg,Squat1Kg,Squat2Kg,Squat3Kg,Best3SquatKg,Bench1Kg,Bench2Kg,Bench3Kg,Best3BenchKg,Deadlift1Kg,Deadlift2Kg,Deadlift3Kg,Best3DeadliftKg,TotalKg,Event
1,Leighanne Russell,F,1981-12-10,39,Raw,F_OR_ABPU,89.3,90,142.5,-152.5,152.5,152.5,65,70,75,75,160,170,-180,170,397.5,SBD
1,Chardonnay Holwell-Russell,F,2003-10-13,17,Raw,F_TR_2_ABPU,78.1,82.5,110,117.5,125,125,50,55,60,60,120,130,140,140,325,SBD
1,Nicola Simmonds,F,1979-01-28,42,Wraps,F_MCR_1_ABPU,78.9,82.5,80,-90,95,95,42.5,45,-47.5,45,110,120,-130,120,260,SBD
1,Nicky Edgar,F,1975-01-31,46,Raw,F_MCR_2_ABPU,66.35,67.5,102.5,-110,-110,102.5,50,52.5,-55,52.5,125,130,-132.5,130,285,SBD
1,Suzie Millns,F,1969-10-29,51,Raw,F_MCR_3_ABPU,110.4,90+,70,80,90,90,50,55,60,60,135,145,155,155,305,SBD
1,Alexandra Blohm,F,1990-04-14,31,Wraps,F_OCR_ABPU,66.45,67.5,120,130,140,140,62.5,67.5,70,70,160,172.5,-182.5,172.5,382.5,SBD
1,Becca Lundberg,F,1983-05-08,38,Wraps,F_OCR_ABPU,81.4,82.5,95,102.5,110,110,62.5,67.5,72.5,72.5,122.5,132.5,140,140,322.5,SBD
1,Karl Williams,M,1980-02-24,41,Raw,M_MR_1_ABPU,81.65,82.5,140,150,160,160,85,92.5,97.5,97.5,170,185,-195,185,442.5,SBD
1,Daniel Hartwell,M,1978-06-11,42,Raw,M_MR_1_BPU,99.8,100,155,165,,165,95,102.5,-112.5,102.5,187.5,205,215,215,482.5,SBD
1,Ryan Faldo,M,1984-04-29,37,Raw,M_OR_ABPU,109.9,110,210,-225,230,230,147.5,155,160,160,225,240,250,250,640,SBD
2,Michael Webster,M,1991-06-15,29,Raw,M_OR_ABPU,101.7,110,-160,-170,175,175,100,107.5,115,115,170,190,210,210,500,SBD
1,Cole Edwards #4,M,2000-01-10,21,Raw,M_JCR_ABPU,89.5,90,180,-195,-195,180,115,122.5,125,125,200,215,-230,215,520,SBD
1,Thomas West #2,M,1998-03-26,23,Raw,M_JCR_ABPU,104.35,110,225,-235,-235,225,115,125,-132.5,125,250,260,-272.5,260,610,SBD
1,Ross Tizard,M,1978-06-13,42,Wraps,M_MCR_1_ABPU,95,100,175,190,200,200,100,110,120,120,185,200,215,215,535,SBD
1,Joe Martin #1,M,1979-05-17,42,Wraps,M_MCR_1_BPU,109.7,110,265,280,-295,280,165,180,190,190,260,280,-300,280,750,SBD
1,Jason Swalwell,M,1971-07-26,49,Wraps,M_MCR_2_BPU,120.6,125,-215,215,222.5,222.5,160,165,170,170,270,280,290,290,682.5,SBD
1,Mark Lawford,M,1973-10-06,47,Wraps,M_MCR_2_ABPU,132.1,140,215,-230,-245,215,170,180,-190,180,230,245,255,255,650,SBD
1,Kevin Smith #21,M,1963-05-26,58,Wraps,M_MCR_4_BPU,86.2,90,130,140,150,150,85,90,95,95,180,200,210,210,455,SBD
1,Kevin Payne #2,M,1957-06-07,63,Raw,M_MCR_5_ABPU,71.8,75,100,-110,110,110,75,80,85,85,175,190,-200,190,385,SBD
1,Frazer Sargordi Marriott,M,1990-05-22,31,Raw,M_OCR_ABPU,89.1,90,212.5,-227.5,227.5,227.5,140,145,-150,145,225,232.5,252.5,252.5,625,SBD
1,Tom Gee #1,M,1983-08-10,37,Multi-ply,M_OEM_ABPU,96.1,100,280,-300,300,300,180,190,195,195,240,257.5,265,265,760,SBD
1,Jin-Ho Jeong,M,1992-02-08,29,Raw,M_OCR_ABPU,99.3,100,202.5,215,-227.5,215,102.5,110,117.5,117.5,205,217.5,225,225,557.5,SBD
1,Rob Flett,M,1994-12-09,26,Wraps,M_OCR_BPU,132.5,140,290,310,320,320,190,205,215,215,285,305,315,315,850,SBD
1,Archie Reid,M,2003-08-16,17,Wraps,M_TCR_2_ABPU,115.4,125,130,145,155,155,110,115,,115,215,230,-240,230,500,SBD
1,Danny O'Brien #1,M,1992-07-30,28,Raw,M_OR_BPU,82.4,82.5,,,,,155,162.5,167.5,167.5,,,,,167.5,B
1,Danny O'Brien #1,M,1992-07-30,28,Raw,M_OR_BPU,82.4,82.5,,,,,,,,,250,-260,-260,250,250,D
1,John MacDonald #3,M,1966-11-03,54,Raw,M_MR_3_ABPU,89.8,90,,,,,140,-145,145,145,,,,,145,B
1,Mark Towers,M,1998-01-11,23,Raw,M_JR_ABPU,99.4,100,,,,,,,,,195,210,220,220,220,D
1,Mark Bromilow,M,1980-02-28,41,Raw,M_MCR_1_BPU,98.2,100,,,,,,,,,275,292.5,302.5,302.5,302.5,D
1,Mike Towers,M,1966-06-21,54,Raw,M_MR_3_BPU,108.1,110,,,,,,,,,230,250,260,260,260,D
