Division,WeightClassKg,Place,Name,Team,BodyweightKg,Best3SquatKg,Best3BenchKg,Best3DeadliftKg,TotalKg,Equipment,Event,Sex,BirthDate
Boys,51.71,1,Weslee Duke,Groesbeck,51.44,108.86,68.04,136.08,312.98,Single-ply,SBD,M,
Boys,51.71,2,Carlos Bolivar,Cameron Yoe,46.27,111.13,63.5,127.01,301.64,Single-ply,SBD,M,
Boys,51.71,DQ,Isaac Rios,Killeen Ellison,49.62,,,,,Single-ply,SBD,M,
Boys,55.79,1,Ruben Salazar,West,54.88,156.49,88.45,145.15,390.09,Single-ply,SBD,M,
Boys,55.79,2,Cameron Sams,Lorena,54.88,136.08,79.38,142.88,358.34,Single-ply,SBD,M,
Boys,55.79,3,Demitrius Parker,Waco La Vega,54.07,124.74,77.11,131.54,333.39,Single-ply,SBD,M,
Boys,55.79,4,Ryan Williams #7,West,53.07,120.2,65.77,120.2,306.17,Single-ply,SBD,M,
Boys,59.87,1,Khyran Jones,McGregor,59.87,188.24,97.52,206.38,492.15,Single-ply,SBD,M,
Boys,59.87,2,Trevor Uptmor,West,58.88,183.7,102.06,183.7,469.47,Single-ply,SBD,M,
Boys,59.87,3,Jonathan Hernandez,Robinson,58.6,136.08,88.45,158.76,383.29,Single-ply,SBD,M,
Boys,59.87,4,Gabriel Vargas,Killeen Ellison,59.6,149.69,81.65,145.15,376.48,Single-ply,SBD,M,
Boys,59.87,5,Jacob Caldwell,Lorena,59.15,136.08,83.91,149.69,369.68,Single-ply,SBD,M,
Boys,59.87,6,Alex Vargas,Rogers,57.7,142.88,86.18,127.01,356.07,Single-ply,SBD,M,
Boys,59.87,7,Croix Dvorak,West,58.79,136.08,79.38,136.08,351.53,Single-ply,SBD,M,
Boys,59.87,8,Gabe Watkins,China Spring,56.15,151.95,61.23,133.81,347,Single-ply,SBD,M,
Boys,59.87,9,Landon Kuehn,China Spring,56.97,117.93,63.5,127.01,308.44,Single-ply,SBD,M,
Boys,59.87,10,Tanner Lindsay,Robinson,57.42,117.93,70.31,120.2,308.44,Single-ply,SBD,M,
Boys,59.87,DQ,Dominic Sisneros,Waco University,55.97,136.08,,,,Single-ply,SBD,M,
Boys,67.13,1,Sergio Watkins,China Spring,65.68,240.4,129.27,195.04,564.72,Single-ply,SBD,M,
Boys,67.13,2,Christian Watkins,Rogers,65.5,181.44,90.72,174.63,446.79,Single-ply,SBD,M,
Boys,67.13,3,Nicky Nieves,McGregor,64.77,151.95,99.79,174.63,426.38,Single-ply,SBD,M,
Boys,67.13,4,Jarian Greene,Killeen Ellison,63.68,142.88,104.33,170.1,417.3,Single-ply,SBD,M,
Boys,67.13,5,Coker Holloway,Groesbeck,66.86,161.03,92.99,163.29,417.3,Single-ply,SBD,M,
Boys,67.13,6,Juan Valencia,McGregor,66.22,151.95,104.33,156.49,412.77,Single-ply,SBD,M,
Boys,67.13,7,Trey Stout,Robinson,64.86,156.49,81.65,147.42,385.55,Single-ply,SBD,M,
Boys,67.13,8,Marcus Tippie,McGregor,63.05,136.08,90.72,154.22,381.02,Single-ply,SBD,M,
Boys,67.13,9,Jacob Divin,West,66.86,136.08,81.65,154.22,371.95,Single-ply,SBD,M,
Boys,67.13,10,Bryan Thuy,Rogers,64.32,145.15,72.57,149.69,367.41,Single-ply,SBD,M,
Boys,67.13,11,Gerardo Sierra,Waco La Vega,62.32,124.74,83.91,124.74,333.39,Single-ply,SBD,M,
Boys,67.13,12,Tanner Marak,West,64.86,122.47,65.77,102.06,290.3,Single-ply,SBD,M,
Boys,74.84,1,Kj Peoples,China Spring,74.3,222.26,142.88,199.58,564.72,Single-ply,SBD,M,
Boys,74.84,2,John Hill,Rogers,74.75,208.65,115.67,219.99,544.31,Single-ply,SBD,M,
Boys,74.84,3,Billy Gann,West,69.04,213.19,113.4,201.85,528.44,Single-ply,SBD,M,
Boys,74.84,4,Fabian Salomon,Cameron Yoe,70.94,190.51,111.13,204.12,505.76,Single-ply,SBD,M,
Boys,74.84,5,Brian Garza,China Spring,74.3,181.44,138.35,185.97,505.76,Single-ply,SBD,M,
Boys,74.84,6,Cedric Lewis,Killeen Ellison,72.3,151.95,133.81,195.04,480.81,Single-ply,SBD,M,
Boys,74.84,7,Kevon Britt,Waco University,73.84,204.12,95.25,181.44,480.81,Single-ply,SBD,M,
Boys,74.84,8,Hunter Speasmaker,Robinson,74.12,172.37,113.4,181.44,467.2,Single-ply,SBD,M,
Boys,74.84,9,Michael Cano,Lorena,69.4,174.63,102.06,158.76,435.45,Single-ply,SBD,M,
Boys,74.84,10,Darryl Thomas #2,Waco University,71.94,158.76,99.79,174.63,433.18,Single-ply,SBD,M,
Boys,74.84,11,Preston Shields,Groesbeck,72.03,140.61,111.13,158.76,410.5,Single-ply,SBD,M,
Boys,74.84,12,Blaine Nichol,Waco La Vega,74.03,147.42,79.38,142.88,369.68,Single-ply,SBD,M,
Boys,74.84,13,Laker Nanninga,Lorena,71.12,149.69,63.5,149.69,362.87,Single-ply,SBD,M,
Boys,74.84,14,Tyler Jaster,West,69.22,136.08,81.65,138.35,356.07,Single-ply,SBD,M,
Boys,74.84,15,Xavier Benavides,Waco University,71.58,108.86,70.31,122.47,301.64,Single-ply,SBD,M,
Boys,82.1,1,Carson Ford,Lorena,81.19,235.87,145.15,235.87,616.89,Single-ply,SBD,M,
Boys,82.1,2,Tyler Burt,Cameron Yoe,79.02,213.19,145.15,217.72,576.06,Single-ply,SBD,M,
Boys,82.1,3,Ethan Linder,Robinson,79.65,208.65,122.47,210.92,542.04,Single-ply,SBD,M,
Boys,82.1,4,Logan Sauer,Robinson,80.2,206.38,122.47,188.24,517.1,Single-ply,SBD,M,
Boys,82.1,5,Nathan Melton,Lorena,80.1,192.78,106.59,208.65,508.02,Single-ply,SBD,M,
Boys,82.1,6,Kelley Rainer,Groesbeck,82.1,176.9,102.06,192.78,471.74,Single-ply,SBD,M,
Boys,82.1,7,Davion Carr,Waco La Vega,76.75,165.56,102.06,195.04,462.66,Single-ply,SBD,M,
Boys,82.1,8,Colby Hale,China Spring,80.29,158.76,97.52,165.56,421.84,Single-ply,SBD,M,
Boys,82.1,9,Daniel Espinoza,McGregor,77.93,149.69,99.79,165.56,415.04,Single-ply,SBD,M,
Boys,82.1,10,Carlos Salomon,Cameron Yoe,77.2,154.22,97.52,156.49,408.23,Single-ply,SBD,M,
Boys,82.1,11,Brice Lechler,McGregor,75.3,142.88,88.45,136.08,367.41,Single-ply,SBD,M,
Boys,89.81,1,Joshua Gunn,Robinson,89.81,226.8,158.76,231.33,616.89,Single-ply,SBD,M,
Boys,89.81,2,Manuel Abdallah,China Spring,83.64,217.72,151.95,226.8,596.47,Single-ply,SBD,M,
Boys,89.81,3,Lawson Kendrick,West,83.46,215.46,140.61,213.19,569.26,Single-ply,SBD,M,
Boys,89.81,4,Adyn Ware,Robinson,88.27,213.19,131.54,210.92,555.65,Single-ply,SBD,M,
Boys,89.81,5,Mason Davis,Rogers,88.99,206.38,129.27,217.72,553.38,Single-ply,SBD,M,
Boys,89.81,6,Dawson Exline,China Spring,88.9,229.06,120.2,201.85,551.11,Single-ply,SBD,M,
Boys,89.81,7,Terrell Conn,Groesbeck,86.18,195.04,136.08,185.97,517.1,Single-ply,SBD,M,
Boys,89.81,8,JJ Smith,Killeen Ellison,87.91,170.1,104.33,206.38,480.81,Single-ply,SBD,M,
Boys,89.81,9,Josue Castro,Waco La Vega,86.18,165.56,102.06,190.51,458.13,Single-ply,SBD,M,
Boys,89.81,10,Taelyn Saunders,Waco La Vega,85.46,197.31,102.06,142.88,442.25,Single-ply,SBD,M,
Boys,89.81,DQ,Dylan Smith #5,Cameron Yoe,87.72,,,,,Single-ply,SBD,M,
Boys,99.79,1,Eduardo Gil,Cameron Yoe,99.61,233.6,165.56,229.06,628.23,Single-ply,SBD,M,
Boys,99.79,2,Jamas Williams,Killeen Ellison,91.53,242.67,115.67,231.33,589.67,Single-ply,SBD,M,
Boys,99.79,3,Oliver Jenkins,McGregor,98.43,185.97,133.81,195.04,514.83,Single-ply,SBD,M,
Boys,99.79,4,Miguel Medrano,Waco University,96.71,181.44,108.86,154.22,444.52,Single-ply,SBD,M,
Boys,99.79,DQ,Ron Murrell,Killeen Ellison,98.88,,,,,Single-ply,SBD,M,
Boys,109.77,1,Vernon Walker,Waco La Vega,106.14,260.82,142.88,231.33,635.03,Single-ply,SBD,M,
Boys,109.77,2,Dominic Lewis,Cameron Yoe,106.59,233.6,142.88,249.48,625.96,Single-ply,SBD,M,
Boys,109.77,3,Jacob Bryant,Waco University,105.78,222.26,142.88,206.38,571.53,Single-ply,SBD,M,
Boys,109.77,4,Eduardo Chavez,Robinson,101.24,197.31,120.2,210.92,528.44,Single-ply,SBD,M,
Boys,109.77,5,Jaylon Johnson,Waco La Vega,106.32,201.85,111.13,192.78,505.76,Single-ply,SBD,M,
Boys,109.77,6,Jaiden Taylor,China Spring,104.78,167.83,113.4,154.22,435.45,Single-ply,SBD,M,
Boys,109.77,7,Will Bradshaw,China Spring,105.78,131.54,92.99,181.44,405.97,Single-ply,SBD,M,
Boys,109.77,8,Josh Lockhart,Groesbeck,109.77,149.69,111.13,129.27,390.09,Single-ply,SBD,M,
Boys,109.77,DQ,Ezekiel Sheridan,Killeen Ellison,100.06,233.6,120.2,,,Single-ply,SBD,M,
Boys,109.77,DQ,Amir Salimon,Killeen Ellison,107.86,238.14,,,,Single-ply,SBD,M,
Boys,124.74,1,James Baggett,Waco La Vega,116.66,281.23,183.7,274.42,739.36,Single-ply,SBD,M,
Boys,124.74,2,Tyler Sparks,Lorena,120.2,281.23,170.1,233.6,684.92,Single-ply,SBD,M,
Boys,124.74,3,Ryan Smiley,Gatesville,119.29,283.5,151.95,215.46,650.91,Single-ply,SBD,M,
Boys,124.74,4,Daylan Littlejohn,Killeen Ellison,122.38,272.16,142.88,226.8,641.83,Single-ply,SBD,M,
Boys,124.74,5,Ruben Vera,West,110.68,272.16,131.54,233.6,637.3,Single-ply,SBD,M,
Boys,124.74,6,Nathan Vilchez,Killeen Ellison,115.94,272.16,131.54,233.6,637.3,Single-ply,SBD,M,
Boys,124.74,7,Ivan Martinez,Waco La Vega,121.02,265.35,124.74,192.78,582.87,Single-ply,SBD,M,
Boys,124.74,8,Brady Haug,Robinson,116.66,215.46,131.54,215.46,562.45,Single-ply,SBD,M,
Boys,124.74,9,Kylan Barnardi,Lorena,124.74,204.12,111.13,213.19,528.44,Single-ply,SBD,M,
Boys,124.74,10,Mark Doyle,Lorena,114.85,195.04,117.93,199.58,512.56,Single-ply,SBD,M,
Boys,124.74,11,Dustin McCullough,West,117.48,197.31,113.4,174.63,485.34,Single-ply,SBD,M,
Boys,124.74,12,Augustine Jiminez,McGregor,117.48,113.4,61.23,299.37,474,Single-ply,SBD,M,
Boys,124.74,13,Jace Hanna,China Spring,110.86,183.7,115.67,154.22,453.59,Single-ply,SBD,M,
Boys,124.74,14,Tyler Morgan,Rogers,122.56,192.78,99.79,161.03,453.59,Single-ply,SBD,M,
Boys,124.74,15,Tyler Shelton,Rogers,109.95,158.76,83.91,156.49,399.16,Single-ply,SBD,M,
Boys,124.74,16,Gage Ashley,Lorena,113.58,158.76,79.38,149.69,387.82,Single-ply,SBD,M,
Boys,124.74,17,Ethan Glenn,Rogers,111.22,124.74,68.04,117.93,310.71,Single-ply,SBD,M,
Boys,124.74+,1,Devin Smith,Waco La Vega,135.62,301.64,167.83,217.72,687.19,Single-ply,SBD,M,
Boys,124.74+,2,Kyle Strmiska,Gatesville,133.17,249.48,183.7,226.8,659.98,Single-ply,SBD,M,
Boys,124.74+,3,Keanu Ramirez,Killeen Ellison,153.4,235.87,181.44,242.67,659.98,Single-ply,SBD,M,
Boys,124.74+,4,Camden Garner,Lorena,128.46,244.94,188.24,190.51,623.69,Single-ply,SBD,M,
Boys,124.74+,5,Domeniss McFadden,McGregor,152.5,263.08,136.08,208.65,607.81,Single-ply,SBD,M,
Boys,124.74+,6,Jacob Gallimore,Robinson,153.31,249.48,122.47,229.06,601.01,Single-ply,SBD,M,
Boys,124.74+,7,Hayden Hopkins,China Spring,129.73,208.65,136.08,213.19,557.92,Single-ply,SBD,M,
Boys,124.74+,8,Rance Ledet,Killeen Ellison,143.97,190.51,129.27,183.7,503.49,Single-ply,SBD,M,
Boys,124.74+,9,Landon McMillan,China Spring,129.82,179.17,127.01,158.76,464.93,Single-ply,SBD,M,
Boys,124.74+,10,Colby Arney,Cameron Yoe,124.83,163.29,102.06,181.44,446.79,Single-ply,SBD,M,
Boys,124.74+,DQ,Wyatt Adams,Rogers,138.8,170.1,104.33,,,Single-ply,SBD,M,
Boys,,NS,Brendan Kidd,Waco University,,,,,,Single-ply,SBD,M,
