Name,WeightClassKg,Division,BodyweightKg,Squat1Kg,Squat2Kg,Squat3Kg,Best3SquatKg,Bench1Kg,Bench2Kg,Bench3Kg,Best3BenchKg,Deadlift1Kg,Deadlift2Kg,Deadlift3Kg,Best3DeadliftKg,TotalKg,Place,Event,Equipment,Sex,BirthDate
Shelby Dahler,84+,Sub-Juniors,112.9,130,140,-145,140,70,-80,-80,70,-130,130,,130,340,1,SBD,Raw,F,
Adamaris Guzman,47,Juniors,46.6,87.5,92.5,-95,92.5,50,52.5,-55,52.5,110,115,-120,115,260,1,SBD,Raw,F,
Sharna Sumpton,63,M1,62.4,90,-100,-105,90,42.5,47.5,52.5,52.5,120,-130,-132.5,120,262.5,1,SBD,Raw,F,
Melissa Trivic,69,M1,66.1,85,92.5,-97.5,92.5,37.5,42.5,-45,42.5,130,-142.5,-145,130,265,2,SBD,Raw,F,
Olivia Lannon,69,M1,67.9,95,105,112.5,112.5,60,65,67.5,67.5,135,145,155,155,335,1,SBD,Raw,F,
Alana Starsevich,76,M1,75.4,105,110,-115,110,70,72.5,-75,72.5,120,130,-140,130,312.5,1,SBD,Raw,F,
Annette Taylor,63,M2,60.4,90,105,-115,105,50,55,-60,55,110,120,-130,120,280,2,SBD,Raw,F,
Tammy Kenny,63,M2,60.7,97.5,105,107.5,107.5,-60,60,-62.5,60,145,-155,155,155,322.5,1,SBD,Raw,F,1970-05-14
Jackie Caldona,47,Open,46.7,100,107.5,112.5,112.5,-55,55,60,60,112.5,122.5,127.5,127.5,300,1,SBD,Raw,F,
Thao Pham,52,Open,50.3,95,-102.5,-102.5,95,57.5,60,62.5,62.5,130,140,-145,140,297.5,1,SBD,Raw,F,
Gabrielle Green,63,Open,61.7,-112.5,117.5,122.5,122.5,67.5,70,-72.5,70,142.5,-152.5,155,155,347.5,1,SBD,Raw,F,
Amelie LeBrie,63,Open,,,,,,,,,,,,,,,NS,SBD,Raw,F,
Robyn Wishart,69,Open,65.5,107.5,112.5,-117.5,112.5,55,-60,-60,55,130,137.5,145,145,312.5,1,SBD,Raw,F,
Sheydn Rowe,69,Open,68.7,92.5,100,107.5,107.5,62.5,65,67.5,67.5,112.5,-125,-135,112.5,287.5,2,SBD,Raw,F,
Brenda Kamau,76,Open,72.5,122.5,-127.5,-130,122.5,65,67.5,70,70,155,-167.5,-167.5,155,347.5,3,SBD,Raw,F,
Casey Molnar,76,Open,73.8,122.5,132.5,137.5,137.5,-60,62.5,-67.5,62.5,140,150,-155,150,350,1,SBD,Raw,F,
Kristy Ireland,76,Open,76,-127.5,135,142.5,142.5,57.5,62.5,-67.5,62.5,130,140,145,145,350,2,SBD,Raw,F,
Regen Foot,76,Open,,,,,,,,,,,,,,,NS,SBD,Raw,F,
Kelly Stoikov,84,Open,82.1,125,132.5,137.5,137.5,57.5,62.5,67.5,67.5,150,160,165,165,370,1,SBD,Raw,F,
Li Min Nein,84,Open,82.6,-122.5,125,127.5,127.5,67.5,72.5,-75,72.5,125,132.5,-137.5,132.5,332.5,2,SBD,Raw,F,
Kathryn Maric,84+,Open,95.8,-135,-137.5,137.5,137.5,67.5,70,-72.5,70,140,-142.5,-142.5,140,347.5,3,SBD,Raw,F,
Katherine Jarvis,84+,Open,124.9,147.5,157.5,165,165,65,70,75,75,150,162.5,170,170,410,1,SBD,Raw,F,
Jessica Quarrell,84+,Open,127.3,122.5,132.5,137.5,137.5,70,75,-80,75,130,140,145,145,357.5,2,SBD,Raw,F,
Hoang Nguyen,74,Juniors,72.34,170,185,-192.5,185,90,97.5,-102.5,97.5,195,210,-217.5,210,492.5,2,SBD,Raw,M,
Tsur Tsaban,74,Juniors,73.18,160,165,170,170,102.5,107.5,112.5,112.5,210,-217.5,217.5,217.5,500,1,SBD,Raw,M,
Newton Tran,83,Juniors,80.92,200,217.5,-230,217.5,115,127.5,-137.5,127.5,215,230,-242.5,230,575,1,SBD,Raw,M,
David Westwater,93,M1,92.34,165,175,-182.5,175,87.5,92.5,-97.5,92.5,180,190,200,200,467.5,1,SBD,Raw,M,
Russell Bricknell,105,M2,98.2,-150,-150,150,150,-90,90,-92.5,90,190,200,-205,200,440,1,SBD,Raw,M,
Chris Ball,83,M2,81.02,187.5,195,200,200,92.5,-100,-100,92.5,200,210,-212.5,210,502.5,1,SBD,Raw,M,
Ian Sullivan,105,M3,97.05,,,,,85,-95,100,100,,,,,100,1,B,Single-ply,M,
Josh Borg,105,Open,,,,,,,,,,,,,,,NS,SBD,Raw,M,
Tony Luc,105,Open,99.52,-195,205,215,215,115,122.5,-130,122.5,225,237.5,-245,237.5,575,1,SBD,Raw,M,
James De Graaf,105,Open,102.94,-190,-190,197.5,197.5,100,107.5,-112.5,107.5,250,257.5,-260,257.5,562.5,3,SBD,Raw,M,
Jonty Hollins,105,Open,103.48,-200,200,-210,200,132.5,-137.5,-137.5,132.5,227.5,-235,-247.5,227.5,560,4,SBD,Raw,M,
Rob Bezant,105,Open,104.66,190,197.5,-202.5,197.5,140,145,150,150,190,205,217.5,217.5,565,2,SBD,Raw,M,
Aaron Dahler,120,Open,117.22,240,-250,-250,240,130,135,-140,135,250,262.5,-267.5,262.5,637.5,1,SBD,Raw,M,
Mina Kiddis,120,Open,117.26,157.5,165,170,170,150,155,-160,155,-220,-220,-220,,,DQ,SBD,Raw,M,
Nathan Quarrell,120,Open,118.54,210,-217.5,217.5,217.5,122.5,130,-135,130,280,290,-295,290,637.5,2,SBD,Raw,M,
Jackson Stubberfield,120+,Open,141.32,280,305,315,315,190,-200,-200,190,280,305,-315,305,810,1,SBD,Raw,M,
Iman Khaer,59,Open,58.56,112.5,122.5,130,130,105,-110,-110,105,152.5,165,-175,165,400,2,SBD,Raw,M,
Carney Tan,59,Open,58.72,142.5,150,-155,150,85,-90,90,90,-190,190,-200,190,430,1,SBD,Raw,M,
Leonardo Sucitra,74,Open,72.78,247.5,262.5,267.5,267.5,142.5,150,155,155,280,297.5,307.5,307.5,730,1,SBD,Raw,M,
Sankalp Singam,83,Open,80.62,190,200,207.5,207.5,112.5,-120,-120,112.5,235,-260,-260,235,555,2,SBD,Raw,M,
Saqib Rahman,83,Open,81.74,175,187.5,195,195,122.5,130,135,135,-215,220,-230,220,550,3,SBD,Raw,M,
Ishy Nyandoro,83,Open,82.56,245,252.5,-260,252.5,147.5,155,160,160,265,282.5,-292.5,282.5,695,1,SBD,Raw,M,
Ryan Van Nellestyn,93,Open,88.52,215,225,235,235,130,135,137.5,137.5,230,242.5,252.5,252.5,625,1,SBD,Raw,M,
Xander Dahler,120,Sub-Juniors,109.6,190,210,-220,210,90,100,-107.5,100,190,-210,-210,190,500,1,SBD,Raw,M,
