Division,WeightClassKg,Place,Name,Team,BodyweightKg,Best3SquatKg,Best3BenchKg,Best3DeadliftKg,TotalKg,Equipment,Event,Sex
Boys,51.71,1,Miguel Contreras,Robinson,51.71,154.22,74.84,163.29,392.36,Single-ply,SBD,M
Boys,51.71,2,Antonio Ponce,Glen Rose,49.99,129.27,61.23,149.69,340.19,Single-ply,SBD,M
Boys,51.71,3,Azahel Herrera,Glen Rose,51.71,115.67,81.65,129.27,326.59,Single-ply,SBD,M
Boys,51.71,4,Will Miller,Dawson,51.62,111.13,61.23,136.08,308.44,Single-ply,SBD,M
Boys,51.71,5,Terrance Barnes,Valley Mills,50.26,113.4,65.77,120.2,299.37,Single-ply,SBD,M
Boys,51.71,6,Pablo Hernandez,Hillsboro,49.99,106.59,68.04,113.4,288.03,Single-ply,SBD,M
Boys,51.71,7,Cesar Herrera,Glen Rose,50.8,108.86,63.5,113.4,285.76,Single-ply,SBD,M
Boys,51.71,8,Cody Halcom,Glen Rose,49.9,104.33,54.43,113.4,272.16,Single-ply,SBD,M
Boys,51.71,9,Nic Garcia,Tolar,51.3,90.72,56.7,124.74,272.16,Single-ply,SBD,M
Boys,51.71,10,Daylan Weithorn,West,49.9,83.91,45.36,99.79,229.06,Single-ply,SBD,M
Boys,55.79,DQ,Tyler Dews,Gatesville,51.89,97.52,,,,Single-ply,SBD,M
Boys,51.71,DQ,Abraham Villarreal,Belton,48.63,,,,,Single-ply,SBD,M
Boys,55.79,1,Johnny Martinez,Belton,54.88,124.74,79.38,145.15,349.27,Single-ply,SBD,M
Boys,55.79,2,Jeremy Alaniz,Riesel,54.25,108.86,63.5,129.27,301.64,Single-ply,SBD,M
Boys,55.79,DQ,Jonathan Lira,Meridian,54.11,138.35,,,,Single-ply,SBD,M
Boys,59.87,DQ,Sam Aguirre,Bruceville-Eddy,55.97,117.93,70.31,,,Single-ply,SBD,M
Boys,59.87,DQ,Dominique Dickerson,Copperas Cove,55.97,129.27,,,,Single-ply,SBD,M
Boys,59.87,1,Dalton Long,Dawson,59.87,142.88,88.45,163.29,394.63,Single-ply,SBD,M
Boys,67.13,2,Carlin Linnabery,Glen Rose,60.06,158.76,90.72,136.08,385.55,Single-ply,SBD,M
Boys,59.87,3,Kaden Trice,Salado,59.33,122.47,63.5,140.61,326.59,Single-ply,SBD,M
Boys,59.87,DQ,Jonathan Johnson,Copperas Cove,59.78,170.1,,,,Single-ply,SBD,M
Boys,59.87,DQ,Pete Contreras,Belton,58.6,151.95,,,,Single-ply,SBD,M
Boys,59.87,DQ,Eduardo Jaimes,Riesel,59.87,,,,,Single-ply,SBD,M
Boys,67.13,1,Roy Ward,Waco Reicher Catholic,66.32,188.24,102.06,192.78,483.08,Single-ply,SBD,M
Boys,67.13,2,Josh Beasley,Glen Rose,65.41,185.97,99.79,195.04,480.81,Single-ply,SBD,M
Boys,67.13,3,Noah Contella,Waco Reicher Catholic,66.77,179.17,104.33,181.44,464.93,Single-ply,SBD,M
Boys,74.84,4,Jeremy Fuentes,Cleburne,67.31,172.37,104.33,188.24,464.93,Single-ply,SBD,M
Boys,67.13,5,Gabe Cobos,Riesel,67.13,176.9,86.18,199.58,462.66,Single-ply,SBD,M
Boys,67.13,6,Hunter Solano,Waco Reicher Catholic,66.32,142.88,79.38,172.37,394.63,Single-ply,SBD,M
Boys,67.13,7,Tyler Stairs,Salado,62.96,106.59,61.23,106.59,274.42,Single-ply,SBD,M
Boys,67.13,DQ,Zach Rankin,West,66.04,158.76,,,,Single-ply,SBD,M
Boys,74.84,1,Marco Castro,Waco Reicher Catholic,73.66,215.46,122.47,208.65,546.58,Single-ply,SBD,M
Boys,74.84,2,Michael Fitzhugh,Waco Reicher Catholic,73.48,213.19,113.4,210.92,537.51,Single-ply,SBD,M
Boys,74.84,3,Allen Scott,Gatesville,73.66,199.58,122.47,204.12,526.17,Single-ply,SBD,M
Boys,74.84,4,Benjamin Munoz,Belton,72.85,188.24,120.2,210.92,519.36,Single-ply,SBD,M
Boys,82.1,5,Braxton Stefka,Riesel,74.93,204.12,102.06,199.58,505.76,Single-ply,SBD,M
Boys,74.84,6,Juan Villa,Robinson,73.84,190.51,124.74,188.24,503.49,Single-ply,SBD,M
Boys,74.84,7,Hunter Redmond,Glen Rose,72.48,172.37,106.59,195.04,474,Single-ply,SBD,M
Boys,74.84,8,Trevor Crawford,Glen Rose,72.57,163.29,106.59,181.44,451.32,Single-ply,SBD,M
Boys,74.84,9,D'Korey-A Johnson,Hillsboro,74.03,161.03,95.25,183.7,439.98,Single-ply,SBD,M
Boys,74.84,10,Oscar Gomez,Hillsboro,73.48,161.03,77.11,165.56,403.7,Single-ply,SBD,M
Boys,74.84,DQ,Lane Fikes,Robinson,71.49,,,,,Single-ply,SBD,M
Boys,74.84,DQ,Chandler Gordon,Hillsboro,72.39,172.37,97.52,,,Single-ply,SBD,M
Boys,82.1,DQ,Romerio Fraire,West,75.02,,,,,Single-ply,SBD,M
Boys,82.1,DQ,Lance Spakes,Salado,75.02,163.29,79.38,,,Single-ply,SBD,M
Boys,82.1,1,Alex O'Neill,Waco Reicher Catholic,81.92,226.8,156.49,231.33,614.62,Single-ply,SBD,M
Boys,82.1,2,Robert Robinson,Mexia,82.1,240.4,111.13,215.46,566.99,Single-ply,SBD,M
Boys,89.81,3,Kasey Kiphen,Gatesville,82.28,204.12,127.01,195.04,526.17,Single-ply,SBD,M
Boys,82.1,4,Tevin Jones,Belton,81.74,201.85,106.59,210.92,519.36,Single-ply,SBD,M
Boys,82.1,5,David Librado,Hillsboro,80.88,151.95,95.25,154.22,401.43,Single-ply,SBD,M
Boys,82.1,6,Josh Steinhardt,Salado,75.66,102.06,70.31,145.15,317.51,Single-ply,SBD,M
Boys,89.81,DQ,Marco Vasquez,Riesel,82.19,233.6,,,,Single-ply,SBD,M
Boys,89.81,1,Omar Cardoso,Waco Reicher Catholic,88.63,254.01,124.74,260.82,639.57,Single-ply,SBD,M
Boys,89.81,2,Ricky Thompson,Robinson,85.28,210.92,115.67,249.48,576.06,Single-ply,SBD,M
Boys,89.81,3,Brett Massey,Dawson,89.45,185.97,99.79,199.58,485.34,Single-ply,SBD,M
Boys,89.81,DQ,Donnell Jenkins,Bruceville-Eddy,89.81,208.65,,,,Single-ply,SBD,M
Boys,89.81,DQ,Tanner Coone,Axtell,86.64,,,,,Single-ply,SBD,M
Boys,89.81,DQ,Robert Perez,Waco Reicher Catholic,89.27,204.12,,,,Single-ply,SBD,M
Boys,89.81,DQ,Luis Villafranco,Salado,89.27,204.12,,,,Single-ply,SBD,M
Boys,99.79,1,Brent Marona,Copperas Cove,97.61,272.16,117.93,226.8,616.89,Single-ply,SBD,M
Boys,99.79,2,Heath Nicholson,Glen Rose,97.34,240.4,108.86,249.48,598.74,Single-ply,SBD,M
Boys,99.79,3,Rayshun Jones,Belton,97.16,233.6,129.27,226.8,589.67,Single-ply,SBD,M
Boys,99.79,4,Hosbaldo Ruiz,Cleburne,96.25,208.65,136.08,226.8,571.53,Single-ply,SBD,M
Boys,99.79,5,Aaron Platt,Tolar,95.25,217.72,142.88,199.58,560.19,Single-ply,SBD,M
Boys,99.79,6,Jacob Kevil,Crawford,97.52,204.12,129.27,217.72,551.11,Single-ply,SBD,M
Boys,99.79,7,Ace Navarrete,Glen Rose,94.17,208.65,129.27,210.92,548.85,Single-ply,SBD,M
Boys,99.79,8,Tyler Talbott,Salado,95.35,192.78,113.4,190.51,496.68,Single-ply,SBD,M
Boys,99.79,9,Jason Harris,West,99.25,199.58,108.86,181.44,489.88,Single-ply,SBD,M
Boys,99.79,10,Devan Reeves,Mexia,93.71,192.78,104.33,185.97,483.08,Single-ply,SBD,M
Boys,99.79,11,Amalio Trejo,Hillsboro,91.35,192.78,106.59,170.1,469.47,Single-ply,SBD,M
Boys,99.79,12,James Collins,Salado,96.43,142.88,92.99,151.95,387.82,Single-ply,SBD,M
Boys,99.79,13,Gustavo Campos,Hillsboro,95.12,142.88,88.45,142.88,374.21,Single-ply,SBD,M
Boys,109.77,1,Koby Williams,Belton,108.5,233.6,140.61,238.14,612.35,Single-ply,SBD,M
Boys,109.77,2,Erik Zavala,Hillsboro,109.77,249.48,113.4,235.87,598.74,Single-ply,SBD,M
Boys,109.77,3,Cutter Shaw,Waco Reicher Catholic,109.59,240.4,151.95,197.31,589.67,Single-ply,SBD,M
Boys,109.77,4,Peyton Womack,Salado,102.97,247.21,120.2,219.99,587.4,Single-ply,SBD,M
Boys,109.77,5,Justin Rhyne,Gatesville,106.23,219.99,163.29,199.58,582.87,Single-ply,SBD,M
Boys,109.77,6,Matt Gerik,West,109.23,238.14,111.13,219.99,569.26,Single-ply,SBD,M
Boys,109.77,7,Logan Willenborg,West,107.77,204.12,117.93,199.58,521.63,Single-ply,SBD,M
Boys,109.77,8,Ethan Sedberry,Meridian,101.6,195.04,90.72,217.72,503.49,Single-ply,SBD,M
Boys,109.77,9,Ricky Reyes,Mexia,105.69,208.65,111.13,170.1,489.88,Single-ply,SBD,M
Boys,109.77,10,Rolando Duran,Mexia,105.51,192.78,106.59,181.44,480.81,Single-ply,SBD,M
Boys,109.77,11,Abram Villescaz,Waco Reicher Catholic,107.86,181.44,77.11,197.31,455.86,Single-ply,SBD,M
Boys,109.77,12,Jamie Saucedo,Bosqueville,102.24,226.8,111.13,108.86,446.79,Single-ply,SBD,M
Boys,109.77,DQ,Tanner Trigg,Valley Mills,105.6,208.65,,,,Single-ply,SBD,M
Boys,109.77,DQ,Tyrell Thompson,Copperas Cove,103.06,156.49,,,,Single-ply,SBD,M
Boys,109.77,DQ,Courtland Rice,Mexia,107.64,226.8,,,,Single-ply,SBD,M
Boys,124.74,1,Billy Golding,Salado,112.58,317.51,181.44,244.94,743.89,Single-ply,SBD,M
Boys,124.74,2,Kyle Parkinson,Cleburne,122.06,272.16,170.1,240.4,682.66,Single-ply,SBD,M
Boys,124.74,3,Rodarious Birks,Belton,122.11,267.62,127.01,217.72,612.35,Single-ply,SBD,M
Boys,124.74,4,Alfredo Librado,Hillsboro,114.58,249.48,151.95,206.38,607.81,Single-ply,SBD,M
Boys,124.74,5,Carlton Hollister,Riesel,123.29,226.8,167.83,208.65,603.28,Single-ply,SBD,M
Boys,124.74,6,Zak Hudspeth,Gatesville,113.49,231.33,124.74,219.99,576.06,Single-ply,SBD,M
Boys,124.74,7,Jody Hodges,Salado,114.31,238.14,122.47,195.04,555.65,Single-ply,SBD,M
Boys,124.74,8,Miguel Callejas,Valley Mills,115.94,215.46,117.93,192.78,526.17,Single-ply,SBD,M
Boys,124.74,9,Bobby Davis,Bosqueville,113.22,195.04,117.93,210.92,523.9,Single-ply,SBD,M
Boys,124.74,10,Andrew French #2,Waco Reicher Catholic,117.39,149.69,90.72,183.7,424.11,Single-ply,SBD,M
Boys,124.74+,1,Trent Andrews,Bosqueville,125.37,299.37,147.42,265.35,712.14,Single-ply,SBD,M
Boys,124.74+,2,Les Sakaria,Copperas Cove,148.32,288.03,158.76,256.28,703.07,Single-ply,SBD,M
Boys,124.74+,3,Edgar Salvador,Hillsboro,153.31,285.76,190.51,217.72,694,Single-ply,SBD,M
Boys,124.74+,4,Tevin Boone,Cleburne,129.27,244.94,147.42,265.35,657.71,Single-ply,SBD,M
Boys,124.74+,5,Colton Schroeder,Glen Rose,133.54,204.12,136.08,195.04,535.24,Single-ply,SBD,M
Boys,124.74+,6,Michael Williams,Dawson,155.67,222.26,124.74,183.7,530.7,Single-ply,SBD,M
Boys,124.74+,DQ,Jarrett Hodges,Salado,129,131.54,,,,Single-ply,SBD,M
