Reading tables
--- Mesh information ---
number of cells =245
number of sides per cells =6
number of directions for radiation integration =24
number of dimensions =3

--- Source and opacity table initialization ---
nBin 100 nTemp 148 nPress 2
--- Anglular quadrature initialization ---

Solving RADIATION
checksum = 2097.59
end
