^C:\USERS\JEREM\DATA\PROJECTS\GRAFKOM\OPENGL\OPENGL\SRC\MOUSEPEN.CPP
/c /ISRC/SHAPES /ISRC/LIB /IC:\USERS\JEREM\DATA\PROJECTS\GRAFKOM\OPENGL\OPENGL\DEPENDENCIES\GLFW\INCLUDE /IC:\USERS\JEREM\DATA\PROJECTS\GRAFKOM\OPENGL\OPENGL\DEPENDENCIES\GLEW\INCLUDE /ZI /JMC /nologo /W3 /WX- /diagnostics:column /sdl /Od /Oy- /D GLEW_STATIC /D WIN32 /D _DEBUG /D _CONSOLE /D _UNICODE /D UNICODE /Gm- /EHsc /RTC1 /MDd /GS /fp:precise /permissive- /Zc:wchar_t /Zc:forScope /Zc:inline /Fo"DEBUG\\" /Fd"DEBUG\VC142.PDB" /Gd /TP /analyze- /FC C:\USERS\JEREM\DATA\PROJECTS\GRAFKOM\OPENGL\OPENGL\SRC\MOUSEPEN.CPP
^C:\USERS\JEREM\DATA\PROJECTS\GRAFKOM\OPENGL\OPENGL\SRC\SHAPES\QUAD.CPP
/c /ISRC/SHAPES /ISRC/LIB /IC:\USERS\JEREM\DATA\PROJECTS\GRAFKOM\OPENGL\OPENGL\DEPENDENCIES\GLFW\INCLUDE /IC:\USERS\JEREM\DATA\PROJECTS\GRAFKOM\OPENGL\OPENGL\DEPENDENCIES\GLEW\INCLUDE /ZI /JMC /nologo /W3 /WX- /diagnostics:column /sdl /Od /Oy- /D GLEW_STATIC /D WIN32 /D _DEBUG /D _CONSOLE /D _UNICODE /D UNICODE /Gm- /EHsc /RTC1 /MDd /GS /fp:precise /permissive- /Zc:wchar_t /Zc:forScope /Zc:inline /Fo"DEBUG\\" /Fd"DEBUG\VC142.PDB" /Gd /TP /analyze- /FC C:\USERS\JEREM\DATA\PROJECTS\GRAFKOM\OPENGL\OPENGL\SRC\SHAPES\QUAD.CPP
^C:\USERS\JEREM\DATA\PROJECTS\GRAFKOM\OPENGL\OPENGL\SRC\SHAPES\CIRCLE.CPP
/c /ISRC/SHAPES /ISRC/LIB /IC:\USERS\JEREM\DATA\PROJECTS\GRAFKOM\OPENGL\OPENGL\DEPENDENCIES\GLFW\INCLUDE /IC:\USERS\JEREM\DATA\PROJECTS\GRAFKOM\OPENGL\OPENGL\DEPENDENCIES\GLEW\INCLUDE /ZI /JMC /nologo /W3 /WX- /diagnostics:column /sdl /Od /Oy- /D GLEW_STATIC /D WIN32 /D _DEBUG /D _CONSOLE /D _UNICODE /D UNICODE /Gm- /EHsc /RTC1 /MDd /GS /fp:precise /permissive- /Zc:wchar_t /Zc:forScope /Zc:inline /Fo"DEBUG\\" /Fd"DEBUG\VC142.PDB" /Gd /TP /analyze- /FC C:\USERS\JEREM\DATA\PROJECTS\GRAFKOM\OPENGL\OPENGL\SRC\SHAPES\CIRCLE.CPP
^C:\USERS\JEREM\DATA\PROJECTS\GRAFKOM\OPENGL\OPENGL\SRC\SHAPES\RECT.CPP
/c /ISRC/SHAPES /ISRC/LIB /IC:\USERS\JEREM\DATA\PROJECTS\GRAFKOM\OPENGL\OPENGL\DEPENDENCIES\GLFW\INCLUDE /IC:\USERS\JEREM\DATA\PROJECTS\GRAFKOM\OPENGL\OPENGL\DEPENDENCIES\GLEW\INCLUDE /ZI /JMC /nologo /W3 /WX- /diagnostics:column /sdl /Od /Oy- /D GLEW_STATIC /D WIN32 /D _DEBUG /D _CONSOLE /D _UNICODE /D UNICODE /Gm- /EHsc /RTC1 /MDd /GS /fp:precise /permissive- /Zc:wchar_t /Zc:forScope /Zc:inline /Fo"DEBUG\\" /Fd"DEBUG\VC142.PDB" /Gd /TP /analyze- /FC C:\USERS\JEREM\DATA\PROJECTS\GRAFKOM\OPENGL\OPENGL\SRC\SHAPES\RECT.CPP
^C:\USERS\JEREM\DATA\PROJECTS\GRAFKOM\OPENGL\OPENGL\SRC\LIB\CAMERA.CPP
/c /ISRC/SHAPES /ISRC/LIB /IC:\USERS\JEREM\DATA\PROJECTS\GRAFKOM\OPENGL\OPENGL\DEPENDENCIES\GLFW\INCLUDE /IC:\USERS\JEREM\DATA\PROJECTS\GRAFKOM\OPENGL\OPENGL\DEPENDENCIES\GLEW\INCLUDE /ZI /JMC /nologo /W3 /WX- /diagnostics:column /sdl /Od /Oy- /D GLEW_STATIC /D WIN32 /D _DEBUG /D _CONSOLE /D _UNICODE /D UNICODE /Gm- /EHsc /RTC1 /MDd /GS /fp:precise /permissive- /Zc:wchar_t /Zc:forScope /Zc:inline /Fo"DEBUG\\" /Fd"DEBUG\VC142.PDB" /Gd /TP /analyze- /FC C:\USERS\JEREM\DATA\PROJECTS\GRAFKOM\OPENGL\OPENGL\SRC\LIB\CAMERA.CPP
^C:\USERS\JEREM\DATA\PROJECTS\GRAFKOM\OPENGL\OPENGL\SRC\LIB\GLM\DETAIL\GLM.CPP
/c /ISRC/SHAPES /ISRC/LIB /IC:\USERS\JEREM\DATA\PROJECTS\GRAFKOM\OPENGL\OPENGL\DEPENDENCIES\GLFW\INCLUDE /IC:\USERS\JEREM\DATA\PROJECTS\GRAFKOM\OPENGL\OPENGL\DEPENDENCIES\GLEW\INCLUDE /ZI /JMC /nologo /W3 /WX- /diagnostics:column /sdl /Od /Oy- /D GLEW_STATIC /D WIN32 /D _DEBUG /D _CONSOLE /D _UNICODE /D UNICODE /Gm- /EHsc /RTC1 /MDd /GS /fp:precise /permissive- /Zc:wchar_t /Zc:forScope /Zc:inline /Fo"DEBUG\\" /Fd"DEBUG\VC142.PDB" /Gd /TP /analyze- /FC C:\USERS\JEREM\DATA\PROJECTS\GRAFKOM\OPENGL\OPENGL\SRC\LIB\GLM\DETAIL\GLM.CPP
^C:\USERS\JEREM\DATA\PROJECTS\GRAFKOM\OPENGL\OPENGL\SRC\LIB\SHADER.CPP
/c /ISRC/SHAPES /ISRC/LIB /IC:\USERS\JEREM\DATA\PROJECTS\GRAFKOM\OPENGL\OPENGL\DEPENDENCIES\GLFW\INCLUDE /IC:\USERS\JEREM\DATA\PROJECTS\GRAFKOM\OPENGL\OPENGL\DEPENDENCIES\GLEW\INCLUDE /ZI /JMC /nologo /W3 /WX- /diagnostics:column /sdl /Od /Oy- /D GLEW_STATIC /D WIN32 /D _DEBUG /D _CONSOLE /D _UNICODE /D UNICODE /Gm- /EHsc /RTC1 /MDd /GS /fp:precise /permissive- /Zc:wchar_t /Zc:forScope /Zc:inline /Fo"DEBUG\\" /Fd"DEBUG\VC142.PDB" /Gd /TP /analyze- /FC C:\USERS\JEREM\DATA\PROJECTS\GRAFKOM\OPENGL\OPENGL\SRC\LIB\SHADER.CPP
^C:\USERS\JEREM\DATA\PROJECTS\GRAFKOM\OPENGL\OPENGL\SRC\LIB\INDEXBUFFER.CPP
/c /ISRC/SHAPES /ISRC/LIB /IC:\USERS\JEREM\DATA\PROJECTS\GRAFKOM\OPENGL\OPENGL\DEPENDENCIES\GLFW\INCLUDE /IC:\USERS\JEREM\DATA\PROJECTS\GRAFKOM\OPENGL\OPENGL\DEPENDENCIES\GLEW\INCLUDE /ZI /JMC /nologo /W3 /WX- /diagnostics:column /sdl /Od /Oy- /D GLEW_STATIC /D WIN32 /D _DEBUG /D _CONSOLE /D _UNICODE /D UNICODE /Gm- /EHsc /RTC1 /MDd /GS /fp:precise /permissive- /Zc:wchar_t /Zc:forScope /Zc:inline /Fo"DEBUG\\" /Fd"DEBUG\VC142.PDB" /Gd /TP /analyze- /FC C:\USERS\JEREM\DATA\PROJECTS\GRAFKOM\OPENGL\OPENGL\SRC\LIB\INDEXBUFFER.CPP
^C:\USERS\JEREM\DATA\PROJECTS\GRAFKOM\OPENGL\OPENGL\SRC\LIB\VERTEXBUFFER.CPP
/c /ISRC/SHAPES /ISRC/LIB /IC:\USERS\JEREM\DATA\PROJECTS\GRAFKOM\OPENGL\OPENGL\DEPENDENCIES\GLFW\INCLUDE /IC:\USERS\JEREM\DATA\PROJECTS\GRAFKOM\OPENGL\OPENGL\DEPENDENCIES\GLEW\INCLUDE /ZI /JMC /nologo /W3 /WX- /diagnostics:column /sdl /Od /Oy- /D GLEW_STATIC /D WIN32 /D _DEBUG /D _CONSOLE /D _UNICODE /D UNICODE /Gm- /EHsc /RTC1 /MDd /GS /fp:precise /permissive- /Zc:wchar_t /Zc:forScope /Zc:inline /Fo"DEBUG\\" /Fd"DEBUG\VC142.PDB" /Gd /TP /analyze- /FC C:\USERS\JEREM\DATA\PROJECTS\GRAFKOM\OPENGL\OPENGL\SRC\LIB\VERTEXBUFFER.CPP
^C:\USERS\JEREM\DATA\PROJECTS\GRAFKOM\OPENGL\OPENGL\SRC\LIB\VERTEXARRAY.CPP
/c /ISRC/SHAPES /ISRC/LIB /IC:\USERS\JEREM\DATA\PROJECTS\GRAFKOM\OPENGL\OPENGL\DEPENDENCIES\GLFW\INCLUDE /IC:\USERS\JEREM\DATA\PROJECTS\GRAFKOM\OPENGL\OPENGL\DEPENDENCIES\GLEW\INCLUDE /ZI /JMC /nologo /W3 /WX- /diagnostics:column /sdl /Od /Oy- /D GLEW_STATIC /D WIN32 /D _DEBUG /D _CONSOLE /D _UNICODE /D UNICODE /Gm- /EHsc /RTC1 /MDd /GS /fp:precise /permissive- /Zc:wchar_t /Zc:forScope /Zc:inline /Fo"DEBUG\\" /Fd"DEBUG\VC142.PDB" /Gd /TP /analyze- /FC C:\USERS\JEREM\DATA\PROJECTS\GRAFKOM\OPENGL\OPENGL\SRC\LIB\VERTEXARRAY.CPP
^C:\USERS\JEREM\DATA\PROJECTS\GRAFKOM\OPENGL\OPENGL\SRC\MAIN.CPP
/c /ISRC/SHAPES /ISRC/LIB /IC:\USERS\JEREM\DATA\PROJECTS\GRAFKOM\OPENGL\OPENGL\DEPENDENCIES\GLFW\INCLUDE /IC:\USERS\JEREM\DATA\PROJECTS\GRAFKOM\OPENGL\OPENGL\DEPENDENCIES\GLEW\INCLUDE /ZI /JMC /nologo /W3 /WX- /diagnostics:column /sdl /Od /Oy- /D GLEW_STATIC /D WIN32 /D _DEBUG /D _CONSOLE /D _UNICODE /D UNICODE /Gm- /EHsc /RTC1 /MDd /GS /fp:precise /permissive- /Zc:wchar_t /Zc:forScope /Zc:inline /Fo"DEBUG\\" /Fd"DEBUG\VC142.PDB" /Gd /TP /analyze- /FC C:\USERS\JEREM\DATA\PROJECTS\GRAFKOM\OPENGL\OPENGL\SRC\MAIN.CPP
^C:\USERS\JEREM\DATA\PROJECTS\GRAFKOM\OPENGL\OPENGL\SRC\SHAPES\TRIANGLE.CPP
/c /ISRC/SHAPES /ISRC/LIB /IC:\USERS\JEREM\DATA\PROJECTS\GRAFKOM\OPENGL\OPENGL\DEPENDENCIES\GLFW\INCLUDE /IC:\USERS\JEREM\DATA\PROJECTS\GRAFKOM\OPENGL\OPENGL\DEPENDENCIES\GLEW\INCLUDE /ZI /JMC /nologo /W3 /WX- /diagnostics:column /sdl /Od /Oy- /D GLEW_STATIC /D WIN32 /D _DEBUG /D _CONSOLE /D _UNICODE /D UNICODE /Gm- /EHsc /RTC1 /MDd /GS /fp:precise /permissive- /Zc:wchar_t /Zc:forScope /Zc:inline /Fo"DEBUG\\" /Fd"DEBUG\VC142.PDB" /Gd /TP /analyze- /FC C:\USERS\JEREM\DATA\PROJECTS\GRAFKOM\OPENGL\OPENGL\SRC\SHAPES\TRIANGLE.CPP
^C:\USERS\JEREM\DATA\PROJECTS\GRAFKOM\OPENGL\OPENGL\SRC\APPLICATION.H
/c /ISRC/SHAPES /ISRC/LIB /IC:\USERS\JEREM\DATA\PROJECTS\GRAFKOM\OPENGL\OPENGL\DEPENDENCIES\GLFW\INCLUDE /IC:\USERS\JEREM\DATA\PROJECTS\GRAFKOM\OPENGL\OPENGL\DEPENDENCIES\GLEW\INCLUDE /ZI /JMC /nologo /W3 /WX- /diagnostics:column /sdl /Od /Oy- /D GLEW_STATIC /D WIN32 /D _DEBUG /D _CONSOLE /D _UNICODE /D UNICODE /Gm- /EHsc /RTC1 /MDd /GS /fp:precise /permissive- /Zc:wchar_t /Zc:forScope /Zc:inline /Fo"DEBUG\\" /Fd"DEBUG\VC142.PDB" /Gd /TP /analyze- /FC C:\USERS\JEREM\DATA\PROJECTS\GRAFKOM\OPENGL\OPENGL\SRC\APPLICATION.H
