^C:\USERS\JEREM\DATA\PROJECTS\GRAFKOM\OPENGL\OPENGL\DEBUG\APPLICATION.OBJ|C:\USERS\JEREM\DATA\PROJECTS\GRAFKOM\OPENGL\OPENGL\DEBUG\CAMERA.OBJ|C:\USERS\JEREM\DATA\PROJECTS\GRAFKOM\OPENGL\OPENGL\DEBUG\CIRCLE.OBJ|C:\USERS\JEREM\DATA\PROJECTS\GRAFKOM\OPENGL\OPENGL\DEBUG\GLM.OBJ|C:\USERS\JEREM\DATA\PROJECTS\GRAFKOM\OPENGL\OPENGL\DEBUG\INDEXBUFFER.OBJ|C:\USERS\JEREM\DATA\PROJECTS\GRAFKOM\OPENGL\OPENGL\DEBUG\MAIN.OBJ|C:\USERS\JEREM\DATA\PROJECTS\GRAFKOM\OPENGL\OPENGL\DEBUG\MOUSEPEN.OBJ|C:\USERS\JEREM\DATA\PROJECTS\GRAFKOM\OPENGL\OPENGL\DEBUG\QUAD.OBJ|C:\USERS\JEREM\DATA\PROJECTS\GRAFKOM\OPENGL\OPENGL\DEBUG\RECT.OBJ|C:\USERS\JEREM\DATA\PROJECTS\GRAFKOM\OPENGL\OPENGL\DEBUG\SHADER.OBJ|C:\USERS\JEREM\DATA\PROJECTS\GRAFKOM\OPENGL\OPENGL\DEBUG\TRIANGLE.OBJ|C:\USERS\JEREM\DATA\PROJECTS\GRAFKOM\OPENGL\OPENGL\DEBUG\VERTEXARRAY.OBJ|C:\USERS\JEREM\DATA\PROJECTS\GRAFKOM\OPENGL\OPENGL\DEBUG\VERTEXBUFFER.OBJ
/OUT:"C:\USERS\JEREM\DATA\PROJECTS\GRAFKOM\OPENGL\DEBUG\OPENGL.EXE" /INCREMENTAL /NOLOGO /LIBPATH:"C:\USERS\JEREM\DATA\PROJECTS\GRAFKOM\OPENGL\OPENGL\DEPENDENCIES\GLFW\LIB-VC2019" /LIBPATH:C:\USERS\JEREM\DATA\PROJECTS\GRAFKOM\OPENGL\OPENGL\DEPENDENCIES\GLEW\LIB\RELEASE\WIN32 GLFW3.LIB OPENGL32.LIB GLEW32S.LIB KERNEL32.LIB USER32.LIB GDI32.LIB WINSPOOL.LIB COMDLG32.LIB ADVAPI32.LIB SHELL32.LIB OLE32.LIB OLEAUT32.LIB UUID.LIB ODBC32.LIB ODBCCP32.LIB /MANIFEST /MANIFESTUAC:"level='asInvoker' uiAccess='false'" /manifest:embed /DEBUG:FASTLINK /PDB:"C:\USERS\JEREM\DATA\PROJECTS\GRAFKOM\OPENGL\DEBUG\OPENGL.PDB" /SUBSYSTEM:CONSOLE /TLBID:1 /DYNAMICBASE /NXCOMPAT /IMPLIB:"C:\USERS\JEREM\DATA\PROJECTS\GRAFKOM\OPENGL\DEBUG\OPENGL.LIB" /MACHINE:X86 DEBUG\MOUSEPEN.OBJ
DEBUG\QUAD.OBJ
DEBUG\CIRCLE.OBJ
DEBUG\RECT.OBJ
DEBUG\CAMERA.OBJ
DEBUG\GLM.OBJ
DEBUG\SHADER.OBJ
DEBUG\APPLICATION.OBJ
DEBUG\INDEXBUFFER.OBJ
DEBUG\VERTEXBUFFER.OBJ
DEBUG\VERTEXARRAY.OBJ
DEBUG\MAIN.OBJ
DEBUG\TRIANGLE.OBJ
