^C:\USERS\JEREM\DATA\PROJECTS\GRAFKOM\OPENGL\OPENGL\SRC\APPLICATION.H|C:\USERS\JEREM\DATA\PROJECTS\GRAFKOM\OPENGL\OPENGL\SRC\LIB\CAMERA.CPP|C:\USERS\JEREM\DATA\PROJECTS\GRAFKOM\OPENGL\OPENGL\SRC\LIB\GLM\DETAIL\GLM.CPP|C:\USERS\JEREM\DATA\PROJECTS\GRAFKOM\OPENGL\OPENGL\SRC\LIB\INDEXBUFFER.CPP|C:\USERS\JEREM\DATA\PROJECTS\GRAFKOM\OPENGL\OPENGL\SRC\LIB\SHADER.CPP|C:\USERS\JEREM\DATA\PROJECTS\GRAFKOM\OPENGL\OPENGL\SRC\LIB\VERTEXARRAY.CPP|C:\USERS\JEREM\DATA\PROJECTS\GRAFKOM\OPENGL\OPENGL\SRC\LIB\VERTEXBUFFER.CPP|C:\USERS\JEREM\DATA\PROJECTS\GRAFKOM\OPENGL\OPENGL\SRC\MAIN.CPP|C:\USERS\JEREM\DATA\PROJECTS\GRAFKOM\OPENGL\OPENGL\SRC\MOUSEPEN.CPP|C:\USERS\JEREM\DATA\PROJECTS\GRAFKOM\OPENGL\OPENGL\SRC\SHAPES\CIRCLE.CPP|C:\USERS\JEREM\DATA\PROJECTS\GRAFKOM\OPENGL\OPENGL\SRC\SHAPES\QUAD.CPP|C:\USERS\JEREM\DATA\PROJECTS\GRAFKOM\OPENGL\OPENGL\SRC\SHAPES\RECT.CPP|C:\USERS\JEREM\DATA\PROJECTS\GRAFKOM\OPENGL\OPENGL\SRC\SHAPES\TRIANGLE.CPP
C:\USERS\JEREM\DATA\PROJECTS\GRAFKOM\OPENGL\OPENGL\DEBUG\VC142.PDB
C:\USERS\JEREM\DATA\PROJECTS\GRAFKOM\OPENGL\OPENGL\DEBUG\VC142.IDB
C:\USERS\JEREM\DATA\PROJECTS\GRAFKOM\OPENGL\OPENGL\DEBUG\TRIANGLE.OBJ
C:\USERS\JEREM\DATA\PROJECTS\GRAFKOM\OPENGL\OPENGL\DEBUG\MAIN.OBJ
C:\USERS\JEREM\DATA\PROJECTS\GRAFKOM\OPENGL\OPENGL\DEBUG\VERTEXARRAY.OBJ
C:\USERS\JEREM\DATA\PROJECTS\GRAFKOM\OPENGL\OPENGL\DEBUG\VERTEXBUFFER.OBJ
C:\USERS\JEREM\DATA\PROJECTS\GRAFKOM\OPENGL\OPENGL\DEBUG\INDEXBUFFER.OBJ
C:\USERS\JEREM\DATA\PROJECTS\GRAFKOM\OPENGL\OPENGL\DEBUG\APPLICATION.OBJ
C:\USERS\JEREM\DATA\PROJECTS\GRAFKOM\OPENGL\OPENGL\DEBUG\SHADER.OBJ
C:\USERS\JEREM\DATA\PROJECTS\GRAFKOM\OPENGL\OPENGL\DEBUG\GLM.OBJ
C:\USERS\JEREM\DATA\PROJECTS\GRAFKOM\OPENGL\OPENGL\DEBUG\CAMERA.OBJ
C:\USERS\JEREM\DATA\PROJECTS\GRAFKOM\OPENGL\OPENGL\DEBUG\RECT.OBJ
C:\USERS\JEREM\DATA\PROJECTS\GRAFKOM\OPENGL\OPENGL\DEBUG\CIRCLE.OBJ
C:\USERS\JEREM\DATA\PROJECTS\GRAFKOM\OPENGL\OPENGL\DEBUG\QUAD.OBJ
C:\USERS\JEREM\DATA\PROJECTS\GRAFKOM\OPENGL\OPENGL\DEBUG\MOUSEPEN.OBJ
^C:\USERS\JEREM\DATA\PROJECTS\GRAFKOM\OPENGL\OPENGL\SRC\MOUSEPEN.CPP
C:\USERS\JEREM\DATA\PROJECTS\GRAFKOM\OPENGL\OPENGL\DEBUG\VC142.PDB
^C:\USERS\JEREM\DATA\PROJECTS\GRAFKOM\OPENGL\OPENGL\SRC\SHAPES\QUAD.CPP
C:\USERS\JEREM\DATA\PROJECTS\GRAFKOM\OPENGL\OPENGL\DEBUG\VC142.PDB
^C:\USERS\JEREM\DATA\PROJECTS\GRAFKOM\OPENGL\OPENGL\SRC\SHAPES\CIRCLE.CPP
C:\USERS\JEREM\DATA\PROJECTS\GRAFKOM\OPENGL\OPENGL\DEBUG\VC142.PDB
^C:\USERS\JEREM\DATA\PROJECTS\GRAFKOM\OPENGL\OPENGL\SRC\SHAPES\RECT.CPP
C:\USERS\JEREM\DATA\PROJECTS\GRAFKOM\OPENGL\OPENGL\DEBUG\VC142.PDB
^C:\USERS\JEREM\DATA\PROJECTS\GRAFKOM\OPENGL\OPENGL\SRC\LIB\CAMERA.CPP
C:\USERS\JEREM\DATA\PROJECTS\GRAFKOM\OPENGL\OPENGL\DEBUG\VC142.PDB
^C:\USERS\JEREM\DATA\PROJECTS\GRAFKOM\OPENGL\OPENGL\SRC\LIB\GLM\DETAIL\GLM.CPP
C:\USERS\JEREM\DATA\PROJECTS\GRAFKOM\OPENGL\OPENGL\DEBUG\VC142.PDB
^C:\USERS\JEREM\DATA\PROJECTS\GRAFKOM\OPENGL\OPENGL\SRC\LIB\SHADER.CPP
C:\USERS\JEREM\DATA\PROJECTS\GRAFKOM\OPENGL\OPENGL\DEBUG\VC142.PDB
^C:\USERS\JEREM\DATA\PROJECTS\GRAFKOM\OPENGL\OPENGL\SRC\LIB\INDEXBUFFER.CPP
C:\USERS\JEREM\DATA\PROJECTS\GRAFKOM\OPENGL\OPENGL\DEBUG\VC142.PDB
^C:\USERS\JEREM\DATA\PROJECTS\GRAFKOM\OPENGL\OPENGL\SRC\LIB\VERTEXBUFFER.CPP
C:\USERS\JEREM\DATA\PROJECTS\GRAFKOM\OPENGL\OPENGL\DEBUG\VC142.PDB
^C:\USERS\JEREM\DATA\PROJECTS\GRAFKOM\OPENGL\OPENGL\SRC\LIB\VERTEXARRAY.CPP
C:\USERS\JEREM\DATA\PROJECTS\GRAFKOM\OPENGL\OPENGL\DEBUG\VC142.PDB
^C:\USERS\JEREM\DATA\PROJECTS\GRAFKOM\OPENGL\OPENGL\SRC\MAIN.CPP
C:\USERS\JEREM\DATA\PROJECTS\GRAFKOM\OPENGL\OPENGL\DEBUG\VC142.PDB
^C:\USERS\JEREM\DATA\PROJECTS\GRAFKOM\OPENGL\OPENGL\SRC\SHAPES\TRIANGLE.CPP
C:\USERS\JEREM\DATA\PROJECTS\GRAFKOM\OPENGL\OPENGL\DEBUG\VC142.PDB
^C:\USERS\JEREM\DATA\PROJECTS\GRAFKOM\OPENGL\OPENGL\SRC\APPLICATION.H
C:\USERS\JEREM\DATA\PROJECTS\GRAFKOM\OPENGL\OPENGL\DEBUG\VC142.PDB
C:\USERS\JEREM\DATA\PROJECTS\GRAFKOM\OPENGL\OPENGL\DEBUG\VC142.IDB
C:\USERS\JEREM\DATA\PROJECTS\GRAFKOM\OPENGL\OPENGL\DEBUG\APPLICATION.OBJ
