species	beta	fillratio	hashfuncs	cost	time	choice1	choice2	choice3	fill0	fill1	fill2	fill3	fill4	fill5	fill6	fill7	fill8	nfull
ebola	1.1	0.98	linear3255:linear2157:linear3219	1.2018991034958357	0.955875	15345	3206	300	0	0	0	3	388	3458	NaN	NaN	NaN	3849
ebola	1.0	0.98	linear7445:linear683:linear8423	1.2018991034958357	0.920658	15346	3204	301	1	3	5	26	310	3504	NaN	NaN	NaN	3849
ebola	1.08	0.98	linear2351:linear4951:linear8073	1.1993528194790728	0.9431	15398	3148	305	0	0	2	0	388	3459	NaN	NaN	NaN	3849
ebola	1.1	0.99	linear4499:linear8135:linear5697	1.2148957614980638	1.038299	15156	3339	356	0	0	0	0	194	3615	NaN	NaN	NaN	3809
ebola	1.01	0.98	linear7387:linear9581:linear7153	1.2010503421569148	0.904906	15371	3170	310	0	0	1	0	391	3457	NaN	NaN	NaN	3849
ebola	1.08	0.5	linear3255:linear2157:linear3219	1.0253567450002652	0.221049	18373	478	0	574	1473	1884	1643	1154	813	NaN	NaN	NaN	7541
ebola	1.01	0.95	linear6697:linear451:linear6197	1.1745795978993157	0.767237	15744	2923	184	0	0	0	1	992	2976	NaN	NaN	NaN	3969
ebola	1.05	0.5	linear5193:linear1373:linear4115	1.0242427457429315	0.224224	18394	457	0	597	1460	1868	1631	1163	822	NaN	NaN	NaN	7541
ebola	1.1	0.95	linear7745:linear5663:linear1639	1.1783990239244602	0.674127	15675	2989	187	0	0	0	1	992	2976	NaN	NaN	NaN	3969
ebola	1.0	0.9	linear6697:linear451:linear6197	1.148427139143812	0.577069	16104	2696	51	7	42	113	256	1050	2723	NaN	NaN	NaN	4191
ebola	1.1	0.999	linear7387:linear9581:linear7153	1.22640708715718	1.661769	15050	3334	467	0	0	0	1	22	3752	NaN	NaN	NaN	3775
ebola	1.1	0.5	linear6697:linear451:linear6197	1.0251976022492175	0.219418	18376	475	0	584	1511	1802	1657	1170	817	NaN	NaN	NaN	7541
ebola	1.03	0.999	linear6697:linear451:linear6197	1.2269375629940056	1.509194	15000	3424	427	0	0	0	1	22	3752	NaN	NaN	NaN	3775
ebola	1.05	0.5	linear7745:linear5663:linear1639	1.0243488409102965	0.229036	18392	459	0	572	1500	1857	1645	1133	834	NaN	NaN	NaN	7541
ebola	1.05	0.5	linear3255:linear2157:linear3219	1.0253567450002652	0.221853	18373	478	0	574	1473	1884	1643	1154	813	NaN	NaN	NaN	7541
ebola	1.0	0.7	linear4499:linear8135:linear5697	1.070447191130444	0.426492	17526	1322	3	94	382	810	1090	1476	1535	NaN	NaN	NaN	5387
ebola	1.08	0.95	linear8871:linear9379:linear7583	1.1763301681608402	0.73354	15717	2944	190	0	0	1	0	991	2977	NaN	NaN	NaN	3969
ebola	1.0	0.95	linear4499:linear8135:linear5697	1.1820062596148746	0.743834	15610	3051	190	0	15	23	75	715	3141	NaN	NaN	NaN	3969
ebola	1.1	0.9	linear7445:linear683:linear8423	1.1471539971354305	0.578417	16140	2648	63	0	0	2	1	2096	2092	NaN	NaN	NaN	4191
ebola	1.01	0.95	linear7445:linear683:linear8423	1.1800965466023023	0.747757	15633	3041	177	0	0	0	0	994	2975	NaN	NaN	NaN	3969
ebola	1.0	0.5	linear8871:linear9379:linear7583	1.026470744257599	0.209995	18352	499	0	616	1418	1891	1640	1149	827	NaN	NaN	NaN	7541
ebola	1.03	0.98	linear5193:linear1373:linear4115	1.203702721341043	0.921526	15303	3256	292	0	0	0	0	394	3455	NaN	NaN	NaN	3849
ebola	1.03	0.95	linear5193:linear1373:linear4115	1.1778155005039521	0.757494	15695	2960	196	0	0	0	0	994	2975	NaN	NaN	NaN	3969
ebola	1.05	0.999	linear5193:linear1373:linear4115	1.2223754707973051	1.583672	15105	3300	446	0	0	0	1	22	3752	NaN	NaN	NaN	3775
ebola	1.01	0.999	linear7445:linear683:linear8423	1.2267253726592753	1.625112	15052	3324	475	0	0	1	1	19	3754	NaN	NaN	NaN	3775
ebola	1.08	0.95	linear7745:linear5663:linear1639	1.1783990239244602	0.675386	15675	2989	187	0	0	0	1	992	2976	NaN	NaN	NaN	3969
ebola	1.01	0.999	linear3255:linear2157:linear3219	1.219616996445812	1.444983	15113	3336	402	0	0	0	0	24	3751	NaN	NaN	NaN	3775
ebola	1.05	0.5	linear8871:linear9379:linear7583	1.026470744257599	0.209033	18352	499	0	615	1437	1853	1662	1148	826	NaN	NaN	NaN	7541
ebola	1.0	0.999	linear7445:linear683:linear8423	1.2267253726592753	1.62808	15052	3324	475	0	1	2	2	10	3760	NaN	NaN	NaN	3775
ebola	1.08	0.5	linear7445:linear683:linear8423	1.0256750305023605	0.215321	18367	484	0	580	1454	1929	1610	1131	837	NaN	NaN	NaN	7541
ebola	1.0	0.8	linear5193:linear1373:linear4115	1.1033897405973159	0.451769	16910	1933	8	25	161	395	605	1550	1977	NaN	NaN	NaN	4713
ebola	1.01	0.9	linear4499:linear8135:linear5697	1.145986950294414	0.578394	16159	2632	60	4	17	64	195	1434	2477	NaN	NaN	NaN	4191
ebola	1.0	0.98	linear5193:linear1373:linear4115	1.203702721341043	0.923008	15303	3256	292	0	1	4	24	330	3490	NaN	NaN	NaN	3849
ebola	1.1	0.95	linear8871:linear9379:linear7583	1.1763301681608402	0.733911	15717	2944	190	0	0	1	0	991	2977	NaN	NaN	NaN	3969
ebola	1.01	0.999	linear5193:linear1373:linear4115	1.2223754707973051	1.569008	15105	3300	446	0	0	0	1	22	3752	NaN	NaN	NaN	3775
ebola	1.0	0.8	linear3255:linear2157:linear3219	1.101426980001061	0.453436	16947	1896	8	33	151	375	675	1470	2009	NaN	NaN	NaN	4713
ebola	1.03	0.98	linear2351:linear4951:linear8073	1.1993528194790728	0.943459	15398	3148	305	0	0	2	0	388	3459	NaN	NaN	NaN	3849
ebola	1.05	0.99	linear7387:linear9581:linear7153	1.2128269057344438	1.152804	15224	3242	385	0	0	0	2	190	3617	NaN	NaN	NaN	3809
ebola	1.05	0.999	linear7745:linear5663:linear1639	1.2271497533287359	1.742462	15039	3342	470	0	0	0	1	22	3752	NaN	NaN	NaN	3775
ebola	1.01	0.9	linear8871:linear9379:linear7583	1.1460399978780966	0.566287	16175	2599	77	3	19	74	207	1377	2511	NaN	NaN	NaN	4191
ebola	1.1	0.5	linear7745:linear5663:linear1639	1.0243488409102965	0.228923	18392	459	0	572	1500	1857	1645	1133	834	NaN	NaN	NaN	7541
ebola	1.0	0.95	linear7445:linear683:linear8423	1.1800965466023023	0.75872	15633	3041	177	1	8	32	92	677	3159	NaN	NaN	NaN	3969
ebola	1.01	0.9	linear9939:linear7959:linear4391	1.1499124714869238	0.5775	16096	2684	71	2	16	75	204	1397	2497	NaN	NaN	NaN	4191
ebola	1.0	0.95	linear7745:linear5663:linear1639	1.1783990239244602	0.677827	15675	2989	187	2	10	36	94	648	3179	NaN	NaN	NaN	3969
ebola	1.05	0.99	linear7445:linear683:linear8423	1.209378812795077	1.177147	15273	3209	369	0	0	0	0	194	3615	NaN	NaN	NaN	3809
ebola	1.08	0.9	linear3255:linear2157:linear3219	1.150230756989019	0.573296	16078	2714	59	0	0	0	1	2102	2088	NaN	NaN	NaN	4191
ebola	1.08	0.98	linear5193:linear1373:linear4115	1.203702721341043	0.921721	15303	3256	292	0	0	0	0	394	3455	NaN	NaN	NaN	3849
ebola	1.05	0.99	linear2351:linear4951:linear8073	1.2090074797092993	1.099324	15252	3258	341	0	0	0	0	194	3615	NaN	NaN	NaN	3809
ebola	1.08	0.98	linear7387:linear9581:linear7153	1.2010503421569148	0.899639	15371	3170	310	0	0	1	0	391	3457	NaN	NaN	NaN	3849
ebola	1.1	0.95	linear7387:linear9581:linear7153	1.1796721659328417	0.746204	15655	3005	191	0	0	0	1	992	2976	NaN	NaN	NaN	3969
ebola	1.01	0.8	linear3255:linear2157:linear3219	1.101426980001061	0.454824	16947	1896	8	21	113	331	718	1728	1802	NaN	NaN	NaN	4713
ebola	1.05	0.9	linear7745:linear5663:linear1639	1.1481088536417166	0.578622	16122	2666	63	0	0	1	1	2099	2090	NaN	NaN	NaN	4191
ebola	1.0	0.99	linear9939:linear7959:linear4391	1.2043923399289163	1.110656	15301	3247	303	0	1	8	23	120	3657	NaN	NaN	NaN	3809
ebola	1.08	0.99	linear7745:linear5663:linear1639	1.2099092886319027	1.134752	15240	3265	346	0	0	0	0	194	3615	NaN	NaN	NaN	3809
ebola	1.1	0.5	linear4499:linear8135:linear5697	1.0241896981592489	0.210199	18395	456	0	543	1487	1913	1667	1118	813	NaN	NaN	NaN	7541
ebola	1.0	0.98	linear9939:linear7959:linear4391	1.2035966261736777	0.90286	15308	3248	295	2	2	15	33	265	3532	NaN	NaN	NaN	3849
ebola	1.03	0.99	linear7445:linear683:linear8423	1.209378812795077	1.178401	15273	3209	369	0	0	0	0	194	3615	NaN	NaN	NaN	3809
ebola	1.01	0.999	linear9939:linear7959:linear4391	1.222640708715718	1.528103	15103	3299	449	0	0	0	2	20	3753	NaN	NaN	NaN	3775
ebola	1.05	0.95	linear9939:linear7959:linear4391	1.1793008328470638	0.780044	15629	3064	158	0	0	0	1	992	2976	NaN	NaN	NaN	3969
ebola	1.1	0.999	linear7445:linear683:linear8423	1.2267253726592753	1.623093	15052	3324	475	0	0	1	1	19	3754	NaN	NaN	NaN	3775
ebola	1.1	0.98	linear6697:linear451:linear6197	1.2026417696673917	0.926562	15332	3218	301	0	0	0	1	392	3456	NaN	NaN	NaN	3849
ebola	1.05	0.99	linear8871:linear9379:linear7583	1.212190334730253	1.104982	15184	3334	333	0	0	0	1	192	3616	NaN	NaN	NaN	3809
ebola	1.03	0.5	linear8871:linear9379:linear7583	1.026470744257599	0.20936	18352	499	0	615	1437	1853	1662	1148	826	NaN	NaN	NaN	7541
ebola	1.0	0.9	linear7445:linear683:linear8423	1.1471539971354305	0.575717	16140	2648	63	6	28	126	266	1052	2713	NaN	NaN	NaN	4191
ebola	1.1	0.999	linear9939:linear7959:linear4391	1.222640708715718	1.521042	15103	3299	449	0	0	0	2	20	3753	NaN	NaN	NaN	3775
ebola	1.03	0.95	linear2351:linear4951:linear8073	1.1787173094265557	0.721569	15667	2999	185	0	0	0	0	994	2975	NaN	NaN	NaN	3969
ebola	1.0	0.8	linear9939:linear7959:linear4391	1.103495835764681	0.447291	16910	1931	10	25	145	401	643	1520	1979	NaN	NaN	NaN	4713
ebola	1.03	0.999	linear7387:linear9581:linear7153	1.22640708715718	1.666384	15050	3334	467	0	0	0	1	22	3752	NaN	NaN	NaN	3775
ebola	1.05	0.98	linear4499:linear8135:linear5697	1.200042438066946	0.847311	15368	3195	288	0	0	0	1	392	3456	NaN	NaN	NaN	3849
ebola	1.1	0.9	linear3255:linear2157:linear3219	1.150230756989019	0.574004	16078	2714	59	0	0	0	1	2102	2088	NaN	NaN	NaN	4191
ebola	1.03	0.5	linear4499:linear8135:linear5697	1.0241896981592489	0.211164	18395	456	0	543	1487	1913	1667	1118	813	NaN	NaN	NaN	7541
ebola	1.08	0.9	linear6697:linear451:linear6197	1.148427139143812	0.576901	16104	2696	51	0	1	1	4	2089	2096	NaN	NaN	NaN	4191
ebola	1.03	0.98	linear6697:linear451:linear6197	1.2026417696673917	0.925982	15332	3218	301	0	0	0	1	392	3456	NaN	NaN	NaN	3849
ebola	1.05	0.95	linear5193:linear1373:linear4115	1.1778155005039521	0.756304	15695	2960	196	0	0	0	0	994	2975	NaN	NaN	NaN	3969
ebola	1.05	0.99	linear6697:linear451:linear6197	1.2145774759959684	1.074246	15155	3347	349	0	0	1	1	189	3618	NaN	NaN	NaN	3809
ebola	1.03	0.95	linear8871:linear9379:linear7583	1.1763301681608402	0.72616	15717	2944	190	0	0	1	0	991	2977	NaN	NaN	NaN	3969
ebola	1.03	0.98	linear4499:linear8135:linear5697	1.200042438066946	0.844491	15368	3195	288	0	0	0	1	392	3456	NaN	NaN	NaN	3849
ebola	1.0	0.98	linear6697:linear451:linear6197	1.2026417696673917	0.930037	15332	3218	301	0	2	8	29	304	3506	NaN	NaN	NaN	3849
ebola	1.05	0.98	linear6697:linear451:linear6197	1.2026417696673917	0.921255	15332	3218	301	0	0	0	1	392	3456	NaN	NaN	NaN	3849
ebola	1.03	0.999	linear7445:linear683:linear8423	1.2267253726592753	1.62814	15052	3324	475	0	0	1	1	19	3754	NaN	NaN	NaN	3775
ebola	1.01	0.5	linear8871:linear9379:linear7583	1.026470744257599	0.21053	18352	499	0	617	1421	1872	1664	1141	826	NaN	NaN	NaN	7541
ebola	1.03	0.99	linear7745:linear5663:linear1639	1.2099092886319027	1.137421	15240	3265	346	0	0	0	0	194	3615	NaN	NaN	NaN	3809
ebola	1.0	0.8	linear2351:linear4951:linear8073	1.1040793591851892	0.451126	16904	1932	15	28	149	368	675	1524	1969	NaN	NaN	NaN	4713
ebola	1.1	0.5	linear2351:linear4951:linear8073	1.0258872208370908	0.224152	18363	488	0	579	1469	1880	1666	1111	836	NaN	NaN	NaN	7541
ebola	1.03	0.98	linear7445:linear683:linear8423	1.2018991034958357	0.92222	15346	3204	301	0	0	0	1	392	3456	NaN	NaN	NaN	3849
ebola	1.0	0.8	linear4499:linear8135:linear5697	1.1070500238714127	0.453815	16849	1986	16	36	131	394	651	1526	1975	NaN	NaN	NaN	4713
ebola	1.1	0.95	linear4499:linear8135:linear5697	1.1820062596148746	0.744509	15610	3051	190	0	0	1	0	991	2977	NaN	NaN	NaN	3969
ebola	1.0	0.98	linear8871:linear9379:linear7583	1.1997241525648508	0.874162	15361	3215	275	0	1	12	25	304	3507	NaN	NaN	NaN	3849
ebola	1.0	0.7	linear8871:linear9379:linear7583	1.0699167152936184	0.429013	17533	1318	0	86	393	787	1099	1523	1499	NaN	NaN	NaN	5387
ebola	1.01	0.95	linear2351:linear4951:linear8073	1.1787173094265557	0.731141	15667	2999	185	0	0	0	0	994	2975	NaN	NaN	NaN	3969
ebola	1.0	0.9	linear3255:linear2157:linear3219	1.150230756989019	0.571154	16078	2714	59	4	31	116	275	1062	2703	NaN	NaN	NaN	4191
ebola	1.03	0.99	linear3255:linear2157:linear3219	1.209166622460347	1.086812	15264	3231	356	0	0	0	1	192	3616	NaN	NaN	NaN	3809
ebola	1.1	0.99	linear6697:linear451:linear6197	1.2145774759959684	1.080976	15155	3347	349	0	0	1	1	189	3618	NaN	NaN	NaN	3809
ebola	1.08	0.98	linear7745:linear5663:linear1639	1.2043923399289163	0.914426	15327	3195	329	0	0	0	2	390	3457	NaN	NaN	NaN	3849
ebola	1.0	0.7	linear6697:linear451:linear6197	1.0699167152936184	0.431628	17535	1314	2	80	392	799	1127	1465	1524	NaN	NaN	NaN	5387
ebola	1.01	0.95	linear8871:linear9379:linear7583	1.1763301681608402	0.725078	15717	2944	190	0	0	1	0	991	2977	NaN	NaN	NaN	3969
ebola	1.08	0.9	linear9939:linear7959:linear4391	1.1499124714869238	0.574902	16096	2684	71	0	0	1	2	2097	2091	NaN	NaN	NaN	4191
ebola	1.1	0.95	linear6697:linear451:linear6197	1.1745795978993157	0.766999	15744	2923	184	0	0	0	1	992	2976	NaN	NaN	NaN	3969
ebola	1.01	0.9	linear3255:linear2157:linear3219	1.150230756989019	0.575844	16078	2714	59	2	17	76	189	1420	2487	NaN	NaN	NaN	4191
ebola	1.03	0.5	linear9939:linear7959:linear4391	1.0262055063391862	0.224993	18357	494	0	581	1516	1833	1634	1118	859	NaN	NaN	NaN	7541
ebola	1.03	0.9	linear4499:linear8135:linear5697	1.145986950294414	0.571699	16159	2632	60	1	3	8	35	1993	2151	NaN	NaN	NaN	4191
ebola	1.03	0.99	linear7387:linear9581:linear7153	1.2128269057344438	1.150026	15224	3242	385	0	0	0	2	191	3616	NaN	NaN	NaN	3809
ebola	1.01	0.5	linear4499:linear8135:linear5697	1.0241896981592489	0.21043	18395	456	0	551	1468	1921	1676	1112	813	NaN	NaN	NaN	7541
ebola	1.01	0.8	linear7387:linear9581:linear7153	1.1060421197814438	0.458562	16867	1969	15	29	113	363	612	1804	1792	NaN	NaN	NaN	4713
ebola	1.0	0.95	linear6697:linear451:linear6197	1.1745795978993157	0.770563	15744	2923	184	0	6	27	80	729	3127	NaN	NaN	NaN	3969
ebola	1.1	0.999	linear8871:linear9379:linear7583	1.222746803883083	1.48966	15098	3307	446	0	0	0	0	24	3751	NaN	NaN	NaN	3775
ebola	1.0	0.5	linear5193:linear1373:linear4115	1.0242427457429315	0.22341	18394	457	0	595	1459	1869	1640	1156	822	NaN	NaN	NaN	7541
ebola	1.08	0.999	linear6697:linear451:linear6197	1.2269375629940056	1.502989	15000	3424	427	0	0	0	1	22	3752	NaN	NaN	NaN	3775
ebola	1.01	0.98	linear4499:linear8135:linear5697	1.200042438066946	0.850299	15368	3195	288	0	0	0	1	392	3456	NaN	NaN	NaN	3849
ebola	1.01	0.8	linear9939:linear7959:linear4391	1.103495835764681	0.450469	16910	1931	10	17	118	349	652	1806	1771	NaN	NaN	NaN	4713
ebola	1.03	0.98	linear3255:linear2157:linear3219	1.2018991034958357	0.959103	15345	3206	300	0	0	0	3	388	3458	NaN	NaN	NaN	3849
ebola	1.03	0.9	linear7745:linear5663:linear1639	1.1481088536417166	0.573369	16122	2666	63	0	2	14	34	1986	2155	NaN	NaN	NaN	4191
ebola	1.1	0.95	linear9939:linear7959:linear4391	1.1793008328470638	0.789019	15629	3064	158	0	0	0	1	992	2976	NaN	NaN	NaN	3969
ebola	1.01	0.99	linear7745:linear5663:linear1639	1.2099092886319027	1.13491	15240	3265	346	0	0	0	0	194	3615	NaN	NaN	NaN	3809
ebola	1.01	0.999	linear6697:linear451:linear6197	1.2269375629940056	1.504458	15000	3424	427	0	0	0	1	22	3752	NaN	NaN	NaN	3775
ebola	1.0	0.7	linear7445:linear683:linear8423	1.0682722401994589	0.429646	17564	1287	0	87	390	792	1110	1493	1515	NaN	NaN	NaN	5387
ebola	1.08	0.999	linear8871:linear9379:linear7583	1.222746803883083	1.484134	15098	3307	446	0	0	0	0	24	3751	NaN	NaN	NaN	3775
ebola	1.05	0.5	linear9939:linear7959:linear4391	1.0262055063391862	0.226447	18357	494	0	581	1516	1820	1660	1105	859	NaN	NaN	NaN	7541
ebola	1.0	0.5	linear4499:linear8135:linear5697	1.0241896981592489	0.210452	18395	456	0	547	1478	1916	1672	1115	813	NaN	NaN	NaN	7541
ebola	1.03	0.999	linear8871:linear9379:linear7583	1.222746803883083	1.485658	15098	3307	446	0	0	0	0	24	3751	NaN	NaN	NaN	3775
ebola	1.01	0.5	linear9939:linear7959:linear4391	1.0262055063391862	0.225094	18357	494	0	571	1523	1832	1655	1101	859	NaN	NaN	NaN	7541
ebola	1.03	0.95	linear3255:linear2157:linear3219	1.1798313086838894	0.760355	15653	3006	192	0	0	0	1	992	2976	NaN	NaN	NaN	3969
ebola	1.1	0.98	linear8871:linear9379:linear7583	1.1997241525648508	0.872569	15361	3215	275	0	0	0	4	386	3459	NaN	NaN	NaN	3849
ebola	1.0	0.99	linear6697:linear451:linear6197	1.2145774759959684	1.076455	15155	3347	349	0	2	8	11	140	3648	NaN	NaN	NaN	3809
ebola	1.0	0.5	linear2351:linear4951:linear8073	1.0258872208370908	0.222466	18363	488	0	579	1481	1850	1691	1103	837	NaN	NaN	NaN	7541
ebola	1.08	0.99	linear7387:linear9581:linear7153	1.2128269057344438	1.151821	15224	3242	385	0	0	0	2	190	3617	NaN	NaN	NaN	3809
ebola	1.03	0.999	linear7745:linear5663:linear1639	1.2271497533287359	1.735706	15039	3342	470	0	0	0	1	22	3752	NaN	NaN	NaN	3775
ebola	1.08	0.5	linear8871:linear9379:linear7583	1.026470744257599	0.208782	18352	499	0	615	1437	1853	1662	1148	826	NaN	NaN	NaN	7541
ebola	1.0	0.9	linear5193:linear1373:linear4115	1.1422736194366347	0.572142	16219	2582	50	4	37	115	272	1047	2716	NaN	NaN	NaN	4191
ebola	1.05	0.5	linear2351:linear4951:linear8073	1.0258872208370908	0.22358	18363	488	0	579	1469	1880	1666	1111	836	NaN	NaN	NaN	7541
ebola	1.01	0.98	linear6697:linear451:linear6197	1.2026417696673917	0.917095	15332	3218	301	0	0	0	1	392	3456	NaN	NaN	NaN	3849
ebola	1.0	0.99	linear5193:linear1373:linear4115	1.2086891942072038	1.058383	15264	3240	347	0	0	5	14	151	3639	NaN	NaN	NaN	3809
ebola	1.05	0.98	linear7387:linear9581:linear7153	1.2010503421569148	0.90308	15371	3170	310	0	0	1	0	391	3457	NaN	NaN	NaN	3849
ebola	1.01	0.99	linear8871:linear9379:linear7583	1.212190334730253	1.107522	15184	3334	333	0	0	0	1	192	3616	NaN	NaN	NaN	3809
ebola	1.01	0.999	linear4499:linear8135:linear5697	1.226035754071402	1.579116	15072	3297	482	0	0	0	0	24	3751	NaN	NaN	NaN	3775
ebola	1.0	0.999	linear9939:linear7959:linear4391	1.222640708715718	1.523446	15103	3299	449	0	0	0	3	18	3754	NaN	NaN	NaN	3775
ebola	1.1	0.98	linear4499:linear8135:linear5697	1.200042438066946	0.846242	15368	3195	288	0	0	0	1	392	3456	NaN	NaN	NaN	3849
ebola	1.05	0.999	linear4499:linear8135:linear5697	1.226035754071402	1.561594	15072	3297	482	0	0	0	0	24	3751	NaN	NaN	NaN	3775
ebola	1.03	0.9	linear5193:linear1373:linear4115	1.1422736194366347	0.576376	16219	2582	50	0	4	15	34	1975	2163	NaN	NaN	NaN	4191
ebola	1.08	0.98	linear9939:linear7959:linear4391	1.2035966261736777	0.924669	15308	3248	295	0	0	1	0	391	3457	NaN	NaN	NaN	3849
ebola	1.05	0.95	linear6697:linear451:linear6197	1.1745795978993157	0.764225	15744	2923	184	0	0	0	1	992	2976	NaN	NaN	NaN	3969
ebola	1.05	0.999	linear9939:linear7959:linear4391	1.222640708715718	1.526063	15103	3299	449	0	0	0	2	20	3753	NaN	NaN	NaN	3775
ebola	1.05	0.98	linear7445:linear683:linear8423	1.2018991034958357	0.916104	15346	3204	301	0	0	0	1	392	3456	NaN	NaN	NaN	3849
ebola	1.05	0.5	linear7445:linear683:linear8423	1.0256750305023605	0.216224	18367	484	0	580	1454	1929	1610	1131	837	NaN	NaN	NaN	7541
ebola	1.0	0.999	linear8871:linear9379:linear7583	1.222746803883083	1.485445	15098	3307	446	0	0	0	0	24	3751	NaN	NaN	NaN	3775
ebola	1.05	0.9	linear4499:linear8135:linear5697	1.145986950294414	0.571448	16159	2632	60	0	0	0	2	2100	2089	NaN	NaN	NaN	4191
ebola	1.0	0.5	linear3255:linear2157:linear3219	1.0253567450002652	0.221096	18373	478	0	572	1463	1903	1643	1147	813	NaN	NaN	NaN	7541
ebola	1.08	0.99	linear3255:linear2157:linear3219	1.209166622460347	1.085787	15264	3231	356	0	0	0	1	192	3616	NaN	NaN	NaN	3809
ebola	1.0	0.99	linear2351:linear4951:linear8073	1.2090074797092993	1.103724	15252	3258	341	0	1	4	11	156	3637	NaN	NaN	NaN	3809
ebola	1.03	0.9	linear7387:linear9581:linear7153	1.1505490424911144	0.574768	16085	2694	72	1	3	18	55	1923	2191	NaN	NaN	NaN	4191
ebola	1.01	0.9	linear7445:linear683:linear8423	1.1471539971354305	0.579213	16140	2648	63	3	15	73	207	1396	2497	NaN	NaN	NaN	4191
ebola	1.01	0.99	linear6697:linear451:linear6197	1.2145774759959684	1.079324	15155	3347	349	0	0	1	1	189	3618	NaN	NaN	NaN	3809
ebola	1.01	0.9	linear2351:linear4951:linear8073	1.151716089332131	0.578545	16053	2736	62	1	20	66	198	1425	2481	NaN	NaN	NaN	4191
ebola	1.01	0.98	linear7745:linear5663:linear1639	1.2043923399289163	0.918602	15327	3195	329	0	0	0	2	390	3457	NaN	NaN	NaN	3849
ebola	1.01	0.95	linear7387:linear9581:linear7153	1.1796721659328417	0.765424	15655	3005	191	0	0	0	1	992	2976	NaN	NaN	NaN	3969
ebola	1.08	0.99	linear8871:linear9379:linear7583	1.212190334730253	1.102623	15184	3334	333	0	0	0	1	192	3616	NaN	NaN	NaN	3809
ebola	1.1	0.95	linear2351:linear4951:linear8073	1.1787173094265557	0.724756	15667	2999	185	0	0	0	0	994	2975	NaN	NaN	NaN	3969
ebola	1.08	0.98	linear7445:linear683:linear8423	1.2018991034958357	0.921364	15346	3204	301	0	0	0	1	392	3456	NaN	NaN	NaN	3849
ebola	1.0	0.8	linear7387:linear9581:linear7153	1.1060421197814438	0.46204	16867	1969	15	32	146	405	625	1505	2000	NaN	NaN	NaN	4713
ebola	1.0	0.99	linear8871:linear9379:linear7583	1.212190334730253	1.110067	15184	3334	333	0	0	3	22	141	3643	NaN	NaN	NaN	3809
ebola	1.01	0.99	linear7387:linear9581:linear7153	1.2128269057344438	1.146421	15224	3242	385	0	0	0	2	190	3617	NaN	NaN	NaN	3809
ebola	1.03	0.98	linear7745:linear5663:linear1639	1.2043923399289163	0.921305	15327	3195	329	0	0	0	2	390	3457	NaN	NaN	NaN	3849
ebola	1.05	0.999	linear6697:linear451:linear6197	1.2269375629940056	1.50957	15000	3424	427	0	0	0	1	22	3752	NaN	NaN	NaN	3775
ebola	1.08	0.95	linear9939:linear7959:linear4391	1.1793008328470638	0.782492	15629	3064	158	0	0	0	1	992	2976	NaN	NaN	NaN	3969
ebola	1.01	0.98	linear7445:linear683:linear8423	1.2018991034958357	0.925758	15346	3204	301	0	0	0	1	392	3456	NaN	NaN	NaN	3849
ebola	1.03	0.999	linear9939:linear7959:linear4391	1.222640708715718	1.543415	15103	3299	449	0	0	0	2	20	3753	NaN	NaN	NaN	3775
ebola	1.03	0.95	linear7387:linear9581:linear7153	1.1796721659328417	0.748384	15655	3005	191	0	0	0	1	992	2976	NaN	NaN	NaN	3969
ebola	1.0	0.99	linear3255:linear2157:linear3219	1.209166622460347	1.086172	15264	3231	356	0	0	6	13	150	3640	NaN	NaN	NaN	3809
ebola	1.08	0.999	linear7387:linear9581:linear7153	1.22640708715718	1.660658	15050	3334	467	0	0	0	1	22	3752	NaN	NaN	NaN	3775
ebola	1.0	0.98	linear4499:linear8135:linear5697	1.200042438066946	0.846481	15368	3195	288	0	3	4	27	316	3499	NaN	NaN	NaN	3849
ebola	1.01	0.8	linear8871:linear9379:linear7583	1.1053525011935705	0.456158	16882	1952	17	21	105	342	673	1817	1755	NaN	NaN	NaN	4713
ebola	1.03	0.5	linear7445:linear683:linear8423	1.0256750305023605	0.214209	18367	484	0	581	1468	1908	1606	1141	837	NaN	NaN	NaN	7541
ebola	1.0	0.7	linear5193:linear1373:linear4115	1.0705002387141265	0.434734	17522	1329	0	101	390	812	1018	1547	1519	NaN	NaN	NaN	5387
ebola	1.01	0.999	linear7745:linear5663:linear1639	1.2271497533287359	1.740343	15039	3342	470	0	0	0	1	22	3752	NaN	NaN	NaN	3775
ebola	1.05	0.99	linear3255:linear2157:linear3219	1.209166622460347	1.090744	15264	3231	356	0	0	0	1	192	3616	NaN	NaN	NaN	3809
ebola	1.0	0.999	linear6697:linear451:linear6197	1.2269375629940056	1.519576	15000	3424	427	0	0	0	3	18	3754	NaN	NaN	NaN	3775
ebola	1.0	0.7	linear3255:linear2157:linear3219	1.0705002387141265	0.429047	17523	1327	1	87	393	801	1097	1480	1529	NaN	NaN	NaN	5387
ebola	1.0	0.999	linear7387:linear9581:linear7153	1.22640708715718	1.657799	15050	3334	467	0	0	0	1	22	3752	NaN	NaN	NaN	3775
ebola	1.01	0.95	linear7745:linear5663:linear1639	1.1783990239244602	0.682148	15675	2989	187	0	0	0	1	992	2976	NaN	NaN	NaN	3969
ebola	1.0	0.98	linear2351:linear4951:linear8073	1.1993528194790728	0.941651	15398	3148	305	0	3	14	25	290	3517	NaN	NaN	NaN	3849
ebola	1.01	0.8	linear7445:linear683:linear8423	1.102169646172617	0.460019	16931	1914	6	19	138	334	641	1783	1798	NaN	NaN	NaN	4713
ebola	1.0	0.5	linear7445:linear683:linear8423	1.0256750305023605	0.214255	18367	484	0	579	1472	1908	1604	1139	839	NaN	NaN	NaN	7541
ebola	1.05	0.98	linear5193:linear1373:linear4115	1.203702721341043	0.921935	15303	3256	292	0	0	0	0	394	3455	NaN	NaN	NaN	3849
ebola	1.01	0.5	linear5193:linear1373:linear4115	1.0242427457429315	0.224562	18394	457	0	595	1458	1871	1639	1156	822	NaN	NaN	NaN	7541
ebola	1.01	0.98	linear2351:linear4951:linear8073	1.1993528194790728	0.942305	15398	3148	305	0	0	2	0	388	3459	NaN	NaN	NaN	3849
ebola	1.0	0.7	linear7387:linear9581:linear7153	1.0715081428040953	0.431716	17505	1344	2	99	397	777	1093	1484	1537	NaN	NaN	NaN	5387
ebola	1.1	0.95	linear3255:linear2157:linear3219	1.1798313086838894	0.765422	15653	3006	192	0	0	0	1	992	2976	NaN	NaN	NaN	3969
ebola	1.08	0.98	linear3255:linear2157:linear3219	1.2018991034958357	0.960926	15345	3206	300	0	0	0	3	388	3458	NaN	NaN	NaN	3849
ebola	1.08	0.95	linear4499:linear8135:linear5697	1.1820062596148746	0.74998	15610	3051	190	0	0	1	0	991	2977	NaN	NaN	NaN	3969
ebola	1.01	0.8	linear6697:linear451:linear6197	1.1048750729404275	0.457894	16893	1939	19	32	108	327	668	1805	1773	NaN	NaN	NaN	4713
ebola	1.1	0.98	linear5193:linear1373:linear4115	1.203702721341043	0.927593	15303	3256	292	0	0	0	0	394	3455	NaN	NaN	NaN	3849
ebola	1.0	0.999	linear5193:linear1373:linear4115	1.2223754707973051	1.577778	15105	3300	446	0	0	0	2	20	3753	NaN	NaN	NaN	3775
ebola	1.08	0.98	linear4499:linear8135:linear5697	1.200042438066946	0.844045	15368	3195	288	0	0	0	1	392	3456	NaN	NaN	NaN	3849
ebola	1.05	0.95	linear7745:linear5663:linear1639	1.1783990239244602	0.679626	15675	2989	187	0	0	0	1	992	2976	NaN	NaN	NaN	3969
ebola	1.0	0.9	linear9939:linear7959:linear4391	1.1499124714869238	0.570955	16096	2684	71	5	29	120	279	1045	2713	NaN	NaN	NaN	4191
ebola	1.03	0.95	linear9939:linear7959:linear4391	1.1793008328470638	0.782486	15629	3064	158	0	0	0	1	992	2976	NaN	NaN	NaN	3969
ebola	1.1	0.5	linear3255:linear2157:linear3219	1.0253567450002652	0.22108	18373	478	0	574	1473	1884	1643	1154	813	NaN	NaN	NaN	7541
ebola	1.1	0.99	linear2351:linear4951:linear8073	1.2090074797092993	1.094457	15252	3258	341	0	0	0	0	194	3615	NaN	NaN	NaN	3809
ebola	1.05	0.98	linear8871:linear9379:linear7583	1.1997241525648508	0.872494	15361	3215	275	0	0	0	4	386	3459	NaN	NaN	NaN	3849
ebola	1.08	0.98	linear8871:linear9379:linear7583	1.1997241525648508	0.879472	15361	3215	275	0	0	0	4	386	3459	NaN	NaN	NaN	3849
ebola	1.1	0.999	linear2351:linear4951:linear8073	1.2245504217282903	1.669277	15078	3313	460	0	0	0	1	22	3752	NaN	NaN	NaN	3775
ebola	1.1	0.99	linear7387:linear9581:linear7153	1.2128269057344438	1.143603	15224	3242	385	0	0	0	2	190	3617	NaN	NaN	NaN	3809
ebola	1.03	0.5	linear5193:linear1373:linear4115	1.0242427457429315	0.223179	18394	457	0	597	1460	1868	1631	1163	822	NaN	NaN	NaN	7541
ebola	1.0	0.7	linear7745:linear5663:linear1639	1.07140204763673	0.428672	17507	1342	2	113	368	760	1114	1539	1493	NaN	NaN	NaN	5387
ebola	1.08	0.999	linear2351:linear4951:linear8073	1.2245504217282903	1.674773	15078	3313	460	0	0	0	1	22	3752	NaN	NaN	NaN	3775
ebola	1.1	0.999	linear7745:linear5663:linear1639	1.2271497533287359	1.74001	15039	3342	470	0	0	0	1	22	3752	NaN	NaN	NaN	3775
ebola	1.08	0.95	linear6697:linear451:linear6197	1.1745795978993157	0.773969	15744	2923	184	0	0	0	1	992	2976	NaN	NaN	NaN	3969
ebola	1.01	0.95	linear5193:linear1373:linear4115	1.1778155005039521	0.756027	15695	2960	196	0	0	0	0	994	2975	NaN	NaN	NaN	3969
ebola	1.05	0.9	linear2351:linear4951:linear8073	1.151716089332131	0.576775	16053	2736	62	0	0	1	4	2093	2093	NaN	NaN	NaN	4191
ebola	1.0	0.98	linear3255:linear2157:linear3219	1.2018991034958357	0.961852	15345	3206	300	0	3	12	31	284	3519	NaN	NaN	NaN	3849
ebola	1.01	0.98	linear8871:linear9379:linear7583	1.1997241525648508	0.874083	15361	3215	275	0	0	0	4	386	3459	NaN	NaN	NaN	3849
ebola	1.01	0.9	linear5193:linear1373:linear4115	1.1422736194366347	0.577234	16219	2582	50	3	20	72	198	1397	2501	NaN	NaN	NaN	4191
ebola	1.01	0.5	linear3255:linear2157:linear3219	1.0253567450002652	0.221387	18373	478	0	576	1451	1917	1635	1149	813	NaN	NaN	NaN	7541
ebola	1.01	0.95	linear4499:linear8135:linear5697	1.1820062596148746	0.750426	15610	3051	190	0	0	1	0	991	2977	NaN	NaN	NaN	3969
ebola	1.0	0.95	linear8871:linear9379:linear7583	1.1763301681608402	0.727425	15717	2944	190	0	10	31	90	681	3157	NaN	NaN	NaN	3969
ebola	1.1	0.5	linear7387:linear9581:linear7153	1.023340936820328	0.209882	18411	440	0	595	1453	1910	1575	1187	821	NaN	NaN	NaN	7541
ebola	1.05	0.5	linear7387:linear9581:linear7153	1.023340936820328	0.210287	18411	440	0	595	1453	1910	1575	1187	821	NaN	NaN	NaN	7541
ebola	1.03	0.99	linear2351:linear4951:linear8073	1.2090074797092993	1.106045	15252	3258	341	0	0	0	0	194	3615	NaN	NaN	NaN	3809
ebola	1.0	0.8	linear8871:linear9379:linear7583	1.1053525011935705	0.463681	16882	1952	17	30	139	370	687	1524	1963	NaN	NaN	NaN	4713
ebola	1.01	0.99	linear2351:linear4951:linear8073	1.2090074797092993	1.094029	15252	3258	341	0	0	0	0	194	3615	NaN	NaN	NaN	3809
ebola	1.01	0.999	linear2351:linear4951:linear8073	1.2245504217282903	1.67237	15078	3313	460	0	0	0	1	22	3752	NaN	NaN	NaN	3775
ebola	1.05	0.9	linear5193:linear1373:linear4115	1.1422736194366347	0.576282	16219	2582	50	0	0	0	5	2094	2092	NaN	NaN	NaN	4191
ebola	1.08	0.9	linear7445:linear683:linear8423	1.1471539971354305	0.583558	16140	2648	63	0	0	2	1	2096	2092	NaN	NaN	NaN	4191
ebola	1.03	0.9	linear7445:linear683:linear8423	1.1471539971354305	0.576793	16140	2648	63	0	1	13	45	1971	2161	NaN	NaN	NaN	4191
ebola	1.01	0.99	linear9939:linear7959:linear4391	1.2043923399289163	1.113228	15301	3247	303	0	0	0	2	190	3617	NaN	NaN	NaN	3809
ebola	1.05	0.95	linear4499:linear8135:linear5697	1.1820062596148746	0.756029	15610	3051	190	0	0	1	0	991	2977	NaN	NaN	NaN	3969
ebola	1.0	0.9	linear4499:linear8135:linear5697	1.145986950294414	0.568769	16159	2632	60	5	32	126	238	1097	2693	NaN	NaN	NaN	4191
ebola	1.08	0.9	linear2351:linear4951:linear8073	1.151716089332131	0.579166	16053	2736	62	0	0	1	4	2093	2093	NaN	NaN	NaN	4191
ebola	1.01	0.99	linear4499:linear8135:linear5697	1.2148957614980638	1.041173	15156	3339	356	0	0	0	0	194	3615	NaN	NaN	NaN	3809
ebola	1.01	0.5	linear7745:linear5663:linear1639	1.0243488409102965	0.229313	18392	459	0	570	1488	1878	1647	1124	834	NaN	NaN	NaN	7541
ebola	1.0	0.99	linear7745:linear5663:linear1639	1.2099092886319027	1.140406	15240	3265	346	0	1	4	10	158	3636	NaN	NaN	NaN	3809
ebola	1.03	0.95	linear6697:linear451:linear6197	1.1745795978993157	0.765631	15744	2923	184	0	0	0	1	992	2976	NaN	NaN	NaN	3969
ebola	1.0	0.99	linear4499:linear8135:linear5697	1.2148957614980638	1.052039	15156	3339	356	0	0	1	15	161	3632	NaN	NaN	NaN	3809
ebola	1.1	0.5	linear5193:linear1373:linear4115	1.0242427457429315	0.22262	18394	457	0	597	1460	1868	1631	1163	822	NaN	NaN	NaN	7541
ebola	1.01	0.999	linear7387:linear9581:linear7153	1.22640708715718	1.675064	15050	3334	467	0	0	0	1	22	3752	NaN	NaN	NaN	3775
ebola	1.05	0.95	linear7387:linear9581:linear7153	1.1796721659328417	0.755608	15655	3005	191	0	0	0	1	992	2976	NaN	NaN	NaN	3969
ebola	1.05	0.99	linear4499:linear8135:linear5697	1.2148957614980638	1.039279	15156	3339	356	0	0	0	0	194	3615	NaN	NaN	NaN	3809
ebola	1.03	0.99	linear8871:linear9379:linear7583	1.212190334730253	1.105339	15184	3334	333	0	0	0	1	192	3616	NaN	NaN	NaN	3809
ebola	1.08	0.98	linear6697:linear451:linear6197	1.2026417696673917	0.92265	15332	3218	301	0	0	0	1	392	3456	NaN	NaN	NaN	3849
ebola	1.03	0.95	linear4499:linear8135:linear5697	1.1820062596148746	0.750156	15610	3051	190	0	0	1	0	991	2977	NaN	NaN	NaN	3969
ebola	1.1	0.98	linear2351:linear4951:linear8073	1.1993528194790728	0.940242	15398	3148	305	0	0	2	0	388	3459	NaN	NaN	NaN	3849
ebola	1.03	0.9	linear3255:linear2157:linear3219	1.150230756989019	0.575633	16078	2714	59	0	0	13	28	2009	2141	NaN	NaN	NaN	4191
ebola	1.01	0.8	linear4499:linear8135:linear5697	1.1070500238714127	0.462883	16849	1986	16	29	116	331	643	1826	1768	NaN	NaN	NaN	4713
ebola	1.1	0.95	linear7445:linear683:linear8423	1.1800965466023023	0.752637	15633	3041	177	0	0	0	0	994	2975	NaN	NaN	NaN	3969
ebola	1.1	0.98	linear7387:linear9581:linear7153	1.2010503421569148	0.912674	15371	3170	310	0	0	1	0	391	3457	NaN	NaN	NaN	3849
ebola	1.03	0.5	linear7387:linear9581:linear7153	1.023340936820328	0.210298	18411	440	0	595	1453	1910	1575	1187	821	NaN	NaN	NaN	7541
ebola	1.03	0.999	linear5193:linear1373:linear4115	1.2223754707973051	1.573695	15105	3300	446	0	0	0	1	22	3752	NaN	NaN	NaN	3775
ebola	1.03	0.9	linear8871:linear9379:linear7583	1.1460399978780966	0.573484	16175	2599	77	0	3	13	46	1961	2168	NaN	NaN	NaN	4191
ebola	1.05	0.999	linear2351:linear4951:linear8073	1.2245504217282903	1.675447	15078	3313	460	0	0	0	1	22	3752	NaN	NaN	NaN	3775
ebola	1.0	0.5	linear9939:linear7959:linear4391	1.0262055063391862	0.225284	18357	494	0	572	1520	1829	1667	1093	860	NaN	NaN	NaN	7541
ebola	1.1	0.999	linear4499:linear8135:linear5697	1.226035754071402	1.556652	15072	3297	482	0	0	0	0	24	3751	NaN	NaN	NaN	3775
ebola	1.1	0.99	linear9939:linear7959:linear4391	1.2043923399289163	1.098576	15301	3247	303	0	0	0	2	190	3617	NaN	NaN	NaN	3809
ebola	1.01	0.95	linear9939:linear7959:linear4391	1.1793008328470638	0.783602	15629	3064	158	0	0	0	1	992	2976	NaN	NaN	NaN	3969
ebola	1.01	0.95	linear3255:linear2157:linear3219	1.1798313086838894	0.760406	15653	3006	192	0	0	0	1	992	2976	NaN	NaN	NaN	3969
ebola	1.05	0.98	linear7745:linear5663:linear1639	1.2043923399289163	0.915236	15327	3195	329	0	0	0	2	390	3457	NaN	NaN	NaN	3849
ebola	1.08	0.99	linear6697:linear451:linear6197	1.2145774759959684	1.078378	15155	3347	349	0	0	1	1	189	3618	NaN	NaN	NaN	3809
ebola	1.08	0.5	linear6697:linear451:linear6197	1.0251976022492175	0.220331	18376	475	0	584	1511	1802	1657	1170	817	NaN	NaN	NaN	7541
ebola	1.01	0.99	linear5193:linear1373:linear4115	1.2086891942072038	1.048618	15264	3240	347	0	0	0	0	194	3615	NaN	NaN	NaN	3809
ebola	1.1	0.95	linear5193:linear1373:linear4115	1.1778155005039521	0.759295	15695	2960	196	0	0	0	0	994	2975	NaN	NaN	NaN	3969
ebola	1.1	0.98	linear9939:linear7959:linear4391	1.2035966261736777	0.898311	15308	3248	295	0	0	1	0	391	3457	NaN	NaN	NaN	3849
ebola	1.01	0.98	linear9939:linear7959:linear4391	1.2035966261736777	0.899972	15308	3248	295	0	0	1	0	391	3457	NaN	NaN	NaN	3849
ebola	1.08	0.999	linear9939:linear7959:linear4391	1.222640708715718	1.526582	15103	3299	449	0	0	0	2	20	3753	NaN	NaN	NaN	3775
ebola	1.1	0.98	linear7445:linear683:linear8423	1.2018991034958357	0.920838	15346	3204	301	0	0	0	1	392	3456	NaN	NaN	NaN	3849
ebola	1.0	0.9	linear2351:linear4951:linear8073	1.151716089332131	0.574206	16053	2736	62	2	40	115	253	1083	2698	NaN	NaN	NaN	4191
ebola	1.05	0.999	linear3255:linear2157:linear3219	1.219616996445812	1.437314	15113	3336	402	0	0	0	0	24	3751	NaN	NaN	NaN	3775
ebola	1.08	0.5	linear7387:linear9581:linear7153	1.023340936820328	0.210494	18411	440	0	595	1453	1910	1575	1187	821	NaN	NaN	NaN	7541
ebola	1.01	0.98	linear5193:linear1373:linear4115	1.203702721341043	0.92849	15303	3256	292	0	0	0	0	394	3455	NaN	NaN	NaN	3849
ebola	1.05	0.98	linear9939:linear7959:linear4391	1.2035966261736777	0.895901	15308	3248	295	0	0	1	0	391	3457	NaN	NaN	NaN	3849
ebola	1.05	0.5	linear4499:linear8135:linear5697	1.0241896981592489	0.211055	18395	456	0	543	1487	1913	1667	1118	813	NaN	NaN	NaN	7541
ebola	1.03	0.99	linear9939:linear7959:linear4391	1.2043923399289163	1.103836	15301	3247	303	0	0	0	2	190	3617	NaN	NaN	NaN	3809
ebola	1.03	0.5	linear7745:linear5663:linear1639	1.0243488409102965	0.228216	18392	459	0	565	1509	1869	1622	1142	834	NaN	NaN	NaN	7541
ebola	1.01	0.5	linear6697:linear451:linear6197	1.0251976022492175	0.221737	18376	475	0	580	1509	1806	1671	1158	817	NaN	NaN	NaN	7541
ebola	1.08	0.999	linear7745:linear5663:linear1639	1.2271497533287359	1.737956	15039	3342	470	0	0	0	1	22	3752	NaN	NaN	NaN	3775
ebola	1.0	0.99	linear7387:linear9581:linear7153	1.2128269057344438	1.155418	15224	3242	385	0	0	8	16	138	3647	NaN	NaN	NaN	3809
ebola	1.08	0.999	linear5193:linear1373:linear4115	1.2223754707973051	1.58373	15105	3300	446	0	0	0	1	22	3752	NaN	NaN	NaN	3775
ebola	1.03	0.999	linear3255:linear2157:linear3219	1.219616996445812	1.445007	15113	3336	402	0	0	0	0	24	3751	NaN	NaN	NaN	3775
ebola	1.05	0.95	linear7445:linear683:linear8423	1.1800965466023023	0.757673	15633	3041	177	0	0	0	0	994	2975	NaN	NaN	NaN	3969
ebola	1.08	0.95	linear2351:linear4951:linear8073	1.1787173094265557	0.732663	15667	2999	185	0	0	0	0	994	2975	NaN	NaN	NaN	3969
ebola	1.08	0.95	linear3255:linear2157:linear3219	1.1798313086838894	0.760263	15653	3006	192	0	0	0	1	992	2976	NaN	NaN	NaN	3969
ebola	1.0	0.5	linear7745:linear5663:linear1639	1.0243488409102965	0.228734	18392	459	0	569	1500	1867	1637	1134	834	NaN	NaN	NaN	7541
ebola	1.08	0.99	linear9939:linear7959:linear4391	1.2043923399289163	1.105835	15301	3247	303	0	0	0	2	190	3617	NaN	NaN	NaN	3809
ebola	1.05	0.99	linear9939:linear7959:linear4391	1.2043923399289163	1.115208	15301	3247	303	0	0	0	2	190	3617	NaN	NaN	NaN	3809
ebola	1.01	0.5	linear2351:linear4951:linear8073	1.0258872208370908	0.223387	18363	488	0	581	1478	1849	1693	1104	836	NaN	NaN	NaN	7541
ebola	1.03	0.95	linear7445:linear683:linear8423	1.1800965466023023	0.755911	15633	3041	177	0	0	0	0	994	2975	NaN	NaN	NaN	3969
ebola	1.08	0.95	linear7445:linear683:linear8423	1.1800965466023023	0.759379	15633	3041	177	0	0	0	0	994	2975	NaN	NaN	NaN	3969
ebola	1.1	0.99	linear8871:linear9379:linear7583	1.212190334730253	1.107057	15184	3334	333	0	0	0	1	192	3616	NaN	NaN	NaN	3809
ebola	1.03	0.99	linear4499:linear8135:linear5697	1.2148957614980638	1.038415	15156	3339	356	0	0	0	0	194	3615	NaN	NaN	NaN	3809
ebola	1.1	0.5	linear7445:linear683:linear8423	1.0256750305023605	0.215519	18367	484	0	580	1454	1929	1610	1131	837	NaN	NaN	NaN	7541
ebola	1.0	0.999	linear4499:linear8135:linear5697	1.226035754071402	1.557611	15072	3297	482	0	0	0	0	24	3751	NaN	NaN	NaN	3775
ebola	1.0	0.9	linear7387:linear9581:linear7153	1.1505490424911144	0.578537	16085	2694	72	4	46	129	252	1009	2751	NaN	NaN	NaN	4191
ebola	1.0	0.95	linear2351:linear4951:linear8073	1.1787173094265557	0.723609	15667	2999	185	0	4	30	73	742	3120	NaN	NaN	NaN	3969
ebola	1.01	0.9	linear6697:linear451:linear6197	1.148427139143812	0.579532	16104	2696	51	6	21	78	177	1402	2507	NaN	NaN	NaN	4191
ebola	1.05	0.5	linear6697:linear451:linear6197	1.0251976022492175	0.219378	18376	475	0	583	1516	1792	1666	1167	817	NaN	NaN	NaN	7541
ebola	1.03	0.95	linear7745:linear5663:linear1639	1.1783990239244602	0.678642	15675	2989	187	0	0	0	1	992	2976	NaN	NaN	NaN	3969
ebola	1.1	0.999	linear5193:linear1373:linear4115	1.2223754707973051	1.576995	15105	3300	446	0	0	0	1	22	3752	NaN	NaN	NaN	3775
ebola	1.0	0.98	linear7387:linear9581:linear7153	1.2010503421569148	0.900763	15371	3170	310	0	0	6	23	330	3490	NaN	NaN	NaN	3849
ebola	1.08	0.5	linear5193:linear1373:linear4115	1.0242427457429315	0.222466	18394	457	0	597	1460	1868	1631	1163	822	NaN	NaN	NaN	7541
ebola	1.0	0.999	linear3255:linear2157:linear3219	1.219616996445812	1.454664	15113	3336	402	0	0	0	0	24	3751	NaN	NaN	NaN	3775
ebola	1.1	0.999	linear3255:linear2157:linear3219	1.219616996445812	1.440719	15113	3336	402	0	0	0	0	24	3751	NaN	NaN	NaN	3775
ebola	1.1	0.5	linear9939:linear7959:linear4391	1.0262055063391862	0.225938	18357	494	0	581	1516	1820	1660	1105	859	NaN	NaN	NaN	7541
ebola	1.05	0.99	linear7745:linear5663:linear1639	1.2099092886319027	1.138106	15240	3265	346	0	0	0	0	194	3615	NaN	NaN	NaN	3809
ebola	1.1	0.999	linear6697:linear451:linear6197	1.2269375629940056	1.497124	15000	3424	427	0	0	0	1	22	3752	NaN	NaN	NaN	3775
ebola	1.01	0.8	linear5193:linear1373:linear4115	1.1033897405973159	0.449409	16910	1933	8	19	130	341	622	1832	1769	NaN	NaN	NaN	4713
ebola	1.05	0.95	linear8871:linear9379:linear7583	1.1763301681608402	0.731422	15717	2944	190	0	0	1	0	991	2977	NaN	NaN	NaN	3969
ebola	1.1	0.9	linear9939:linear7959:linear4391	1.1499124714869238	0.574128	16096	2684	71	0	0	1	2	2097	2091	NaN	NaN	NaN	4191
ebola	1.03	0.99	linear5193:linear1373:linear4115	1.2086891942072038	1.047799	15264	3240	347	0	0	0	0	194	3615	NaN	NaN	NaN	3809
ebola	1.01	0.5	linear7445:linear683:linear8423	1.0256750305023605	0.214902	18367	484	0	575	1471	1916	1605	1137	837	NaN	NaN	NaN	7541
ebola	1.08	0.99	linear5193:linear1373:linear4115	1.2086891942072038	1.053619	15264	3240	347	0	0	0	0	194	3615	NaN	NaN	NaN	3809
ebola	1.05	0.999	linear7387:linear9581:linear7153	1.22640708715718	1.660477	15050	3334	467	0	0	0	1	22	3752	NaN	NaN	NaN	3775
ebola	1.05	0.98	linear2351:linear4951:linear8073	1.1993528194790728	0.9459	15398	3148	305	0	0	2	0	388	3459	NaN	NaN	NaN	3849
ebola	1.0	0.999	linear7745:linear5663:linear1639	1.2271497533287359	1.741614	15039	3342	470	0	1	0	0	20	3754	NaN	NaN	NaN	3775
ebola	1.01	0.99	linear3255:linear2157:linear3219	1.209166622460347	1.093798	15264	3231	356	0	0	0	1	192	3616	NaN	NaN	NaN	3809
ebola	1.05	0.95	linear2351:linear4951:linear8073	1.1787173094265557	0.722878	15667	2999	185	0	0	0	0	994	2975	NaN	NaN	NaN	3969
ebola	1.1	0.5	linear8871:linear9379:linear7583	1.026470744257599	0.209333	18352	499	0	615	1437	1853	1662	1148	826	NaN	NaN	NaN	7541
ebola	1.1	0.99	linear5193:linear1373:linear4115	1.2086891942072038	1.056421	15264	3240	347	0	0	0	0	194	3615	NaN	NaN	NaN	3809
ebola	1.03	0.9	linear2351:linear4951:linear8073	1.151716089332131	0.579085	16053	2736	62	1	1	13	29	1998	2149	NaN	NaN	NaN	4191
ebola	1.03	0.98	linear8871:linear9379:linear7583	1.1997241525648508	0.880719	15361	3215	275	0	0	0	4	386	3459	NaN	NaN	NaN	3849
ebola	1.03	0.5	linear3255:linear2157:linear3219	1.0253567450002652	0.222226	18373	478	0	571	1462	1905	1646	1144	813	NaN	NaN	NaN	7541
ebola	1.0	0.5	linear6697:linear451:linear6197	1.0251976022492175	0.219728	18376	475	0	582	1505	1803	1681	1153	817	NaN	NaN	NaN	7541
ebola	1.0	0.95	linear5193:linear1373:linear4115	1.1778155005039521	0.757846	15695	2960	196	1	7	32	93	679	3157	NaN	NaN	NaN	3969
ebola	1.0	0.5	linear7387:linear9581:linear7153	1.023340936820328	0.210257	18411	440	0	594	1447	1915	1587	1177	821	NaN	NaN	NaN	7541
ebola	1.08	0.999	linear7445:linear683:linear8423	1.2267253726592753	1.643356	15052	3324	475	0	0	1	1	19	3754	NaN	NaN	NaN	3775
ebola	1.0	0.95	linear3255:linear2157:linear3219	1.1798313086838894	0.762065	15653	3006	192	2	9	24	82	712	3140	NaN	NaN	NaN	3969
ebola	1.01	0.98	linear3255:linear2157:linear3219	1.2018991034958357	0.955965	15345	3206	300	0	0	0	3	388	3458	NaN	NaN	NaN	3849
ebola	1.01	0.999	linear8871:linear9379:linear7583	1.222746803883083	1.479555	15098	3307	446	0	0	0	0	24	3751	NaN	NaN	NaN	3775
ebola	1.0	0.8	linear7745:linear5663:linear1639	1.100684313829505	0.454836	16962	1880	9	26	148	366	667	1560	1946	NaN	NaN	NaN	4713
ebola	1.0	0.7	linear2351:linear4951:linear8073	1.0714550952204127	0.438534	17504	1347	0	109	376	772	1067	1585	1478	NaN	NaN	NaN	5387
ebola	1.05	0.9	linear3255:linear2157:linear3219	1.150230756989019	0.575484	16078	2714	59	0	0	0	1	2102	2088	NaN	NaN	NaN	4191
ebola	1.05	0.99	linear5193:linear1373:linear4115	1.2086891942072038	1.058867	15264	3240	347	0	0	0	0	194	3615	NaN	NaN	NaN	3809
ebola	1.0	0.999	linear2351:linear4951:linear8073	1.2245504217282903	1.671516	15078	3313	460	0	0	0	4	16	3755	NaN	NaN	NaN	3775
ebola	1.08	0.999	linear3255:linear2157:linear3219	1.219616996445812	1.429252	15113	3336	402	0	0	0	0	24	3751	NaN	NaN	NaN	3775
ebola	1.08	0.5	linear4499:linear8135:linear5697	1.0241896981592489	0.210197	18395	456	0	543	1487	1913	1667	1118	813	NaN	NaN	NaN	7541
ebola	1.0	0.7	linear9939:linear7959:linear4391	1.0684313829505065	0.426208	17561	1290	0	88	398	785	1128	1441	1547	NaN	NaN	NaN	5387
ebola	1.05	0.9	linear6697:linear451:linear6197	1.148427139143812	0.580863	16104	2696	51	0	1	1	4	2089	2096	NaN	NaN	NaN	4191
ebola	1.08	0.99	linear7445:linear683:linear8423	1.209378812795077	1.178538	15273	3209	369	0	0	0	0	194	3615	NaN	NaN	NaN	3809
ebola	1.0	0.95	linear9939:linear7959:linear4391	1.1793008328470638	0.78797	15629	3064	158	0	4	24	94	718	3129	NaN	NaN	NaN	3969
ebola	1.08	0.5	linear7745:linear5663:linear1639	1.0243488409102965	0.228349	18392	459	0	572	1500	1857	1645	1133	834	NaN	NaN	NaN	7541
ebola	1.05	0.9	linear7445:linear683:linear8423	1.1471539971354305	0.573745	16140	2648	63	0	0	2	1	2096	2092	NaN	NaN	NaN	4191
ebola	1.0	0.8	linear7445:linear683:linear8423	1.102169646172617	0.458972	16931	1914	6	23	165	374	671	1475	2005	NaN	NaN	NaN	4713
ebola	1.0	0.98	linear7745:linear5663:linear1639	1.2043923399289163	0.917081	15327	3195	329	0	2	9	22	315	3501	NaN	NaN	NaN	3849
ebola	1.05	0.98	linear3255:linear2157:linear3219	1.2018991034958357	0.953613	15345	3206	300	0	0	0	3	388	3458	NaN	NaN	NaN	3849
ebola	1.05	0.95	linear3255:linear2157:linear3219	1.1798313086838894	0.763203	15653	3006	192	0	0	0	1	992	2976	NaN	NaN	NaN	3969
ebola	1.03	0.5	linear6697:linear451:linear6197	1.0251976022492175	0.218369	18376	475	0	583	1516	1786	1678	1161	817	NaN	NaN	NaN	7541
ebola	1.1	0.99	linear7745:linear5663:linear1639	1.2099092886319027	1.13368	15240	3265	346	0	0	0	0	194	3615	NaN	NaN	NaN	3809
ebola	1.03	0.99	linear6697:linear451:linear6197	1.2145774759959684	1.077564	15155	3347	349	0	0	1	1	189	3618	NaN	NaN	NaN	3809
ebola	1.05	0.999	linear8871:linear9379:linear7583	1.222746803883083	1.476878	15098	3307	446	0	0	0	0	24	3751	NaN	NaN	NaN	3775
ebola	1.1	0.9	linear2351:linear4951:linear8073	1.151716089332131	0.577615	16053	2736	62	0	0	1	4	2093	2093	NaN	NaN	NaN	4191
ebola	1.03	0.98	linear7387:linear9581:linear7153	1.2010503421569148	0.90248	15371	3170	310	0	0	1	0	391	3457	NaN	NaN	NaN	3849
ebola	1.08	0.5	linear9939:linear7959:linear4391	1.0262055063391862	0.223974	18357	494	0	581	1516	1820	1660	1105	859	NaN	NaN	NaN	7541
ebola	1.03	0.5	linear2351:linear4951:linear8073	1.0258872208370908	0.223282	18363	488	0	578	1462	1892	1667	1106	836	NaN	NaN	NaN	7541
ebola	1.0	0.9	linear7745:linear5663:linear1639	1.1481088536417166	0.578332	16122	2666	63	6	30	127	271	1031	2726	NaN	NaN	NaN	4191
ebola	1.01	0.9	linear7745:linear5663:linear1639	1.1481088536417166	0.573487	16122	2666	63	4	15	74	214	1374	2510	NaN	NaN	NaN	4191
ebola	1.05	0.999	linear7445:linear683:linear8423	1.2267253726592753	1.622201	15052	3324	475	0	0	1	1	19	3754	NaN	NaN	NaN	3775
ebola	1.03	0.999	linear2351:linear4951:linear8073	1.2245504217282903	1.669728	15078	3313	460	0	0	0	1	22	3752	NaN	NaN	NaN	3775
ebola	1.01	0.99	linear7445:linear683:linear8423	1.209378812795077	1.182675	15273	3209	369	0	0	0	0	194	3615	NaN	NaN	NaN	3809
ebola	1.08	0.99	linear2351:linear4951:linear8073	1.2090074797092993	1.101386	15252	3258	341	0	0	0	0	194	3615	NaN	NaN	NaN	3809
ebola	1.03	0.9	linear9939:linear7959:linear4391	1.1499124714869238	0.576714	16096	2684	71	0	3	14	42	1966	2166	NaN	NaN	NaN	4191
ebola	1.03	0.9	linear6697:linear451:linear6197	1.148427139143812	0.578577	16104	2696	51	0	6	10	41	1968	2166	NaN	NaN	NaN	4191
ebola	1.0	0.8	linear6697:linear451:linear6197	1.1048750729404275	0.456634	16893	1939	19	38	148	365	656	1525	1981	NaN	NaN	NaN	4713
ebola	1.03	0.999	linear4499:linear8135:linear5697	1.226035754071402	1.566917	15072	3297	482	0	0	0	0	24	3751	NaN	NaN	NaN	3775
ebola	1.0	0.95	linear7387:linear9581:linear7153	1.1796721659328417	0.752048	15655	3005	191	2	8	29	72	721	3137	NaN	NaN	NaN	3969
ebola	1.01	0.5	linear7387:linear9581:linear7153	1.023340936820328	0.210298	18411	440	0	587	1461	1913	1577	1182	821	NaN	NaN	NaN	7541
ebola	1.08	0.5	linear2351:linear4951:linear8073	1.0258872208370908	0.223577	18363	488	0	579	1469	1880	1666	1111	836	NaN	NaN	NaN	7541
ebola	1.08	0.95	linear5193:linear1373:linear4115	1.1778155005039521	0.757513	15695	2960	196	0	0	0	0	994	2975	NaN	NaN	NaN	3969
ebola	1.08	0.99	linear4499:linear8135:linear5697	1.2148957614980638	1.044277	15156	3339	356	0	0	0	0	194	3615	NaN	NaN	NaN	3809
ebola	1.1	0.99	linear7445:linear683:linear8423	1.209378812795077	1.175468	15273	3209	369	0	0	0	0	194	3615	NaN	NaN	NaN	3809
ebola	1.0	0.99	linear7445:linear683:linear8423	1.209378812795077	1.182671	15273	3209	369	0	1	8	22	122	3656	NaN	NaN	NaN	3809
ebola	1.1	0.99	linear3255:linear2157:linear3219	1.209166622460347	1.110341	15264	3231	356	0	0	0	1	192	3616	NaN	NaN	NaN	3809
ebola	1.08	0.95	linear7387:linear9581:linear7153	1.1796721659328417	0.748621	15655	3005	191	0	0	0	1	992	2976	NaN	NaN	NaN	3969
ebola	1.08	0.999	linear4499:linear8135:linear5697	1.226035754071402	1.569908	15072	3297	482	0	0	0	0	24	3751	NaN	NaN	NaN	3775
ebola	1.08	0.9	linear7745:linear5663:linear1639	1.1481088536417166	0.582554	16122	2666	63	0	0	1	1	2099	2090	NaN	NaN	NaN	4191
ebola	1.1	0.98	linear7745:linear5663:linear1639	1.2043923399289163	0.918856	15327	3195	329	0	0	0	2	390	3457	NaN	NaN	NaN	3849