{
  "log" : {
    "version" : "1.2",
    "creator" : {
      "name" : "BrowserMob Proxy",
      "version" : "2.1.5",
      "comment" : ""
    },
    "pages" : [ {
      "id" : "Page 0",
      "startedDateTime" : "2019-03-29T13:16:42.961Z",
      "title" : "Page 0",
      "pageTimings" : {
        "onLoad" : 1378,
        "comment" : ""
      },
      "comment" : ""
    } ],
    "entries" : [ {
      "pageref" : "Page 0",
      "startedDateTime" : "2019-03-29T13:16:42.962Z",
      "request" : {
        "method" : "POST",
        "url" : "http://localhost:10520/WebAPI/api/admin/v1/users/?",
        "httpVersion" : "HTTP/1.1",
        "cookies" : [ ],
        "headers" : [ {
          "name" : "User-Agent",
          "value" : "Katalon Studio"
        }, {
          "name" : "Content-Type",
          "value" : "application/x-www-form-urlencoded"
        }, {
          "name" : "Authorization",
          "value" : "Bearer eyJ0eXAiOiJKV1QiLCJhbGciOiJIUzI1NiJ9.eyJ1bmlxdWVfbmFtZSI6ImFkbWluIiwicm9sZSI6InVzZXIiLCJzdWIiOiJhZG1pbiIsImlzcyI6IkNyb3BNZXRyaWNzIiwiYXVkIjoiYWxsIiwiZXhwIjoxNTUzODY5MzAyLCJuYmYiOjE1NTM4NjU0MDJ9.tT19HIOWNRLy9zX8OpEs4h9YiXBQYxmLJVww_a_WEck"
        }, {
          "name" : "Host",
          "value" : "localhost:10520"
        }, {
          "name" : "Accept",
          "value" : "text/html, image/gif, image/jpeg, *; q=.2, */*; q=.2"
        }, {
          "name" : "Proxy-Connection",
          "value" : "keep-alive"
        }, {
          "name" : "Content-Length",
          "value" : "731"
        } ],
        "queryString" : [ ],
        "postData" : {
          "mimeType" : "application/x-www-form-urlencoded",
          "params" : [ {
            "name" : "password",
            "value" : "cropmetrics",
            "comment" : ""
          }, {
            "name" : "email",
            "value" : "cropmetricsvo.townlong@gmail.com",
            "comment" : ""
          }, {
            "name" : "fullname",
            "value" : "x",
            "comment" : ""
          }, {
            "name" : "phone",
            "value" : "1",
            "comment" : ""
          }, {
            "name" : "dealer",
            "value" : "xx",
            "comment" : ""
          }, {
            "name" : "addressLine1",
            "value" : "address line 1 test validation",
            "comment" : ""
          }, {
            "name" : "addressLine2",
            "value" : "address line 2 test validation",
            "comment" : ""
          }, {
            "name" : "town",
            "value" : "18 API_ACNT_When_new_account_have_long_town_attribute_Expected_status_code_20018 API_ACNT_When_new_account_have_long_town_attribute_Expected_status_code_20018 API_ACNT_When_new_account_have_long_town_attribute_Expected_status_code_20018 API_ACNT_When_new_account_have_long_town_attribute_Expected_status_code_20018 API_ACNT_When_new_account_have_long_town_attribute_Expected_status_code_20018 API_ACNT_When_new_account_have_long_town_attribute_Expected_status_code_200",
            "comment" : ""
          }, {
            "name" : "state",
            "value" : "stateValidation",
            "comment" : ""
          }, {
            "name" : "zip",
            "value" : "zipValidation",
            "comment" : ""
          }, {
            "name" : "country",
            "value" : "countryValidation",
            "comment" : ""
          }, {
            "name" : "roles",
            "value" : "Client",
            "comment" : ""
          } ],
          "comment" : ""
        },
        "headersSize" : 544,
        "bodySize" : 731,
        "comment" : ""
      },
      "response" : {
        "status" : 200,
        "statusText" : "OK",
        "httpVersion" : "HTTP/1.1",
        "cookies" : [ {
          "name" : ".ASPROLES",
          "value" : "fAbeKg1xiOWzKl65XFeEINFucfAyl7PbqR_hlky0FM9ecIxYaSCGffStcTS1BRLw_jvL2W00fKKOkCNFAa3lbNemmXo04mOhKEPd8PhJrfywvy0ixliyDNjC3kKByFxjyiRgYgBPaDg7Qb7sr2AZB4ujV7URYgDsZYwVPwW6S1pYVQBVY60HoclAfNth8SSVSV-jjbOM4LyulqNyGq4AslK6Jf9lkWJ8JVOUf1BxJEDYL5aXct_L73K7IhEmrm1LrQVZqyTZAC5nAe0MBe2ZMQfEBDW8hABbx_dqvUHTcQSJcwSoSqchghS2a36rbUrdDKl25rImncN0INfDD6zEYv-mG9z7nwYpUqFuG91BtDkvAxsoXvsnPOtx5dg2jWn1ze1W-52DMaQdR90lLO9U-keS-rJitqc2AWxd1CSELIxcrB4znbNDojMu1CcEDi3AiqteaaE5zvzEGjEyp8das5wps4mzZqjxFDqFpDGXywY1_OUy0",
          "path" : "/",
          "httpOnly" : true,
          "secure" : false,
          "comment" : ""
        } ],
        "headers" : [ {
          "name" : "Cache-Control",
          "value" : "private"
        }, {
          "name" : "Content-Type",
          "value" : "application/json; charset=utf-8"
        }, {
          "name" : "Server",
          "value" : "Microsoft-IIS/10.0"
        }, {
          "name" : "Set-Cookie",
          "value" : ".ASPROLES=fAbeKg1xiOWzKl65XFeEINFucfAyl7PbqR_hlky0FM9ecIxYaSCGffStcTS1BRLw_jvL2W00fKKOkCNFAa3lbNemmXo04mOhKEPd8PhJrfywvy0ixliyDNjC3kKByFxjyiRgYgBPaDg7Qb7sr2AZB4ujV7URYgDsZYwVPwW6S1pYVQBVY60HoclAfNth8SSVSV-jjbOM4LyulqNyGq4AslK6Jf9lkWJ8JVOUf1BxJEDYL5aXct_L73K7IhEmrm1LrQVZqyTZAC5nAe0MBe2ZMQfEBDW8hABbx_dqvUHTcQSJcwSoSqchghS2a36rbUrdDKl25rImncN0INfDD6zEYv-mG9z7nwYpUqFuG91BtDkvAxsoXvsnPOtx5dg2jWn1ze1W-52DMaQdR90lLO9U-keS-rJitqc2AWxd1CSELIxcrB4znbNDojMu1CcEDi3AiqteaaE5zvzEGjEyp8das5wps4mzZqjxFDqFpDGXywY1_OUy0; path=/; HttpOnly"
        }, {
          "name" : "X-SourceFiles",
          "value" : "=?UTF-8?B?RDpcVmlydHVhbE9wdGltaXplci1SZWZhY3RvcmluZ1xDcm9wTWV0cmljcy5Wby5BcGlcQ3JvcE1ldHJpY3MuVm8uQXBpXGFwaVxhZG1pblx2MVx1c2Vyc1w=?="
        }, {
          "name" : "X-Powered-By",
          "value" : "ASP.NET"
        }, {
          "name" : "Date",
          "value" : "Fri, 29 Mar 2019 13:16:44 GMT"
        }, {
          "name" : "Content-Length",
          "value" : "9"
        } ],
        "content" : {
          "size" : 9,
          "mimeType" : "application/json; charset=utf-8",
          "text" : "{\"id\":17}",
          "comment" : ""
        },
        "redirectURL" : "",
        "headersSize" : 887,
        "bodySize" : 9,
        "comment" : ""
      },
      "cache" : { },
      "timings" : {
        "comment" : "",
        "ssl" : -1,
        "receive" : 0,
        "wait" : 1384,
        "send" : 0,
        "connect" : -1,
        "dns" : -1,
        "blocked" : -1
      },
      "serverIPAddress" : "127.0.0.1",
      "comment" : "",
      "_katalonRequestInformation" : {
        "name" : "71",
        "testObjectId" : "Object Repository/VoPro/Account/api_admin_v1_users",
        "harId" : "c30f9271-7d8b-4f50-9daf-ec79130b7df2"
      },
      "time" : 1385
    } ],
    "comment" : ""
  }
}