{
  "log" : {
    "version" : "1.2",
    "creator" : {
      "name" : "BrowserMob Proxy",
      "version" : "2.1.5",
      "comment" : ""
    },
    "pages" : [ {
      "id" : "Page 0",
      "startedDateTime" : "2019-03-29T22:15:19.374Z",
      "title" : "Page 0",
      "pageTimings" : {
        "onLoad" : 2015,
        "comment" : ""
      },
      "comment" : ""
    } ],
    "entries" : [ {
      "pageref" : "Page 0",
      "startedDateTime" : "2019-03-29T22:15:19.376Z",
      "request" : {
        "method" : "PUT",
        "url" : "http://localhost:10520/WebAPI/api/admin/v1/users/14?",
        "httpVersion" : "HTTP/1.1",
        "cookies" : [ ],
        "headers" : [ {
          "name" : "User-Agent",
          "value" : "Katalon Studio"
        }, {
          "name" : "Content-Type",
          "value" : "application/x-www-form-urlencoded"
        }, {
          "name" : "Authorization",
          "value" : "Bearer eyJ0eXAiOiJKV1QiLCJhbGciOiJIUzI1NiJ9.eyJ1bmlxdWVfbmFtZSI6ImFkbWluIiwicm9sZSI6InVzZXIiLCJzdWIiOiJhZG1pbiIsImlzcyI6IkNyb3BNZXRyaWNzIiwiYXVkIjoiYWxsIiwiZXhwIjoxNTUzOTAxNjE5LCJuYmYiOjE1NTM4OTc3MTl9.COmmEM5rqwTi0s3K8g9pwQcEgZNBOfhtdKenYyZL_ww"
        }, {
          "name" : "Host",
          "value" : "localhost:10520"
        }, {
          "name" : "Accept",
          "value" : "text/html, image/gif, image/jpeg, *; q=.2, */*; q=.2"
        }, {
          "name" : "Proxy-Connection",
          "value" : "keep-alive"
        }, {
          "name" : "Content-Length",
          "value" : "303"
        } ],
        "queryString" : [ ],
        "postData" : {
          "mimeType" : "application/x-www-form-urlencoded",
          "params" : [ {
            "name" : "password",
            "value" : "cropmetrics",
            "comment" : ""
          }, {
            "name" : "email",
            "value" : "cropmetricsvo.passwithsymbols@gmail.com",
            "comment" : ""
          }, {
            "name" : "fullname",
            "value" : "test validation",
            "comment" : ""
          }, {
            "name" : "phone",
            "value" : "123",
            "comment" : ""
          }, {
            "name" : "dealer",
            "value" : "x",
            "comment" : ""
          }, {
            "name" : "addressLine1",
            "value" : "address line 1 test validation",
            "comment" : ""
          }, {
            "name" : "addressLine2",
            "value" : "address line 2 test validation",
            "comment" : ""
          }, {
            "name" : "town",
            "value" : "townValidation",
            "comment" : ""
          }, {
            "name" : "state",
            "value" : "stateValidation",
            "comment" : ""
          }, {
            "name" : "zip",
            "value" : "",
            "comment" : ""
          }, {
            "name" : "country",
            "value" : "countryValidation",
            "comment" : ""
          }, {
            "name" : "roles",
            "value" : "Client",
            "comment" : ""
          }, {
            "name" : "userProfileId",
            "value" : "14",
            "comment" : ""
          } ],
          "comment" : ""
        },
        "headersSize" : 545,
        "bodySize" : 303,
        "comment" : ""
      },
      "response" : {
        "status" : 200,
        "statusText" : "OK",
        "httpVersion" : "HTTP/1.1",
        "cookies" : [ {
          "name" : ".ASPROLES",
          "value" : "Fu0h4hdPX2cHLMmf9rCf7m1dHy3sHJcvVRrb9w0Nk5drm3mk_-sS3ndwK9GJ5LX29QCcPpTdj5NFgVFzt_DBcDl8Z3O6X0miupXzoMNTmjpRO2nZaowAHfKQdIVD_YCY2HlL5ChwdO1suep9QIj6a8PwZKwCJwNqJ1Y1j-FOgzC-dtszHwpXxjkoNkz_z6Av4Ui_Ieg1FWWmsdy5hRYIV53tBpcLGJ5lIQerjL8bTihzdJ0ZGy9FfyT1xXdEIjHKcg66XvZ4wg4kxiwxd9r2SwRwfRqxVKHFeaAZ58tudSyQVBzu7XB0INCw5On0yZzQQFL7pAPFSy3UrjknCAJimiwKueU4-UAEDYd4ox-BwLx9s6WZMwC7TVbCJ5bNZYuBtS4pqCGCrwIl2HzSrYss8LJ-kf70dLLeKqUWRXh8HZAyVIzTI8G3hiYMXXrSfOeo5q_U9k1XicgRtMH5bxf84ZztKWWffz5AEvJNa9E9wFtNppWO0",
          "path" : "/",
          "httpOnly" : true,
          "secure" : false,
          "comment" : ""
        } ],
        "headers" : [ {
          "name" : "Cache-Control",
          "value" : "private"
        }, {
          "name" : "Server",
          "value" : "Microsoft-IIS/10.0"
        }, {
          "name" : "Set-Cookie",
          "value" : ".ASPROLES=Fu0h4hdPX2cHLMmf9rCf7m1dHy3sHJcvVRrb9w0Nk5drm3mk_-sS3ndwK9GJ5LX29QCcPpTdj5NFgVFzt_DBcDl8Z3O6X0miupXzoMNTmjpRO2nZaowAHfKQdIVD_YCY2HlL5ChwdO1suep9QIj6a8PwZKwCJwNqJ1Y1j-FOgzC-dtszHwpXxjkoNkz_z6Av4Ui_Ieg1FWWmsdy5hRYIV53tBpcLGJ5lIQerjL8bTihzdJ0ZGy9FfyT1xXdEIjHKcg66XvZ4wg4kxiwxd9r2SwRwfRqxVKHFeaAZ58tudSyQVBzu7XB0INCw5On0yZzQQFL7pAPFSy3UrjknCAJimiwKueU4-UAEDYd4ox-BwLx9s6WZMwC7TVbCJ5bNZYuBtS4pqCGCrwIl2HzSrYss8LJ-kf70dLLeKqUWRXh8HZAyVIzTI8G3hiYMXXrSfOeo5q_U9k1XicgRtMH5bxf84ZztKWWffz5AEvJNa9E9wFtNppWO0; path=/; HttpOnly"
        }, {
          "name" : "X-SourceFiles",
          "value" : "=?UTF-8?B?RDpcVmlydHVhbE9wdGltaXplci1SZWZhY3RvcmluZ1xDcm9wTWV0cmljcy5Wby5BcGlcQ3JvcE1ldHJpY3MuVm8uQXBpXGFwaVxhZG1pblx2MVx1c2Vyc1wxNA==?="
        }, {
          "name" : "X-Powered-By",
          "value" : "ASP.NET"
        }, {
          "name" : "Date",
          "value" : "Fri, 29 Mar 2019 22:15:21 GMT"
        }, {
          "name" : "Content-Length",
          "value" : "0"
        } ],
        "content" : {
          "size" : 0,
          "mimeType" : "",
          "text" : "",
          "encoding" : "base64",
          "comment" : ""
        },
        "redirectURL" : "",
        "headersSize" : 844,
        "bodySize" : 0,
        "comment" : ""
      },
      "cache" : { },
      "timings" : {
        "comment" : "",
        "connect" : -1,
        "wait" : 2009,
        "receive" : 1,
        "dns" : -1,
        "send" : 0,
        "blocked" : -1,
        "ssl" : -1
      },
      "serverIPAddress" : "127.0.0.1",
      "comment" : "",
      "_katalonRequestInformation" : {
        "name" : "121",
        "testObjectId" : "Object Repository/VoPro/Account/api_admin_v1_users_userprofileid",
        "harId" : "96dbdad4-a343-44b6-ba7e-57ba666c6a64"
      },
      "time" : 2011
    } ],
    "comment" : ""
  }
}