{
  "log" : {
    "version" : "1.2",
    "creator" : {
      "name" : "BrowserMob Proxy",
      "version" : "2.1.5",
      "comment" : ""
    },
    "pages" : [ {
      "id" : "Page 0",
      "startedDateTime" : "2019-04-05T19:31:16.679Z",
      "title" : "Page 0",
      "pageTimings" : {
        "onLoad" : 34810,
        "comment" : ""
      },
      "comment" : ""
    } ],
    "entries" : [ {
      "pageref" : "Page 0",
      "startedDateTime" : "2019-04-05T19:31:16.681Z",
      "request" : {
        "method" : "POST",
        "url" : "http://localhost:10520/WebAPI/api/mobile/v1/fields?",
        "httpVersion" : "HTTP/1.1",
        "cookies" : [ ],
        "headers" : [ {
          "name" : "User-Agent",
          "value" : "Katalon Studio"
        }, {
          "name" : "Content-Type",
          "value" : "application/json"
        }, {
          "name" : "Authorization",
          "value" : "Bearer eyJ0eXAiOiJKV1QiLCJhbGciOiJIUzI1NiJ9.eyJ1bmlxdWVfbmFtZSI6Implbm55Lm1hbGRvbmFkby50eDFAZ21haWwuY29tIiwicm9sZSI6InVzZXIiLCJzdWIiOiJqZW5ueS5tYWxkb25hZG8udHgxQGdtYWlsLmNvbSIsImlzcyI6IkNyb3BNZXRyaWNzIiwiYXVkIjoiYWxsIiwiZXhwIjoxNTU0NDk2NTc2LCJuYmYiOjE1NTQ0OTI2NzZ9.uHtHgM35WXDEMHmEx_phKocbB01wefPJRCYcj0sgGao"
        }, {
          "name" : "Host",
          "value" : "localhost:10520"
        }, {
          "name" : "Accept",
          "value" : "text/html, image/gif, image/jpeg, *; q=.2, */*; q=.2"
        }, {
          "name" : "Proxy-Connection",
          "value" : "keep-alive"
        }, {
          "name" : "Content-Length",
          "value" : "396"
        } ],
        "queryString" : [ ],
        "postData" : {
          "mimeType" : "application/json",
          "text" : "{\"field\":{\"farm_id\":3,\"name\":\"Field name with spaces\",\"boundary\":{\"boundaries\":[{\"boundary\":{\"coords\":[{\"x\":-101.49568751,\"y\":37.14976293},{\"x\":-101.50049403,\"y\":37.14647907},{\"x\":-101.50049403,\"y\":37.14264773},{\"x\":-101.49723246,\"y\":37.1411425},{\"x\":-101.49019435,\"y\":37.14223722},{\"x\":-101.48933604,\"y\":37.14620541},{\"x\":-101.49294093,\"y\":37.14866833},{\"x\":-101.49568751,\"y\":37.14976293}]}}]}}}",
          "comment" : ""
        },
        "headersSize" : 592,
        "bodySize" : 396,
        "comment" : ""
      },
      "response" : {
        "status" : 201,
        "statusText" : "Created",
        "httpVersion" : "HTTP/1.1",
        "cookies" : [ {
          "name" : ".ASPROLES",
          "value" : "jc7m1HxLOEiND31zJHW4SSTlJMsMQJF2xZefFQMr-s9QXiA13eZmZPWpnjJ_c76nhrhWmCLixygPloD3G8iEqwk5ovnEj1wxLBa5lyGvZ3NC3ISrlVrE6tBx-tLBDF8eS5142-wwOHB5FC2FTMTS8KeTGKqgoTVDttwkbrOhKF3Zttm8sUl7SSKE0g2WzxNADsIbnCRbRbfaH9CvrCzNHuFFvUqXKzSVk34rFzD05XZBTTp2qhNUCgwa-a_XgN-KSRG8x3la0sw5_cN5oWGZTug5LxMaJ8BZOxAcsaY53QHOgMOkcuc-fkX_279cq2-ArU1sgJk7l8BXpay0O1OiIIaV8tiqUeZHTNriGl9pRbLmGxuMnHNpittlQWFXXDn_q5D4oIanaZFEoW-tlFDhr_bGb9RjmWxxe7blrJFMUBypJpjU1McrQaLuviAchdc_zIVa8n0kaEFaOsAAFBtTUCCTctQ8HUFiQOdtc9Q68LIIs0caXFJL9TS9C5oMCv3BHbT5_sGXPtJ3RqPvopQh86icgVk1",
          "path" : "/",
          "httpOnly" : true,
          "secure" : false,
          "comment" : ""
        } ],
        "headers" : [ {
          "name" : "Cache-Control",
          "value" : "private"
        }, {
          "name" : "Content-Type",
          "value" : "application/json; charset=utf-8"
        }, {
          "name" : "Location",
          "value" : "api/mobile/v1/fields/5"
        }, {
          "name" : "Server",
          "value" : "Microsoft-IIS/10.0"
        }, {
          "name" : "Set-Cookie",
          "value" : ".ASPROLES=jc7m1HxLOEiND31zJHW4SSTlJMsMQJF2xZefFQMr-s9QXiA13eZmZPWpnjJ_c76nhrhWmCLixygPloD3G8iEqwk5ovnEj1wxLBa5lyGvZ3NC3ISrlVrE6tBx-tLBDF8eS5142-wwOHB5FC2FTMTS8KeTGKqgoTVDttwkbrOhKF3Zttm8sUl7SSKE0g2WzxNADsIbnCRbRbfaH9CvrCzNHuFFvUqXKzSVk34rFzD05XZBTTp2qhNUCgwa-a_XgN-KSRG8x3la0sw5_cN5oWGZTug5LxMaJ8BZOxAcsaY53QHOgMOkcuc-fkX_279cq2-ArU1sgJk7l8BXpay0O1OiIIaV8tiqUeZHTNriGl9pRbLmGxuMnHNpittlQWFXXDn_q5D4oIanaZFEoW-tlFDhr_bGb9RjmWxxe7blrJFMUBypJpjU1McrQaLuviAchdc_zIVa8n0kaEFaOsAAFBtTUCCTctQ8HUFiQOdtc9Q68LIIs0caXFJL9TS9C5oMCv3BHbT5_sGXPtJ3RqPvopQh86icgVk1; path=/; HttpOnly"
        }, {
          "name" : "X-SourceFiles",
          "value" : "=?UTF-8?B?RDpcVmlydHVhbE9wdGltaXplci1SZWZhY3RvcmluZ1xDcm9wTWV0cmljcy5Wby5BcGlcQ3JvcE1ldHJpY3MuVm8uQXBpXGFwaVxtb2JpbGVcdjFcZmllbGRz?="
        }, {
          "name" : "X-Powered-By",
          "value" : "ASP.NET"
        }, {
          "name" : "Date",
          "value" : "Fri, 05 Apr 2019 19:31:51 GMT"
        }, {
          "name" : "Content-Length",
          "value" : "416"
        } ],
        "content" : {
          "size" : 416,
          "mimeType" : "application/json; charset=utf-8",
          "text" : "{\"field\":{\"id\":5,\"farm_id\":3,\"name\":\"Field name with spaces\",\"boundary\":{\"boundaries\":[{\"boundary\":{\"coords\":[{\"x\":-101.49568751,\"y\":37.14976293},{\"x\":-101.49294093,\"y\":37.14866833},{\"x\":-101.48933604,\"y\":37.14620541},{\"x\":-101.49019435,\"y\":37.14223722},{\"x\":-101.49723246,\"y\":37.1411425},{\"x\":-101.50049403,\"y\":37.14264773},{\"x\":-101.50049403,\"y\":37.14647907},{\"x\":-101.49568751,\"y\":37.14976293}]},\"holes\":null}]}}}",
          "comment" : ""
        },
        "redirectURL" : "",
        "headersSize" : 971,
        "bodySize" : 416,
        "comment" : ""
      },
      "cache" : { },
      "timings" : {
        "comment" : "",
        "ssl" : -1,
        "connect" : -1,
        "blocked" : -1,
        "send" : 0,
        "dns" : -1,
        "receive" : 0,
        "wait" : 34802
      },
      "serverIPAddress" : "127.0.0.1",
      "comment" : "",
      "_katalonRequestInformation" : {
        "name" : "53",
        "testObjectId" : "Object Repository/VoGrow/Field/FieldPost",
        "harId" : "204514fa-f711-4de4-a041-1f0b455cd824"
      },
      "time" : 34804
    } ],
    "comment" : ""
  }
}