{
  "log" : {
    "version" : "1.2",
    "creator" : {
      "name" : "BrowserMob Proxy",
      "version" : "2.1.5",
      "comment" : ""
    },
    "pages" : [ {
      "id" : "Page 0",
      "startedDateTime" : "2019-04-01T13:35:44.518Z",
      "title" : "Page 0",
      "pageTimings" : {
        "onLoad" : 1996,
        "comment" : ""
      },
      "comment" : ""
    } ],
    "entries" : [ {
      "pageref" : "Page 0",
      "startedDateTime" : "2019-04-01T13:35:44.519Z",
      "request" : {
        "method" : "POST",
        "url" : "http://localhost:10520/WebAPI/api/admin/v1/users/?",
        "httpVersion" : "HTTP/1.1",
        "cookies" : [ ],
        "headers" : [ {
          "name" : "User-Agent",
          "value" : "Katalon Studio"
        }, {
          "name" : "Content-Type",
          "value" : "application/x-www-form-urlencoded"
        }, {
          "name" : "Authorization",
          "value" : "Bearer eyJ0eXAiOiJKV1QiLCJhbGciOiJIUzI1NiJ9.eyJ1bmlxdWVfbmFtZSI6ImFkbWluIiwicm9sZSI6InVzZXIiLCJzdWIiOiJhZG1pbiIsImlzcyI6IkNyb3BNZXRyaWNzIiwiYXVkIjoiYWxsIiwiZXhwIjoxNTU0MTI5NjQ0LCJuYmYiOjE1NTQxMjU3NDR9.q7RMsVhPsaerglQwzsQVEbdLW1VmKDNOzOnXO9H_Wtk"
        }, {
          "name" : "Host",
          "value" : "localhost:10520"
        }, {
          "name" : "Accept",
          "value" : "text/html, image/gif, image/jpeg, *; q=.2, */*; q=.2"
        }, {
          "name" : "Proxy-Connection",
          "value" : "keep-alive"
        }, {
          "name" : "Content-Length",
          "value" : "279"
        } ],
        "queryString" : [ ],
        "postData" : {
          "mimeType" : "application/x-www-form-urlencoded",
          "params" : [ {
            "name" : "password",
            "value" : "cropmetrics",
            "comment" : ""
          }, {
            "name" : "email",
            "value" : "cropmetricsvo.countrynumber@gmail.com",
            "comment" : ""
          }, {
            "name" : "fullname",
            "value" : "test validation",
            "comment" : ""
          }, {
            "name" : "phone",
            "value" : "123",
            "comment" : ""
          }, {
            "name" : "dealer",
            "value" : "x",
            "comment" : ""
          }, {
            "name" : "addressLine1",
            "value" : "address line 1 test validation",
            "comment" : ""
          }, {
            "name" : "addressLine2",
            "value" : "address line 2 test validation",
            "comment" : ""
          }, {
            "name" : "town",
            "value" : "townValidation",
            "comment" : ""
          }, {
            "name" : "state",
            "value" : "stateValidation",
            "comment" : ""
          }, {
            "name" : "zip",
            "value" : "123457",
            "comment" : ""
          }, {
            "name" : "country",
            "value" : "123456",
            "comment" : ""
          }, {
            "name" : "roles",
            "value" : "Client",
            "comment" : ""
          } ],
          "comment" : ""
        },
        "headersSize" : 544,
        "bodySize" : 279,
        "comment" : ""
      },
      "response" : {
        "status" : 200,
        "statusText" : "OK",
        "httpVersion" : "HTTP/1.1",
        "cookies" : [ {
          "name" : ".ASPROLES",
          "value" : "sy1_IfgeAtAqDfkIqO2HYUDvk_cnCZQ8sZKUnXGrdNvXTQaGAVPqfL7HhPtm5-oVqdHN77HXipljAIrqY9W3gUu5o0akqcz7eoUns5mb--buwtlxC3jjzMNeD_ZzrLJKthg01AyS6xOUycYVYq59Uzl1MnkjqFNUDEHHHurLL93ScvVQuMgVVwpXv33YVPQnJ0rZyzFaaAEjH2ehAnx31DOaBeS6lR-fAwZAakEfYDgU2x_N7yR4lscFbsdtMx0RRlbqE6r0NOlAFOUYNVE-w5vCszWWj_QGc6BRpJAE4c1AZFOiYyCTtYjpyKhXIQ0kZyiI_Ij2ZHr93dv8u4NYn8IwD_PlwNO_iLQ8TJpinnFWzHD2RqpIMY1c7wSXb8hIolA5J5mQ3f0FYwSCqE2WushEZHTtnNSwGDwI_G6sBL4e1FfVNSzRIfOGS4fwQ9qYYoEib56QQvnERqiGYg8Mb91GyN9RBE2gPPXR1RLk4T0x2uCp0",
          "path" : "/",
          "httpOnly" : true,
          "secure" : false,
          "comment" : ""
        } ],
        "headers" : [ {
          "name" : "Cache-Control",
          "value" : "private"
        }, {
          "name" : "Content-Type",
          "value" : "application/json; charset=utf-8"
        }, {
          "name" : "Server",
          "value" : "Microsoft-IIS/10.0"
        }, {
          "name" : "Set-Cookie",
          "value" : ".ASPROLES=sy1_IfgeAtAqDfkIqO2HYUDvk_cnCZQ8sZKUnXGrdNvXTQaGAVPqfL7HhPtm5-oVqdHN77HXipljAIrqY9W3gUu5o0akqcz7eoUns5mb--buwtlxC3jjzMNeD_ZzrLJKthg01AyS6xOUycYVYq59Uzl1MnkjqFNUDEHHHurLL93ScvVQuMgVVwpXv33YVPQnJ0rZyzFaaAEjH2ehAnx31DOaBeS6lR-fAwZAakEfYDgU2x_N7yR4lscFbsdtMx0RRlbqE6r0NOlAFOUYNVE-w5vCszWWj_QGc6BRpJAE4c1AZFOiYyCTtYjpyKhXIQ0kZyiI_Ij2ZHr93dv8u4NYn8IwD_PlwNO_iLQ8TJpinnFWzHD2RqpIMY1c7wSXb8hIolA5J5mQ3f0FYwSCqE2WushEZHTtnNSwGDwI_G6sBL4e1FfVNSzRIfOGS4fwQ9qYYoEib56QQvnERqiGYg8Mb91GyN9RBE2gPPXR1RLk4T0x2uCp0; path=/; HttpOnly"
        }, {
          "name" : "X-SourceFiles",
          "value" : "=?UTF-8?B?RDpcVmlydHVhbE9wdGltaXplci1SZWZhY3RvcmluZ1xDcm9wTWV0cmljcy5Wby5BcGlcQ3JvcE1ldHJpY3MuVm8uQXBpXGFwaVxhZG1pblx2MVx1c2Vyc1w=?="
        }, {
          "name" : "X-Powered-By",
          "value" : "ASP.NET"
        }, {
          "name" : "Date",
          "value" : "Mon, 01 Apr 2019 13:35:46 GMT"
        }, {
          "name" : "Content-Length",
          "value" : "9"
        } ],
        "content" : {
          "size" : 9,
          "mimeType" : "application/json; charset=utf-8",
          "text" : "{\"id\":36}",
          "comment" : ""
        },
        "redirectURL" : "",
        "headersSize" : 887,
        "bodySize" : 9,
        "comment" : ""
      },
      "cache" : { },
      "timings" : {
        "comment" : "",
        "ssl" : -1,
        "wait" : 1991,
        "receive" : 0,
        "send" : 0,
        "dns" : -1,
        "blocked" : -1,
        "connect" : -1
      },
      "serverIPAddress" : "127.0.0.1",
      "comment" : "",
      "_katalonRequestInformation" : {
        "name" : "93",
        "testObjectId" : "Object Repository/VoPro/Account/api_admin_v1_users",
        "harId" : "f48a5b77-5692-453e-8df1-16d97e2ee3e0"
      },
      "time" : 1992
    } ],
    "comment" : ""
  }
}