Suite/Test/Step Name,Browser,Description,Tag,Start time,End time,Duration,Status
Auto_Restore_vo_probereadings_database_using_flyway_script,,,,2019-08-02 16:54:16,2019-08-02 16:54:24,8.467s,PASSED
,,,,,,,
Test Cases/Databases/CreateDatabases/Functional/DB_Create_vo_probereadings_database,,,,2019-08-02 16:54:16,2019-08-02 16:54:23,6.635s,PASSED
server = server,,,,2019-08-02 16:54:17,2019-08-02 16:54:18,0.707s,PASSED
port = port,,,,2019-08-02 16:54:18,2019-08-02 16:54:18,0.002s,PASSED
user = userDb,,,,2019-08-02 16:54:18,2019-08-02 16:54:18,0.001s,PASSED
password = passwordDb,,,,2019-08-02 16:54:18,2019-08-02 16:54:18,0.001s,PASSED
pathPostgreSQL = pathPostgreSQLBin,,,,2019-08-02 16:54:18,2019-08-02 16:54:18,0.001s,PASSED
"database = ""vo_probeReadings""",,,,2019-08-02 16:54:18,2019-08-02 16:54:18,0.001s,PASSED
"command = String.format(""cd ""%s"" && createdb -h %s -p %d -U %s  %s"", pathPostgreSQL, server, port, user, database)",,,,2019-08-02 16:54:18,2019-08-02 16:54:18,0.002s,PASSED
"commandLine.cmd.cmdLine(command, password)",,,,2019-08-02 16:54:18,2019-08-02 16:54:23,5.077s,PASSED
"println(""The vo_probeReadings database was created..."")",,,,2019-08-02 16:54:23,2019-08-02 16:54:23,0.005s,PASSED
,,,,,,,
Test Cases/Databases/DatabasesWithFlyway/Functional/DB_vo_probereadings_with_flyway,,,,2019-08-02 16:54:23,2019-08-02 16:54:24,1.292s,PASSED
user = userDb,,,,2019-08-02 16:54:23,2019-08-02 16:54:23,0.005s,PASSED
password = passwordDb,,,,2019-08-02 16:54:23,2019-08-02 16:54:23,0.000s,PASSED
pathFlyWay = flyway,,,,2019-08-02 16:54:23,2019-08-02 16:54:23,0.001s,PASSED
urlPostgreSql = urlPostgreSQL,,,,2019-08-02 16:54:23,2019-08-02 16:54:23,0.007s,PASSED
fielSystenPath = fileSystemPath,,,,2019-08-02 16:54:23,2019-08-02 16:54:23,0.007s,PASSED
"urlDatabase = ""vo_probeReadings""",,,,2019-08-02 16:54:23,2019-08-02 16:54:23,0.003s,PASSED
"filesystemDatabase = ""probeReadings""",,,,2019-08-02 16:54:23,2019-08-02 16:54:23,0.002s,PASSED
"commandFlyWay = String.format(""cd ""%s"" && flyway -user=%s -password=%s -url=%s%s -locations=filesystem:""%s%s""  migrate"", pathFlyWay, user, password, urlPostgreSql, urlDatabase, fielSystenPath, filesystemDatabase)",,,,2019-08-02 16:54:23,2019-08-02 16:54:23,0.001s,PASSED
commandLine.cmd.singleCommand(commandFlyWay),,,,2019-08-02 16:54:23,2019-08-02 16:54:24,1.024s,PASSED
"println(""The vo_probeReadings database is applied with flyway scripts..."")",,,,2019-08-02 16:54:24,2019-08-02 16:54:24,0.002s,PASSED
