{
  "log" : {
    "version" : "1.2",
    "creator" : {
      "name" : "BrowserMob Proxy",
      "version" : "2.1.5",
      "comment" : ""
    },
    "pages" : [ {
      "id" : "Page 0",
      "startedDateTime" : "2019-03-29T16:41:04.990Z",
      "title" : "Page 0",
      "pageTimings" : {
        "onLoad" : 2456,
        "comment" : ""
      },
      "comment" : ""
    } ],
    "entries" : [ {
      "pageref" : "Page 0",
      "startedDateTime" : "2019-03-29T16:41:04.998Z",
      "request" : {
        "method" : "POST",
        "url" : "http://localhost:10520/WebAPI/api/admin/v1/users/?",
        "httpVersion" : "HTTP/1.1",
        "cookies" : [ ],
        "headers" : [ {
          "name" : "User-Agent",
          "value" : "Katalon Studio"
        }, {
          "name" : "Content-Type",
          "value" : "application/x-www-form-urlencoded"
        }, {
          "name" : "Authorization",
          "value" : "Bearer eyJ0eXAiOiJKV1QiLCJhbGciOiJIUzI1NiJ9.eyJ1bmlxdWVfbmFtZSI6ImFkbWluIiwicm9sZSI6InVzZXIiLCJzdWIiOiJhZG1pbiIsImlzcyI6IkNyb3BNZXRyaWNzIiwiYXVkIjoiYWxsIiwiZXhwIjoxNTUzODgxNTY0LCJuYmYiOjE1NTM4Nzc2NjR9.xTAD9WV8HRM1oYLHyycNER3G9uTC29_5p4_wxlbAhtg"
        }, {
          "name" : "Host",
          "value" : "localhost:10520"
        }, {
          "name" : "Accept",
          "value" : "text/html, image/gif, image/jpeg, *; q=.2, */*; q=.2"
        }, {
          "name" : "Proxy-Connection",
          "value" : "keep-alive"
        }, {
          "name" : "Content-Length",
          "value" : "264"
        } ],
        "queryString" : [ ],
        "postData" : {
          "mimeType" : "application/x-www-form-urlencoded",
          "params" : [ {
            "name" : "password",
            "value" : "cropmetrics",
            "comment" : ""
          }, {
            "name" : "email",
            "value" : "cropmetricsvo.client@gmail.com",
            "comment" : ""
          }, {
            "name" : "fullname",
            "value" : "test validation",
            "comment" : ""
          }, {
            "name" : "phone",
            "value" : "123",
            "comment" : ""
          }, {
            "name" : "dealer",
            "value" : "x",
            "comment" : ""
          }, {
            "name" : "addressLine1",
            "value" : "address line 1 test validation",
            "comment" : ""
          }, {
            "name" : "addressLine2",
            "value" : "address line 2 test validation",
            "comment" : ""
          }, {
            "name" : "town",
            "value" : "townValidation",
            "comment" : ""
          }, {
            "name" : "state",
            "value" : "stateValidation",
            "comment" : ""
          }, {
            "name" : "zip",
            "value" : "xx",
            "comment" : ""
          }, {
            "name" : "country",
            "value" : "xx",
            "comment" : ""
          }, {
            "name" : "roles",
            "value" : "Client",
            "comment" : ""
          } ],
          "comment" : ""
        },
        "headersSize" : 544,
        "bodySize" : 264,
        "comment" : ""
      },
      "response" : {
        "status" : 200,
        "statusText" : "OK",
        "httpVersion" : "HTTP/1.1",
        "cookies" : [ {
          "name" : ".ASPROLES",
          "value" : "y4QReiqYEwQ3sZV67vHL31hp_WbjApBzl2kWmuN39Lp5T8Klxb1gC3_tnmMHN6qzZZHK7nLi9iV6UZZZOcAwoPC8bk2vFPuIhbgYEp-xjjB7KaukOV9JDtBEKE9PRE6CUiOaHZPgBG1uvD9Q6jZ-Y-DlYCtf9rLqRW9lIRu0yYJ8cJiUkyn2F5krseJE7U5zVgJkBS-2ufbCI1hi0V2KPwuxDSCY07LZHsXiTz3DmiShXQIxEOfv_vq43r29lWBGhOWf6iGftgPoN3uT9ULrkQ6V7i_v7u5XlU5Tskzmg-6-nBzkG4YBacH4yYhXaFror-pSoS98gs9jwuw2MBA6JeDcqplP8BkWvyeYkjfIt9P1VVl2CkUviyS3iNHhenaqQNxhztpTMzQ-CKzb45lex0cA2A7vbHwtE-9Iou0eudWl-84jZRVLBpE5ydzR_RsOLqtSb8uJg7HtuL5yxgxd-q8sB5R7AJqD1LuiXWhGnn-Xs__00",
          "path" : "/",
          "httpOnly" : true,
          "secure" : false,
          "comment" : ""
        } ],
        "headers" : [ {
          "name" : "Cache-Control",
          "value" : "private"
        }, {
          "name" : "Content-Type",
          "value" : "application/json; charset=utf-8"
        }, {
          "name" : "Server",
          "value" : "Microsoft-IIS/10.0"
        }, {
          "name" : "Set-Cookie",
          "value" : ".ASPROLES=y4QReiqYEwQ3sZV67vHL31hp_WbjApBzl2kWmuN39Lp5T8Klxb1gC3_tnmMHN6qzZZHK7nLi9iV6UZZZOcAwoPC8bk2vFPuIhbgYEp-xjjB7KaukOV9JDtBEKE9PRE6CUiOaHZPgBG1uvD9Q6jZ-Y-DlYCtf9rLqRW9lIRu0yYJ8cJiUkyn2F5krseJE7U5zVgJkBS-2ufbCI1hi0V2KPwuxDSCY07LZHsXiTz3DmiShXQIxEOfv_vq43r29lWBGhOWf6iGftgPoN3uT9ULrkQ6V7i_v7u5XlU5Tskzmg-6-nBzkG4YBacH4yYhXaFror-pSoS98gs9jwuw2MBA6JeDcqplP8BkWvyeYkjfIt9P1VVl2CkUviyS3iNHhenaqQNxhztpTMzQ-CKzb45lex0cA2A7vbHwtE-9Iou0eudWl-84jZRVLBpE5ydzR_RsOLqtSb8uJg7HtuL5yxgxd-q8sB5R7AJqD1LuiXWhGnn-Xs__00; path=/; HttpOnly"
        }, {
          "name" : "X-SourceFiles",
          "value" : "=?UTF-8?B?RDpcVmlydHVhbE9wdGltaXplci1SZWZhY3RvcmluZ1xDcm9wTWV0cmljcy5Wby5BcGlcQ3JvcE1ldHJpY3MuVm8uQXBpXGFwaVxhZG1pblx2MVx1c2Vyc1w=?="
        }, {
          "name" : "X-Powered-By",
          "value" : "ASP.NET"
        }, {
          "name" : "Date",
          "value" : "Fri, 29 Mar 2019 16:41:07 GMT"
        }, {
          "name" : "Content-Length",
          "value" : "9"
        } ],
        "content" : {
          "size" : 9,
          "mimeType" : "application/json; charset=utf-8",
          "text" : "{\"id\":46}",
          "comment" : ""
        },
        "redirectURL" : "",
        "headersSize" : 887,
        "bodySize" : 9,
        "comment" : ""
      },
      "cache" : { },
      "timings" : {
        "comment" : "",
        "ssl" : -1,
        "wait" : 2445,
        "connect" : -1,
        "send" : 0,
        "blocked" : -1,
        "receive" : 0,
        "dns" : -1
      },
      "serverIPAddress" : "127.0.0.1",
      "comment" : "",
      "_katalonRequestInformation" : {
        "name" : "117",
        "testObjectId" : "Object Repository/VoPro/Account/api_admin_v1_users",
        "harId" : "4fd741d1-007b-44bc-bb08-e3ccc6afe8db"
      },
      "time" : 2447
    } ],
    "comment" : ""
  }
}