{
  "log" : {
    "version" : "1.2",
    "creator" : {
      "name" : "BrowserMob Proxy",
      "version" : "2.1.5",
      "comment" : ""
    },
    "pages" : [ {
      "id" : "Page 0",
      "startedDateTime" : "2019-03-29T18:59:12.046Z",
      "title" : "Page 0",
      "pageTimings" : {
        "onLoad" : 48,
        "comment" : ""
      },
      "comment" : ""
    } ],
    "entries" : [ {
      "pageref" : "Page 0",
      "startedDateTime" : "2019-03-29T18:59:12.049Z",
      "request" : {
        "method" : "PUT",
        "url" : "http://localhost:10520/WebAPI/api/admin/v1/users/14?",
        "httpVersion" : "HTTP/1.1",
        "cookies" : [ ],
        "headers" : [ {
          "name" : "User-Agent",
          "value" : "Katalon Studio"
        }, {
          "name" : "Content-Type",
          "value" : "application/x-www-form-urlencoded"
        }, {
          "name" : "Authorization",
          "value" : "Bearer eyJ0eXAiOiJKV1QiLCJhbGciOiJIUzI1NiJ9.eyJ1bmlxdWVfbmFtZSI6ImFkbWluIiwicm9sZSI6InVzZXIiLCJzdWIiOiJhZG1pbiIsImlzcyI6IkNyb3BNZXRyaWNzIiwiYXVkIjoiYWxsIiwiZXhwIjoxNTUzODg5ODUyLCJuYmYiOjE1NTM4ODU5NTJ9.WzY_iJT9qr7sUcIsIZxAd5pfQR3aYBPmb7944u-PmuE"
        }, {
          "name" : "Host",
          "value" : "localhost:10520"
        }, {
          "name" : "Accept",
          "value" : "text/html, image/gif, image/jpeg, *; q=.2, */*; q=.2"
        }, {
          "name" : "Proxy-Connection",
          "value" : "keep-alive"
        }, {
          "name" : "Content-Length",
          "value" : "317"
        } ],
        "queryString" : [ ],
        "postData" : {
          "mimeType" : "application/x-www-form-urlencoded",
          "params" : [ {
            "name" : "password",
            "value" : "morethan15characters",
            "comment" : ""
          }, {
            "name" : "email",
            "value" : "cropmetricsvo.15.pass@gmail.com",
            "comment" : ""
          }, {
            "name" : "fullname",
            "value" : "test validation",
            "comment" : ""
          }, {
            "name" : "phone",
            "value" : "123",
            "comment" : ""
          }, {
            "name" : "dealer",
            "value" : "x",
            "comment" : ""
          }, {
            "name" : "addressLine1",
            "value" : "address line 1 test validation",
            "comment" : ""
          }, {
            "name" : "addressLine2",
            "value" : "address line 2 test validation",
            "comment" : ""
          }, {
            "name" : "town",
            "value" : "townValidation",
            "comment" : ""
          }, {
            "name" : "state",
            "value" : "stateValidation",
            "comment" : ""
          }, {
            "name" : "zip",
            "value" : "zipValidation",
            "comment" : ""
          }, {
            "name" : "country",
            "value" : "countryValidation",
            "comment" : ""
          }, {
            "name" : "roles",
            "value" : "Client",
            "comment" : ""
          }, {
            "name" : "userProfileId",
            "value" : "14",
            "comment" : ""
          } ],
          "comment" : ""
        },
        "headersSize" : 545,
        "bodySize" : 317,
        "comment" : ""
      },
      "response" : {
        "status" : 400,
        "statusText" : "Bad Request",
        "httpVersion" : "HTTP/1.1",
        "cookies" : [ {
          "name" : ".ASPROLES",
          "value" : "cfDphBhjSk1uHYKexP_DXQ-1yoP4YfBhDtsIGPMsJR3C4kGwynKB5x4Fni8J9Df1VT9HMsc6OoFn-No3yBJzJzBEUwUgh3eMwbwFDmZ3cxlL_TlysHlYhQdaCUXHctUDOrBnJTcDmbLHHBXzdxYIiu4vxJPHTa7bxl33r5T17dOHOo82MFsjEum4nZ9-IPrm56Ky2lumUIMuhnlPPD5eHBqcaoHwSJO-Fc_XC1qPX5AdVky319nTZjHu27K9Y9col3xsOSm7E2acjF0n9bqImRfDws1_e42uwiGnSd7L_5q8AwCF98_uM8Log4yzVzNdB5BLY6euaIamEwdjJU3bpfU0HSsz_WT7TuXeIaUScm6qL-r-suxM5hQMCpRH_d-eLZ1K5xUlY1wgrps7Dh4RVLzlt8E3G7MxxrxMORxJLHGT4AJVaLUa5-pklq0vS2K_fV8wBVeCVuxvzBxOeLQQ31HyQ63TsJofXQHiNho9Bc22Ouyb0",
          "path" : "/",
          "httpOnly" : true,
          "secure" : false,
          "comment" : ""
        } ],
        "headers" : [ {
          "name" : "Cache-Control",
          "value" : "private"
        }, {
          "name" : "Content-Type",
          "value" : "application/json; charset=utf-8"
        }, {
          "name" : "Server",
          "value" : "Microsoft-IIS/10.0"
        }, {
          "name" : "Set-Cookie",
          "value" : ".ASPROLES=cfDphBhjSk1uHYKexP_DXQ-1yoP4YfBhDtsIGPMsJR3C4kGwynKB5x4Fni8J9Df1VT9HMsc6OoFn-No3yBJzJzBEUwUgh3eMwbwFDmZ3cxlL_TlysHlYhQdaCUXHctUDOrBnJTcDmbLHHBXzdxYIiu4vxJPHTa7bxl33r5T17dOHOo82MFsjEum4nZ9-IPrm56Ky2lumUIMuhnlPPD5eHBqcaoHwSJO-Fc_XC1qPX5AdVky319nTZjHu27K9Y9col3xsOSm7E2acjF0n9bqImRfDws1_e42uwiGnSd7L_5q8AwCF98_uM8Log4yzVzNdB5BLY6euaIamEwdjJU3bpfU0HSsz_WT7TuXeIaUScm6qL-r-suxM5hQMCpRH_d-eLZ1K5xUlY1wgrps7Dh4RVLzlt8E3G7MxxrxMORxJLHGT4AJVaLUa5-pklq0vS2K_fV8wBVeCVuxvzBxOeLQQ31HyQ63TsJofXQHiNho9Bc22Ouyb0; path=/; HttpOnly"
        }, {
          "name" : "X-SourceFiles",
          "value" : "=?UTF-8?B?RDpcVmlydHVhbE9wdGltaXplci1SZWZhY3RvcmluZ1xDcm9wTWV0cmljcy5Wby5BcGlcQ3JvcE1ldHJpY3MuVm8uQXBpXGFwaVxhZG1pblx2MVx1c2Vyc1wxNA==?="
        }, {
          "name" : "X-Powered-By",
          "value" : "ASP.NET"
        }, {
          "name" : "Date",
          "value" : "Fri, 29 Mar 2019 18:59:12 GMT"
        }, {
          "name" : "Content-Length",
          "value" : "85"
        } ],
        "content" : {
          "size" : 85,
          "mimeType" : "application/json; charset=utf-8",
          "text" : "{\"message\":\"The request is invalid. The password must contain as max 15 characters.\"}",
          "comment" : ""
        },
        "redirectURL" : "",
        "headersSize" : 901,
        "bodySize" : 85,
        "comment" : ""
      },
      "cache" : { },
      "timings" : {
        "comment" : "",
        "ssl" : -1,
        "wait" : 40,
        "send" : 0,
        "receive" : 0,
        "dns" : -1,
        "blocked" : -1,
        "connect" : -1
      },
      "serverIPAddress" : "127.0.0.1",
      "comment" : "",
      "_katalonRequestInformation" : {
        "name" : "5",
        "testObjectId" : "Object Repository/VoPro/Account/api_admin_v1_users_userprofileid",
        "harId" : "6d4d5404-4f36-41ee-976b-660902bd98ff"
      },
      "time" : 41
    } ],
    "comment" : ""
  }
}