{
  "log" : {
    "version" : "1.2",
    "creator" : {
      "name" : "BrowserMob Proxy",
      "version" : "2.1.5",
      "comment" : ""
    },
    "pages" : [ {
      "id" : "Page 0",
      "startedDateTime" : "2019-03-27T19:34:42.614Z",
      "title" : "Page 0",
      "pageTimings" : {
        "onLoad" : 1545,
        "comment" : ""
      },
      "comment" : ""
    } ],
    "entries" : [ {
      "pageref" : "Page 0",
      "startedDateTime" : "2019-03-27T19:34:42.621Z",
      "request" : {
        "method" : "POST",
        "url" : "http://localhost:10520/WebAPI/api/Account/AdministrativeRegister/?",
        "httpVersion" : "HTTP/1.1",
        "cookies" : [ ],
        "headers" : [ {
          "name" : "User-Agent",
          "value" : "Katalon Studio"
        }, {
          "name" : "Content-Type",
          "value" : "application/x-www-form-urlencoded"
        }, {
          "name" : "Authorization",
          "value" : "Bearer eyJ0eXAiOiJKV1QiLCJhbGciOiJIUzI1NiJ9.eyJ1bmlxdWVfbmFtZSI6ImFkbWluIiwicm9sZSI6InVzZXIiLCJzdWIiOiJhZG1pbiIsImlzcyI6IkNyb3BNZXRyaWNzIiwiYXVkIjoiYWxsIiwiZXhwIjoxNTUzNzE5MTgyLCJuYmYiOjE1NTM3MTUyODJ9.2DJ4xqsIvSwZFCfHHimVDOFB9VtqCyCWIgE8vD5Yd94"
        }, {
          "name" : "Host",
          "value" : "localhost:10520"
        }, {
          "name" : "Accept",
          "value" : "text/html, image/gif, image/jpeg, *; q=.2, */*; q=.2"
        }, {
          "name" : "Proxy-Connection",
          "value" : "keep-alive"
        }, {
          "name" : "Content-Length",
          "value" : "417"
        } ],
        "queryString" : [ ],
        "postData" : {
          "mimeType" : "application/x-www-form-urlencoded",
          "params" : [ {
            "name" : "username",
            "value" : "kusernocountry",
            "comment" : ""
          }, {
            "name" : "password",
            "value" : "cropmetrics",
            "comment" : ""
          }, {
            "name" : "confirmPassword",
            "value" : "cropmetrics",
            "comment" : ""
          }, {
            "name" : "email",
            "value" : "cropmetricsvo@gmail.com",
            "comment" : ""
          }, {
            "name" : "fullname",
            "value" : "test validation phone attribute as characters instead of numbers",
            "comment" : ""
          }, {
            "name" : "phone",
            "value" : "123",
            "comment" : ""
          }, {
            "name" : "dealer",
            "value" : "dealet test",
            "comment" : ""
          }, {
            "name" : "addressLine1",
            "value" : "address line 1 test validation",
            "comment" : ""
          }, {
            "name" : "addressLine2",
            "value" : "address line 2 test validation",
            "comment" : ""
          }, {
            "name" : "town",
            "value" : "townValidation",
            "comment" : ""
          }, {
            "name" : "state",
            "value" : "stateValidation",
            "comment" : ""
          }, {
            "name" : "zip",
            "value" : "zipValidation",
            "comment" : ""
          }, {
            "name" : "country",
            "value" : "",
            "comment" : ""
          }, {
            "name" : "roles",
            "value" : "Client",
            "comment" : ""
          }, {
            "name" : "modifierUsername",
            "value" : "admin",
            "comment" : ""
          }, {
            "name" : "modifierUserId",
            "value" : "1",
            "comment" : ""
          } ],
          "comment" : ""
        },
        "headersSize" : 560,
        "bodySize" : 417,
        "comment" : ""
      },
      "response" : {
        "status" : 200,
        "statusText" : "OK",
        "httpVersion" : "HTTP/1.1",
        "cookies" : [ {
          "name" : ".ASPROLES",
          "value" : "S9ylFvC_amLEF3SBOLunWG4zmrsQjqFIXZdtJyNn5zD-1b_g1FsoddXZ8cHhZRWMiPmpO2sT3bosKN6f8WNktck20R7K6RcndQMwJkbObCzIKgmVZw-Wb5I-BnO1CJ0hQOai5POmQjvOHWK_hD4FLdo7ZTw3EgoIAh7dJs85_oBfs8Mv9gq5O2j1koWwQTnT6hDvJTSHC905xCKIGTEWKi0srTYRsuxCvzsHpq_CWEPauCg5CGAMHqj5_pd63bxvH7SzBIGopEP4B76kD8vviwM8FxjSDX-9ADedP1alfoe0_IgcIGeFOPwgePY4hFKLDAeapy3dN8rQz9leX0mFGXtNA9FdWzAidkZMxSShT6bVzFENR3ty0AaLYl-yo9LTFX7whioKTOWFZK3ne7lZx2D0ng1vcY4LCdqJaQ843gthTUIFhbOl-rULGG1XQCQUdey_r5qctWsA0KYaQCz5JE5suU3MN4IPqHmVPnosV0J11J560",
          "path" : "/",
          "httpOnly" : true,
          "secure" : false,
          "comment" : ""
        } ],
        "headers" : [ {
          "name" : "Cache-Control",
          "value" : "private"
        }, {
          "name" : "Content-Type",
          "value" : "application/json; charset=utf-8"
        }, {
          "name" : "Server",
          "value" : "Microsoft-IIS/10.0"
        }, {
          "name" : "Set-Cookie",
          "value" : ".ASPROLES=S9ylFvC_amLEF3SBOLunWG4zmrsQjqFIXZdtJyNn5zD-1b_g1FsoddXZ8cHhZRWMiPmpO2sT3bosKN6f8WNktck20R7K6RcndQMwJkbObCzIKgmVZw-Wb5I-BnO1CJ0hQOai5POmQjvOHWK_hD4FLdo7ZTw3EgoIAh7dJs85_oBfs8Mv9gq5O2j1koWwQTnT6hDvJTSHC905xCKIGTEWKi0srTYRsuxCvzsHpq_CWEPauCg5CGAMHqj5_pd63bxvH7SzBIGopEP4B76kD8vviwM8FxjSDX-9ADedP1alfoe0_IgcIGeFOPwgePY4hFKLDAeapy3dN8rQz9leX0mFGXtNA9FdWzAidkZMxSShT6bVzFENR3ty0AaLYl-yo9LTFX7whioKTOWFZK3ne7lZx2D0ng1vcY4LCdqJaQ843gthTUIFhbOl-rULGG1XQCQUdey_r5qctWsA0KYaQCz5JE5suU3MN4IPqHmVPnosV0J11J560; path=/; HttpOnly"
        }, {
          "name" : "X-SourceFiles",
          "value" : "=?UTF-8?B?RDpcVmlydHVhbE9wdGltaXplci1SZWZhY3RvcmluZ1xDcm9wTWV0cmljcy5Wby5BcGlcQ3JvcE1ldHJpY3MuVm8uQXBpXGFwaVxBY2NvdW50XEFkbWluaXN0cmF0aXZlUmVnaXN0ZXJc?="
        }, {
          "name" : "X-Powered-By",
          "value" : "ASP.NET"
        }, {
          "name" : "Date",
          "value" : "Wed, 27 Mar 2019 19:34:44 GMT"
        }, {
          "name" : "Content-Length",
          "value" : "9"
        } ],
        "content" : {
          "size" : 9,
          "mimeType" : "application/json; charset=utf-8",
          "text" : "{\"id\":15}",
          "comment" : ""
        },
        "redirectURL" : "",
        "headersSize" : 907,
        "bodySize" : 9,
        "comment" : ""
      },
      "cache" : { },
      "timings" : {
        "comment" : "",
        "ssl" : -1,
        "dns" : -1,
        "receive" : 0,
        "blocked" : -1,
        "wait" : 1534,
        "send" : 0,
        "connect" : -1
      },
      "serverIPAddress" : "127.0.0.1",
      "comment" : "",
      "_katalonRequestInformation" : {
        "name" : "33",
        "testObjectId" : "Object Repository/VoPro/Account/AdministrativeRegister",
        "harId" : "1a1857f9-fee1-4258-ac6d-0deb453a267c"
      },
      "time" : 1535
    } ],
    "comment" : ""
  }
}