{
  "log" : {
    "version" : "1.2",
    "creator" : {
      "name" : "BrowserMob Proxy",
      "version" : "2.1.5",
      "comment" : ""
    },
    "pages" : [ {
      "id" : "Page 0",
      "startedDateTime" : "2019-03-28T20:23:33.636Z",
      "title" : "Page 0",
      "pageTimings" : {
        "onLoad" : 1237,
        "comment" : ""
      },
      "comment" : ""
    } ],
    "entries" : [ {
      "pageref" : "Page 0",
      "startedDateTime" : "2019-03-28T20:23:33.637Z",
      "request" : {
        "method" : "POST",
        "url" : "http://localhost:10520/WebAPI/api/admin/v1/users/?",
        "httpVersion" : "HTTP/1.1",
        "cookies" : [ ],
        "headers" : [ {
          "name" : "User-Agent",
          "value" : "Katalon Studio"
        }, {
          "name" : "Content-Type",
          "value" : "application/x-www-form-urlencoded"
        }, {
          "name" : "Authorization",
          "value" : "Bearer eyJ0eXAiOiJKV1QiLCJhbGciOiJIUzI1NiJ9.eyJ1bmlxdWVfbmFtZSI6ImFkbWluIiwicm9sZSI6InVzZXIiLCJzdWIiOiJhZG1pbiIsImlzcyI6IkNyb3BNZXRyaWNzIiwiYXVkIjoiYWxsIiwiZXhwIjoxNTUzODA4NTEzLCJuYmYiOjE1NTM4MDQ2MTN9.2Vh8zBXDwVQOUStZpdZwkW-GTU8XPjKE8SPvjrsAMLE"
        }, {
          "name" : "Host",
          "value" : "localhost:10520"
        }, {
          "name" : "Accept",
          "value" : "text/html, image/gif, image/jpeg, *; q=.2, */*; q=.2"
        }, {
          "name" : "Proxy-Connection",
          "value" : "keep-alive"
        }, {
          "name" : "Content-Length",
          "value" : "316"
        } ],
        "queryString" : [ ],
        "postData" : {
          "mimeType" : "application/x-www-form-urlencoded",
          "params" : [ {
            "name" : "password",
            "value" : "cropmetrics",
            "comment" : ""
          }, {
            "name" : "email",
            "value" : "cropmetricsvo.no.town@gmail.com",
            "comment" : ""
          }, {
            "name" : "fullname",
            "value" : "test validation",
            "comment" : ""
          }, {
            "name" : "phone",
            "value" : "phone test validation",
            "comment" : ""
          }, {
            "name" : "dealer",
            "value" : "dealer test validation",
            "comment" : ""
          }, {
            "name" : "addressLine1",
            "value" : "address line 1 test validation",
            "comment" : ""
          }, {
            "name" : "addressLine2",
            "value" : "address line 2 test validation",
            "comment" : ""
          }, {
            "name" : "town",
            "value" : "",
            "comment" : ""
          }, {
            "name" : "state",
            "value" : "stateValidation",
            "comment" : ""
          }, {
            "name" : "zip",
            "value" : "zipValidation",
            "comment" : ""
          }, {
            "name" : "country",
            "value" : "countryValidation",
            "comment" : ""
          }, {
            "name" : "roles",
            "value" : "Client",
            "comment" : ""
          } ],
          "comment" : ""
        },
        "headersSize" : 544,
        "bodySize" : 316,
        "comment" : ""
      },
      "response" : {
        "status" : 200,
        "statusText" : "OK",
        "httpVersion" : "HTTP/1.1",
        "cookies" : [ {
          "name" : ".ASPROLES",
          "value" : "JAYHWpqDu_zth6o2bB4PzgxAxduUGnZO-ajavbMBQznrDPboCdeefMRxKceShtYD29gGaTtcibz1L4WTXnklGyAEQX4KVYCWUvNVcQyGxEBtKWvknv8OQeH35S39ZWly81T1QHjLuNvkn0EjzYVTGW8wWuo86wwn5GJrtOFIIMoQbB3O-p6-ybN8ZG5cvOdzWi0BFH36Kk68ttBZNhgaxDnL5b-xx7-YBF8bsK4Nc86d8rqc465ydsSJWrDdx1yPooWHalX4q3fWIMDqDJMfVjM1lbqhHLaX2Hhje-p9bAht69iuQlzsMkB6NRiM8KvPxGzOebGUT5PWPkXnnPUUhuxGXEg4wGrIscTuFrj1pmcLkZvTNSy68rtZ39A_VEopPntldD6HRtyh-V-_M9W8ZLXC30hRzaf6Tnvr6Y41_rzfnO6035DwqjS62FM4fso--qdPnXhtETs6ZxBvHu9wo7LJsyaMQwLdaQHBT1NfH_tI_f1N0",
          "path" : "/",
          "httpOnly" : true,
          "secure" : false,
          "comment" : ""
        } ],
        "headers" : [ {
          "name" : "Cache-Control",
          "value" : "private"
        }, {
          "name" : "Content-Type",
          "value" : "application/json; charset=utf-8"
        }, {
          "name" : "Server",
          "value" : "Microsoft-IIS/10.0"
        }, {
          "name" : "Set-Cookie",
          "value" : ".ASPROLES=JAYHWpqDu_zth6o2bB4PzgxAxduUGnZO-ajavbMBQznrDPboCdeefMRxKceShtYD29gGaTtcibz1L4WTXnklGyAEQX4KVYCWUvNVcQyGxEBtKWvknv8OQeH35S39ZWly81T1QHjLuNvkn0EjzYVTGW8wWuo86wwn5GJrtOFIIMoQbB3O-p6-ybN8ZG5cvOdzWi0BFH36Kk68ttBZNhgaxDnL5b-xx7-YBF8bsK4Nc86d8rqc465ydsSJWrDdx1yPooWHalX4q3fWIMDqDJMfVjM1lbqhHLaX2Hhje-p9bAht69iuQlzsMkB6NRiM8KvPxGzOebGUT5PWPkXnnPUUhuxGXEg4wGrIscTuFrj1pmcLkZvTNSy68rtZ39A_VEopPntldD6HRtyh-V-_M9W8ZLXC30hRzaf6Tnvr6Y41_rzfnO6035DwqjS62FM4fso--qdPnXhtETs6ZxBvHu9wo7LJsyaMQwLdaQHBT1NfH_tI_f1N0; path=/; HttpOnly"
        }, {
          "name" : "X-SourceFiles",
          "value" : "=?UTF-8?B?RDpcVmlydHVhbE9wdGltaXplci1SZWZhY3RvcmluZ1xDcm9wTWV0cmljcy5Wby5BcGlcQ3JvcE1ldHJpY3MuVm8uQXBpXGFwaVxhZG1pblx2MVx1c2Vyc1w=?="
        }, {
          "name" : "X-Powered-By",
          "value" : "ASP.NET"
        }, {
          "name" : "Date",
          "value" : "Thu, 28 Mar 2019 20:23:34 GMT"
        }, {
          "name" : "Content-Length",
          "value" : "9"
        } ],
        "content" : {
          "size" : 9,
          "mimeType" : "application/json; charset=utf-8",
          "text" : "{\"id\":10}",
          "comment" : ""
        },
        "redirectURL" : "",
        "headersSize" : 887,
        "bodySize" : 9,
        "comment" : ""
      },
      "cache" : { },
      "timings" : {
        "comment" : "",
        "wait" : 1233,
        "dns" : -1,
        "blocked" : -1,
        "connect" : -1,
        "receive" : 0,
        "send" : 0,
        "ssl" : -1
      },
      "serverIPAddress" : "127.0.0.1",
      "comment" : "",
      "_katalonRequestInformation" : {
        "name" : "23",
        "testObjectId" : "Object Repository/VoPro/Account/api_admin_v1_users",
        "harId" : "e3aec08a-bf15-4e7e-857f-00f4812294ae"
      },
      "time" : 1234
    } ],
    "comment" : ""
  }
}