{
  "log" : {
    "version" : "1.2",
    "creator" : {
      "name" : "BrowserMob Proxy",
      "version" : "2.1.5",
      "comment" : ""
    },
    "pages" : [ {
      "id" : "Page 0",
      "startedDateTime" : "2019-03-29T22:10:09.490Z",
      "title" : "Page 0",
      "pageTimings" : {
        "onLoad" : 1818,
        "comment" : ""
      },
      "comment" : ""
    } ],
    "entries" : [ {
      "pageref" : "Page 0",
      "startedDateTime" : "2019-03-29T22:10:09.491Z",
      "request" : {
        "method" : "POST",
        "url" : "http://localhost:10520/WebAPI/api/admin/v1/users/?",
        "httpVersion" : "HTTP/1.1",
        "cookies" : [ ],
        "headers" : [ {
          "name" : "User-Agent",
          "value" : "Katalon Studio"
        }, {
          "name" : "Content-Type",
          "value" : "application/x-www-form-urlencoded"
        }, {
          "name" : "Authorization",
          "value" : "Bearer eyJ0eXAiOiJKV1QiLCJhbGciOiJIUzI1NiJ9.eyJ1bmlxdWVfbmFtZSI6ImFkbWluIiwicm9sZSI6InVzZXIiLCJzdWIiOiJhZG1pbiIsImlzcyI6IkNyb3BNZXRyaWNzIiwiYXVkIjoiYWxsIiwiZXhwIjoxNTUzOTAxMzA5LCJuYmYiOjE1NTM4OTc0MDl9.lKVeBPjVC2yLmjqBhmsFwVOuoXOTX4hLXqimH-Gee2Q"
        }, {
          "name" : "Host",
          "value" : "localhost:10520"
        }, {
          "name" : "Accept",
          "value" : "text/html, image/gif, image/jpeg, *; q=.2, */*; q=.2"
        }, {
          "name" : "Proxy-Connection",
          "value" : "keep-alive"
        }, {
          "name" : "Content-Length",
          "value" : "757"
        } ],
        "queryString" : [ ],
        "postData" : {
          "mimeType" : "application/x-www-form-urlencoded",
          "params" : [ {
            "name" : "password",
            "value" : "cropmetrics",
            "comment" : ""
          }, {
            "name" : "email",
            "value" : "cropmetricsvo.dealerlong@gmail.com",
            "comment" : ""
          }, {
            "name" : "fullname",
            "value" : "x",
            "comment" : ""
          }, {
            "name" : "phone",
            "value" : "1",
            "comment" : ""
          }, {
            "name" : "dealer",
            "value" : "12 API_ACNT_When_new_account_have_long_dealer_attribute_Expected_status_code_20012 API_ACNT_When_new_account_have_long_dealer_attribute_Expected_status_code_20012 API_ACNT_When_new_account_have_long_dealer_attribute_Expected_status_code_20012 API_ACNT_When_new_account_have_long_dealer_attribute_Expected_status_code_20012 API_ACNT_When_new_account_have_long_dealer_attribute_Expected_status_code_20012 API_ACNT_When_new_account_have_long_dealer_attribute_Expected_status_code_200",
            "comment" : ""
          }, {
            "name" : "addressLine1",
            "value" : "address line 1 test validation",
            "comment" : ""
          }, {
            "name" : "addressLine2",
            "value" : "address line 2 test validation",
            "comment" : ""
          }, {
            "name" : "town",
            "value" : "townValidation",
            "comment" : ""
          }, {
            "name" : "state",
            "value" : "stateValidation",
            "comment" : ""
          }, {
            "name" : "zip",
            "value" : "zipValidation",
            "comment" : ""
          }, {
            "name" : "country",
            "value" : "countryValidation",
            "comment" : ""
          }, {
            "name" : "roles",
            "value" : "Client",
            "comment" : ""
          } ],
          "comment" : ""
        },
        "headersSize" : 544,
        "bodySize" : 757,
        "comment" : ""
      },
      "response" : {
        "status" : 200,
        "statusText" : "OK",
        "httpVersion" : "HTTP/1.1",
        "cookies" : [ {
          "name" : ".ASPROLES",
          "value" : "IcQ48XxlzvgbNE1E_G08KMZw5a55U5kuDNP8MbsVago7DHxosy9bGqKq0RXEye_2HDy0TZYWmyA1x36DqoZsL67A3lb8J6tHqytj7pm5COgZfQLI2Tslvo1Q84H0fVTLZ9ESDAxgURM4Em5qbSMLTejUqofitvYRJ8aCuw3C9upckaWaoCtnpFSyzlTI7U71kitonl2ngocgFDnLL5k2XnZKd8vJwn2a-ORsg4XYTsHPzyzzbojGxSljWqh7uHDEDwJVCFj9D3rx3KXN2Tl_vUTcTFP92jD--fOY4nYgC2_Npih2W2iS7NGek5qUmEtKD170aRwmWBiYxVSHC0S0ivizZT3WZcO38wLywqhefReb2g14L97i5Sj49VCRaJd5m78Spm3MidP0PXSvC_S6LNShXx-q8e1TNYvDaE3KLBPMOEIWv4Qy9CvLTZ_UyHhPp-8bgq6qkcsDIlMW-SOO-Z8IAb0vXPMpg6Rk8ZiSRs-GSiSI0",
          "path" : "/",
          "httpOnly" : true,
          "secure" : false,
          "comment" : ""
        } ],
        "headers" : [ {
          "name" : "Cache-Control",
          "value" : "private"
        }, {
          "name" : "Content-Type",
          "value" : "application/json; charset=utf-8"
        }, {
          "name" : "Server",
          "value" : "Microsoft-IIS/10.0"
        }, {
          "name" : "Set-Cookie",
          "value" : ".ASPROLES=IcQ48XxlzvgbNE1E_G08KMZw5a55U5kuDNP8MbsVago7DHxosy9bGqKq0RXEye_2HDy0TZYWmyA1x36DqoZsL67A3lb8J6tHqytj7pm5COgZfQLI2Tslvo1Q84H0fVTLZ9ESDAxgURM4Em5qbSMLTejUqofitvYRJ8aCuw3C9upckaWaoCtnpFSyzlTI7U71kitonl2ngocgFDnLL5k2XnZKd8vJwn2a-ORsg4XYTsHPzyzzbojGxSljWqh7uHDEDwJVCFj9D3rx3KXN2Tl_vUTcTFP92jD--fOY4nYgC2_Npih2W2iS7NGek5qUmEtKD170aRwmWBiYxVSHC0S0ivizZT3WZcO38wLywqhefReb2g14L97i5Sj49VCRaJd5m78Spm3MidP0PXSvC_S6LNShXx-q8e1TNYvDaE3KLBPMOEIWv4Qy9CvLTZ_UyHhPp-8bgq6qkcsDIlMW-SOO-Z8IAb0vXPMpg6Rk8ZiSRs-GSiSI0; path=/; HttpOnly"
        }, {
          "name" : "X-SourceFiles",
          "value" : "=?UTF-8?B?RDpcVmlydHVhbE9wdGltaXplci1SZWZhY3RvcmluZ1xDcm9wTWV0cmljcy5Wby5BcGlcQ3JvcE1ldHJpY3MuVm8uQXBpXGFwaVxhZG1pblx2MVx1c2Vyc1w=?="
        }, {
          "name" : "X-Powered-By",
          "value" : "ASP.NET"
        }, {
          "name" : "Date",
          "value" : "Fri, 29 Mar 2019 22:10:11 GMT"
        }, {
          "name" : "Content-Length",
          "value" : "9"
        } ],
        "content" : {
          "size" : 9,
          "mimeType" : "application/json; charset=utf-8",
          "text" : "{\"id\":19}",
          "comment" : ""
        },
        "redirectURL" : "",
        "headersSize" : 887,
        "bodySize" : 9,
        "comment" : ""
      },
      "cache" : { },
      "timings" : {
        "comment" : "",
        "ssl" : -1,
        "connect" : -1,
        "send" : 0,
        "receive" : 0,
        "wait" : 1813,
        "dns" : -1,
        "blocked" : -1
      },
      "serverIPAddress" : "127.0.0.1",
      "comment" : "",
      "_katalonRequestInformation" : {
        "name" : "59",
        "testObjectId" : "Object Repository/VoPro/Account/api_admin_v1_users",
        "harId" : "0745198b-adaf-42df-9c73-79ac81f15613"
      },
      "time" : 1814
    } ],
    "comment" : ""
  }
}