{
  "log" : {
    "version" : "1.2",
    "creator" : {
      "name" : "BrowserMob Proxy",
      "version" : "2.1.5",
      "comment" : ""
    },
    "pages" : [ {
      "id" : "Page 0",
      "startedDateTime" : "2019-04-01T13:38:31.957Z",
      "title" : "Page 0",
      "pageTimings" : {
        "onLoad" : 1947,
        "comment" : ""
      },
      "comment" : ""
    } ],
    "entries" : [ {
      "pageref" : "Page 0",
      "startedDateTime" : "2019-04-01T13:38:31.959Z",
      "request" : {
        "method" : "PUT",
        "url" : "http://localhost:10520/WebAPI/api/admin/v1/users/28?",
        "httpVersion" : "HTTP/1.1",
        "cookies" : [ ],
        "headers" : [ {
          "name" : "User-Agent",
          "value" : "Katalon Studio"
        }, {
          "name" : "Content-Type",
          "value" : "application/x-www-form-urlencoded"
        }, {
          "name" : "Authorization",
          "value" : "Bearer eyJ0eXAiOiJKV1QiLCJhbGciOiJIUzI1NiJ9.eyJ1bmlxdWVfbmFtZSI6ImFkbWluIiwicm9sZSI6InVzZXIiLCJzdWIiOiJhZG1pbiIsImlzcyI6IkNyb3BNZXRyaWNzIiwiYXVkIjoiYWxsIiwiZXhwIjoxNTU0MTI5ODExLCJuYmYiOjE1NTQxMjU5MTF9.w5L5dR_Di90Fag_VX-NcpjLxBcPuytINp3sTkSP4q-Y"
        }, {
          "name" : "Host",
          "value" : "localhost:10520"
        }, {
          "name" : "Accept",
          "value" : "text/html, image/gif, image/jpeg, *; q=.2, */*; q=.2"
        }, {
          "name" : "Proxy-Connection",
          "value" : "keep-alive"
        }, {
          "name" : "Content-Length",
          "value" : "336"
        } ],
        "queryString" : [ ],
        "postData" : {
          "mimeType" : "application/x-www-form-urlencoded",
          "params" : [ {
            "name" : "password",
            "value" : "cropmetrics",
            "comment" : ""
          }, {
            "name" : "email",
            "value" : "cropmetricsvo.statespaces@gmail.com",
            "comment" : ""
          }, {
            "name" : "fullname",
            "value" : "x",
            "comment" : ""
          }, {
            "name" : "phone",
            "value" : "1",
            "comment" : ""
          }, {
            "name" : "dealer",
            "value" : "xx",
            "comment" : ""
          }, {
            "name" : "addressLine1",
            "value" : "address line 1 test validation",
            "comment" : ""
          }, {
            "name" : "addressLine2",
            "value" : "address line 2 test validation",
            "comment" : ""
          }, {
            "name" : "town",
            "value" : "townValidation",
            "comment" : ""
          }, {
            "name" : "state",
            "value" : " state Validation Updated   state Validation Updated  ",
            "comment" : ""
          }, {
            "name" : "zip",
            "value" : "zipValidation",
            "comment" : ""
          }, {
            "name" : "country",
            "value" : "countryValidation",
            "comment" : ""
          }, {
            "name" : "roles",
            "value" : "Client",
            "comment" : ""
          }, {
            "name" : "userProfileId",
            "value" : "28",
            "comment" : ""
          } ],
          "comment" : ""
        },
        "headersSize" : 545,
        "bodySize" : 336,
        "comment" : ""
      },
      "response" : {
        "status" : 200,
        "statusText" : "OK",
        "httpVersion" : "HTTP/1.1",
        "cookies" : [ {
          "name" : ".ASPROLES",
          "value" : "IHA-TE7yRwLEku-sSNxe9rVZbMvSgZy5lr-a-ekK-6WJvPsJoPtNzXe-NV0ZgBxjAydLipxfXzZrtU_9Y8klS0xjFx5oYSnNNOb0KTpTPogZlpppXADWPqUV6CPRNYlcczOtR_IXJ09RoeVKg29v7xfeg74W6GILOaALtjG3YbA15VP8DstnfW4nFP6kKEfiAXjw3s6NTXKyTz6ANT5kvVwN36izKICnMigUlJTJ3e9lIOEj2XoAhhujK4MvDdCTFTeEd4rYgb3WIXtIhX2uRS36rrqzMk1ZSG4Y5Pc70BuR_1hBnlWmZRziQyvRyraGa2BgssItVG0Twbvj7mBVYdUHyweeULoaapMzSweFiAYg6xGOlhTjDwLBK5htW_IGrAWbZl5FdLkzq8yxIc5Y0jepz2j9dat8ZGOj_k8GS_ZWF6E12cpEYnm0JBMv77WjvIk1QifhSFffUDEVy8nCb-44_e3B6696xvPg9K37lNR0gsGG0",
          "path" : "/",
          "httpOnly" : true,
          "secure" : false,
          "comment" : ""
        } ],
        "headers" : [ {
          "name" : "Cache-Control",
          "value" : "private"
        }, {
          "name" : "Server",
          "value" : "Microsoft-IIS/10.0"
        }, {
          "name" : "Set-Cookie",
          "value" : ".ASPROLES=IHA-TE7yRwLEku-sSNxe9rVZbMvSgZy5lr-a-ekK-6WJvPsJoPtNzXe-NV0ZgBxjAydLipxfXzZrtU_9Y8klS0xjFx5oYSnNNOb0KTpTPogZlpppXADWPqUV6CPRNYlcczOtR_IXJ09RoeVKg29v7xfeg74W6GILOaALtjG3YbA15VP8DstnfW4nFP6kKEfiAXjw3s6NTXKyTz6ANT5kvVwN36izKICnMigUlJTJ3e9lIOEj2XoAhhujK4MvDdCTFTeEd4rYgb3WIXtIhX2uRS36rrqzMk1ZSG4Y5Pc70BuR_1hBnlWmZRziQyvRyraGa2BgssItVG0Twbvj7mBVYdUHyweeULoaapMzSweFiAYg6xGOlhTjDwLBK5htW_IGrAWbZl5FdLkzq8yxIc5Y0jepz2j9dat8ZGOj_k8GS_ZWF6E12cpEYnm0JBMv77WjvIk1QifhSFffUDEVy8nCb-44_e3B6696xvPg9K37lNR0gsGG0; path=/; HttpOnly"
        }, {
          "name" : "X-SourceFiles",
          "value" : "=?UTF-8?B?RDpcVmlydHVhbE9wdGltaXplci1SZWZhY3RvcmluZ1xDcm9wTWV0cmljcy5Wby5BcGlcQ3JvcE1ldHJpY3MuVm8uQXBpXGFwaVxhZG1pblx2MVx1c2Vyc1wyOA==?="
        }, {
          "name" : "X-Powered-By",
          "value" : "ASP.NET"
        }, {
          "name" : "Date",
          "value" : "Mon, 01 Apr 2019 13:38:33 GMT"
        }, {
          "name" : "Content-Length",
          "value" : "0"
        } ],
        "content" : {
          "size" : 0,
          "mimeType" : "",
          "text" : "",
          "encoding" : "base64",
          "comment" : ""
        },
        "redirectURL" : "",
        "headersSize" : 844,
        "bodySize" : 0,
        "comment" : ""
      },
      "cache" : { },
      "timings" : {
        "comment" : "",
        "blocked" : -1,
        "connect" : -1,
        "dns" : -1,
        "ssl" : -1,
        "send" : 0,
        "wait" : 1900,
        "receive" : 0
      },
      "serverIPAddress" : "127.0.0.1",
      "comment" : "",
      "_katalonRequestInformation" : {
        "name" : "47",
        "testObjectId" : "Object Repository/VoPro/Account/api_admin_v1_users_userprofileid",
        "harId" : "441d0d26-d65c-447c-9e15-e8a3a0857caa"
      },
      "time" : 1901
    } ],
    "comment" : ""
  }
}