{
  "log" : {
    "version" : "1.2",
    "creator" : {
      "name" : "BrowserMob Proxy",
      "version" : "2.1.5",
      "comment" : ""
    },
    "pages" : [ {
      "id" : "Page 0",
      "startedDateTime" : "2019-03-29T22:13:25.673Z",
      "title" : "Page 0",
      "pageTimings" : {
        "onLoad" : 1856,
        "comment" : ""
      },
      "comment" : ""
    } ],
    "entries" : [ {
      "pageref" : "Page 0",
      "startedDateTime" : "2019-03-29T22:13:25.674Z",
      "request" : {
        "method" : "PUT",
        "url" : "http://localhost:10520/WebAPI/api/admin/v1/users/14?",
        "httpVersion" : "HTTP/1.1",
        "cookies" : [ ],
        "headers" : [ {
          "name" : "User-Agent",
          "value" : "Katalon Studio"
        }, {
          "name" : "Content-Type",
          "value" : "application/x-www-form-urlencoded"
        }, {
          "name" : "Authorization",
          "value" : "Bearer eyJ0eXAiOiJKV1QiLCJhbGciOiJIUzI1NiJ9.eyJ1bmlxdWVfbmFtZSI6ImFkbWluIiwicm9sZSI6InVzZXIiLCJzdWIiOiJhZG1pbiIsImlzcyI6IkNyb3BNZXRyaWNzIiwiYXVkIjoiYWxsIiwiZXhwIjoxNTUzOTAxNTA1LCJuYmYiOjE1NTM4OTc2MDV9.uBxOK9-fW2-Rk8EstDGbvi-d7nFJD4CZWSwFyqOpm0U"
        }, {
          "name" : "Host",
          "value" : "localhost:10520"
        }, {
          "name" : "Accept",
          "value" : "text/html, image/gif, image/jpeg, *; q=.2, */*; q=.2"
        }, {
          "name" : "Proxy-Connection",
          "value" : "keep-alive"
        }, {
          "name" : "Content-Length",
          "value" : "329"
        } ],
        "queryString" : [ ],
        "postData" : {
          "mimeType" : "application/x-www-form-urlencoded",
          "params" : [ {
            "name" : "password",
            "value" : "!!!!!!!!",
            "comment" : ""
          }, {
            "name" : "email",
            "value" : "cropmetricsvo.passwithsymbols@gmail.com",
            "comment" : ""
          }, {
            "name" : "fullname",
            "value" : "test validation",
            "comment" : ""
          }, {
            "name" : "phone",
            "value" : "123",
            "comment" : ""
          }, {
            "name" : "dealer",
            "value" : "x",
            "comment" : ""
          }, {
            "name" : "addressLine1",
            "value" : "address line 1 test validation",
            "comment" : ""
          }, {
            "name" : "addressLine2",
            "value" : "address line 2 test validation",
            "comment" : ""
          }, {
            "name" : "town",
            "value" : "townValidation",
            "comment" : ""
          }, {
            "name" : "state",
            "value" : "stateValidation",
            "comment" : ""
          }, {
            "name" : "zip",
            "value" : "zipValidation",
            "comment" : ""
          }, {
            "name" : "country",
            "value" : "countryValidation",
            "comment" : ""
          }, {
            "name" : "roles",
            "value" : "Client",
            "comment" : ""
          }, {
            "name" : "userProfileId",
            "value" : "14",
            "comment" : ""
          } ],
          "comment" : ""
        },
        "headersSize" : 545,
        "bodySize" : 329,
        "comment" : ""
      },
      "response" : {
        "status" : 200,
        "statusText" : "OK",
        "httpVersion" : "HTTP/1.1",
        "cookies" : [ {
          "name" : ".ASPROLES",
          "value" : "SwtRhhJy6JAXZHmDcXwqBUF-fqm4wG1cODNIr6SKrgsPaW2c0V1NFCDrmBROzKX5PR1RslInNQFnp0nf8i-qdqMat5--Vq6OC35NLHNmFWT2Oexsn6F0dnPIvVY4Au1TIPSYwn3au-NpWcMrdTUeIpMIOlb3UpE4gg-9ikebpVGLjJSqC311iS4jC9Kd-RYBsBf7zQhxyGjCfLtEiSi7nTn_mk3KgK8sz1PWu_0j7qmQ_HyZq5pt4Fz9F5faNx5ZSbpR2Tq079gJGl5zd9qFEnrZ3bXLcQgm4PusvHj1wb9vyl9SM-M9Gh2Q0M2JxbvMuKoaiB1CQq09v20IRo0SiBrOard1M50Wp25VEr09kkUHipM0IyqErzzDKCJTNHY-ovvhkTom5Z4a_wH4nsZ3WpK5M8joxGfDzYe_MqJpuV-flAMEVGed0Hz_9aVWkPnjFoaM_GDraSB0ambRO4ZstvQDqSLt_lBmmRMu5Dk3_xlLtV0b0",
          "path" : "/",
          "httpOnly" : true,
          "secure" : false,
          "comment" : ""
        } ],
        "headers" : [ {
          "name" : "Cache-Control",
          "value" : "private"
        }, {
          "name" : "Server",
          "value" : "Microsoft-IIS/10.0"
        }, {
          "name" : "Set-Cookie",
          "value" : ".ASPROLES=SwtRhhJy6JAXZHmDcXwqBUF-fqm4wG1cODNIr6SKrgsPaW2c0V1NFCDrmBROzKX5PR1RslInNQFnp0nf8i-qdqMat5--Vq6OC35NLHNmFWT2Oexsn6F0dnPIvVY4Au1TIPSYwn3au-NpWcMrdTUeIpMIOlb3UpE4gg-9ikebpVGLjJSqC311iS4jC9Kd-RYBsBf7zQhxyGjCfLtEiSi7nTn_mk3KgK8sz1PWu_0j7qmQ_HyZq5pt4Fz9F5faNx5ZSbpR2Tq079gJGl5zd9qFEnrZ3bXLcQgm4PusvHj1wb9vyl9SM-M9Gh2Q0M2JxbvMuKoaiB1CQq09v20IRo0SiBrOard1M50Wp25VEr09kkUHipM0IyqErzzDKCJTNHY-ovvhkTom5Z4a_wH4nsZ3WpK5M8joxGfDzYe_MqJpuV-flAMEVGed0Hz_9aVWkPnjFoaM_GDraSB0ambRO4ZstvQDqSLt_lBmmRMu5Dk3_xlLtV0b0; path=/; HttpOnly"
        }, {
          "name" : "X-SourceFiles",
          "value" : "=?UTF-8?B?RDpcVmlydHVhbE9wdGltaXplci1SZWZhY3RvcmluZ1xDcm9wTWV0cmljcy5Wby5BcGlcQ3JvcE1ldHJpY3MuVm8uQXBpXGFwaVxhZG1pblx2MVx1c2Vyc1wxNA==?="
        }, {
          "name" : "X-Powered-By",
          "value" : "ASP.NET"
        }, {
          "name" : "Date",
          "value" : "Fri, 29 Mar 2019 22:13:27 GMT"
        }, {
          "name" : "Content-Length",
          "value" : "0"
        } ],
        "content" : {
          "size" : 0,
          "mimeType" : "",
          "text" : "",
          "encoding" : "base64",
          "comment" : ""
        },
        "redirectURL" : "",
        "headersSize" : 844,
        "bodySize" : 0,
        "comment" : ""
      },
      "cache" : { },
      "timings" : {
        "comment" : "",
        "connect" : -1,
        "wait" : 1851,
        "receive" : 0,
        "dns" : -1,
        "send" : 0,
        "blocked" : -1,
        "ssl" : -1
      },
      "serverIPAddress" : "127.0.0.1",
      "comment" : "",
      "_katalonRequestInformation" : {
        "name" : "13",
        "testObjectId" : "Object Repository/VoPro/Account/api_admin_v1_users_userprofileid",
        "harId" : "652d9c05-fb36-45b3-a429-164784634f98"
      },
      "time" : 1852
    } ],
    "comment" : ""
  }
}