{
  "log" : {
    "version" : "1.2",
    "creator" : {
      "name" : "BrowserMob Proxy",
      "version" : "2.1.5",
      "comment" : ""
    },
    "pages" : [ {
      "id" : "Page 0",
      "startedDateTime" : "2019-03-29T22:27:13.978Z",
      "title" : "Page 0",
      "pageTimings" : {
        "onLoad" : 1835,
        "comment" : ""
      },
      "comment" : ""
    } ],
    "entries" : [ {
      "pageref" : "Page 0",
      "startedDateTime" : "2019-03-29T22:27:13.979Z",
      "request" : {
        "method" : "POST",
        "url" : "http://localhost:10520/WebAPI/api/admin/v1/users/?",
        "httpVersion" : "HTTP/1.1",
        "cookies" : [ ],
        "headers" : [ {
          "name" : "User-Agent",
          "value" : "Katalon Studio"
        }, {
          "name" : "Content-Type",
          "value" : "application/x-www-form-urlencoded"
        }, {
          "name" : "Authorization",
          "value" : "Bearer eyJ0eXAiOiJKV1QiLCJhbGciOiJIUzI1NiJ9.eyJ1bmlxdWVfbmFtZSI6ImFkbWluIiwicm9sZSI6InVzZXIiLCJzdWIiOiJhZG1pbiIsImlzcyI6IkNyb3BNZXRyaWNzIiwiYXVkIjoiYWxsIiwiZXhwIjoxNTUzOTAyMzMzLCJuYmYiOjE1NTM4OTg0MzN9.sfko8cAKqLYDe1btzRd4U1eRn7wPH5EHV4of7D_LFEs"
        }, {
          "name" : "Host",
          "value" : "localhost:10520"
        }, {
          "name" : "Accept",
          "value" : "text/html, image/gif, image/jpeg, *; q=.2, */*; q=.2"
        }, {
          "name" : "Proxy-Connection",
          "value" : "keep-alive"
        }, {
          "name" : "Content-Length",
          "value" : "286"
        } ],
        "queryString" : [ ],
        "postData" : {
          "mimeType" : "application/x-www-form-urlencoded",
          "params" : [ {
            "name" : "password",
            "value" : "cropmetrics",
            "comment" : ""
          }, {
            "name" : "email",
            "value" : "cropmetricsvo.zipnumber@gmail.com",
            "comment" : ""
          }, {
            "name" : "fullname",
            "value" : "test validation",
            "comment" : ""
          }, {
            "name" : "phone",
            "value" : "123",
            "comment" : ""
          }, {
            "name" : "dealer",
            "value" : "x",
            "comment" : ""
          }, {
            "name" : "addressLine1",
            "value" : "address line 1 test validation",
            "comment" : ""
          }, {
            "name" : "addressLine2",
            "value" : "address line 2 test validation",
            "comment" : ""
          }, {
            "name" : "town",
            "value" : "townValidation",
            "comment" : ""
          }, {
            "name" : "state",
            "value" : "stateValidation",
            "comment" : ""
          }, {
            "name" : "zip",
            "value" : "123457",
            "comment" : ""
          }, {
            "name" : "country",
            "value" : "countryValidation",
            "comment" : ""
          }, {
            "name" : "roles",
            "value" : "Client",
            "comment" : ""
          } ],
          "comment" : ""
        },
        "headersSize" : 544,
        "bodySize" : 286,
        "comment" : ""
      },
      "response" : {
        "status" : 200,
        "statusText" : "OK",
        "httpVersion" : "HTTP/1.1",
        "cookies" : [ {
          "name" : ".ASPROLES",
          "value" : "20GZI-GWVOLNG0YZVzsbLDL2Cbz4Dya6_axRXMgPAT5A0BQL18AVz8rvOe-l3r3zxKhITj5W6449LVQWJ0yyozLGiMp9Yk5vODmUvg-HcFWk0Dj6_I-rh7uZc2xuEYZCuo6a0zFP_p4m5spXw8OTp4xXsbvA4Ih3mgrycwUbQmd3yXCDzVWCcqWQJd1bHRMVysiJHhxPVOEo-VL_vwH1zadxiI4RkvTPbkGY1t63qKkClduqhKjrqukWjgkPq_U-hUj75wibdnIzOjtGK7thCb-IdFjq1LpQXi39gMS1a4DyG0sgybE-6rjXK2P8a-oH-um7gsjf1SoJOdEY5AHg-ff9L1f-wSDSZkBF6hx8E3Qr4fNhWaZjou_xEFVBGTmvnEpQdYFeWxIqUfj33JNhghbrgAQyx8DiB8U0vMVnIAAgSMo1mV_yc1DjoD3ZKDTvnvjXZdRe_M2hWuLO-7xRYqfomsE5FGnerV56VVRkLCcFc50t0",
          "path" : "/",
          "httpOnly" : true,
          "secure" : false,
          "comment" : ""
        } ],
        "headers" : [ {
          "name" : "Cache-Control",
          "value" : "private"
        }, {
          "name" : "Content-Type",
          "value" : "application/json; charset=utf-8"
        }, {
          "name" : "Server",
          "value" : "Microsoft-IIS/10.0"
        }, {
          "name" : "Set-Cookie",
          "value" : ".ASPROLES=20GZI-GWVOLNG0YZVzsbLDL2Cbz4Dya6_axRXMgPAT5A0BQL18AVz8rvOe-l3r3zxKhITj5W6449LVQWJ0yyozLGiMp9Yk5vODmUvg-HcFWk0Dj6_I-rh7uZc2xuEYZCuo6a0zFP_p4m5spXw8OTp4xXsbvA4Ih3mgrycwUbQmd3yXCDzVWCcqWQJd1bHRMVysiJHhxPVOEo-VL_vwH1zadxiI4RkvTPbkGY1t63qKkClduqhKjrqukWjgkPq_U-hUj75wibdnIzOjtGK7thCb-IdFjq1LpQXi39gMS1a4DyG0sgybE-6rjXK2P8a-oH-um7gsjf1SoJOdEY5AHg-ff9L1f-wSDSZkBF6hx8E3Qr4fNhWaZjou_xEFVBGTmvnEpQdYFeWxIqUfj33JNhghbrgAQyx8DiB8U0vMVnIAAgSMo1mV_yc1DjoD3ZKDTvnvjXZdRe_M2hWuLO-7xRYqfomsE5FGnerV56VVRkLCcFc50t0; path=/; HttpOnly"
        }, {
          "name" : "X-SourceFiles",
          "value" : "=?UTF-8?B?RDpcVmlydHVhbE9wdGltaXplci1SZWZhY3RvcmluZ1xDcm9wTWV0cmljcy5Wby5BcGlcQ3JvcE1ldHJpY3MuVm8uQXBpXGFwaVxhZG1pblx2MVx1c2Vyc1w=?="
        }, {
          "name" : "X-Powered-By",
          "value" : "ASP.NET"
        }, {
          "name" : "Date",
          "value" : "Fri, 29 Mar 2019 22:27:15 GMT"
        }, {
          "name" : "Content-Length",
          "value" : "9"
        } ],
        "content" : {
          "size" : 9,
          "mimeType" : "application/json; charset=utf-8",
          "text" : "{\"id\":34}",
          "comment" : ""
        },
        "redirectURL" : "",
        "headersSize" : 887,
        "bodySize" : 9,
        "comment" : ""
      },
      "cache" : { },
      "timings" : {
        "comment" : "",
        "ssl" : -1,
        "wait" : 1830,
        "send" : 0,
        "receive" : 0,
        "dns" : -1,
        "connect" : -1,
        "blocked" : -1
      },
      "serverIPAddress" : "127.0.0.1",
      "comment" : "",
      "_katalonRequestInformation" : {
        "name" : "89",
        "testObjectId" : "Object Repository/VoPro/Account/api_admin_v1_users",
        "harId" : "ee4fdf46-9e61-4fba-aa7c-e3790a8a293b"
      },
      "time" : 1831
    } ],
    "comment" : ""
  }
}