{
  "log" : {
    "version" : "1.2",
    "creator" : {
      "name" : "BrowserMob Proxy",
      "version" : "2.1.5",
      "comment" : ""
    },
    "pages" : [ {
      "id" : "Page 0",
      "startedDateTime" : "2019-04-11T16:03:36.293Z",
      "title" : "Page 0",
      "pageTimings" : {
        "onLoad" : 3269,
        "comment" : ""
      },
      "comment" : ""
    } ],
    "entries" : [ {
      "pageref" : "Page 0",
      "startedDateTime" : "2019-04-11T16:03:36.294Z",
      "request" : {
        "method" : "POST",
        "url" : "http://localhost:10520/WebAPI/api/mobile/v1/farms/?",
        "httpVersion" : "HTTP/1.1",
        "cookies" : [ ],
        "headers" : [ {
          "name" : "User-Agent",
          "value" : "Katalon Studio"
        }, {
          "name" : "Content-Type",
          "value" : "application/json"
        }, {
          "name" : "Authorization",
          "value" : "Bearer eyJ0eXAiOiJKV1QiLCJhbGciOiJIUzI1NiJ9.eyJ1bmlxdWVfbmFtZSI6Implbm55Lm1hbGRvbmFkby50eDFAZ21haWwuY29tIiwicm9sZSI6InVzZXIiLCJzdWIiOiJqZW5ueS5tYWxkb25hZG8udHgxQGdtYWlsLmNvbSIsImlzcyI6IkNyb3BNZXRyaWNzIiwiYXVkIjoiYWxsIiwiZXhwIjoxNTU1MDAyNTE2LCJuYmYiOjE1NTQ5OTg2MTZ9.4y7td7bfgHgC96bpGAUPNMAtExjqlGRDL7fWmf5f2_Y"
        }, {
          "name" : "Host",
          "value" : "localhost:10520"
        }, {
          "name" : "Accept",
          "value" : "text/html, image/gif, image/jpeg, *; q=.2, */*; q=.2"
        }, {
          "name" : "Proxy-Connection",
          "value" : "keep-alive"
        }, {
          "name" : "Content-Length",
          "value" : "30"
        } ],
        "queryString" : [ ],
        "postData" : {
          "mimeType" : "application/json",
          "text" : "{\"name\": \"    \", \"user_id\": 2}",
          "comment" : ""
        },
        "headersSize" : 591,
        "bodySize" : 30,
        "comment" : ""
      },
      "response" : {
        "status" : 400,
        "statusText" : "Bad Request",
        "httpVersion" : "HTTP/1.1",
        "cookies" : [ {
          "name" : ".ASPROLES",
          "value" : "qCcnlEvMZFaRIcjiSwhsNJWZEV3bX3HimmjR_Kg1Teb-lXooJFwJvnfI8kSzbOcVYuzilRmf3W4ACzLNczeFXvsm4fiNwJ6IoaFt2JF0uAwxFumt4eSZlesIpx_KpUVBPXCPKdHkeVPn_GRz9RJylOJKh6pYNYLZtf4yttccv-DflkiGdVYACiDH6HKHdFCTe3ZQ8EirPYolaai8AjM3QH5zdkTtJ-Y0ROoF2E6OhMH0MfmrO_FOuywwOwAqmErFgJnU4Z1-cuIzgdyUO-_9-wpnocUl_u_eDl6S6YXtRj2M6RZszhkvuNJetQpMJwsPHCKkUo5BGfzZb33oYUQgynH_Hrq14mzSb7mWrQpNEy9ftYwHHRY5DFUoOxvZD9m__dPczGNziSGvTEzVdXEnrgmzIcm6F0QfnTcKA58fIkWRiYItC20r_QKPwygBMicmZTUBA3Tmv0flEblY0enkmXPkBH5uBrVWT0aPlilo_z4K-Ba8-zWCKgOzOuNx-tvF_sfA4EKujLIAcqqUMGd08MPSQps1",
          "path" : "/",
          "httpOnly" : true,
          "secure" : false,
          "comment" : ""
        } ],
        "headers" : [ {
          "name" : "Cache-Control",
          "value" : "private"
        }, {
          "name" : "Content-Type",
          "value" : "application/json; charset=utf-8"
        }, {
          "name" : "Server",
          "value" : "Microsoft-IIS/10.0"
        }, {
          "name" : "Set-Cookie",
          "value" : ".ASPROLES=qCcnlEvMZFaRIcjiSwhsNJWZEV3bX3HimmjR_Kg1Teb-lXooJFwJvnfI8kSzbOcVYuzilRmf3W4ACzLNczeFXvsm4fiNwJ6IoaFt2JF0uAwxFumt4eSZlesIpx_KpUVBPXCPKdHkeVPn_GRz9RJylOJKh6pYNYLZtf4yttccv-DflkiGdVYACiDH6HKHdFCTe3ZQ8EirPYolaai8AjM3QH5zdkTtJ-Y0ROoF2E6OhMH0MfmrO_FOuywwOwAqmErFgJnU4Z1-cuIzgdyUO-_9-wpnocUl_u_eDl6S6YXtRj2M6RZszhkvuNJetQpMJwsPHCKkUo5BGfzZb33oYUQgynH_Hrq14mzSb7mWrQpNEy9ftYwHHRY5DFUoOxvZD9m__dPczGNziSGvTEzVdXEnrgmzIcm6F0QfnTcKA58fIkWRiYItC20r_QKPwygBMicmZTUBA3Tmv0flEblY0enkmXPkBH5uBrVWT0aPlilo_z4K-Ba8-zWCKgOzOuNx-tvF_sfA4EKujLIAcqqUMGd08MPSQps1; path=/; HttpOnly"
        }, {
          "name" : "X-SourceFiles",
          "value" : "=?UTF-8?B?RDpcVmlydHVhbE9wdGltaXplci1SZWZhY3RvcmluZ1xDcm9wTWV0cmljcy5Wby5BcGlcQ3JvcE1ldHJpY3MuVm8uQXBpXGFwaVxtb2JpbGVcdjFcZmFybXNc?="
        }, {
          "name" : "X-Powered-By",
          "value" : "ASP.NET"
        }, {
          "name" : "Date",
          "value" : "Thu, 11 Apr 2019 16:03:39 GMT"
        }, {
          "name" : "Content-Length",
          "value" : "45"
        } ],
        "content" : {
          "size" : 45,
          "mimeType" : "application/json; charset=utf-8",
          "text" : "{\"message\":\"The farm name must be provided.\"}",
          "comment" : ""
        },
        "redirectURL" : "",
        "headersSize" : 940,
        "bodySize" : 45,
        "comment" : ""
      },
      "cache" : { },
      "timings" : {
        "comment" : "",
        "ssl" : -1,
        "send" : 0,
        "dns" : -1,
        "blocked" : -1,
        "connect" : -1,
        "wait" : 3247,
        "receive" : 0
      },
      "serverIPAddress" : "127.0.0.1",
      "comment" : "",
      "_katalonRequestInformation" : {
        "name" : "13",
        "testObjectId" : "Object Repository/VoGrow/Farm/FarmPost",
        "harId" : "8cc65558-14c1-4ddb-a65e-1175e2844ed2"
      },
      "time" : 3248
    } ],
    "comment" : ""
  }
}