{
  "log" : {
    "version" : "1.2",
    "creator" : {
      "name" : "BrowserMob Proxy",
      "version" : "2.1.5",
      "comment" : ""
    },
    "pages" : [ {
      "id" : "Page 0",
      "startedDateTime" : "2019-03-29T13:22:21.103Z",
      "title" : "Page 0",
      "pageTimings" : {
        "onLoad" : 1332,
        "comment" : ""
      },
      "comment" : ""
    } ],
    "entries" : [ {
      "pageref" : "Page 0",
      "startedDateTime" : "2019-03-29T13:22:21.103Z",
      "request" : {
        "method" : "PUT",
        "url" : "http://localhost:10520/WebAPI/api/admin/v1/users/15?",
        "httpVersion" : "HTTP/1.1",
        "cookies" : [ ],
        "headers" : [ {
          "name" : "User-Agent",
          "value" : "Katalon Studio"
        }, {
          "name" : "Content-Type",
          "value" : "application/x-www-form-urlencoded"
        }, {
          "name" : "Authorization",
          "value" : "Bearer eyJ0eXAiOiJKV1QiLCJhbGciOiJIUzI1NiJ9.eyJ1bmlxdWVfbmFtZSI6ImFkbWluIiwicm9sZSI6InVzZXIiLCJzdWIiOiJhZG1pbiIsImlzcyI6IkNyb3BNZXRyaWNzIiwiYXVkIjoiYWxsIiwiZXhwIjoxNTUzODY5NjQxLCJuYmYiOjE1NTM4NjU3NDF9.h4gbTpkmTlOESwbkZiRkRmhAX4NKMcK2sNXki6f2GtI"
        }, {
          "name" : "Host",
          "value" : "localhost:10520"
        }, {
          "name" : "Accept",
          "value" : "text/html, image/gif, image/jpeg, *; q=.2, */*; q=.2"
        }, {
          "name" : "Proxy-Connection",
          "value" : "keep-alive"
        }, {
          "name" : "Content-Length",
          "value" : "329"
        } ],
        "queryString" : [ ],
        "postData" : {
          "mimeType" : "application/x-www-form-urlencoded",
          "params" : [ {
            "name" : "password",
            "value" : "!!!!!!!!",
            "comment" : ""
          }, {
            "name" : "email",
            "value" : "cropmetricsvo.passwithsymbols@gmail.com",
            "comment" : ""
          }, {
            "name" : "fullname",
            "value" : "test validation",
            "comment" : ""
          }, {
            "name" : "phone",
            "value" : "123",
            "comment" : ""
          }, {
            "name" : "dealer",
            "value" : "x",
            "comment" : ""
          }, {
            "name" : "addressLine1",
            "value" : "address line 1 test validation",
            "comment" : ""
          }, {
            "name" : "addressLine2",
            "value" : "address line 2 test validation",
            "comment" : ""
          }, {
            "name" : "town",
            "value" : "townValidation",
            "comment" : ""
          }, {
            "name" : "state",
            "value" : "stateValidation",
            "comment" : ""
          }, {
            "name" : "zip",
            "value" : "zipValidation",
            "comment" : ""
          }, {
            "name" : "country",
            "value" : "countryValidation",
            "comment" : ""
          }, {
            "name" : "roles",
            "value" : "Client",
            "comment" : ""
          }, {
            "name" : "userProfileId",
            "value" : "15",
            "comment" : ""
          } ],
          "comment" : ""
        },
        "headersSize" : 545,
        "bodySize" : 329,
        "comment" : ""
      },
      "response" : {
        "status" : 200,
        "statusText" : "OK",
        "httpVersion" : "HTTP/1.1",
        "cookies" : [ {
          "name" : ".ASPROLES",
          "value" : "9MVGM7s5pJgiPSsxJucOA0QvkrQw_C0gE1anDgGeRWDTNV9KfGH94leUPNfwGMNGLZ5k0U1eEo7Octjl_XuWYPkgpP9KgxJep8mgaQ1aRP3Ohc8qHIhSZcq5FnQCtSb1mrADxd0Md13RXY8JFYlv4xgg301dYyO9g1zj6bboeMyX1AloB6nNckuDK21536LQSrCNgG63k6UGua5IJmoM97Cqh190eh0I1EPeoeUrBMLYxPoc7HY7igB68srOOzNQLLbSiZrsByD5e8rxtRT_PEa70sxWXBe1JdP2ySXCK_AxBtUvr-FqkuXkhUY7EDt1tnJJoAkN7YzZrbPA0AW-MSeL92-wF_zOA4AKL1-1NqpI_H6jreLxnCL4gOzZ9-E79mu5LumeKOiuQqayygoXP67GsUei3EEtpcHbBxi7Cc0aRhufkuadXuoGxY1NaoKRLCePiMO-hBi1SQ8SJI88RpkXdCjnPz7KF04pOINkxcV92aOq0",
          "path" : "/",
          "httpOnly" : true,
          "secure" : false,
          "comment" : ""
        } ],
        "headers" : [ {
          "name" : "Cache-Control",
          "value" : "private"
        }, {
          "name" : "Server",
          "value" : "Microsoft-IIS/10.0"
        }, {
          "name" : "Set-Cookie",
          "value" : ".ASPROLES=9MVGM7s5pJgiPSsxJucOA0QvkrQw_C0gE1anDgGeRWDTNV9KfGH94leUPNfwGMNGLZ5k0U1eEo7Octjl_XuWYPkgpP9KgxJep8mgaQ1aRP3Ohc8qHIhSZcq5FnQCtSb1mrADxd0Md13RXY8JFYlv4xgg301dYyO9g1zj6bboeMyX1AloB6nNckuDK21536LQSrCNgG63k6UGua5IJmoM97Cqh190eh0I1EPeoeUrBMLYxPoc7HY7igB68srOOzNQLLbSiZrsByD5e8rxtRT_PEa70sxWXBe1JdP2ySXCK_AxBtUvr-FqkuXkhUY7EDt1tnJJoAkN7YzZrbPA0AW-MSeL92-wF_zOA4AKL1-1NqpI_H6jreLxnCL4gOzZ9-E79mu5LumeKOiuQqayygoXP67GsUei3EEtpcHbBxi7Cc0aRhufkuadXuoGxY1NaoKRLCePiMO-hBi1SQ8SJI88RpkXdCjnPz7KF04pOINkxcV92aOq0; path=/; HttpOnly"
        }, {
          "name" : "X-SourceFiles",
          "value" : "=?UTF-8?B?RDpcVmlydHVhbE9wdGltaXplci1SZWZhY3RvcmluZ1xDcm9wTWV0cmljcy5Wby5BcGlcQ3JvcE1ldHJpY3MuVm8uQXBpXGFwaVxhZG1pblx2MVx1c2Vyc1wxNQ==?="
        }, {
          "name" : "X-Powered-By",
          "value" : "ASP.NET"
        }, {
          "name" : "Date",
          "value" : "Fri, 29 Mar 2019 13:22:22 GMT"
        }, {
          "name" : "Content-Length",
          "value" : "0"
        } ],
        "content" : {
          "size" : 0,
          "mimeType" : "",
          "text" : "",
          "encoding" : "base64",
          "comment" : ""
        },
        "redirectURL" : "",
        "headersSize" : 844,
        "bodySize" : 0,
        "comment" : ""
      },
      "cache" : { },
      "timings" : {
        "comment" : "",
        "ssl" : -1,
        "receive" : 0,
        "wait" : 1275,
        "connect" : -1,
        "send" : 0,
        "dns" : -1,
        "blocked" : -1
      },
      "serverIPAddress" : "127.0.0.1",
      "comment" : "",
      "_katalonRequestInformation" : {
        "name" : "13",
        "testObjectId" : "Object Repository/VoPro/Account/api_admin_v1_users_userprofileid",
        "harId" : "82e8ed4c-20a4-47fd-93bc-2daf23b26de9"
      },
      "time" : 1276
    } ],
    "comment" : ""
  }
}