{
  "log" : {
    "version" : "1.2",
    "creator" : {
      "name" : "BrowserMob Proxy",
      "version" : "2.1.5",
      "comment" : ""
    },
    "pages" : [ {
      "id" : "Page 0",
      "startedDateTime" : "2019-04-04T18:51:51.596Z",
      "title" : "Page 0",
      "pageTimings" : {
        "onLoad" : 35,
        "comment" : ""
      },
      "comment" : ""
    } ],
    "entries" : [ {
      "pageref" : "Page 0",
      "startedDateTime" : "2019-04-04T18:51:51.596Z",
      "request" : {
        "method" : "POST",
        "url" : "http://localhost:10520/WebAPI/api/mobile/v1/farms/?",
        "httpVersion" : "HTTP/1.1",
        "cookies" : [ ],
        "headers" : [ {
          "name" : "User-Agent",
          "value" : "Katalon Studio"
        }, {
          "name" : "Content-Type",
          "value" : "application/json"
        }, {
          "name" : "Authorization",
          "value" : "Bearer eyJ0eXAiOiJKV1QiLCJhbGciOiJIUzI1NiJ9.eyJ1bmlxdWVfbmFtZSI6Implbm55Lm1hbGRvbmFkby50eDFAZ21haWwuY29tIiwicm9sZSI6InVzZXIiLCJzdWIiOiJqZW5ueS5tYWxkb25hZG8udHgxQGdtYWlsLmNvbSIsImlzcyI6IkNyb3BNZXRyaWNzIiwiYXVkIjoiYWxsIiwiZXhwIjoxNTU0NDA3ODExLCJuYmYiOjE1NTQ0MDM5MTF9.zT7dFs1aZo31jegEfn5ih_kdbyA9OV7i3Sjbm6MkGs8"
        }, {
          "name" : "Host",
          "value" : "localhost:10520"
        }, {
          "name" : "Accept",
          "value" : "text/html, image/gif, image/jpeg, *; q=.2, */*; q=.2"
        }, {
          "name" : "Proxy-Connection",
          "value" : "keep-alive"
        }, {
          "name" : "Content-Length",
          "value" : "154"
        } ],
        "queryString" : [ ],
        "postData" : {
          "mimeType" : "application/json",
          "text" : "{\"name\": \"129 charsWhen new farm has name attribute with more than 128 chars Expected status code 400 API FARM When new farm has name attr\", \"user_id\": 2}",
          "comment" : ""
        },
        "headersSize" : 592,
        "bodySize" : 154,
        "comment" : ""
      },
      "response" : {
        "status" : 201,
        "statusText" : "Created",
        "httpVersion" : "HTTP/1.1",
        "cookies" : [ {
          "name" : ".ASPROLES",
          "value" : "lZmm9-An39bVI_MohFrPoReMERngO4w3zpndXqtqbo_HD5OVtr8YpqLfHDeQINsFw6vy3r3o0lAfxleg4lZi3qFhqLloUvmHhRMIVr3gZmkFkkpkOQauMpKdhb4me38AvGDuEGzcol97o6krrUwXyLoVH6Goy4YDwm5xjrwZT83PjtYGfAhMAH4FXQGZ9UxzttmjrzxarwFI9sWmRgzkwAo9qvR1W68z3BWZb1ka9zzjrQv5jmM4TYi1_xQhVZRKksTxYSX_YjwtsXX1BQNzZvk7wwt2cWXB6B1pdBo8RHppnCPdgjRFIw5hrKrSTIdCnTZnygdk2MDrngyYSf1_DX0ibt398PWYNdlBm3-QD-SKZ6BQJ59KVbNFU-qMYBxKGrJ7B6xyq0_i_Ut8rKI9xyGOnZ5lS6AGIKnAfwTf2AnAyxGvB4obKNoUXgCCZ-e6H7iNYJGiwSs1F-iESASr2CHrSsDE861izQpVjKWyY-me_mwyS9qrCbLCyYCXwWsdzd4AfSA6YJlwgMykD62tB-dbIl81",
          "path" : "/",
          "httpOnly" : true,
          "secure" : false,
          "comment" : ""
        } ],
        "headers" : [ {
          "name" : "Cache-Control",
          "value" : "private"
        }, {
          "name" : "Content-Type",
          "value" : "application/json; charset=utf-8"
        }, {
          "name" : "Location",
          "value" : "api/mobile/v1/farms/3"
        }, {
          "name" : "Server",
          "value" : "Microsoft-IIS/10.0"
        }, {
          "name" : "Set-Cookie",
          "value" : ".ASPROLES=lZmm9-An39bVI_MohFrPoReMERngO4w3zpndXqtqbo_HD5OVtr8YpqLfHDeQINsFw6vy3r3o0lAfxleg4lZi3qFhqLloUvmHhRMIVr3gZmkFkkpkOQauMpKdhb4me38AvGDuEGzcol97o6krrUwXyLoVH6Goy4YDwm5xjrwZT83PjtYGfAhMAH4FXQGZ9UxzttmjrzxarwFI9sWmRgzkwAo9qvR1W68z3BWZb1ka9zzjrQv5jmM4TYi1_xQhVZRKksTxYSX_YjwtsXX1BQNzZvk7wwt2cWXB6B1pdBo8RHppnCPdgjRFIw5hrKrSTIdCnTZnygdk2MDrngyYSf1_DX0ibt398PWYNdlBm3-QD-SKZ6BQJ59KVbNFU-qMYBxKGrJ7B6xyq0_i_Ut8rKI9xyGOnZ5lS6AGIKnAfwTf2AnAyxGvB4obKNoUXgCCZ-e6H7iNYJGiwSs1F-iESASr2CHrSsDE861izQpVjKWyY-me_mwyS9qrCbLCyYCXwWsdzd4AfSA6YJlwgMykD62tB-dbIl81; path=/; HttpOnly"
        }, {
          "name" : "X-SourceFiles",
          "value" : "=?UTF-8?B?RDpcVmlydHVhbE9wdGltaXplci1SZWZhY3RvcmluZ1xDcm9wTWV0cmljcy5Wby5BcGlcQ3JvcE1ldHJpY3MuVm8uQXBpXGFwaVxtb2JpbGVcdjFcZmFybXNc?="
        }, {
          "name" : "X-Powered-By",
          "value" : "ASP.NET"
        }, {
          "name" : "Date",
          "value" : "Thu, 04 Apr 2019 18:51:51 GMT"
        }, {
          "name" : "Content-Length",
          "value" : "158"
        } ],
        "content" : {
          "size" : 158,
          "mimeType" : "application/json; charset=utf-8",
          "text" : "{\"id\":3,\"name\":\"129 charsWhen new farm has name attribute with more than 128 chars Expected status code 400 API FARM When new farm has name attr\",\"user_id\":2}",
          "comment" : ""
        },
        "redirectURL" : "",
        "headersSize" : 970,
        "bodySize" : 158,
        "comment" : ""
      },
      "cache" : { },
      "timings" : {
        "comment" : "",
        "receive" : 1,
        "wait" : 30,
        "send" : 0,
        "blocked" : -1,
        "connect" : -1,
        "dns" : -1,
        "ssl" : -1
      },
      "serverIPAddress" : "127.0.0.1",
      "comment" : "",
      "_katalonRequestInformation" : {
        "name" : "11",
        "testObjectId" : "Object Repository/VoGrow/Farm/FarmPost",
        "harId" : "78df94ff-538b-4d21-83df-3f00246de630"
      },
      "time" : 32
    } ],
    "comment" : ""
  }
}