{
  "log" : {
    "version" : "1.2",
    "creator" : {
      "name" : "BrowserMob Proxy",
      "version" : "2.1.5",
      "comment" : ""
    },
    "pages" : [ {
      "id" : "Page 0",
      "startedDateTime" : "2019-04-09T20:45:49.827Z",
      "title" : "Page 0",
      "pageTimings" : {
        "onLoad" : 34846,
        "comment" : ""
      },
      "comment" : ""
    } ],
    "entries" : [ {
      "pageref" : "Page 0",
      "startedDateTime" : "2019-04-09T20:45:49.828Z",
      "request" : {
        "method" : "POST",
        "url" : "http://localhost:10520/WebAPI/api/mobile/v1/fields?",
        "httpVersion" : "HTTP/1.1",
        "cookies" : [ ],
        "headers" : [ {
          "name" : "User-Agent",
          "value" : "Katalon Studio"
        }, {
          "name" : "Content-Type",
          "value" : "application/json"
        }, {
          "name" : "Authorization",
          "value" : "Bearer eyJ0eXAiOiJKV1QiLCJhbGciOiJIUzI1NiJ9.eyJ1bmlxdWVfbmFtZSI6Implbm55Lm1hbGRvbmFkby50eDFAZ21haWwuY29tIiwicm9sZSI6InVzZXIiLCJzdWIiOiJqZW5ueS5tYWxkb25hZG8udHgxQGdtYWlsLmNvbSIsImlzcyI6IkNyb3BNZXRyaWNzIiwiYXVkIjoiYWxsIiwiZXhwIjoxNTU0ODQ2NjQ5LCJuYmYiOjE1NTQ4NDI3NDl9.LQt976FR0s2Syv8VdKUcjotE8EiGny0O8ZJJPrH2-A8"
        }, {
          "name" : "Host",
          "value" : "localhost:10520"
        }, {
          "name" : "Accept",
          "value" : "text/html, image/gif, image/jpeg, *; q=.2, */*; q=.2"
        }, {
          "name" : "Proxy-Connection",
          "value" : "keep-alive"
        }, {
          "name" : "Content-Length",
          "value" : "392"
        } ],
        "queryString" : [ ],
        "postData" : {
          "mimeType" : "application/json",
          "text" : "{\"field\":{\"farm_id\":4,\"name\":\"Field IN FARM ID 4\",\"boundary\":{\"boundaries\":[{\"boundary\":{\"coords\":[{\"x\":-101.49568751,\"y\":37.14976293},{\"x\":-101.50049403,\"y\":37.14647907},{\"x\":-101.50049403,\"y\":37.14264773},{\"x\":-101.49723246,\"y\":37.1411425},{\"x\":-101.49019435,\"y\":37.14223722},{\"x\":-101.48933604,\"y\":37.14620541},{\"x\":-101.49294093,\"y\":37.14866833},{\"x\":-101.49568751,\"y\":37.14976293}]}}]}}}",
          "comment" : ""
        },
        "headersSize" : 592,
        "bodySize" : 392,
        "comment" : ""
      },
      "response" : {
        "status" : 201,
        "statusText" : "Created",
        "httpVersion" : "HTTP/1.1",
        "cookies" : [ {
          "name" : ".ASPROLES",
          "value" : "d48hhysf_dv-gUHYQcy_xESxIFCMI9MkODGpPCKRU1sXA2gPOKMYrFV2ifKWtG8gSRp6dNUt1KakXmWz6106csdwPu6xDJplTh1u76tfV-J51XxB-3eyG62qAq0SVBDt6ykyNSllVCLtLKhdFHRVCfOYJlXwwTIc2OpBTYAcIDNWmGlatpnUK4tN8Ii2BhFPbAvTzh1J98MVv-CdqlvFm_RWUJ0NpRRxcrOhbJv50yCfb-TjELkVRu2Y20GP0cbTKFSG9tvYIR9ck575ZyOCkAhmldCARuPUvE7dN1SJANgBAKVjPWaGga6lyxpkaAr2Jron_kY0q0vVG86SIqTkBfG8Vrd2Lh9H1_ewzF4Zy-C1y9JyZ2p_SIxOqVZZ_ko-5mCGGXAR33wjg0lrsjohNKqs1pIDHmxjLORQqxX3bnyz23R7vDAR9oZmHs_t5rWaxYA5ixFmF8s567t7IIihF1zF02CsDcBlzkCNqpAbdOCuB4WnEfKCKDbqHSusllkNi31zBzaj1VE8-Q5OvV8snQ_HYKM1",
          "path" : "/",
          "httpOnly" : true,
          "secure" : false,
          "comment" : ""
        } ],
        "headers" : [ {
          "name" : "Cache-Control",
          "value" : "private"
        }, {
          "name" : "Content-Type",
          "value" : "application/json; charset=utf-8"
        }, {
          "name" : "Location",
          "value" : "api/mobile/v1/fields/9"
        }, {
          "name" : "Server",
          "value" : "Microsoft-IIS/10.0"
        }, {
          "name" : "Set-Cookie",
          "value" : ".ASPROLES=d48hhysf_dv-gUHYQcy_xESxIFCMI9MkODGpPCKRU1sXA2gPOKMYrFV2ifKWtG8gSRp6dNUt1KakXmWz6106csdwPu6xDJplTh1u76tfV-J51XxB-3eyG62qAq0SVBDt6ykyNSllVCLtLKhdFHRVCfOYJlXwwTIc2OpBTYAcIDNWmGlatpnUK4tN8Ii2BhFPbAvTzh1J98MVv-CdqlvFm_RWUJ0NpRRxcrOhbJv50yCfb-TjELkVRu2Y20GP0cbTKFSG9tvYIR9ck575ZyOCkAhmldCARuPUvE7dN1SJANgBAKVjPWaGga6lyxpkaAr2Jron_kY0q0vVG86SIqTkBfG8Vrd2Lh9H1_ewzF4Zy-C1y9JyZ2p_SIxOqVZZ_ko-5mCGGXAR33wjg0lrsjohNKqs1pIDHmxjLORQqxX3bnyz23R7vDAR9oZmHs_t5rWaxYA5ixFmF8s567t7IIihF1zF02CsDcBlzkCNqpAbdOCuB4WnEfKCKDbqHSusllkNi31zBzaj1VE8-Q5OvV8snQ_HYKM1; path=/; HttpOnly"
        }, {
          "name" : "X-SourceFiles",
          "value" : "=?UTF-8?B?RDpcVmlydHVhbE9wdGltaXplci1SZWZhY3RvcmluZ1xDcm9wTWV0cmljcy5Wby5BcGlcQ3JvcE1ldHJpY3MuVm8uQXBpXGFwaVxtb2JpbGVcdjFcZmllbGRz?="
        }, {
          "name" : "X-Powered-By",
          "value" : "ASP.NET"
        }, {
          "name" : "Date",
          "value" : "Tue, 09 Apr 2019 20:46:24 GMT"
        }, {
          "name" : "Content-Length",
          "value" : "412"
        } ],
        "content" : {
          "size" : 412,
          "mimeType" : "application/json; charset=utf-8",
          "text" : "{\"field\":{\"id\":9,\"farm_id\":4,\"name\":\"Field IN FARM ID 4\",\"boundary\":{\"boundaries\":[{\"boundary\":{\"coords\":[{\"x\":-101.49568751,\"y\":37.14976293},{\"x\":-101.49294093,\"y\":37.14866833},{\"x\":-101.48933604,\"y\":37.14620541},{\"x\":-101.49019435,\"y\":37.14223722},{\"x\":-101.49723246,\"y\":37.1411425},{\"x\":-101.50049403,\"y\":37.14264773},{\"x\":-101.50049403,\"y\":37.14647907},{\"x\":-101.49568751,\"y\":37.14976293}]},\"holes\":null}]}}}",
          "comment" : ""
        },
        "redirectURL" : "",
        "headersSize" : 971,
        "bodySize" : 412,
        "comment" : ""
      },
      "cache" : { },
      "timings" : {
        "comment" : "",
        "ssl" : -1,
        "receive" : 0,
        "dns" : -1,
        "send" : 0,
        "blocked" : -1,
        "connect" : -1,
        "wait" : 34840
      },
      "serverIPAddress" : "127.0.0.1",
      "comment" : "",
      "_katalonRequestInformation" : {
        "name" : "65",
        "testObjectId" : "Object Repository/VoGrow/Field/FieldPost",
        "harId" : "22ac8baf-c465-4b88-b327-4d62b0e465fe"
      },
      "time" : 34841
    } ],
    "comment" : ""
  }
}