{
  "log" : {
    "version" : "1.2",
    "creator" : {
      "name" : "BrowserMob Proxy",
      "version" : "2.1.5",
      "comment" : ""
    },
    "pages" : [ {
      "id" : "Page 0",
      "startedDateTime" : "2019-04-11T16:03:55.127Z",
      "title" : "Page 0",
      "pageTimings" : {
        "onLoad" : 3298,
        "comment" : ""
      },
      "comment" : ""
    } ],
    "entries" : [ {
      "pageref" : "Page 0",
      "startedDateTime" : "2019-04-11T16:03:55.128Z",
      "request" : {
        "method" : "POST",
        "url" : "http://localhost:10520/WebAPI/api/mobile/v1/farms/?",
        "httpVersion" : "HTTP/1.1",
        "cookies" : [ ],
        "headers" : [ {
          "name" : "User-Agent",
          "value" : "Katalon Studio"
        }, {
          "name" : "Content-Type",
          "value" : "application/json"
        }, {
          "name" : "Authorization",
          "value" : "Bearer eyJ0eXAiOiJKV1QiLCJhbGciOiJIUzI1NiJ9.eyJ1bmlxdWVfbmFtZSI6Implbm55Lm1hbGRvbmFkby50eDFAZ21haWwuY29tIiwicm9sZSI6InVzZXIiLCJzdWIiOiJqZW5ueS5tYWxkb25hZG8udHgxQGdtYWlsLmNvbSIsImlzcyI6IkNyb3BNZXRyaWNzIiwiYXVkIjoiYWxsIiwiZXhwIjoxNTU1MDAyNTM1LCJuYmYiOjE1NTQ5OTg2MzV9.XsI4VyWuac1HNDPFR4MeK6xc2wjwfl9jAIQTNE9BgMM"
        }, {
          "name" : "Host",
          "value" : "localhost:10520"
        }, {
          "name" : "Accept",
          "value" : "text/html, image/gif, image/jpeg, *; q=.2, */*; q=.2"
        }, {
          "name" : "Proxy-Connection",
          "value" : "keep-alive"
        }, {
          "name" : "Content-Length",
          "value" : "31"
        } ],
        "queryString" : [ ],
        "postData" : {
          "mimeType" : "application/json",
          "text" : "{\"name\": \"!@#$%\", \"user_id\": 2}",
          "comment" : ""
        },
        "headersSize" : 591,
        "bodySize" : 31,
        "comment" : ""
      },
      "response" : {
        "status" : 400,
        "statusText" : "Bad Request",
        "httpVersion" : "HTTP/1.1",
        "cookies" : [ {
          "name" : ".ASPROLES",
          "value" : "nm4iUWO39KXBc9asp0nwvJQ3BsI8gOFfEyaGjQwEO9Z6XkH5Fy4wKDnvxtPhmKOd77d_yVAnCcLMyOlYVdho2X4lQUDHxBNCGlsFSe_QgZmLJ8VKlYLCK_x99BRcqp-FDj_NVOLdJORYPAXnAOnWS-xRdx0tSn0xjtMsAagHOTqaivUBVOKA611WUi1yFS_dBFWQ9nJsPxEA02X2pmIPkrvmj_xesxOre3R2ylXRuQJgA7k1aWs_IGT02qe_Ncab4qmBKzHWOppw0eTSW7C4ADsNjeF3RLJCTe-mj4_IjgMH9YsnuGGfPnwVEv67vI7VeXFWRR3UMEmgG1fHgEBY0ghMbK6_0e17iWn1WVHhCzaKrYTgYSZ4cPENsriFhjvMxiDWy9QqkRaXpgFL9mz2vTfn4niIVJVbB_p62DJBDlhJxXfNE5XXbicAqy_LsRBTe0VKINU3Pv4Z0qT2Q56GyhLg5sRhL8Kt1YOnZRMkVCGneBIugPQaIkU340KKK4aiwkgreTIrc6_ytGlJES7oYkOY3Vk1",
          "path" : "/",
          "httpOnly" : true,
          "secure" : false,
          "comment" : ""
        } ],
        "headers" : [ {
          "name" : "Cache-Control",
          "value" : "private"
        }, {
          "name" : "Content-Type",
          "value" : "application/json; charset=utf-8"
        }, {
          "name" : "Server",
          "value" : "Microsoft-IIS/10.0"
        }, {
          "name" : "Set-Cookie",
          "value" : ".ASPROLES=nm4iUWO39KXBc9asp0nwvJQ3BsI8gOFfEyaGjQwEO9Z6XkH5Fy4wKDnvxtPhmKOd77d_yVAnCcLMyOlYVdho2X4lQUDHxBNCGlsFSe_QgZmLJ8VKlYLCK_x99BRcqp-FDj_NVOLdJORYPAXnAOnWS-xRdx0tSn0xjtMsAagHOTqaivUBVOKA611WUi1yFS_dBFWQ9nJsPxEA02X2pmIPkrvmj_xesxOre3R2ylXRuQJgA7k1aWs_IGT02qe_Ncab4qmBKzHWOppw0eTSW7C4ADsNjeF3RLJCTe-mj4_IjgMH9YsnuGGfPnwVEv67vI7VeXFWRR3UMEmgG1fHgEBY0ghMbK6_0e17iWn1WVHhCzaKrYTgYSZ4cPENsriFhjvMxiDWy9QqkRaXpgFL9mz2vTfn4niIVJVbB_p62DJBDlhJxXfNE5XXbicAqy_LsRBTe0VKINU3Pv4Z0qT2Q56GyhLg5sRhL8Kt1YOnZRMkVCGneBIugPQaIkU340KKK4aiwkgreTIrc6_ytGlJES7oYkOY3Vk1; path=/; HttpOnly"
        }, {
          "name" : "X-SourceFiles",
          "value" : "=?UTF-8?B?RDpcVmlydHVhbE9wdGltaXplci1SZWZhY3RvcmluZ1xDcm9wTWV0cmljcy5Wby5BcGlcQ3JvcE1ldHJpY3MuVm8uQXBpXGFwaVxtb2JpbGVcdjFcZmFybXNc?="
        }, {
          "name" : "X-Powered-By",
          "value" : "ASP.NET"
        }, {
          "name" : "Date",
          "value" : "Thu, 11 Apr 2019 16:03:58 GMT"
        }, {
          "name" : "Content-Length",
          "value" : "97"
        } ],
        "content" : {
          "size" : 97,
          "mimeType" : "application/json; charset=utf-8",
          "text" : "{\"message\":\"The farm name must contain only alphanumeric characters, apostrophes and/or spaces.\"}",
          "comment" : ""
        },
        "redirectURL" : "",
        "headersSize" : 940,
        "bodySize" : 97,
        "comment" : ""
      },
      "cache" : { },
      "timings" : {
        "comment" : "",
        "ssl" : -1,
        "send" : 0,
        "dns" : -1,
        "blocked" : -1,
        "connect" : -1,
        "wait" : 3294,
        "receive" : 0
      },
      "serverIPAddress" : "127.0.0.1",
      "comment" : "",
      "_katalonRequestInformation" : {
        "name" : "23",
        "testObjectId" : "Object Repository/VoGrow/Farm/FarmPost",
        "harId" : "ed894239-455a-462a-9387-e7a59da849a0"
      },
      "time" : 3295
    } ],
    "comment" : ""
  }
}