{
  "log" : {
    "version" : "1.2",
    "creator" : {
      "name" : "BrowserMob Proxy",
      "version" : "2.1.5",
      "comment" : ""
    },
    "pages" : [ {
      "id" : "Page 0",
      "startedDateTime" : "2019-04-09T20:43:15.962Z",
      "title" : "Page 0",
      "pageTimings" : {
        "onLoad" : 3420,
        "comment" : ""
      },
      "comment" : ""
    } ],
    "entries" : [ {
      "pageref" : "Page 0",
      "startedDateTime" : "2019-04-09T20:43:15.963Z",
      "request" : {
        "method" : "POST",
        "url" : "http://localhost:10520/WebAPI/api/mobile/v1/fields?",
        "httpVersion" : "HTTP/1.1",
        "cookies" : [ ],
        "headers" : [ {
          "name" : "User-Agent",
          "value" : "Katalon Studio"
        }, {
          "name" : "Content-Type",
          "value" : "application/json"
        }, {
          "name" : "Authorization",
          "value" : "Bearer eyJ0eXAiOiJKV1QiLCJhbGciOiJIUzI1NiJ9.eyJ1bmlxdWVfbmFtZSI6Implbm55Lm1hbGRvbmFkby50eDFAZ21haWwuY29tIiwicm9sZSI6InVzZXIiLCJzdWIiOiJqZW5ueS5tYWxkb25hZG8udHgxQGdtYWlsLmNvbSIsImlzcyI6IkNyb3BNZXRyaWNzIiwiYXVkIjoiYWxsIiwiZXhwIjoxNTU0ODQ2NDk1LCJuYmYiOjE1NTQ4NDI1OTV9.T8FsSgZv-dOZgLJNvU4L4SmR8eYI9LO975byf3ptOvQ"
        }, {
          "name" : "Host",
          "value" : "localhost:10520"
        }, {
          "name" : "Accept",
          "value" : "text/html, image/gif, image/jpeg, *; q=.2, */*; q=.2"
        }, {
          "name" : "Proxy-Connection",
          "value" : "keep-alive"
        }, {
          "name" : "Content-Length",
          "value" : "380"
        } ],
        "queryString" : [ ],
        "postData" : {
          "mimeType" : "application/json",
          "text" : "{\"field\":{\"farm_id\":3,\"name\":\"!@#$%^\",\"boundary\":{\"boundaries\":[{\"boundary\":{\"coords\":[{\"x\":-101.49568751,\"y\":37.14976293},{\"x\":-101.50049403,\"y\":37.14647907},{\"x\":-101.50049403,\"y\":37.14264773},{\"x\":-101.49723246,\"y\":37.1411425},{\"x\":-101.49019435,\"y\":37.14223722},{\"x\":-101.48933604,\"y\":37.14620541},{\"x\":-101.49294093,\"y\":37.14866833},{\"x\":-101.49568751,\"y\":37.14976293}]}}]}}}",
          "comment" : ""
        },
        "headersSize" : 592,
        "bodySize" : 380,
        "comment" : ""
      },
      "response" : {
        "status" : 400,
        "statusText" : "Bad Request",
        "httpVersion" : "HTTP/1.1",
        "cookies" : [ {
          "name" : ".ASPROLES",
          "value" : "chcHzGf5T9nLoyaBzUIxzpu4F3WtH3l3e-duQsOB7s9d5kbyt22RXrGzBNOI7wsI8pwdVj10uP2mks20ntNfkJx6iZ0zH4M8NI9rCqUBVguK6tof7W5bQUc7-ZiJf_dtRwNmklWHv--rwPl-r21wWUYwX5RtDpxy19Nx0nkygEOVmJaGIPGUilRH1w8V4FGmLMJ5zuplzKW6RjGc7IT6YExI8vswHua7lhsx8KWZe3TVPeIsQvvRmAZobynlOVn4HtHFSexOky9Z62UVpEsARjDf4rw784OIkGmDucrISCQKvLsx0grbeXrdNOKSE_OWSivwJ-p7E7YaoimaVlLaypeNTtK0Z-P42H_gQaE7cTQpQtpfRbvrbB4hAtm6OVxgrndbhlAZR5O3uOD8uymz4m8uFY6B9DRRtQrHWmgBdrk9_DS8hoK_I887xvoBTx9zKWasFPbAjxQm8THF8Q0FPWQOO5jUG2HcmPOwFZ6YhFZZPaskXd4DSOOGlSsV65SDtSMMSZ2Cr8JdvR26fNJqa4AZ2ao1",
          "path" : "/",
          "httpOnly" : true,
          "secure" : false,
          "comment" : ""
        } ],
        "headers" : [ {
          "name" : "Cache-Control",
          "value" : "private"
        }, {
          "name" : "Content-Type",
          "value" : "application/json; charset=utf-8"
        }, {
          "name" : "Server",
          "value" : "Microsoft-IIS/10.0"
        }, {
          "name" : "Set-Cookie",
          "value" : ".ASPROLES=chcHzGf5T9nLoyaBzUIxzpu4F3WtH3l3e-duQsOB7s9d5kbyt22RXrGzBNOI7wsI8pwdVj10uP2mks20ntNfkJx6iZ0zH4M8NI9rCqUBVguK6tof7W5bQUc7-ZiJf_dtRwNmklWHv--rwPl-r21wWUYwX5RtDpxy19Nx0nkygEOVmJaGIPGUilRH1w8V4FGmLMJ5zuplzKW6RjGc7IT6YExI8vswHua7lhsx8KWZe3TVPeIsQvvRmAZobynlOVn4HtHFSexOky9Z62UVpEsARjDf4rw784OIkGmDucrISCQKvLsx0grbeXrdNOKSE_OWSivwJ-p7E7YaoimaVlLaypeNTtK0Z-P42H_gQaE7cTQpQtpfRbvrbB4hAtm6OVxgrndbhlAZR5O3uOD8uymz4m8uFY6B9DRRtQrHWmgBdrk9_DS8hoK_I887xvoBTx9zKWasFPbAjxQm8THF8Q0FPWQOO5jUG2HcmPOwFZ6YhFZZPaskXd4DSOOGlSsV65SDtSMMSZ2Cr8JdvR26fNJqa4AZ2ao1; path=/; HttpOnly"
        }, {
          "name" : "X-SourceFiles",
          "value" : "=?UTF-8?B?RDpcVmlydHVhbE9wdGltaXplci1SZWZhY3RvcmluZ1xDcm9wTWV0cmljcy5Wby5BcGlcQ3JvcE1ldHJpY3MuVm8uQXBpXGFwaVxtb2JpbGVcdjFcZmllbGRz?="
        }, {
          "name" : "X-Powered-By",
          "value" : "ASP.NET"
        }, {
          "name" : "Date",
          "value" : "Tue, 09 Apr 2019 20:43:19 GMT"
        }, {
          "name" : "Content-Length",
          "value" : "98"
        } ],
        "content" : {
          "size" : 98,
          "mimeType" : "application/json; charset=utf-8",
          "text" : "{\"message\":\"The field name must contain only alphanumeric characters, apostrophes and/or spaces.\"}",
          "comment" : ""
        },
        "redirectURL" : "",
        "headersSize" : 940,
        "bodySize" : 98,
        "comment" : ""
      },
      "cache" : { },
      "timings" : {
        "comment" : "",
        "ssl" : -1,
        "receive" : 0,
        "dns" : -1,
        "send" : 0,
        "blocked" : -1,
        "connect" : -1,
        "wait" : 3415
      },
      "serverIPAddress" : "127.0.0.1",
      "comment" : "",
      "_katalonRequestInformation" : {
        "name" : "49",
        "testObjectId" : "Object Repository/VoGrow/Field/FieldPost",
        "harId" : "156b504b-b27f-42d1-b927-fe2d5f9d844c"
      },
      "time" : 3416
    } ],
    "comment" : ""
  }
}