Suite/Test/Step Name,Browser,Description,Start time,End time,Duration,Status
Auto_Post_Farm,,,2019-04-09 05:28:20,2019-04-09 05:30:18,1m - 58.223s,PASSED
,,,,,,
Test Cases/VoGrow/API/Farm/Post/1 API_FARM_When_new_farm_is_created_as_grower_Expected_status_code_201,,,2019-04-09 05:28:21,2019-04-09 05:28:27,6.383s,PASSED
"name = ""Farm 10 katalon""",,,2019-04-09 05:28:21,2019-04-09 05:28:21,0.003s,PASSED
"userId = ""4""",,,2019-04-09 05:28:21,2019-04-09 05:28:22,0.137s,PASSED
"tokenUserName = ""jenny.maldonado.tx2@gmail.com""",,,2019-04-09 05:28:22,2019-04-09 05:28:22,0.003s,PASSED
"tokenPassword = ""cropmetrics""",,,2019-04-09 05:28:22,2019-04-09 05:28:22,0.004s,PASSED
"responseToken = sendRequest(findTestObject(""VoPro/Token"", [""usernameToken"":tokenUserName, ""passwordToken"":tokenPassword]))",,,2019-04-09 05:28:22,2019-04-09 05:28:26,3.982s,PASSED
slurper = new groovy.json.JsonSlurper(),,,2019-04-09 05:28:26,2019-04-09 05:28:26,0.031s,PASSED
tokenResult = slurper.parseText(responseToken.getResponseBodyContent()),,,2019-04-09 05:28:26,2019-04-09 05:28:26,0.038s,PASSED
accessToken = access_token,,,2019-04-09 05:28:26,2019-04-09 05:28:26,0.018s,PASSED
"println("".. Current access token generated for admin user : "" + accessToken)",,,2019-04-09 05:28:26,2019-04-09 05:28:26,0.004s,PASSED
"requestFarmPost = findTestObject(""VoGrow/Farm/FarmPost"", [""access_token"":accessToken])",,,2019-04-09 05:28:26,2019-04-09 05:28:26,0.019s,PASSED
"bodyRequest = ""{""name"": """" + name + """", ""user_id"": "" + userId + ""}""",,,2019-04-09 05:28:26,2019-04-09 05:28:26,0.001s,PASSED
try,,,2019-04-09 05:28:26,2019-04-09 05:28:26,0.018s,PASSED
responseFarm = sendRequest(requestFarmPost),,,2019-04-09 05:28:26,2019-04-09 05:28:27,1.045s,PASSED
"verifyResponseStatusCode(responseFarm, 201)",,,2019-04-09 05:28:27,2019-04-09 05:28:27,0.027s,PASSED
slurper1 = new groovy.json.JsonSlurper(),,,2019-04-09 05:28:27,2019-04-09 05:28:27,0.001s,PASSED
FarmPostResult = slurper1.parseText(responseFarm.getResponseBodyContent()),,,2019-04-09 05:28:27,2019-04-09 05:28:27,0.002s,PASSED
farmId = id,,,2019-04-09 05:28:27,2019-04-09 05:28:27,0.291s,PASSED
userId = userId,,,2019-04-09 05:28:27,2019-04-09 05:28:27,0.003s,PASSED
"println(""New Farm created has the next id:  "" + id)",,,2019-04-09 05:28:27,2019-04-09 05:28:27,0.003s,PASSED
"println(""New Farm created has the next name:  "" + name)",,,2019-04-09 05:28:27,2019-04-09 05:28:27,0.006s,PASSED
"println(""New Farm created has the user id:  "" + user_id)",,,2019-04-09 05:28:27,2019-04-09 05:28:27,0.011s,PASSED
"verifyElementPropertyValue(responseFarm, ""user_id"", userId)",,,2019-04-09 05:28:27,2019-04-09 05:28:27,0.078s,PASSED
,,,,,,
Test Cases/VoGrow/API/Farm/Post/2 API_FARM_When_new_farm_is_created_as_grower_Expected_new_farm_is_added_in_database,,,2019-04-09 05:28:27,2019-04-09 05:28:28,1.149s,PASSED
"connectionCmDatabase.CmConnection.connectDB(""localhost"", ""virtualoptimizer"", ""5432"", ""postgres"", ""admin"")",,,2019-04-09 05:28:28,2019-04-09 05:28:28,0.699s,PASSED
"println(""New farm id is : "" + farmId)",,,2019-04-09 05:28:28,2019-04-09 05:28:28,0.001s,PASSED
"query = ""select id, name, userprofile_id from cropmetrics.farm where id ="" + farmId",,,2019-04-09 05:28:28,2019-04-09 05:28:28,0.001s,PASSED
queryResult = connectionCmDatabase.CmConnection.executeQuery(query),,,2019-04-09 05:28:28,2019-04-09 05:28:28,0.097s,PASSED
while (queryResult.next()),,,2019-04-09 05:28:28,2019-04-09 05:28:28,0.029s,PASSED
"query1 = ""select farm_id, currentfarmserviceleveltype_id, onexpirefarmserviceleveltype_id from cropmetrics.farmsubscription where currentfarmserviceleveltype_id = 0 and  onexpirefarmserviceleveltype_id = 0 and farm_id ="" + farmId",,,2019-04-09 05:28:28,2019-04-09 05:28:28,0.001s,PASSED
queryResult1 = connectionCmDatabase.CmConnection.executeQuery(query1),,,2019-04-09 05:28:28,2019-04-09 05:28:28,0.003s,PASSED
while (queryResult1.next()),,,2019-04-09 05:28:28,2019-04-09 05:28:28,0.009s,PASSED
,,,,,,
Test Cases/VoGrow/API/Farm/Post/4 API_FARM_When_new_farm_is_created_as_dealer_for_one_of_the_grower_assigned_Expected_status_code_201,,,2019-04-09 05:28:28,2019-04-09 05:28:29,0.752s,PASSED
"name = ""Farm 2 created by dealer""",,,2019-04-09 05:28:29,2019-04-09 05:28:29,0.000s,PASSED
"userId = ""3""",,,2019-04-09 05:28:29,2019-04-09 05:28:29,0.001s,PASSED
"tokenUserName = ""jenny.maldonado.tx1@gmail.com""",,,2019-04-09 05:28:29,2019-04-09 05:28:29,0.001s,PASSED
"tokenPassword = ""cropmetrics""",,,2019-04-09 05:28:29,2019-04-09 05:28:29,0.000s,PASSED
"responseToken = sendRequest(findTestObject(""VoPro/Token"", [""usernameToken"":tokenUserName, ""passwordToken"":tokenPassword]))",,,2019-04-09 05:28:29,2019-04-09 05:28:29,0.244s,PASSED
slurper = new groovy.json.JsonSlurper(),,,2019-04-09 05:28:29,2019-04-09 05:28:29,0.001s,PASSED
tokenResult = slurper.parseText(responseToken.getResponseBodyContent()),,,2019-04-09 05:28:29,2019-04-09 05:28:29,0.001s,PASSED
accessToken = access_token,,,2019-04-09 05:28:29,2019-04-09 05:28:29,0.000s,PASSED
"println("".. Current access token generated for dealer account : "" + accessToken)",,,2019-04-09 05:28:29,2019-04-09 05:28:29,0.000s,PASSED
"requestFarmPost = findTestObject(""VoGrow/Farm/FarmPost"", [""access_token"":accessToken])",,,2019-04-09 05:28:29,2019-04-09 05:28:29,0.005s,PASSED
"bodyRequest = ""{""name"": """" + name + """", ""user_id"": "" + userId + ""}""",,,2019-04-09 05:28:29,2019-04-09 05:28:29,0.001s,PASSED
try,,,2019-04-09 05:28:29,2019-04-09 05:28:29,0.002s,PASSED
responseFarm = sendRequest(requestFarmPost),,,2019-04-09 05:28:29,2019-04-09 05:28:29,0.083s,PASSED
"verifyResponseStatusCode(responseFarm, 201)",,,2019-04-09 05:28:29,2019-04-09 05:28:29,0.002s,PASSED
slurper1 = new groovy.json.JsonSlurper(),,,2019-04-09 05:28:29,2019-04-09 05:28:29,0.001s,PASSED
FarmPostResult = slurper1.parseText(responseFarm.getResponseBodyContent()),,,2019-04-09 05:28:29,2019-04-09 05:28:29,0.002s,PASSED
farmId = id,,,2019-04-09 05:28:29,2019-04-09 05:28:29,0.001s,PASSED
userId = userId,,,2019-04-09 05:28:29,2019-04-09 05:28:29,0.001s,PASSED
"println(""New Farm created has the next id:  "" + id)",,,2019-04-09 05:28:29,2019-04-09 05:28:29,0.001s,PASSED
"println(""New Farm created has the next name:  "" + name)",,,2019-04-09 05:28:29,2019-04-09 05:28:29,0.001s,PASSED
"println(""New Farm created has the user id:  "" + user_id)",,,2019-04-09 05:28:29,2019-04-09 05:28:29,0.001s,PASSED
"verifyElementPropertyValue(responseFarm, ""user_id"", userId)",,,2019-04-09 05:28:29,2019-04-09 05:28:29,0.017s,PASSED
,,,,,,
Test Cases/VoGrow/API/Farm/Post/4.1 API_FARM_When_new_farm_as_dealer_for_grower_not_assigned_Expected_status_code_400,,,2019-04-09 05:28:29,2019-04-09 05:28:41,11.844s,PASSED
"name = ""Farm not created into the grower does not assined the dealer account""",,,2019-04-09 05:28:29,2019-04-09 05:28:29,0.000s,PASSED
"userId = ""4""",,,2019-04-09 05:28:29,2019-04-09 05:28:29,0.000s,PASSED
"tokenUserName = ""jenny.maldonado.tx1@gmail.com""",,,2019-04-09 05:28:29,2019-04-09 05:28:29,0.007s,PASSED
"tokenPassword = ""cropmetrics""",,,2019-04-09 05:28:29,2019-04-09 05:28:29,0.001s,PASSED
"responseToken = sendRequest(findTestObject(""VoPro/Token"", [""usernameToken"":tokenUserName, ""passwordToken"":tokenPassword]))",,,2019-04-09 05:28:29,2019-04-09 05:28:30,0.156s,PASSED
slurper = new groovy.json.JsonSlurper(),,,2019-04-09 05:28:30,2019-04-09 05:28:30,0.001s,PASSED
tokenResult = slurper.parseText(responseToken.getResponseBodyContent()),,,2019-04-09 05:28:30,2019-04-09 05:28:30,0.001s,PASSED
accessToken = access_token,,,2019-04-09 05:28:30,2019-04-09 05:28:30,0.001s,PASSED
"println("".. Current access token generated for admin user : "" + accessToken)",,,2019-04-09 05:28:30,2019-04-09 05:28:30,0.001s,PASSED
"requestFarmPost = findTestObject(""VoGrow/Farm/FarmPost"", [""access_token"":accessToken])",,,2019-04-09 05:28:30,2019-04-09 05:28:30,0.005s,PASSED
"bodyRequest = ""{""name"": """" + name + """", ""user_id"": "" + userId + ""}""",,,2019-04-09 05:28:30,2019-04-09 05:28:30,0.001s,PASSED
try,,,2019-04-09 05:28:30,2019-04-09 05:28:30,0.002s,PASSED
responseFarm = sendRequest(requestFarmPost),,,2019-04-09 05:28:30,2019-04-09 05:28:41,11.404s,PASSED
"verifyResponseStatusCode(responseFarm, 400)",,,2019-04-09 05:28:41,2019-04-09 05:28:41,0.002s,PASSED
slurper1 = new groovy.json.JsonSlurper(),,,2019-04-09 05:28:41,2019-04-09 05:28:41,0.000s,PASSED
FarmPostResult = slurper1.parseText(responseFarm.getResponseBodyContent()),,,2019-04-09 05:28:41,2019-04-09 05:28:41,0.000s,PASSED
messageResponse = message,,,2019-04-09 05:28:41,2019-04-09 05:28:41,0.000s,PASSED
"messageExpected = ""The grower is not related to the dealer.""",,,2019-04-09 05:28:41,2019-04-09 05:28:41,0.000s,PASSED
"println(""Error message response: "" + messageResponse)",,,2019-04-09 05:28:41,2019-04-09 05:28:41,0.000s,PASSED
"println(""Error message expected: "" + messageExpected)",,,2019-04-09 05:28:41,2019-04-09 05:28:41,0.000s,PASSED
"verifyElementPropertyValue(responseFarm, ""message"", messageExpected)",,,2019-04-09 05:28:41,2019-04-09 05:28:41,0.012s,PASSED
,,,,,,
Test Cases/VoGrow/API/Farm/Post/5 API_FARM_When_new_farm_as_dealer_for_one_grower_assigned_Expected_new_farm_is_added_in_database_only_for_corresponding_grower,,,2019-04-09 05:28:41,2019-04-09 05:28:41,0.380s,PASSED
"connectionCmDatabase.CmConnection.connectDB(""localhost"", ""virtualoptimizer"", ""5432"", ""postgres"", ""admin"")",,,2019-04-09 05:28:41,2019-04-09 05:28:41,0.069s,PASSED
"println(""New farm id is : "" + farmId)",,,2019-04-09 05:28:41,2019-04-09 05:28:41,0.000s,PASSED
"query = ""select id, name, userprofile_id from cropmetrics.farm where id ="" + farmId",,,2019-04-09 05:28:41,2019-04-09 05:28:41,0.000s,PASSED
queryResult = connectionCmDatabase.CmConnection.executeQuery(query),,,2019-04-09 05:28:41,2019-04-09 05:28:41,0.009s,PASSED
while (queryResult.next()),,,2019-04-09 05:28:41,2019-04-09 05:28:41,0.002s,PASSED
"query1 = ""select farm_id, currentfarmserviceleveltype_id, onexpirefarmserviceleveltype_id from cropmetrics.farmsubscription where currentfarmserviceleveltype_id = 0 and  onexpirefarmserviceleveltype_id = 0 and farm_id ="" + farmId",,,2019-04-09 05:28:41,2019-04-09 05:28:41,0.000s,PASSED
queryResult1 = connectionCmDatabase.CmConnection.executeQuery(query1),,,2019-04-09 05:28:41,2019-04-09 05:28:41,0.008s,PASSED
while (queryResult1.next()),,,2019-04-09 05:28:41,2019-04-09 05:28:41,0.000s,PASSED
,,,,,,
Test Cases/VoGrow/API/Farm/Post/7 API_FARM_When_new_farm_as_dealer_for_one_grower_assigned_Expected_new_farm_is_not_added_in_database_for_dealer_account,,,2019-04-09 05:28:41,2019-04-09 05:28:42,0.302s,PASSED
"connectionCmDatabase.CmConnection.connectDB(""localhost"", ""virtualoptimizer"", ""5432"", ""postgres"", ""admin"")",,,2019-04-09 05:28:42,2019-04-09 05:28:42,0.070s,PASSED
dealerId = 2,,,2019-04-09 05:28:42,2019-04-09 05:28:42,0.000s,PASSED
"println(""New farm id is : "" + farmId)",,,2019-04-09 05:28:42,2019-04-09 05:28:42,0.000s,PASSED
"println(""Dealer of the grower id that has the new farm, is : "" + dealerId)",,,2019-04-09 05:28:42,2019-04-09 05:28:42,0.000s,PASSED
"query = ""select id, name, userprofile_id from cropmetrics.farm where id ="" + farmId",,,2019-04-09 05:28:42,2019-04-09 05:28:42,0.000s,PASSED
queryResult = connectionCmDatabase.CmConnection.executeQuery(query),,,2019-04-09 05:28:42,2019-04-09 05:28:42,0.012s,PASSED
while (queryResult.next()),,,2019-04-09 05:28:42,2019-04-09 05:28:42,0.010s,PASSED
,,,,,,
Test Cases/VoGrow/API/Farm/Post/8 API_FARM_When_new_farm_has_name_attribute_with_more_than_128_chars_Expected_status_code_400,,,2019-04-09 05:28:42,2019-04-09 05:28:47,5.618s,PASSED
"name = ""API_FARM_When_new_farm_has_name_attribute_with_more_than_128_chars_Expected_status_code_400 API_FARM_When_new_farm_has_name_attribute_with_more_than_128_chars_Expected_status_code_400""",,,2019-04-09 05:28:42,2019-04-09 05:28:42,0.000s,PASSED
"userId = ""2""",,,2019-04-09 05:28:42,2019-04-09 05:28:42,0.010s,PASSED
"tokenUserName = ""jenny.maldonado.tx1@gmail.com""",,,2019-04-09 05:28:42,2019-04-09 05:28:42,0.000s,PASSED
"tokenPassword = ""cropmetrics""",,,2019-04-09 05:28:42,2019-04-09 05:28:42,0.000s,PASSED
"responseToken = sendRequest(findTestObject(""VoPro/Token"", [""usernameToken"":tokenUserName, ""passwordToken"":tokenPassword]))",,,2019-04-09 05:28:42,2019-04-09 05:28:42,0.135s,PASSED
slurper = new groovy.json.JsonSlurper(),,,2019-04-09 05:28:42,2019-04-09 05:28:42,0.003s,PASSED
tokenResult = slurper.parseText(responseToken.getResponseBodyContent()),,,2019-04-09 05:28:42,2019-04-09 05:28:42,0.001s,PASSED
accessToken = access_token,,,2019-04-09 05:28:42,2019-04-09 05:28:42,0.001s,PASSED
"println("".. Current access token generated for dealer account : "" + accessToken)",,,2019-04-09 05:28:42,2019-04-09 05:28:42,0.000s,PASSED
"requestFarmPost = findTestObject(""VoGrow/Farm/FarmPost"", [""access_token"":accessToken])",,,2019-04-09 05:28:42,2019-04-09 05:28:42,0.004s,PASSED
"bodyRequest = ""{""name"": """" + name + """", ""user_id"": "" + userId + ""}""",,,2019-04-09 05:28:42,2019-04-09 05:28:42,0.000s,PASSED
try,,,2019-04-09 05:28:42,2019-04-09 05:28:42,0.003s,PASSED
responseFarm = sendRequest(requestFarmPost),,,2019-04-09 05:28:42,2019-04-09 05:28:47,5.246s,PASSED
"verifyResponseStatusCode(responseFarm, 400)",,,2019-04-09 05:28:47,2019-04-09 05:28:47,0.000s,PASSED
,,,,,,
Test Cases/VoGrow/API/Farm/Post/9 API_FARM_When_new_farm_has_name_attribute_with_more_than_128_chars_Expected_properly_error_message_is_displayed,,,2019-04-09 05:28:47,2019-04-09 05:28:52,4.851s,PASSED
"name = ""API_FARM_When_new_farm_has_name_attribute_with_more_than_128_chars_Expected_status_code_400 API_FARM_When_new_farm_has_name_attribute_with_more_than_128_chars_Expected_status_code_400""",,,2019-04-09 05:28:47,2019-04-09 05:28:47,0.001s,PASSED
"userId = ""2""",,,2019-04-09 05:28:47,2019-04-09 05:28:47,0.000s,PASSED
"tokenUserName = ""jenny.maldonado.tx1@gmail.com""",,,2019-04-09 05:28:47,2019-04-09 05:28:47,0.001s,PASSED
"tokenPassword = ""cropmetrics""",,,2019-04-09 05:28:47,2019-04-09 05:28:47,0.001s,PASSED
"responseToken = sendRequest(findTestObject(""VoPro/Token"", [""usernameToken"":tokenUserName, ""passwordToken"":tokenPassword]))",,,2019-04-09 05:28:47,2019-04-09 05:28:48,0.092s,PASSED
slurper = new groovy.json.JsonSlurper(),,,2019-04-09 05:28:48,2019-04-09 05:28:48,0.001s,PASSED
tokenResult = slurper.parseText(responseToken.getResponseBodyContent()),,,2019-04-09 05:28:48,2019-04-09 05:28:48,0.001s,PASSED
accessToken = access_token,,,2019-04-09 05:28:48,2019-04-09 05:28:48,0.001s,PASSED
"println("".. Current access token generated for dealer account : "" + accessToken)",,,2019-04-09 05:28:48,2019-04-09 05:28:48,0.001s,PASSED
"requestFarmPost = findTestObject(""VoGrow/Farm/FarmPost"", [""access_token"":accessToken])",,,2019-04-09 05:28:48,2019-04-09 05:28:48,0.004s,PASSED
"bodyRequest = ""{""name"": """" + name + """", ""user_id"": "" + userId + ""}""",,,2019-04-09 05:28:48,2019-04-09 05:28:48,0.000s,PASSED
try,,,2019-04-09 05:28:48,2019-04-09 05:28:48,0.001s,PASSED
responseFarm = sendRequest(requestFarmPost),,,2019-04-09 05:28:48,2019-04-09 05:28:52,4.546s,PASSED
slurper1 = new groovy.json.JsonSlurper(),,,2019-04-09 05:28:52,2019-04-09 05:28:52,0.000s,PASSED
FarmPostResult = slurper1.parseText(responseFarm.getResponseBodyContent()),,,2019-04-09 05:28:52,2019-04-09 05:28:52,0.000s,PASSED
messageResponse = message,,,2019-04-09 05:28:52,2019-04-09 05:28:52,0.000s,PASSED
"messageExpected = ""The farm name must contains as max 128 characters.""",,,2019-04-09 05:28:52,2019-04-09 05:28:52,0.000s,PASSED
"println(""Error message response: "" + messageResponse)",,,2019-04-09 05:28:52,2019-04-09 05:28:52,0.000s,PASSED
"println(""Error message expected: "" + messageExpected)",,,2019-04-09 05:28:52,2019-04-09 05:28:52,0.000s,PASSED
"verifyElementPropertyValue(responseFarm, ""message"", messageExpected)",,,2019-04-09 05:28:52,2019-04-09 05:28:52,0.019s,PASSED
,,,,,,
Test Cases/VoGrow/API/Farm/Post/10 API_FARM_When_new_farm_has_name_attribute_with_128_chars_Expected_status_code_201,,,2019-04-09 05:28:52,2019-04-09 05:28:53,0.410s,PASSED
"name = ""129 charsWhen new farm has name attribute with more than 128 chars Expected status code 400 API FARM When new farm has name attr""",,,2019-04-09 05:28:52,2019-04-09 05:28:52,0.000s,PASSED
"userId = ""2""",,,2019-04-09 05:28:52,2019-04-09 05:28:52,0.000s,PASSED
"tokenUserName = ""jenny.maldonado.tx1@gmail.com""",,,2019-04-09 05:28:52,2019-04-09 05:28:52,0.000s,PASSED
"tokenPassword = ""cropmetrics""",,,2019-04-09 05:28:52,2019-04-09 05:28:52,0.000s,PASSED
"responseToken = sendRequest(findTestObject(""VoPro/Token"", [""usernameToken"":tokenUserName, ""passwordToken"":tokenPassword]))",,,2019-04-09 05:28:52,2019-04-09 05:28:52,0.105s,PASSED
slurper = new groovy.json.JsonSlurper(),,,2019-04-09 05:28:52,2019-04-09 05:28:52,0.000s,PASSED
tokenResult = slurper.parseText(responseToken.getResponseBodyContent()),,,2019-04-09 05:28:52,2019-04-09 05:28:52,0.002s,PASSED
accessToken = access_token,,,2019-04-09 05:28:52,2019-04-09 05:28:52,0.000s,PASSED
"println("".. Current access token generated for admin user : "" + accessToken)",,,2019-04-09 05:28:52,2019-04-09 05:28:52,0.000s,PASSED
"requestFarmPost = findTestObject(""VoGrow/Farm/FarmPost"", [""access_token"":accessToken])",,,2019-04-09 05:28:52,2019-04-09 05:28:52,0.000s,PASSED
"bodyRequest = ""{""name"": """" + name + """", ""user_id"": "" + userId + ""}""",,,2019-04-09 05:28:52,2019-04-09 05:28:52,0.000s,PASSED
try,,,2019-04-09 05:28:52,2019-04-09 05:28:52,0.008s,PASSED
responseFarm = sendRequest(requestFarmPost),,,2019-04-09 05:28:52,2019-04-09 05:28:53,0.020s,PASSED
"verifyResponseStatusCode(responseFarm, 201)",,,2019-04-09 05:28:53,2019-04-09 05:28:53,0.010s,PASSED
slurper1 = new groovy.json.JsonSlurper(),,,2019-04-09 05:28:53,2019-04-09 05:28:53,0.000s,PASSED
FarmPostResult = slurper1.parseText(responseFarm.getResponseBodyContent()),,,2019-04-09 05:28:53,2019-04-09 05:28:53,0.000s,PASSED
farmId = id,,,2019-04-09 05:28:53,2019-04-09 05:28:53,0.000s,PASSED
userId = userId,,,2019-04-09 05:28:53,2019-04-09 05:28:53,0.000s,PASSED
"println(""New Farm created has the next id:  "" + id)",,,2019-04-09 05:28:53,2019-04-09 05:28:53,0.000s,PASSED
"println(""New Farm created has the next name:  "" + name)",,,2019-04-09 05:28:53,2019-04-09 05:28:53,0.000s,PASSED
"println(""New Farm created has the user id:  "" + user_id)",,,2019-04-09 05:28:53,2019-04-09 05:28:53,0.000s,PASSED
"verifyElementPropertyValue(responseFarm, ""user_id"", userId)",,,2019-04-09 05:28:53,2019-04-09 05:28:53,0.020s,PASSED
,,,,,,
Test Cases/VoGrow/API/Farm/Post/11 API_FARM_When_new_farm_has_name_attribute_with_128_chars_Expected_new_farm_is_added_in_database,,,2019-04-09 05:28:53,2019-04-09 05:28:53,0.208s,PASSED
"connectionCmDatabase.CmConnection.connectDB(""localhost"", ""virtualoptimizer"", ""5432"", ""postgres"", ""admin"")",,,2019-04-09 05:28:53,2019-04-09 05:28:53,0.047s,PASSED
"println(""New farm id is : "" + farmId)",,,2019-04-09 05:28:53,2019-04-09 05:28:53,0.000s,PASSED
"query = ""select id, name, userprofile_id from cropmetrics.farm where id ="" + farmId",,,2019-04-09 05:28:53,2019-04-09 05:28:53,0.010s,PASSED
queryResult = connectionCmDatabase.CmConnection.executeQuery(query),,,2019-04-09 05:28:53,2019-04-09 05:28:53,0.000s,PASSED
while (queryResult.next()),,,2019-04-09 05:28:53,2019-04-09 05:28:53,0.004s,PASSED
"query1 = ""select farm_id, currentfarmserviceleveltype_id, onexpirefarmserviceleveltype_id from cropmetrics.farmsubscription where currentfarmserviceleveltype_id = 0 and  onexpirefarmserviceleveltype_id = 0 and farm_id ="" + farmId",,,2019-04-09 05:28:53,2019-04-09 05:28:53,0.000s,PASSED
queryResult1 = connectionCmDatabase.CmConnection.executeQuery(query1),,,2019-04-09 05:28:53,2019-04-09 05:28:53,0.006s,PASSED
while (queryResult1.next()),,,2019-04-09 05:28:53,2019-04-09 05:28:53,0.000s,PASSED
,,,,,,
Test Cases/VoGrow/API/Farm/Post/12 API_FARM_When_new_farm_has_name_attribute_with_only_spaces_Expected_status_code_400,,,2019-04-09 05:28:53,2019-04-09 05:28:58,4.852s,PASSED
"name = ""    """,,,2019-04-09 05:28:53,2019-04-09 05:28:53,0.000s,PASSED
"userId = ""2""",,,2019-04-09 05:28:53,2019-04-09 05:28:53,0.000s,PASSED
"tokenUserName = ""jenny.maldonado.tx1@gmail.com""",,,2019-04-09 05:28:53,2019-04-09 05:28:53,0.000s,PASSED
"tokenPassword = ""cropmetrics""",,,2019-04-09 05:28:53,2019-04-09 05:28:53,0.000s,PASSED
"responseToken = sendRequest(findTestObject(""VoPro/Token"", [""usernameToken"":tokenUserName, ""passwordToken"":tokenPassword]))",,,2019-04-09 05:28:53,2019-04-09 05:28:53,0.120s,PASSED
slurper = new groovy.json.JsonSlurper(),,,2019-04-09 05:28:53,2019-04-09 05:28:53,0.000s,PASSED
tokenResult = slurper.parseText(responseToken.getResponseBodyContent()),,,2019-04-09 05:28:53,2019-04-09 05:28:53,0.000s,PASSED
accessToken = access_token,,,2019-04-09 05:28:53,2019-04-09 05:28:53,0.004s,PASSED
"println("".. Current access token generated for admin user : "" + accessToken)",,,2019-04-09 05:28:53,2019-04-09 05:28:53,0.000s,PASSED
"requestFarmPost = findTestObject(""VoGrow/Farm/FarmPost"", [""access_token"":accessToken])",,,2019-04-09 05:28:53,2019-04-09 05:28:53,0.006s,PASSED
"bodyRequest = ""{""name"": """" + name + """", ""user_id"": "" + userId + ""}""",,,2019-04-09 05:28:53,2019-04-09 05:28:53,0.000s,PASSED
try,,,2019-04-09 05:28:53,2019-04-09 05:28:53,0.003s,PASSED
responseFarm = sendRequest(requestFarmPost),,,2019-04-09 05:28:53,2019-04-09 05:28:58,4.515s,PASSED
"verifyResponseStatusCode(responseFarm, 400)",,,2019-04-09 05:28:58,2019-04-09 05:28:58,0.001s,PASSED
,,,,,,
Test Cases/VoGrow/API/Farm/Post/12.1 API_FARM_When_new_farm_has_name_attribute_with_only_spaces_Expected_properly_error_message_is_displayed,,,2019-04-09 05:28:58,2019-04-09 05:29:02,4.868s,PASSED
"name = ""    """,,,2019-04-09 05:28:58,2019-04-09 05:28:58,0.000s,PASSED
"userId = ""2""",,,2019-04-09 05:28:58,2019-04-09 05:28:58,0.000s,PASSED
"tokenUserName = ""jenny.maldonado.tx1@gmail.com""",,,2019-04-09 05:28:58,2019-04-09 05:28:58,0.000s,PASSED
"tokenPassword = ""cropmetrics""",,,2019-04-09 05:28:58,2019-04-09 05:28:58,0.000s,PASSED
"responseToken = sendRequest(findTestObject(""VoPro/Token"", [""usernameToken"":tokenUserName, ""passwordToken"":tokenPassword]))",,,2019-04-09 05:28:58,2019-04-09 05:28:58,0.095s,PASSED
slurper = new groovy.json.JsonSlurper(),,,2019-04-09 05:28:58,2019-04-09 05:28:58,0.010s,PASSED
tokenResult = slurper.parseText(responseToken.getResponseBodyContent()),,,2019-04-09 05:28:58,2019-04-09 05:28:58,0.000s,PASSED
accessToken = access_token,,,2019-04-09 05:28:58,2019-04-09 05:28:58,0.000s,PASSED
"println("".. Current access token generated for admin user : "" + accessToken)",,,2019-04-09 05:28:58,2019-04-09 05:28:58,0.000s,PASSED
"requestFarmPost = findTestObject(""VoGrow/Farm/FarmPost"", [""access_token"":accessToken])",,,2019-04-09 05:28:58,2019-04-09 05:28:58,0.005s,PASSED
"bodyRequest = ""{""name"": """" + name + """", ""user_id"": "" + userId + ""}""",,,2019-04-09 05:28:58,2019-04-09 05:28:58,0.000s,PASSED
try,,,2019-04-09 05:28:58,2019-04-09 05:28:58,0.000s,PASSED
responseFarm = sendRequest(requestFarmPost),,,2019-04-09 05:28:58,2019-04-09 05:29:02,4.367s,PASSED
slurper1 = new groovy.json.JsonSlurper(),,,2019-04-09 05:29:02,2019-04-09 05:29:02,0.000s,PASSED
FarmPostResult = slurper1.parseText(responseFarm.getResponseBodyContent()),,,2019-04-09 05:29:02,2019-04-09 05:29:02,0.000s,PASSED
messageResponse = message,,,2019-04-09 05:29:02,2019-04-09 05:29:02,0.000s,PASSED
"messageExpected = ""The farm name must be provided.""",,,2019-04-09 05:29:02,2019-04-09 05:29:02,0.000s,PASSED
"println(""Error message response: "" + messageResponse)",,,2019-04-09 05:29:02,2019-04-09 05:29:02,0.000s,PASSED
"println(""Error message expected: "" + messageExpected)",,,2019-04-09 05:29:02,2019-04-09 05:29:02,0.000s,PASSED
"verifyElementPropertyValue(responseFarm, ""message"", messageExpected)",,,2019-04-09 05:29:02,2019-04-09 05:29:02,0.008s,PASSED
,,,,,,
Test Cases/VoGrow/API/Farm/Post/13 API_FARM_When_new_farm_has_name_attribute_as_empty_Expected_status_code_400,,,2019-04-09 05:29:02,2019-04-09 05:29:08,5.457s,PASSED
"name = """"",,,2019-04-09 05:29:03,2019-04-09 05:29:03,0.000s,PASSED
"userId = ""2""",,,2019-04-09 05:29:03,2019-04-09 05:29:03,0.001s,PASSED
"tokenUserName = ""jenny.maldonado.tx1@gmail.com""",,,2019-04-09 05:29:03,2019-04-09 05:29:03,0.001s,PASSED
"tokenPassword = ""cropmetrics""",,,2019-04-09 05:29:03,2019-04-09 05:29:03,0.001s,PASSED
"responseToken = sendRequest(findTestObject(""VoPro/Token"", [""usernameToken"":tokenUserName, ""passwordToken"":tokenPassword]))",,,2019-04-09 05:29:03,2019-04-09 05:29:03,0.067s,PASSED
slurper = new groovy.json.JsonSlurper(),,,2019-04-09 05:29:03,2019-04-09 05:29:03,0.000s,PASSED
tokenResult = slurper.parseText(responseToken.getResponseBodyContent()),,,2019-04-09 05:29:03,2019-04-09 05:29:03,0.000s,PASSED
accessToken = access_token,,,2019-04-09 05:29:03,2019-04-09 05:29:03,0.000s,PASSED
"println("".. Current access token generated for admin user : "" + accessToken)",,,2019-04-09 05:29:03,2019-04-09 05:29:03,0.000s,PASSED
"requestFarmPost = findTestObject(""VoGrow/Farm/FarmPost"", [""access_token"":accessToken])",,,2019-04-09 05:29:03,2019-04-09 05:29:03,0.008s,PASSED
"bodyRequest = ""{""name"": """" + name + """", ""user_id"": "" + userId + ""}""",,,2019-04-09 05:29:03,2019-04-09 05:29:03,0.000s,PASSED
try,,,2019-04-09 05:29:03,2019-04-09 05:29:03,0.000s,PASSED
responseFarm = sendRequest(requestFarmPost),,,2019-04-09 05:29:03,2019-04-09 05:29:08,5.207s,PASSED
"verifyResponseStatusCode(responseFarm, 400)",,,2019-04-09 05:29:08,2019-04-09 05:29:08,0.000s,PASSED
,,,,,,
Test Cases/VoGrow/API/Farm/Post/14 API_FARM_When_new_farm_has_name_attribute_as_empty_Expected_properly_error_message_is_displayed,,,2019-04-09 05:29:08,2019-04-09 05:29:14,6.520s,PASSED
"name = """"",,,2019-04-09 05:29:08,2019-04-09 05:29:08,0.005s,PASSED
"userId = ""2""",,,2019-04-09 05:29:08,2019-04-09 05:29:08,0.000s,PASSED
"tokenUserName = ""jenny.maldonado.tx1@gmail.com""",,,2019-04-09 05:29:08,2019-04-09 05:29:08,0.000s,PASSED
"tokenPassword = ""cropmetrics""",,,2019-04-09 05:29:08,2019-04-09 05:29:08,0.000s,PASSED
"responseToken = sendRequest(findTestObject(""VoPro/Token"", [""usernameToken"":tokenUserName, ""passwordToken"":tokenPassword]))",,,2019-04-09 05:29:08,2019-04-09 05:29:08,0.093s,PASSED
slurper = new groovy.json.JsonSlurper(),,,2019-04-09 05:29:08,2019-04-09 05:29:08,0.000s,PASSED
tokenResult = slurper.parseText(responseToken.getResponseBodyContent()),,,2019-04-09 05:29:08,2019-04-09 05:29:08,0.000s,PASSED
accessToken = access_token,,,2019-04-09 05:29:08,2019-04-09 05:29:08,0.000s,PASSED
"println("".. Current access token generated for admin user : "" + accessToken)",,,2019-04-09 05:29:08,2019-04-09 05:29:08,0.000s,PASSED
"requestFarmPost = findTestObject(""VoGrow/Farm/FarmPost"", [""access_token"":accessToken])",,,2019-04-09 05:29:08,2019-04-09 05:29:08,0.000s,PASSED
"bodyRequest = ""{""name"": """" + name + """", ""user_id"": "" + userId + ""}""",,,2019-04-09 05:29:08,2019-04-09 05:29:08,0.000s,PASSED
try,,,2019-04-09 05:29:08,2019-04-09 05:29:08,0.000s,PASSED
responseFarm = sendRequest(requestFarmPost),,,2019-04-09 05:29:08,2019-04-09 05:29:14,6.239s,PASSED
slurper1 = new groovy.json.JsonSlurper(),,,2019-04-09 05:29:14,2019-04-09 05:29:14,0.001s,PASSED
FarmPostResult = slurper1.parseText(responseFarm.getResponseBodyContent()),,,2019-04-09 05:29:14,2019-04-09 05:29:14,0.000s,PASSED
messageResponse = message,,,2019-04-09 05:29:14,2019-04-09 05:29:14,0.000s,PASSED
"messageExpected = ""The farm name must be provided.""",,,2019-04-09 05:29:14,2019-04-09 05:29:14,0.000s,PASSED
"println(""Error message response: "" + messageResponse)",,,2019-04-09 05:29:14,2019-04-09 05:29:14,0.000s,PASSED
"println(""Error message expected: "" + messageExpected)",,,2019-04-09 05:29:14,2019-04-09 05:29:14,0.000s,PASSED
"verifyElementPropertyValue(responseFarm, ""message"", messageExpected)",,,2019-04-09 05:29:14,2019-04-09 05:29:14,0.010s,PASSED
,,,,,,
Test Cases/VoGrow/API/Farm/Post/15 API_FARM_When_new_farm_has_name_attribute_as_symbols_Expected_status_code_400,,,2019-04-09 05:29:14,2019-04-09 05:29:20,5.733s,PASSED
"name = ""!@#$%^&""",,,2019-04-09 05:29:15,2019-04-09 05:29:15,0.001s,PASSED
"userId = ""2""",,,2019-04-09 05:29:15,2019-04-09 05:29:15,0.001s,PASSED
"tokenUserName = ""jenny.maldonado.tx1@gmail.com""",,,2019-04-09 05:29:15,2019-04-09 05:29:15,0.000s,PASSED
"tokenPassword = ""cropmetrics""",,,2019-04-09 05:29:15,2019-04-09 05:29:15,0.001s,PASSED
"responseToken = sendRequest(findTestObject(""VoPro/Token"", [""usernameToken"":tokenUserName, ""passwordToken"":tokenPassword]))",,,2019-04-09 05:29:15,2019-04-09 05:29:15,0.124s,PASSED
slurper = new groovy.json.JsonSlurper(),,,2019-04-09 05:29:15,2019-04-09 05:29:15,0.000s,PASSED
tokenResult = slurper.parseText(responseToken.getResponseBodyContent()),,,2019-04-09 05:29:15,2019-04-09 05:29:15,0.000s,PASSED
accessToken = access_token,,,2019-04-09 05:29:15,2019-04-09 05:29:15,0.000s,PASSED
"println("".. Current access token generated for admin user : "" + accessToken)",,,2019-04-09 05:29:15,2019-04-09 05:29:15,0.000s,PASSED
"requestFarmPost = findTestObject(""VoGrow/Farm/FarmPost"", [""access_token"":accessToken])",,,2019-04-09 05:29:15,2019-04-09 05:29:15,0.005s,PASSED
"bodyRequest = ""{""name"": """" + name + """", ""user_id"": "" + userId + ""}""",,,2019-04-09 05:29:15,2019-04-09 05:29:15,0.000s,PASSED
try,,,2019-04-09 05:29:15,2019-04-09 05:29:15,0.005s,PASSED
responseFarm = sendRequest(requestFarmPost),,,2019-04-09 05:29:15,2019-04-09 05:29:20,5.384s,PASSED
"verifyResponseStatusCode(responseFarm, 400)",,,2019-04-09 05:29:20,2019-04-09 05:29:20,0.003s,PASSED
,,,,,,
Test Cases/VoGrow/API/Farm/Post/16 API_FARM_When_new_farm_has_name_attribute_as_symbols_Expected_properly_error_message_is_displayed,,,2019-04-09 05:29:20,2019-04-09 05:29:26,6.048s,PASSED
"name = ""!@#$%""",,,2019-04-09 05:29:20,2019-04-09 05:29:20,0.001s,PASSED
"userId = ""2""",,,2019-04-09 05:29:20,2019-04-09 05:29:20,0.001s,PASSED
"tokenUserName = ""jenny.maldonado.tx1@gmail.com""",,,2019-04-09 05:29:20,2019-04-09 05:29:20,0.000s,PASSED
"tokenPassword = ""cropmetrics""",,,2019-04-09 05:29:20,2019-04-09 05:29:20,0.001s,PASSED
"responseToken = sendRequest(findTestObject(""VoPro/Token"", [""usernameToken"":tokenUserName, ""passwordToken"":tokenPassword]))",,,2019-04-09 05:29:20,2019-04-09 05:29:21,0.096s,PASSED
slurper = new groovy.json.JsonSlurper(),,,2019-04-09 05:29:21,2019-04-09 05:29:21,0.000s,PASSED
tokenResult = slurper.parseText(responseToken.getResponseBodyContent()),,,2019-04-09 05:29:21,2019-04-09 05:29:21,0.000s,PASSED
accessToken = access_token,,,2019-04-09 05:29:21,2019-04-09 05:29:21,0.000s,PASSED
"println("".. Current access token generated for admin user : "" + accessToken)",,,2019-04-09 05:29:21,2019-04-09 05:29:21,0.005s,PASSED
"requestFarmPost = findTestObject(""VoGrow/Farm/FarmPost"", [""access_token"":accessToken])",,,2019-04-09 05:29:21,2019-04-09 05:29:21,0.000s,PASSED
"bodyRequest = ""{""name"": """" + name + """", ""user_id"": "" + userId + ""}""",,,2019-04-09 05:29:21,2019-04-09 05:29:21,0.005s,PASSED
try,,,2019-04-09 05:29:21,2019-04-09 05:29:21,0.000s,PASSED
responseFarm = sendRequest(requestFarmPost),,,2019-04-09 05:29:21,2019-04-09 05:29:26,5.706s,PASSED
slurper1 = new groovy.json.JsonSlurper(),,,2019-04-09 05:29:26,2019-04-09 05:29:26,0.000s,PASSED
FarmPostResult = slurper1.parseText(responseFarm.getResponseBodyContent()),,,2019-04-09 05:29:26,2019-04-09 05:29:26,0.000s,PASSED
messageResponse = message,,,2019-04-09 05:29:26,2019-04-09 05:29:26,0.000s,PASSED
"messageExpected = ""The farm name must contain only alphanumeric characters, apostrophes and/or spaces.""",,,2019-04-09 05:29:26,2019-04-09 05:29:26,0.000s,PASSED
"println(""Error message response: "" + messageResponse)",,,2019-04-09 05:29:26,2019-04-09 05:29:26,0.000s,PASSED
"println(""Error message expected: "" + messageExpected)",,,2019-04-09 05:29:26,2019-04-09 05:29:26,0.000s,PASSED
"verifyElementPropertyValue(responseFarm, ""message"", messageExpected)",,,2019-04-09 05:29:26,2019-04-09 05:29:26,0.020s,PASSED
,,,,,,
Test Cases/VoGrow/API/Farm/Post/17 API_FARM_When_new_farm_has_name_attribute_with_spaces_and_chars_Expected_status_code_201,,,2019-04-09 05:29:26,2019-04-09 05:29:27,0.455s,PASSED
"name = ""   Farm name with spaces    """,,,2019-04-09 05:29:27,2019-04-09 05:29:27,0.000s,PASSED
"userId = ""2""",,,2019-04-09 05:29:27,2019-04-09 05:29:27,0.000s,PASSED
"tokenUserName = ""jenny.maldonado.tx1@gmail.com""",,,2019-04-09 05:29:27,2019-04-09 05:29:27,0.000s,PASSED
"tokenPassword = ""cropmetrics""",,,2019-04-09 05:29:27,2019-04-09 05:29:27,0.000s,PASSED
"responseToken = sendRequest(findTestObject(""VoPro/Token"", [""usernameToken"":tokenUserName, ""passwordToken"":tokenPassword]))",,,2019-04-09 05:29:27,2019-04-09 05:29:27,0.104s,PASSED
slurper = new groovy.json.JsonSlurper(),,,2019-04-09 05:29:27,2019-04-09 05:29:27,0.000s,PASSED
tokenResult = slurper.parseText(responseToken.getResponseBodyContent()),,,2019-04-09 05:29:27,2019-04-09 05:29:27,0.000s,PASSED
accessToken = access_token,,,2019-04-09 05:29:27,2019-04-09 05:29:27,0.000s,PASSED
"println("".. Current access token generated for admin user : "" + accessToken)",,,2019-04-09 05:29:27,2019-04-09 05:29:27,0.006s,PASSED
"requestFarmPost = findTestObject(""VoGrow/Farm/FarmPost"", [""access_token"":accessToken])",,,2019-04-09 05:29:27,2019-04-09 05:29:27,0.004s,PASSED
"bodyRequest = ""{""name"": """" + name + """", ""user_id"": "" + userId + ""}""",,,2019-04-09 05:29:27,2019-04-09 05:29:27,0.000s,PASSED
try,,,2019-04-09 05:29:27,2019-04-09 05:29:27,0.001s,PASSED
responseFarm = sendRequest(requestFarmPost),,,2019-04-09 05:29:27,2019-04-09 05:29:27,0.033s,PASSED
"verifyResponseStatusCode(responseFarm, 201)",,,2019-04-09 05:29:27,2019-04-09 05:29:27,0.002s,PASSED
slurper1 = new groovy.json.JsonSlurper(),,,2019-04-09 05:29:27,2019-04-09 05:29:27,0.001s,PASSED
FarmPostResult = slurper1.parseText(responseFarm.getResponseBodyContent()),,,2019-04-09 05:29:27,2019-04-09 05:29:27,0.000s,PASSED
farmId = id,,,2019-04-09 05:29:27,2019-04-09 05:29:27,0.000s,PASSED
userId = userId,,,2019-04-09 05:29:27,2019-04-09 05:29:27,0.001s,PASSED
"println(""New Farm created has the next id:  "" + id)",,,2019-04-09 05:29:27,2019-04-09 05:29:27,0.000s,PASSED
"println(""New Farm created has the next name:  "" + name)",,,2019-04-09 05:29:27,2019-04-09 05:29:27,0.000s,PASSED
"println(""New Farm created has the user id:  "" + user_id)",,,2019-04-09 05:29:27,2019-04-09 05:29:27,0.001s,PASSED
"verifyElementPropertyValue(responseFarm, ""user_id"", userId)",,,2019-04-09 05:29:27,2019-04-09 05:29:27,0.013s,PASSED
,,,,,,
Test Cases/VoGrow/API/Farm/Post/18 API_FARM_When_new_farm_has_name_attribute_with_only_numbers_Expected_status_code_201,,,2019-04-09 05:29:27,2019-04-09 05:29:27,0.330s,PASSED
"name = ""1234567890""",,,2019-04-09 05:29:27,2019-04-09 05:29:27,0.000s,PASSED
"userId = ""2""",,,2019-04-09 05:29:27,2019-04-09 05:29:27,0.000s,PASSED
"tokenUserName = ""jenny.maldonado.tx1@gmail.com""",,,2019-04-09 05:29:27,2019-04-09 05:29:27,0.000s,PASSED
"tokenPassword = ""cropmetrics""",,,2019-04-09 05:29:27,2019-04-09 05:29:27,0.000s,PASSED
"responseToken = sendRequest(findTestObject(""VoPro/Token"", [""usernameToken"":tokenUserName, ""passwordToken"":tokenPassword]))",,,2019-04-09 05:29:27,2019-04-09 05:29:27,0.124s,PASSED
slurper = new groovy.json.JsonSlurper(),,,2019-04-09 05:29:27,2019-04-09 05:29:27,0.000s,PASSED
tokenResult = slurper.parseText(responseToken.getResponseBodyContent()),,,2019-04-09 05:29:27,2019-04-09 05:29:27,0.000s,PASSED
accessToken = access_token,,,2019-04-09 05:29:27,2019-04-09 05:29:27,0.006s,PASSED
"println("".. Current access token generated for admin user : "" + accessToken)",,,2019-04-09 05:29:27,2019-04-09 05:29:27,0.000s,PASSED
"requestFarmPost = findTestObject(""VoGrow/Farm/FarmPost"", [""access_token"":accessToken])",,,2019-04-09 05:29:27,2019-04-09 05:29:27,0.000s,PASSED
"bodyRequest = ""{""name"": """" + name + """", ""user_id"": "" + userId + ""}""",,,2019-04-09 05:29:27,2019-04-09 05:29:27,0.000s,PASSED
try,,,2019-04-09 05:29:27,2019-04-09 05:29:27,0.000s,PASSED
responseFarm = sendRequest(requestFarmPost),,,2019-04-09 05:29:27,2019-04-09 05:29:27,0.030s,PASSED
"verifyResponseStatusCode(responseFarm, 201)",,,2019-04-09 05:29:27,2019-04-09 05:29:27,0.000s,PASSED
slurper1 = new groovy.json.JsonSlurper(),,,2019-04-09 05:29:27,2019-04-09 05:29:27,0.000s,PASSED
FarmPostResult = slurper1.parseText(responseFarm.getResponseBodyContent()),,,2019-04-09 05:29:27,2019-04-09 05:29:27,0.000s,PASSED
farmId = id,,,2019-04-09 05:29:27,2019-04-09 05:29:27,0.000s,PASSED
userId = userId,,,2019-04-09 05:29:27,2019-04-09 05:29:27,0.000s,PASSED
"println(""New Farm created has the next id:  "" + id)",,,2019-04-09 05:29:27,2019-04-09 05:29:27,0.000s,PASSED
"println(""New Farm created has the next name:  "" + name)",,,2019-04-09 05:29:27,2019-04-09 05:29:27,0.000s,PASSED
"println(""New Farm created has the user id:  "" + user_id)",,,2019-04-09 05:29:27,2019-04-09 05:29:27,0.000s,PASSED
"verifyElementPropertyValue(responseFarm, ""user_id"", userId)",,,2019-04-09 05:29:27,2019-04-09 05:29:27,0.020s,PASSED
,,,,,,
Test Cases/VoGrow/API/Farm/Post/19 API_FARM_When_new_farm_has_name_attribute_with_only_chars_Expected_status_code_201,,,2019-04-09 05:29:27,2019-04-09 05:29:27,0.360s,PASSED
"name = ""FarmNameWithOnlychars""",,,2019-04-09 05:29:27,2019-04-09 05:29:27,0.004s,PASSED
"userId = ""2""",,,2019-04-09 05:29:27,2019-04-09 05:29:27,0.000s,PASSED
"tokenUserName = ""jenny.maldonado.tx1@gmail.com""",,,2019-04-09 05:29:27,2019-04-09 05:29:27,0.000s,PASSED
"tokenPassword = ""cropmetrics""",,,2019-04-09 05:29:27,2019-04-09 05:29:27,0.000s,PASSED
"responseToken = sendRequest(findTestObject(""VoPro/Token"", [""usernameToken"":tokenUserName, ""passwordToken"":tokenPassword]))",,,2019-04-09 05:29:27,2019-04-09 05:29:27,0.104s,PASSED
slurper = new groovy.json.JsonSlurper(),,,2019-04-09 05:29:27,2019-04-09 05:29:27,0.000s,PASSED
tokenResult = slurper.parseText(responseToken.getResponseBodyContent()),,,2019-04-09 05:29:27,2019-04-09 05:29:27,0.000s,PASSED
accessToken = access_token,,,2019-04-09 05:29:27,2019-04-09 05:29:27,0.000s,PASSED
"println("".. Current access token generated for admin user : "" + accessToken)",,,2019-04-09 05:29:27,2019-04-09 05:29:27,0.000s,PASSED
"requestFarmPost = findTestObject(""VoGrow/Farm/FarmPost"", [""access_token"":accessToken])",,,2019-04-09 05:29:27,2019-04-09 05:29:27,0.000s,PASSED
"bodyRequest = ""{""name"": """" + name + """", ""user_id"": "" + userId + ""}""",,,2019-04-09 05:29:27,2019-04-09 05:29:27,0.000s,PASSED
try,,,2019-04-09 05:29:27,2019-04-09 05:29:27,0.000s,PASSED
responseFarm = sendRequest(requestFarmPost),,,2019-04-09 05:29:27,2019-04-09 05:29:27,0.035s,PASSED
"verifyResponseStatusCode(responseFarm, 201)",,,2019-04-09 05:29:27,2019-04-09 05:29:27,0.000s,PASSED
slurper1 = new groovy.json.JsonSlurper(),,,2019-04-09 05:29:27,2019-04-09 05:29:27,0.000s,PASSED
FarmPostResult = slurper1.parseText(responseFarm.getResponseBodyContent()),,,2019-04-09 05:29:27,2019-04-09 05:29:27,0.000s,PASSED
farmId = id,,,2019-04-09 05:29:27,2019-04-09 05:29:27,0.000s,PASSED
userId = userId,,,2019-04-09 05:29:27,2019-04-09 05:29:27,0.000s,PASSED
"println(""New Farm created has the next id:  "" + id)",,,2019-04-09 05:29:27,2019-04-09 05:29:27,0.000s,PASSED
"println(""New Farm created has the next name:  "" + name)",,,2019-04-09 05:29:27,2019-04-09 05:29:27,0.000s,PASSED
"println(""New Farm created has the user id:  "" + user_id)",,,2019-04-09 05:29:27,2019-04-09 05:29:27,0.000s,PASSED
"verifyElementPropertyValue(responseFarm, ""user_id"", userId)",,,2019-04-09 05:29:27,2019-04-09 05:29:27,0.015s,PASSED
,,,,,,
Test Cases/VoGrow/API/Farm/Post/20 API_FARM_When_new_farm_has_an_existing_name_for_the_user_token_Expected_status_code_400,,,2019-04-09 05:29:27,2019-04-09 05:29:33,5.388s,PASSED
"name = ""FarmNameWithOnlychars""",,,2019-04-09 05:29:28,2019-04-09 05:29:28,0.000s,PASSED
"userId = ""2""",,,2019-04-09 05:29:28,2019-04-09 05:29:28,0.001s,PASSED
"tokenUserName = ""jenny.maldonado.tx1@gmail.com""",,,2019-04-09 05:29:28,2019-04-09 05:29:28,0.001s,PASSED
"tokenPassword = ""cropmetrics""",,,2019-04-09 05:29:28,2019-04-09 05:29:28,0.001s,PASSED
"responseToken = sendRequest(findTestObject(""VoPro/Token"", [""usernameToken"":tokenUserName, ""passwordToken"":tokenPassword]))",,,2019-04-09 05:29:28,2019-04-09 05:29:28,0.105s,PASSED
slurper = new groovy.json.JsonSlurper(),,,2019-04-09 05:29:28,2019-04-09 05:29:28,0.000s,PASSED
tokenResult = slurper.parseText(responseToken.getResponseBodyContent()),,,2019-04-09 05:29:28,2019-04-09 05:29:28,0.000s,PASSED
accessToken = access_token,,,2019-04-09 05:29:28,2019-04-09 05:29:28,0.000s,PASSED
"println("".. Current access token generated for admin user : "" + accessToken)",,,2019-04-09 05:29:28,2019-04-09 05:29:28,0.000s,PASSED
"requestFarmPost = findTestObject(""VoGrow/Farm/FarmPost"", [""access_token"":accessToken])",,,2019-04-09 05:29:28,2019-04-09 05:29:28,0.007s,PASSED
"bodyRequest = ""{""name"": """" + name + """", ""user_id"": "" + userId + ""}""",,,2019-04-09 05:29:28,2019-04-09 05:29:28,0.000s,PASSED
try,,,2019-04-09 05:29:28,2019-04-09 05:29:28,0.000s,PASSED
responseFarm = sendRequest(requestFarmPost),,,2019-04-09 05:29:28,2019-04-09 05:29:33,4.994s,PASSED
"verifyResponseStatusCode(responseFarm, 400)",,,2019-04-09 05:29:33,2019-04-09 05:29:33,0.001s,PASSED
,,,,,,
Test Cases/VoGrow/API/Farm/Post/21 API_FARM_When_new_farm_has_an_existing_name_for_the_user_token_Expected_properly_error_message_is_displayed,,,2019-04-09 05:29:33,2019-04-09 05:29:38,4.898s,PASSED
"name = ""FarmNameWithOnlychars""",,,2019-04-09 05:29:33,2019-04-09 05:29:33,0.000s,PASSED
"userId = ""2""",,,2019-04-09 05:29:33,2019-04-09 05:29:33,0.000s,PASSED
"tokenUserName = ""jenny.maldonado.tx1@gmail.com""",,,2019-04-09 05:29:33,2019-04-09 05:29:33,0.000s,PASSED
"tokenPassword = ""cropmetrics""",,,2019-04-09 05:29:33,2019-04-09 05:29:33,0.000s,PASSED
"responseToken = sendRequest(findTestObject(""VoPro/Token"", [""usernameToken"":tokenUserName, ""passwordToken"":tokenPassword]))",,,2019-04-09 05:29:33,2019-04-09 05:29:33,0.160s,PASSED
slurper = new groovy.json.JsonSlurper(),,,2019-04-09 05:29:33,2019-04-09 05:29:33,0.000s,PASSED
tokenResult = slurper.parseText(responseToken.getResponseBodyContent()),,,2019-04-09 05:29:33,2019-04-09 05:29:33,0.005s,PASSED
accessToken = access_token,,,2019-04-09 05:29:33,2019-04-09 05:29:33,0.005s,PASSED
"println("".. Current access token generated for admin user : "" + accessToken)",,,2019-04-09 05:29:33,2019-04-09 05:29:33,0.000s,PASSED
"requestFarmPost = findTestObject(""VoGrow/Farm/FarmPost"", [""access_token"":accessToken])",,,2019-04-09 05:29:33,2019-04-09 05:29:33,0.000s,PASSED
"bodyRequest = ""{""name"": """" + name + """", ""user_id"": "" + userId + ""}""",,,2019-04-09 05:29:33,2019-04-09 05:29:33,0.000s,PASSED
try,,,2019-04-09 05:29:33,2019-04-09 05:29:33,0.000s,PASSED
responseFarm = sendRequest(requestFarmPost),,,2019-04-09 05:29:33,2019-04-09 05:29:38,4.545s,PASSED
slurper1 = new groovy.json.JsonSlurper(),,,2019-04-09 05:29:38,2019-04-09 05:29:38,0.001s,PASSED
FarmPostResult = slurper1.parseText(responseFarm.getResponseBodyContent()),,,2019-04-09 05:29:38,2019-04-09 05:29:38,0.001s,PASSED
messageResponse = message,,,2019-04-09 05:29:38,2019-04-09 05:29:38,0.001s,PASSED
"messageExpected = ""The farm name already exists.""",,,2019-04-09 05:29:38,2019-04-09 05:29:38,0.001s,PASSED
"println(""Error message response: "" + messageResponse)",,,2019-04-09 05:29:38,2019-04-09 05:29:38,0.000s,PASSED
"println(""Error message expected: "" + messageExpected)",,,2019-04-09 05:29:38,2019-04-09 05:29:38,0.000s,PASSED
"verifyElementPropertyValue(responseFarm, ""message"", messageExpected)",,,2019-04-09 05:29:38,2019-04-09 05:29:38,0.015s,PASSED
,,,,,,
Test Cases/VoGrow/API/Farm/Post/22 API_FARM_When_new_farm_has_the_name_of_the_other_user_different_of_the_user_token_Expected_status_code_201,,,2019-04-09 05:29:38,2019-04-09 05:29:38,0.411s,PASSED
"name = ""FarmNameWithOnlychars""",,,2019-04-09 05:29:38,2019-04-09 05:29:38,0.000s,PASSED
"userId = ""3""",,,2019-04-09 05:29:38,2019-04-09 05:29:38,0.000s,PASSED
"tokenUserName = ""jenny.maldonado.tx1@gmail.com""",,,2019-04-09 05:29:38,2019-04-09 05:29:38,0.005s,PASSED
"tokenPassword = ""cropmetrics""",,,2019-04-09 05:29:38,2019-04-09 05:29:38,0.000s,PASSED
"responseToken = sendRequest(findTestObject(""VoPro/Token"", [""usernameToken"":tokenUserName, ""passwordToken"":tokenPassword]))",,,2019-04-09 05:29:38,2019-04-09 05:29:38,0.125s,PASSED
slurper = new groovy.json.JsonSlurper(),,,2019-04-09 05:29:38,2019-04-09 05:29:38,0.000s,PASSED
tokenResult = slurper.parseText(responseToken.getResponseBodyContent()),,,2019-04-09 05:29:38,2019-04-09 05:29:38,0.000s,PASSED
accessToken = access_token,,,2019-04-09 05:29:38,2019-04-09 05:29:38,0.000s,PASSED
"println("".. Current access token generated for admin user : "" + accessToken)",,,2019-04-09 05:29:38,2019-04-09 05:29:38,0.000s,PASSED
"requestFarmPost = findTestObject(""VoGrow/Farm/FarmPost"", [""access_token"":accessToken])",,,2019-04-09 05:29:38,2019-04-09 05:29:38,0.007s,PASSED
"bodyRequest = ""{""name"": """" + name + """", ""user_id"": "" + userId + ""}""",,,2019-04-09 05:29:38,2019-04-09 05:29:38,0.000s,PASSED
try,,,2019-04-09 05:29:38,2019-04-09 05:29:38,0.000s,PASSED
responseFarm = sendRequest(requestFarmPost),,,2019-04-09 05:29:38,2019-04-09 05:29:38,0.038s,PASSED
"verifyResponseStatusCode(responseFarm, 201)",,,2019-04-09 05:29:38,2019-04-09 05:29:38,0.005s,PASSED
slurper1 = new groovy.json.JsonSlurper(),,,2019-04-09 05:29:38,2019-04-09 05:29:38,0.000s,PASSED
FarmPostResult = slurper1.parseText(responseFarm.getResponseBodyContent()),,,2019-04-09 05:29:38,2019-04-09 05:29:38,0.000s,PASSED
farmId = id,,,2019-04-09 05:29:38,2019-04-09 05:29:38,0.000s,PASSED
userId = userId,,,2019-04-09 05:29:38,2019-04-09 05:29:38,0.000s,PASSED
"println(""New Farm created has the next id:  "" + id)",,,2019-04-09 05:29:38,2019-04-09 05:29:38,0.000s,PASSED
"println(""New Farm created has the next name:  "" + name)",,,2019-04-09 05:29:38,2019-04-09 05:29:38,0.000s,PASSED
"println(""New Farm created has the user id:  "" + user_id)",,,2019-04-09 05:29:38,2019-04-09 05:29:38,0.000s,PASSED
"verifyElementPropertyValue(responseFarm, ""user_id"", userId)",,,2019-04-09 05:29:38,2019-04-09 05:29:38,0.010s,PASSED
,,,,,,
Test Cases/VoGrow/API/Farm/Post/23 API_FARM_When_new_farm_has_the_userid_attribute_as_empty_Expected_status_code_400,,,2019-04-09 05:29:38,2019-04-09 05:29:38,0.340s,PASSED
"name = ""New Farm with userID empty""",,,2019-04-09 05:29:38,2019-04-09 05:29:38,0.000s,PASSED
"userId = """"",,,2019-04-09 05:29:38,2019-04-09 05:29:38,0.000s,PASSED
"tokenUserName = ""jenny.maldonado.tx1@gmail.com""",,,2019-04-09 05:29:38,2019-04-09 05:29:38,0.000s,PASSED
"tokenPassword = ""cropmetrics""",,,2019-04-09 05:29:38,2019-04-09 05:29:38,0.000s,PASSED
"responseToken = sendRequest(findTestObject(""VoPro/Token"", [""usernameToken"":tokenUserName, ""passwordToken"":tokenPassword]))",,,2019-04-09 05:29:38,2019-04-09 05:29:38,0.098s,PASSED
slurper = new groovy.json.JsonSlurper(),,,2019-04-09 05:29:38,2019-04-09 05:29:38,0.000s,PASSED
tokenResult = slurper.parseText(responseToken.getResponseBodyContent()),,,2019-04-09 05:29:38,2019-04-09 05:29:38,0.000s,PASSED
accessToken = access_token,,,2019-04-09 05:29:38,2019-04-09 05:29:38,0.000s,PASSED
"println("".. Current access token generated for admin user : "" + accessToken)",,,2019-04-09 05:29:38,2019-04-09 05:29:38,0.000s,PASSED
"requestFarmPost = findTestObject(""VoGrow/Farm/FarmPost"", [""access_token"":accessToken])",,,2019-04-09 05:29:38,2019-04-09 05:29:38,0.000s,PASSED
"bodyRequest = ""{""name"": """" + name + """", ""user_id"": "" + userId + ""}""",,,2019-04-09 05:29:38,2019-04-09 05:29:38,0.000s,PASSED
try,,,2019-04-09 05:29:38,2019-04-09 05:29:38,0.000s,PASSED
responseFarm = sendRequest(requestFarmPost),,,2019-04-09 05:29:38,2019-04-09 05:29:38,0.030s,PASSED
"verifyResponseStatusCode(responseFarm, 400)",,,2019-04-09 05:29:38,2019-04-09 05:29:38,0.010s,PASSED
,,,,,,
Test Cases/VoGrow/API/Farm/Post/24 API_FARM_When_new_farm_has_the_userid_attribute_as_empty_Expected_properly_error_message_is_displayed,,,2019-04-09 05:29:38,2019-04-09 05:29:39,0.276s,PASSED
"name = ""New Farm with userID empty""",,,2019-04-09 05:29:39,2019-04-09 05:29:39,0.000s,PASSED
"userId = """"",,,2019-04-09 05:29:39,2019-04-09 05:29:39,0.000s,PASSED
"tokenUserName = ""jenny.maldonado.tx1@gmail.com""",,,2019-04-09 05:29:39,2019-04-09 05:29:39,0.000s,PASSED
"tokenPassword = ""cropmetrics""",,,2019-04-09 05:29:39,2019-04-09 05:29:39,0.000s,PASSED
"responseToken = sendRequest(findTestObject(""VoPro/Token"", [""usernameToken"":tokenUserName, ""passwordToken"":tokenPassword]))",,,2019-04-09 05:29:39,2019-04-09 05:29:39,0.069s,PASSED
slurper = new groovy.json.JsonSlurper(),,,2019-04-09 05:29:39,2019-04-09 05:29:39,0.001s,PASSED
tokenResult = slurper.parseText(responseToken.getResponseBodyContent()),,,2019-04-09 05:29:39,2019-04-09 05:29:39,0.000s,PASSED
accessToken = access_token,,,2019-04-09 05:29:39,2019-04-09 05:29:39,0.000s,PASSED
"println("".. Current access token generated for admin user : "" + accessToken)",,,2019-04-09 05:29:39,2019-04-09 05:29:39,0.000s,PASSED
"requestFarmPost = findTestObject(""VoGrow/Farm/FarmPost"", [""access_token"":accessToken])",,,2019-04-09 05:29:39,2019-04-09 05:29:39,0.002s,PASSED
"bodyRequest = ""{""name"": """" + name + """", ""user_id"": "" + userId + ""}""",,,2019-04-09 05:29:39,2019-04-09 05:29:39,0.000s,PASSED
try,,,2019-04-09 05:29:39,2019-04-09 05:29:39,0.001s,PASSED
responseFarm = sendRequest(requestFarmPost),,,2019-04-09 05:29:39,2019-04-09 05:29:39,0.018s,PASSED
slurper1 = new groovy.json.JsonSlurper(),,,2019-04-09 05:29:39,2019-04-09 05:29:39,0.001s,PASSED
FarmPostResult = slurper1.parseText(responseFarm.getResponseBodyContent()),,,2019-04-09 05:29:39,2019-04-09 05:29:39,0.000s,PASSED
messageResponse = message,,,2019-04-09 05:29:39,2019-04-09 05:29:39,0.001s,PASSED
"messageExpected = ""The request is invalid.""",,,2019-04-09 05:29:39,2019-04-09 05:29:39,0.001s,PASSED
"println(""Error message response: "" + messageResponse)",,,2019-04-09 05:29:39,2019-04-09 05:29:39,0.001s,PASSED
"println(""Error message expected: "" + messageExpected)",,,2019-04-09 05:29:39,2019-04-09 05:29:39,0.000s,PASSED
"verifyElementPropertyValue(responseFarm, ""message"", messageExpected)",,,2019-04-09 05:29:39,2019-04-09 05:29:39,0.017s,PASSED
,,,,,,
Test Cases/VoGrow/API/Farm/Post/25 API_FARM_When_new_farm_has_the_userid_attribute_with_chars_Expected_status_code_400,,,2019-04-09 05:29:39,2019-04-09 05:29:39,0.344s,PASSED
"name = ""New Farm with userID as char""",,,2019-04-09 05:29:39,2019-04-09 05:29:39,0.000s,PASSED
"userId = ""one""",,,2019-04-09 05:29:39,2019-04-09 05:29:39,0.000s,PASSED
"tokenUserName = ""jenny.maldonado.tx1@gmail.com""",,,2019-04-09 05:29:39,2019-04-09 05:29:39,0.000s,PASSED
"tokenPassword = ""cropmetrics""",,,2019-04-09 05:29:39,2019-04-09 05:29:39,0.000s,PASSED
"responseToken = sendRequest(findTestObject(""VoPro/Token"", [""usernameToken"":tokenUserName, ""passwordToken"":tokenPassword]))",,,2019-04-09 05:29:39,2019-04-09 05:29:39,0.132s,PASSED
slurper = new groovy.json.JsonSlurper(),,,2019-04-09 05:29:39,2019-04-09 05:29:39,0.000s,PASSED
tokenResult = slurper.parseText(responseToken.getResponseBodyContent()),,,2019-04-09 05:29:39,2019-04-09 05:29:39,0.000s,PASSED
accessToken = access_token,,,2019-04-09 05:29:39,2019-04-09 05:29:39,0.000s,PASSED
"println("".. Current access token generated for admin user : "" + accessToken)",,,2019-04-09 05:29:39,2019-04-09 05:29:39,0.000s,PASSED
"requestFarmPost = findTestObject(""VoGrow/Farm/FarmPost"", [""access_token"":accessToken])",,,2019-04-09 05:29:39,2019-04-09 05:29:39,0.000s,PASSED
"bodyRequest = ""{""name"": """" + name + """", ""user_id"": """" + userId + """"}""",,,2019-04-09 05:29:39,2019-04-09 05:29:39,0.008s,PASSED
try,,,2019-04-09 05:29:39,2019-04-09 05:29:39,0.000s,PASSED
responseFarm = sendRequest(requestFarmPost),,,2019-04-09 05:29:39,2019-04-09 05:29:39,0.027s,PASSED
"verifyResponseStatusCode(responseFarm, 400)",,,2019-04-09 05:29:39,2019-04-09 05:29:39,0.003s,PASSED
,,,,,,
Test Cases/VoGrow/API/Farm/Post/26 API_FARM_When_new_farm_has_the_userid_attribute_with_chars_Expected_properly_error_message_is_displayed,,,2019-04-09 05:29:39,2019-04-09 05:29:39,0.381s,PASSED
"name = ""New Farm with userID as char""",,,2019-04-09 05:29:39,2019-04-09 05:29:39,0.003s,PASSED
"userId = ""one""",,,2019-04-09 05:29:39,2019-04-09 05:29:39,0.000s,PASSED
"tokenUserName = ""jenny.maldonado.tx1@gmail.com""",,,2019-04-09 05:29:39,2019-04-09 05:29:39,0.000s,PASSED
"tokenPassword = ""cropmetrics""",,,2019-04-09 05:29:39,2019-04-09 05:29:39,0.000s,PASSED
"responseToken = sendRequest(findTestObject(""VoPro/Token"", [""usernameToken"":tokenUserName, ""passwordToken"":tokenPassword]))",,,2019-04-09 05:29:39,2019-04-09 05:29:39,0.090s,PASSED
slurper = new groovy.json.JsonSlurper(),,,2019-04-09 05:29:39,2019-04-09 05:29:39,0.000s,PASSED
tokenResult = slurper.parseText(responseToken.getResponseBodyContent()),,,2019-04-09 05:29:39,2019-04-09 05:29:39,0.000s,PASSED
accessToken = access_token,,,2019-04-09 05:29:39,2019-04-09 05:29:39,0.000s,PASSED
"println("".. Current access token generated for admin user : "" + accessToken)",,,2019-04-09 05:29:39,2019-04-09 05:29:39,0.002s,PASSED
"requestFarmPost = findTestObject(""VoGrow/Farm/FarmPost"", [""access_token"":accessToken])",,,2019-04-09 05:29:39,2019-04-09 05:29:39,0.002s,PASSED
"bodyRequest = ""{""name"": """" + name + """", ""user_id"": """" + userId + """"}""",,,2019-04-09 05:29:39,2019-04-09 05:29:39,0.000s,PASSED
try,,,2019-04-09 05:29:39,2019-04-09 05:29:39,0.000s,PASSED
responseFarm = sendRequest(requestFarmPost),,,2019-04-09 05:29:39,2019-04-09 05:29:39,0.026s,PASSED
slurper1 = new groovy.json.JsonSlurper(),,,2019-04-09 05:29:39,2019-04-09 05:29:39,0.000s,PASSED
FarmPostResult = slurper1.parseText(responseFarm.getResponseBodyContent()),,,2019-04-09 05:29:39,2019-04-09 05:29:39,0.000s,PASSED
messageResponse = message,,,2019-04-09 05:29:39,2019-04-09 05:29:39,0.000s,PASSED
"messageExpected = ""The request is invalid.""",,,2019-04-09 05:29:39,2019-04-09 05:29:39,0.000s,PASSED
"println(""Error message response: "" + messageResponse)",,,2019-04-09 05:29:39,2019-04-09 05:29:39,0.000s,PASSED
"println(""Error message expected: "" + messageExpected)",,,2019-04-09 05:29:39,2019-04-09 05:29:39,0.000s,PASSED
"verifyElementPropertyValue(responseFarm, ""message"", messageExpected)",,,2019-04-09 05:29:39,2019-04-09 05:29:39,0.016s,PASSED
,,,,,,
Test Cases/VoGrow/API/Farm/Post/27 API_FARM_When_new_farm_has_the_userid_attribute_with_spaces_Expected_status_code_400,,,2019-04-09 05:29:39,2019-04-09 05:29:40,0.366s,PASSED
"name = ""New Farm with userID as spaces""",,,2019-04-09 05:29:40,2019-04-09 05:29:40,0.000s,PASSED
"userId = ""   """,,,2019-04-09 05:29:40,2019-04-09 05:29:40,0.000s,PASSED
"tokenUserName = ""jenny.maldonado.tx1@gmail.com""",,,2019-04-09 05:29:40,2019-04-09 05:29:40,0.000s,PASSED
"tokenPassword = ""cropmetrics""",,,2019-04-09 05:29:40,2019-04-09 05:29:40,0.000s,PASSED
"responseToken = sendRequest(findTestObject(""VoPro/Token"", [""usernameToken"":tokenUserName, ""passwordToken"":tokenPassword]))",,,2019-04-09 05:29:40,2019-04-09 05:29:40,0.125s,PASSED
slurper = new groovy.json.JsonSlurper(),,,2019-04-09 05:29:40,2019-04-09 05:29:40,0.000s,PASSED
tokenResult = slurper.parseText(responseToken.getResponseBodyContent()),,,2019-04-09 05:29:40,2019-04-09 05:29:40,0.000s,PASSED
accessToken = access_token,,,2019-04-09 05:29:40,2019-04-09 05:29:40,0.000s,PASSED
"println("".. Current access token generated for admin user : "" + accessToken)",,,2019-04-09 05:29:40,2019-04-09 05:29:40,0.000s,PASSED
"requestFarmPost = findTestObject(""VoGrow/Farm/FarmPost"", [""access_token"":accessToken])",,,2019-04-09 05:29:40,2019-04-09 05:29:40,0.005s,PASSED
"bodyRequest = ""{""name"": """" + name + """", ""user_id"": """" + userId + """"}""",,,2019-04-09 05:29:40,2019-04-09 05:29:40,0.000s,PASSED
try,,,2019-04-09 05:29:40,2019-04-09 05:29:40,0.000s,PASSED
responseFarm = sendRequest(requestFarmPost),,,2019-04-09 05:29:40,2019-04-09 05:29:40,0.018s,PASSED
"verifyResponseStatusCode(responseFarm, 400)",,,2019-04-09 05:29:40,2019-04-09 05:29:40,0.007s,PASSED
,,,,,,
Test Cases/VoGrow/API/Farm/Post/28 API_FARM_When_new_farm_has_the_userid_attribute_with_spaces_Expected_properly_error_message_is_displayed,,,2019-04-09 05:29:40,2019-04-09 05:29:40,0.371s,PASSED
"name = ""New Farm with userID with spaces""",,,2019-04-09 05:29:40,2019-04-09 05:29:40,0.000s,PASSED
"userId = ""   """,,,2019-04-09 05:29:40,2019-04-09 05:29:40,0.000s,PASSED
"tokenUserName = ""jenny.maldonado.tx1@gmail.com""",,,2019-04-09 05:29:40,2019-04-09 05:29:40,0.000s,PASSED
"tokenPassword = ""cropmetrics""",,,2019-04-09 05:29:40,2019-04-09 05:29:40,0.000s,PASSED
"responseToken = sendRequest(findTestObject(""VoPro/Token"", [""usernameToken"":tokenUserName, ""passwordToken"":tokenPassword]))",,,2019-04-09 05:29:40,2019-04-09 05:29:40,0.100s,PASSED
slurper = new groovy.json.JsonSlurper(),,,2019-04-09 05:29:40,2019-04-09 05:29:40,0.000s,PASSED
tokenResult = slurper.parseText(responseToken.getResponseBodyContent()),,,2019-04-09 05:29:40,2019-04-09 05:29:40,0.000s,PASSED
accessToken = access_token,,,2019-04-09 05:29:40,2019-04-09 05:29:40,0.000s,PASSED
"println("".. Current access token generated for admin user : "" + accessToken)",,,2019-04-09 05:29:40,2019-04-09 05:29:40,0.002s,PASSED
"requestFarmPost = findTestObject(""VoGrow/Farm/FarmPost"", [""access_token"":accessToken])",,,2019-04-09 05:29:40,2019-04-09 05:29:40,0.003s,PASSED
"bodyRequest = ""{""name"": """" + name + """", ""user_id"": """" + userId + """"}""",,,2019-04-09 05:29:40,2019-04-09 05:29:40,0.000s,PASSED
try,,,2019-04-09 05:29:40,2019-04-09 05:29:40,0.000s,PASSED
responseFarm = sendRequest(requestFarmPost),,,2019-04-09 05:29:40,2019-04-09 05:29:40,0.022s,PASSED
slurper1 = new groovy.json.JsonSlurper(),,,2019-04-09 05:29:40,2019-04-09 05:29:40,0.000s,PASSED
FarmPostResult = slurper1.parseText(responseFarm.getResponseBodyContent()),,,2019-04-09 05:29:40,2019-04-09 05:29:40,0.001s,PASSED
messageResponse = message,,,2019-04-09 05:29:40,2019-04-09 05:29:40,0.000s,PASSED
"messageExpected = ""The request is invalid.""",,,2019-04-09 05:29:40,2019-04-09 05:29:40,0.001s,PASSED
"println(""Error message response: "" + messageResponse)",,,2019-04-09 05:29:40,2019-04-09 05:29:40,0.000s,PASSED
"println(""Error message expected: "" + messageExpected)",,,2019-04-09 05:29:40,2019-04-09 05:29:40,0.000s,PASSED
"verifyElementPropertyValue(responseFarm, ""message"", messageExpected)",,,2019-04-09 05:29:40,2019-04-09 05:29:40,0.015s,PASSED
,,,,,,
Test Cases/VoGrow/API/Farm/Post/29 API_FARM_When_new_farm_has_the_valid_userid_attribute_but_different_of_the_user_token_Expected_status_code_400,,,2019-04-09 05:29:40,2019-04-09 05:30:02,21.940s,PASSED
"name = ""New Farm with userID different of the user token""",,,2019-04-09 05:29:40,2019-04-09 05:29:40,0.000s,PASSED
"userId = ""4""",,,2019-04-09 05:29:40,2019-04-09 05:29:40,0.000s,PASSED
"tokenUserName = ""jenny.maldonado.tx@gmail.com""",,,2019-04-09 05:29:40,2019-04-09 05:29:40,0.000s,PASSED
"tokenPassword = ""cropmetrics""",,,2019-04-09 05:29:40,2019-04-09 05:29:40,0.000s,PASSED
"responseToken = sendRequest(findTestObject(""VoPro/Token"", [""usernameToken"":tokenUserName, ""passwordToken"":tokenPassword]))",,,2019-04-09 05:29:40,2019-04-09 05:29:41,0.108s,PASSED
slurper = new groovy.json.JsonSlurper(),,,2019-04-09 05:29:41,2019-04-09 05:29:41,0.000s,PASSED
tokenResult = slurper.parseText(responseToken.getResponseBodyContent()),,,2019-04-09 05:29:41,2019-04-09 05:29:41,0.000s,PASSED
accessToken = access_token,,,2019-04-09 05:29:41,2019-04-09 05:29:41,0.000s,PASSED
"println("".. Current access token generated for admin user : "" + accessToken)",,,2019-04-09 05:29:41,2019-04-09 05:29:41,0.000s,PASSED
"requestFarmPost = findTestObject(""VoGrow/Farm/FarmPost"", [""access_token"":accessToken])",,,2019-04-09 05:29:41,2019-04-09 05:29:41,0.005s,PASSED
"bodyRequest = ""{""name"": """" + name + """", ""user_id"": """" + userId + """"}""",,,2019-04-09 05:29:41,2019-04-09 05:29:41,0.000s,PASSED
try,,,2019-04-09 05:29:41,2019-04-09 05:29:41,0.004s,PASSED
responseFarm = sendRequest(requestFarmPost),,,2019-04-09 05:29:41,2019-04-09 05:30:02,21.588s,PASSED
"verifyResponseStatusCode(responseFarm, 400)",,,2019-04-09 05:30:02,2019-04-09 05:30:02,0.001s,PASSED
,,,,,,
Test Cases/VoGrow/API/Farm/Post/30 API_FARM_When_new_farm_has_valid_userid_attribute_but_different_of_user_token_Expected_properly_error_message_is_displayed,,,2019-04-09 05:30:02,2019-04-09 05:30:07,5.107s,PASSED
"name = ""New Farm with userID different of the user token""",,,2019-04-09 05:30:02,2019-04-09 05:30:02,0.000s,PASSED
"userId = ""4""",,,2019-04-09 05:30:02,2019-04-09 05:30:02,0.000s,PASSED
"tokenUserName = ""jenny.maldonado.tx@gmail.com""",,,2019-04-09 05:30:02,2019-04-09 05:30:02,0.000s,PASSED
"tokenPassword = ""cropmetrics""",,,2019-04-09 05:30:02,2019-04-09 05:30:02,0.000s,PASSED
"responseToken = sendRequest(findTestObject(""VoPro/Token"", [""usernameToken"":tokenUserName, ""passwordToken"":tokenPassword]))",,,2019-04-09 05:30:02,2019-04-09 05:30:02,0.090s,PASSED
slurper = new groovy.json.JsonSlurper(),,,2019-04-09 05:30:02,2019-04-09 05:30:02,0.000s,PASSED
tokenResult = slurper.parseText(responseToken.getResponseBodyContent()),,,2019-04-09 05:30:02,2019-04-09 05:30:02,0.000s,PASSED
accessToken = access_token,,,2019-04-09 05:30:02,2019-04-09 05:30:02,0.000s,PASSED
"println("".. Current access token generated for admin user : "" + accessToken)",,,2019-04-09 05:30:02,2019-04-09 05:30:02,0.004s,PASSED
"requestFarmPost = findTestObject(""VoGrow/Farm/FarmPost"", [""access_token"":accessToken])",,,2019-04-09 05:30:02,2019-04-09 05:30:02,0.000s,PASSED
"bodyRequest = ""{""name"": """" + name + """", ""user_id"": """" + userId + """"}""",,,2019-04-09 05:30:02,2019-04-09 05:30:02,0.000s,PASSED
try,,,2019-04-09 05:30:02,2019-04-09 05:30:02,0.000s,PASSED
responseFarm = sendRequest(requestFarmPost),,,2019-04-09 05:30:02,2019-04-09 05:30:07,4.833s,PASSED
slurper1 = new groovy.json.JsonSlurper(),,,2019-04-09 05:30:07,2019-04-09 05:30:07,0.000s,PASSED
FarmPostResult = slurper1.parseText(responseFarm.getResponseBodyContent()),,,2019-04-09 05:30:07,2019-04-09 05:30:07,0.000s,PASSED
messageResponse = message,,,2019-04-09 05:30:07,2019-04-09 05:30:07,0.000s,PASSED
"messageExpected = ""The request is not valid for a grower role.""",,,2019-04-09 05:30:07,2019-04-09 05:30:07,0.000s,PASSED
"println(""Error message response: "" + messageResponse)",,,2019-04-09 05:30:07,2019-04-09 05:30:07,0.001s,PASSED
"println(""Error message expected: "" + messageExpected)",,,2019-04-09 05:30:07,2019-04-09 05:30:07,0.000s,PASSED
"verifyElementPropertyValue(responseFarm, ""message"", messageExpected)",,,2019-04-09 05:30:07,2019-04-09 05:30:07,0.010s,PASSED
,,,,,,
Test Cases/VoGrow/API/Farm/Post/31 API_FARM_When_new_farm_has_an_invalid_userid_attribute_Expected_status_code_400,,,2019-04-09 05:30:07,2019-04-09 05:30:13,5.817s,PASSED
"name = ""New Farm with invalid userID""",,,2019-04-09 05:30:07,2019-04-09 05:30:07,0.000s,PASSED
"userId = ""1111111""",,,2019-04-09 05:30:07,2019-04-09 05:30:07,0.000s,PASSED
"tokenUserName = ""jenny.maldonado.tx@gmail.com""",,,2019-04-09 05:30:07,2019-04-09 05:30:07,0.000s,PASSED
"tokenPassword = ""cropmetrics""",,,2019-04-09 05:30:07,2019-04-09 05:30:07,0.000s,PASSED
"responseToken = sendRequest(findTestObject(""VoPro/Token"", [""usernameToken"":tokenUserName, ""passwordToken"":tokenPassword]))",,,2019-04-09 05:30:07,2019-04-09 05:30:07,0.096s,PASSED
slurper = new groovy.json.JsonSlurper(),,,2019-04-09 05:30:07,2019-04-09 05:30:07,0.000s,PASSED
tokenResult = slurper.parseText(responseToken.getResponseBodyContent()),,,2019-04-09 05:30:07,2019-04-09 05:30:07,0.000s,PASSED
accessToken = access_token,,,2019-04-09 05:30:07,2019-04-09 05:30:07,0.000s,PASSED
"println("".. Current access token generated for admin user : "" + accessToken)",,,2019-04-09 05:30:07,2019-04-09 05:30:08,0.005s,PASSED
"requestFarmPost = findTestObject(""VoGrow/Farm/FarmPost"", [""access_token"":accessToken])",,,2019-04-09 05:30:08,2019-04-09 05:30:08,0.000s,PASSED
"bodyRequest = ""{""name"": """" + name + """", ""user_id"": """" + userId + """"}""",,,2019-04-09 05:30:08,2019-04-09 05:30:08,0.000s,PASSED
try,,,2019-04-09 05:30:08,2019-04-09 05:30:08,0.000s,PASSED
responseFarm = sendRequest(requestFarmPost),,,2019-04-09 05:30:08,2019-04-09 05:30:13,5.537s,PASSED
"verifyResponseStatusCode(responseFarm, 400)",,,2019-04-09 05:30:13,2019-04-09 05:30:13,0.000s,PASSED
,,,,,,
Test Cases/VoGrow/API/Farm/Post/32 API_FARM_When_new_farm_has_an_invalid_userid_attribute_Expected_properly_error_message_is_displayed,,,2019-04-09 05:30:13,2019-04-09 05:30:18,4.860s,PASSED
"name = ""New Farm with invalid userID""",,,2019-04-09 05:30:13,2019-04-09 05:30:13,0.000s,PASSED
"userId = ""1111111""",,,2019-04-09 05:30:13,2019-04-09 05:30:13,0.000s,PASSED
"tokenUserName = ""jenny.maldonado.tx@gmail.com""",,,2019-04-09 05:30:13,2019-04-09 05:30:13,0.000s,PASSED
"tokenPassword = ""cropmetrics""",,,2019-04-09 05:30:13,2019-04-09 05:30:13,0.000s,PASSED
"responseToken = sendRequest(findTestObject(""VoPro/Token"", [""usernameToken"":tokenUserName, ""passwordToken"":tokenPassword]))",,,2019-04-09 05:30:13,2019-04-09 05:30:13,0.100s,PASSED
slurper = new groovy.json.JsonSlurper(),,,2019-04-09 05:30:13,2019-04-09 05:30:13,0.000s,PASSED
tokenResult = slurper.parseText(responseToken.getResponseBodyContent()),,,2019-04-09 05:30:13,2019-04-09 05:30:13,0.000s,PASSED
accessToken = access_token,,,2019-04-09 05:30:13,2019-04-09 05:30:13,0.000s,PASSED
"println("".. Current access token generated for admin user : "" + accessToken)",,,2019-04-09 05:30:13,2019-04-09 05:30:13,0.000s,PASSED
"requestFarmPost = findTestObject(""VoGrow/Farm/FarmPost"", [""access_token"":accessToken])",,,2019-04-09 05:30:13,2019-04-09 05:30:13,0.000s,PASSED
"bodyRequest = ""{""name"": """" + name + """", ""user_id"": """" + userId + """"}""",,,2019-04-09 05:30:13,2019-04-09 05:30:13,0.000s,PASSED
try,,,2019-04-09 05:30:13,2019-04-09 05:30:13,0.005s,PASSED
responseFarm = sendRequest(requestFarmPost),,,2019-04-09 05:30:13,2019-04-09 05:30:18,4.565s,PASSED
slurper1 = new groovy.json.JsonSlurper(),,,2019-04-09 05:30:18,2019-04-09 05:30:18,0.000s,PASSED
FarmPostResult = slurper1.parseText(responseFarm.getResponseBodyContent()),,,2019-04-09 05:30:18,2019-04-09 05:30:18,0.000s,PASSED
messageResponse = message,,,2019-04-09 05:30:18,2019-04-09 05:30:18,0.000s,PASSED
"messageExpected = ""The user id is not valid.""",,,2019-04-09 05:30:18,2019-04-09 05:30:18,0.000s,PASSED
"println(""Error message response: "" + messageResponse)",,,2019-04-09 05:30:18,2019-04-09 05:30:18,0.000s,PASSED
"println(""Error message expected: "" + messageExpected)",,,2019-04-09 05:30:18,2019-04-09 05:30:18,0.000s,PASSED
"verifyElementPropertyValue(responseFarm, ""message"", messageExpected)",,,2019-04-09 05:30:18,2019-04-09 05:30:18,0.005s,PASSED
,,,,,,
Test Cases/VoGrow/API/Farm/Post/33 API_FARM_When_new_farm_is_created_as_dealer_read_only_for_one_of_the_grower_assigned_Expected_status_code_201,,,2019-04-09 05:30:18,2019-04-09 05:30:18,0.390s,PASSED
"name = ""Farm 2 created by dealer read only""",,,2019-04-09 05:30:18,2019-04-09 05:30:18,0.000s,PASSED
"userId = ""3""",,,2019-04-09 05:30:18,2019-04-09 05:30:18,0.000s,PASSED
"tokenUserName = ""jenny.maldonado.tx.agent.ro@gmail.com""",,,2019-04-09 05:30:18,2019-04-09 05:30:18,0.000s,PASSED
"tokenPassword = ""cropmetrics""",,,2019-04-09 05:30:18,2019-04-09 05:30:18,0.000s,PASSED
"responseToken = sendRequest(findTestObject(""VoPro/Token"", [""usernameToken"":tokenUserName, ""passwordToken"":tokenPassword]))",,,2019-04-09 05:30:18,2019-04-09 05:30:18,0.093s,PASSED
slurper = new groovy.json.JsonSlurper(),,,2019-04-09 05:30:18,2019-04-09 05:30:18,0.005s,PASSED
tokenResult = slurper.parseText(responseToken.getResponseBodyContent()),,,2019-04-09 05:30:18,2019-04-09 05:30:18,0.000s,PASSED
accessToken = access_token,,,2019-04-09 05:30:18,2019-04-09 05:30:18,0.000s,PASSED
"println("".. Current access token generated for dealer account : "" + accessToken)",,,2019-04-09 05:30:18,2019-04-09 05:30:18,0.000s,PASSED
"requestFarmPost = findTestObject(""VoGrow/Farm/FarmPost"", [""access_token"":accessToken])",,,2019-04-09 05:30:18,2019-04-09 05:30:18,0.005s,PASSED
"bodyRequest = ""{""name"": """" + name + """", ""user_id"": "" + userId + ""}""",,,2019-04-09 05:30:18,2019-04-09 05:30:18,0.000s,PASSED
try,,,2019-04-09 05:30:18,2019-04-09 05:30:18,0.000s,PASSED
responseFarm = sendRequest(requestFarmPost),,,2019-04-09 05:30:18,2019-04-09 05:30:18,0.030s,PASSED
"verifyResponseStatusCode(responseFarm, 201)",,,2019-04-09 05:30:18,2019-04-09 05:30:18,0.000s,PASSED
slurper1 = new groovy.json.JsonSlurper(),,,2019-04-09 05:30:18,2019-04-09 05:30:18,0.010s,PASSED
FarmPostResult = slurper1.parseText(responseFarm.getResponseBodyContent()),,,2019-04-09 05:30:18,2019-04-09 05:30:18,0.000s,PASSED
farmId = id,,,2019-04-09 05:30:18,2019-04-09 05:30:18,0.000s,PASSED
userId = userId,,,2019-04-09 05:30:18,2019-04-09 05:30:18,0.000s,PASSED
"println(""New Farm created has the next id:  "" + id)",,,2019-04-09 05:30:18,2019-04-09 05:30:18,0.000s,PASSED
"println(""New Farm created has the next name:  "" + name)",,,2019-04-09 05:30:18,2019-04-09 05:30:18,0.000s,PASSED
"println(""New Farm created has the user id:  "" + user_id)",,,2019-04-09 05:30:18,2019-04-09 05:30:18,0.000s,PASSED
"verifyElementPropertyValue(responseFarm, ""user_id"", userId)",,,2019-04-09 05:30:18,2019-04-09 05:30:18,0.020s,PASSED
