{
  "log" : {
    "version" : "1.2",
    "creator" : {
      "name" : "BrowserMob Proxy",
      "version" : "2.1.5",
      "comment" : ""
    },
    "pages" : [ {
      "id" : "Page 0",
      "startedDateTime" : "2019-03-29T22:26:44.490Z",
      "title" : "Page 0",
      "pageTimings" : {
        "onLoad" : 1817,
        "comment" : ""
      },
      "comment" : ""
    } ],
    "entries" : [ {
      "pageref" : "Page 0",
      "startedDateTime" : "2019-03-29T22:26:44.491Z",
      "request" : {
        "method" : "POST",
        "url" : "http://localhost:10520/WebAPI/api/admin/v1/users/?",
        "httpVersion" : "HTTP/1.1",
        "cookies" : [ ],
        "headers" : [ {
          "name" : "User-Agent",
          "value" : "Katalon Studio"
        }, {
          "name" : "Content-Type",
          "value" : "application/x-www-form-urlencoded"
        }, {
          "name" : "Authorization",
          "value" : "Bearer eyJ0eXAiOiJKV1QiLCJhbGciOiJIUzI1NiJ9.eyJ1bmlxdWVfbmFtZSI6ImFkbWluIiwicm9sZSI6InVzZXIiLCJzdWIiOiJhZG1pbiIsImlzcyI6IkNyb3BNZXRyaWNzIiwiYXVkIjoiYWxsIiwiZXhwIjoxNTUzOTAyMzA0LCJuYmYiOjE1NTM4OTg0MDR9.iZ2XjLAEvvU43Rw8DrdqZfdikm9oi4PGQfIuo_seXEw"
        }, {
          "name" : "Host",
          "value" : "localhost:10520"
        }, {
          "name" : "Accept",
          "value" : "text/html, image/gif, image/jpeg, *; q=.2, */*; q=.2"
        }, {
          "name" : "Proxy-Connection",
          "value" : "keep-alive"
        }, {
          "name" : "Content-Length",
          "value" : "685"
        } ],
        "queryString" : [ ],
        "postData" : {
          "mimeType" : "application/x-www-form-urlencoded",
          "params" : [ {
            "name" : "password",
            "value" : "cropmetrics",
            "comment" : ""
          }, {
            "name" : "email",
            "value" : "cropmetricsvo.addressline1long@gmail.com",
            "comment" : ""
          }, {
            "name" : "fullname",
            "value" : "x",
            "comment" : ""
          }, {
            "name" : "phone",
            "value" : "1",
            "comment" : ""
          }, {
            "name" : "dealer",
            "value" : "xx",
            "comment" : ""
          }, {
            "name" : "addressLine1",
            "value" : "14 API_ACNT_When_new_account_have_long_addressline1_attribute_Expected_status_code_20014 API_ACNT_When_new_account_have_long_addressline1_attribute_Expected_status_code_20014 API_ACNT_When_new_account_have_long_addressline1_attribute_Expected_status_code_20014 API_ACNT_When_new_account_have_long_addressline1_attribute_Expected_status_code_20014 API_ACNT_When_new_account_have_long_addressline1_attribute_Expected_status_code_200",
            "comment" : ""
          }, {
            "name" : "addressLine2",
            "value" : "address line 2 test validation",
            "comment" : ""
          }, {
            "name" : "town",
            "value" : "townValidation",
            "comment" : ""
          }, {
            "name" : "state",
            "value" : "stateValidation",
            "comment" : ""
          }, {
            "name" : "zip",
            "value" : "zipValidation",
            "comment" : ""
          }, {
            "name" : "country",
            "value" : "countryValidation",
            "comment" : ""
          }, {
            "name" : "roles",
            "value" : "Client",
            "comment" : ""
          } ],
          "comment" : ""
        },
        "headersSize" : 544,
        "bodySize" : 685,
        "comment" : ""
      },
      "response" : {
        "status" : 200,
        "statusText" : "OK",
        "httpVersion" : "HTTP/1.1",
        "cookies" : [ {
          "name" : ".ASPROLES",
          "value" : "GwseRRKCRF0LztvAoRnevYCyjjQfMWSmRZbwlS6XCE9XaRQBidGlimf8kHo9EWZQdPebGeex5-YS1J3qmr-VC2EbFcPrgu64a-xQ_aVy0kZySATrBwQSALYcLkflvoKpOFwaQNouqk3xuTdTUULocsq4sEY5Rg8SGLYqp3QueSgXRfj5DjjJXcS0h2m12Zfiv4p__SJ9CVzCPwgPkZ_tQ3s7ISJ36GharFwD2otr1-QCo0_qQqh79duFiRq0y_swT3OPcPycwhKYHLXEGp-IHwMsU2qtrQDIQYUFhzvFrpCsa9PDxdZX0jUcM8_pfhO8nSYfzGyNdldT6Mg4SNaAXDxkdHko-Ocmnr_9PZzD0qemEOq2XL7im9U9oofkJyN2l0UsZ-Q7xdWJESVHs7XXlJwqcasf6K1JAICfWX0eFUAQqR99a0X2AS-rEpxw6ubRlOY9EN6wJESN7ncooIuRr5HAjE2hRws_hrt83vvB4-VFCdT80",
          "path" : "/",
          "httpOnly" : true,
          "secure" : false,
          "comment" : ""
        } ],
        "headers" : [ {
          "name" : "Cache-Control",
          "value" : "private"
        }, {
          "name" : "Content-Type",
          "value" : "application/json; charset=utf-8"
        }, {
          "name" : "Server",
          "value" : "Microsoft-IIS/10.0"
        }, {
          "name" : "Set-Cookie",
          "value" : ".ASPROLES=GwseRRKCRF0LztvAoRnevYCyjjQfMWSmRZbwlS6XCE9XaRQBidGlimf8kHo9EWZQdPebGeex5-YS1J3qmr-VC2EbFcPrgu64a-xQ_aVy0kZySATrBwQSALYcLkflvoKpOFwaQNouqk3xuTdTUULocsq4sEY5Rg8SGLYqp3QueSgXRfj5DjjJXcS0h2m12Zfiv4p__SJ9CVzCPwgPkZ_tQ3s7ISJ36GharFwD2otr1-QCo0_qQqh79duFiRq0y_swT3OPcPycwhKYHLXEGp-IHwMsU2qtrQDIQYUFhzvFrpCsa9PDxdZX0jUcM8_pfhO8nSYfzGyNdldT6Mg4SNaAXDxkdHko-Ocmnr_9PZzD0qemEOq2XL7im9U9oofkJyN2l0UsZ-Q7xdWJESVHs7XXlJwqcasf6K1JAICfWX0eFUAQqR99a0X2AS-rEpxw6ubRlOY9EN6wJESN7ncooIuRr5HAjE2hRws_hrt83vvB4-VFCdT80; path=/; HttpOnly"
        }, {
          "name" : "X-SourceFiles",
          "value" : "=?UTF-8?B?RDpcVmlydHVhbE9wdGltaXplci1SZWZhY3RvcmluZ1xDcm9wTWV0cmljcy5Wby5BcGlcQ3JvcE1ldHJpY3MuVm8uQXBpXGFwaVxhZG1pblx2MVx1c2Vyc1w=?="
        }, {
          "name" : "X-Powered-By",
          "value" : "ASP.NET"
        }, {
          "name" : "Date",
          "value" : "Fri, 29 Mar 2019 22:26:46 GMT"
        }, {
          "name" : "Content-Length",
          "value" : "9"
        } ],
        "content" : {
          "size" : 9,
          "mimeType" : "application/json; charset=utf-8",
          "text" : "{\"id\":21}",
          "comment" : ""
        },
        "redirectURL" : "",
        "headersSize" : 887,
        "bodySize" : 9,
        "comment" : ""
      },
      "cache" : { },
      "timings" : {
        "comment" : "",
        "ssl" : -1,
        "wait" : 1812,
        "send" : 0,
        "receive" : 1,
        "dns" : -1,
        "connect" : -1,
        "blocked" : -1
      },
      "serverIPAddress" : "127.0.0.1",
      "comment" : "",
      "_katalonRequestInformation" : {
        "name" : "63",
        "testObjectId" : "Object Repository/VoPro/Account/api_admin_v1_users",
        "harId" : "a38c1306-8999-47e9-bcaf-de1f6a14117e"
      },
      "time" : 1813
    } ],
    "comment" : ""
  }
}