{
  "log" : {
    "version" : "1.2",
    "creator" : {
      "name" : "BrowserMob Proxy",
      "version" : "2.1.5",
      "comment" : ""
    },
    "pages" : [ {
      "id" : "Page 0",
      "startedDateTime" : "2019-03-28T19:48:06.698Z",
      "title" : "Page 0",
      "pageTimings" : {
        "onLoad" : 1310,
        "comment" : ""
      },
      "comment" : ""
    } ],
    "entries" : [ {
      "pageref" : "Page 0",
      "startedDateTime" : "2019-03-28T19:48:06.699Z",
      "request" : {
        "method" : "POST",
        "url" : "http://localhost:10520/WebAPI/api/admin/v1/users/?",
        "httpVersion" : "HTTP/1.1",
        "cookies" : [ ],
        "headers" : [ {
          "name" : "User-Agent",
          "value" : "Katalon Studio"
        }, {
          "name" : "Content-Type",
          "value" : "application/x-www-form-urlencoded"
        }, {
          "name" : "Authorization",
          "value" : "Bearer eyJ0eXAiOiJKV1QiLCJhbGciOiJIUzI1NiJ9.eyJ1bmlxdWVfbmFtZSI6ImFkbWluIiwicm9sZSI6InVzZXIiLCJzdWIiOiJhZG1pbiIsImlzcyI6IkNyb3BNZXRyaWNzIiwiYXVkIjoiYWxsIiwiZXhwIjoxNTUzODA2Mzg2LCJuYmYiOjE1NTM4MDI0ODZ9.VQxWAYUWK0Q_FEd_MpykMsY42x1RDHJZzDO009UzYFo"
        }, {
          "name" : "Host",
          "value" : "localhost:10520"
        }, {
          "name" : "Accept",
          "value" : "text/html, image/gif, image/jpeg, *; q=.2, */*; q=.2"
        }, {
          "name" : "Proxy-Connection",
          "value" : "keep-alive"
        }, {
          "name" : "Content-Length",
          "value" : "286"
        } ],
        "queryString" : [ ],
        "postData" : {
          "mimeType" : "application/x-www-form-urlencoded",
          "params" : [ {
            "name" : "password",
            "value" : "cropmetrics",
            "comment" : ""
          }, {
            "name" : "email",
            "value" : "cropmetricsvo.zipnumber@gmail.com",
            "comment" : ""
          }, {
            "name" : "fullname",
            "value" : "test validation",
            "comment" : ""
          }, {
            "name" : "phone",
            "value" : "123",
            "comment" : ""
          }, {
            "name" : "dealer",
            "value" : "x",
            "comment" : ""
          }, {
            "name" : "addressLine1",
            "value" : "address line 1 test validation",
            "comment" : ""
          }, {
            "name" : "addressLine2",
            "value" : "address line 2 test validation",
            "comment" : ""
          }, {
            "name" : "town",
            "value" : "townValidation",
            "comment" : ""
          }, {
            "name" : "state",
            "value" : "stateValidation",
            "comment" : ""
          }, {
            "name" : "zip",
            "value" : "123457",
            "comment" : ""
          }, {
            "name" : "country",
            "value" : "countryValidation",
            "comment" : ""
          }, {
            "name" : "roles",
            "value" : "Client",
            "comment" : ""
          } ],
          "comment" : ""
        },
        "headersSize" : 544,
        "bodySize" : 286,
        "comment" : ""
      },
      "response" : {
        "status" : 200,
        "statusText" : "OK",
        "httpVersion" : "HTTP/1.1",
        "cookies" : [ {
          "name" : ".ASPROLES",
          "value" : "POFybohTkWnz2vdlbMc7iJalAarGg9GR_bDJNwpFRR9YJbjv5j1P0QVo2YXq04RYKZHyeNRZ-2dmEzROIMJvstlMv6gcYFehQrAZbzNqLfjyQAvyOVv52ZfMvvzbGLRyQmNjl8LxuxNFchQ7cjLRo3YfXME5-LApnFZJ5RnSYDh1nIOjLlOKsz-133-ELQhHUY9g236EroO4Vc75CMvWEfOjOy3h4Fi8DYV5ZXO7RRMC-RBctwsbwWSc9hBxHd6HFg8QhDXZFO2o67O9C-Kb0Ut3-aahLrYed4OPiTio5O5VgCvpsHl7m6_EmUHhc_yKtVYZPKF5DVyPHtvpOOr1m1Hq67uApr-GKOxWkN7CVtb-08IG3bXTv2AlR3rAh_wcd2RLyGHBYZn-gJC8-MPwrxITqvjoTGzme1psG2KReyY7YdFDIC1uEWyP1Uy4vzcLFezheDiTURhg46I0lYQeY_vO8v2b9qjbxd5fsaD4i-gninBv0",
          "path" : "/",
          "httpOnly" : true,
          "secure" : false,
          "comment" : ""
        } ],
        "headers" : [ {
          "name" : "Cache-Control",
          "value" : "private"
        }, {
          "name" : "Content-Type",
          "value" : "application/json; charset=utf-8"
        }, {
          "name" : "Server",
          "value" : "Microsoft-IIS/10.0"
        }, {
          "name" : "Set-Cookie",
          "value" : ".ASPROLES=POFybohTkWnz2vdlbMc7iJalAarGg9GR_bDJNwpFRR9YJbjv5j1P0QVo2YXq04RYKZHyeNRZ-2dmEzROIMJvstlMv6gcYFehQrAZbzNqLfjyQAvyOVv52ZfMvvzbGLRyQmNjl8LxuxNFchQ7cjLRo3YfXME5-LApnFZJ5RnSYDh1nIOjLlOKsz-133-ELQhHUY9g236EroO4Vc75CMvWEfOjOy3h4Fi8DYV5ZXO7RRMC-RBctwsbwWSc9hBxHd6HFg8QhDXZFO2o67O9C-Kb0Ut3-aahLrYed4OPiTio5O5VgCvpsHl7m6_EmUHhc_yKtVYZPKF5DVyPHtvpOOr1m1Hq67uApr-GKOxWkN7CVtb-08IG3bXTv2AlR3rAh_wcd2RLyGHBYZn-gJC8-MPwrxITqvjoTGzme1psG2KReyY7YdFDIC1uEWyP1Uy4vzcLFezheDiTURhg46I0lYQeY_vO8v2b9qjbxd5fsaD4i-gninBv0; path=/; HttpOnly"
        }, {
          "name" : "X-SourceFiles",
          "value" : "=?UTF-8?B?RDpcVmlydHVhbE9wdGltaXplci1SZWZhY3RvcmluZ1xDcm9wTWV0cmljcy5Wby5BcGlcQ3JvcE1ldHJpY3MuVm8uQXBpXGFwaVxhZG1pblx2MVx1c2Vyc1w=?="
        }, {
          "name" : "X-Powered-By",
          "value" : "ASP.NET"
        }, {
          "name" : "Date",
          "value" : "Thu, 28 Mar 2019 19:48:08 GMT"
        }, {
          "name" : "Content-Length",
          "value" : "9"
        } ],
        "content" : {
          "size" : 9,
          "mimeType" : "application/json; charset=utf-8",
          "text" : "{\"id\":25}",
          "comment" : ""
        },
        "redirectURL" : "",
        "headersSize" : 887,
        "bodySize" : 9,
        "comment" : ""
      },
      "cache" : { },
      "timings" : {
        "comment" : "",
        "ssl" : -1,
        "send" : 0,
        "wait" : 1305,
        "receive" : 0,
        "dns" : -1,
        "blocked" : -1,
        "connect" : -1
      },
      "serverIPAddress" : "127.0.0.1",
      "comment" : "",
      "_katalonRequestInformation" : {
        "name" : "85",
        "testObjectId" : "Object Repository/VoPro/Account/api_admin_v1_users",
        "harId" : "84140d65-a2d4-4dce-954b-e7217cdb706c"
      },
      "time" : 1306
    } ],
    "comment" : ""
  }
}