{
  "log" : {
    "version" : "1.2",
    "creator" : {
      "name" : "BrowserMob Proxy",
      "version" : "2.1.5",
      "comment" : ""
    },
    "pages" : [ {
      "id" : "Page 0",
      "startedDateTime" : "2019-04-04T21:06:24.363Z",
      "title" : "Page 0",
      "pageTimings" : {
        "onLoad" : 3178,
        "comment" : ""
      },
      "comment" : ""
    } ],
    "entries" : [ {
      "pageref" : "Page 0",
      "startedDateTime" : "2019-04-04T21:06:24.363Z",
      "request" : {
        "method" : "PUT",
        "url" : "http://localhost:10520/WebAPI/api/mobile/v1/farms/6?",
        "httpVersion" : "HTTP/1.1",
        "cookies" : [ ],
        "headers" : [ {
          "name" : "User-Agent",
          "value" : "Katalon Studio"
        }, {
          "name" : "Content-Type",
          "value" : "application/json"
        }, {
          "name" : "Authorization",
          "value" : "Bearer eyJ0eXAiOiJKV1QiLCJhbGciOiJIUzI1NiJ9.eyJ1bmlxdWVfbmFtZSI6Implbm55Lm1hbGRvbmFkby50eDFAZ21haWwuY29tIiwicm9sZSI6InVzZXIiLCJzdWIiOiJqZW5ueS5tYWxkb25hZG8udHgxQGdtYWlsLmNvbSIsImlzcyI6IkNyb3BNZXRyaWNzIiwiYXVkIjoiYWxsIiwiZXhwIjoxNTU0NDE1ODg0LCJuYmYiOjE1NTQ0MTE5ODR9.iTl8RK3CUGLtSJdvcdodsOEu68HNzgSgQTT96uh0LNY"
        }, {
          "name" : "Host",
          "value" : "localhost:10520"
        }, {
          "name" : "Accept",
          "value" : "text/html, image/gif, image/jpeg, *; q=.2, */*; q=.2"
        }, {
          "name" : "Proxy-Connection",
          "value" : "keep-alive"
        }, {
          "name" : "Content-Length",
          "value" : "22"
        } ],
        "queryString" : [ ],
        "postData" : {
          "mimeType" : "application/json",
          "text" : "{\"name\": \"1234567890\"}",
          "comment" : ""
        },
        "headersSize" : 591,
        "bodySize" : 22,
        "comment" : ""
      },
      "response" : {
        "status" : 400,
        "statusText" : "Bad Request",
        "httpVersion" : "HTTP/1.1",
        "cookies" : [ {
          "name" : ".ASPROLES",
          "value" : "meiRNOpLTqIWUhtJJxG9IuMAmn_QWXW0MPdjGpeFfQSYNiRQnx1YO5d_L2I_w6Au5imt1LXtETGbbY1JS4Y5WX_DvB-khx_LxF-IkyS_BPXukafWoqKCxl2dsKsWb15RnEjeYkaVs0IWz7WnrC0s_6wLIlZIiIggWZMXILTNB2_QTrVGO5xuC2-JHmwR_yOhPlAKJxrq-zMUImpEOwHJAQBTRrTiWfXKbOyOY9NgALZQXyvFRn8PngSRrBPHzHbr7l0pLRCGBvnyqD5WEWeeCDxmaivNBS_s3JbtmdwG-0m7NWECGB-5okBbmozSOwsI30Xi6GSrQC8j0qP4nXLmtguePV4XNmmFtnOpKJZagmuil1kRaSyx9PxwIXi1ol5nq9q3qEHPcEi2NYnWdv84_R5Sh2m5j0VltpYyzEVi-JR6Q7Efu7edoWsCe0FlSzLLtIX-3TjxMbnWJ8GjebU3BFVRF0oPMbsKiqqvnOykfdLPSrA-VC3Cb0cTQ4J4Tp47mUzqxbAXw8YpWmqTPkoBp_x2lT41",
          "path" : "/",
          "httpOnly" : true,
          "secure" : false,
          "comment" : ""
        } ],
        "headers" : [ {
          "name" : "Cache-Control",
          "value" : "private"
        }, {
          "name" : "Content-Type",
          "value" : "application/json; charset=utf-8"
        }, {
          "name" : "Server",
          "value" : "Microsoft-IIS/10.0"
        }, {
          "name" : "Set-Cookie",
          "value" : ".ASPROLES=meiRNOpLTqIWUhtJJxG9IuMAmn_QWXW0MPdjGpeFfQSYNiRQnx1YO5d_L2I_w6Au5imt1LXtETGbbY1JS4Y5WX_DvB-khx_LxF-IkyS_BPXukafWoqKCxl2dsKsWb15RnEjeYkaVs0IWz7WnrC0s_6wLIlZIiIggWZMXILTNB2_QTrVGO5xuC2-JHmwR_yOhPlAKJxrq-zMUImpEOwHJAQBTRrTiWfXKbOyOY9NgALZQXyvFRn8PngSRrBPHzHbr7l0pLRCGBvnyqD5WEWeeCDxmaivNBS_s3JbtmdwG-0m7NWECGB-5okBbmozSOwsI30Xi6GSrQC8j0qP4nXLmtguePV4XNmmFtnOpKJZagmuil1kRaSyx9PxwIXi1ol5nq9q3qEHPcEi2NYnWdv84_R5Sh2m5j0VltpYyzEVi-JR6Q7Efu7edoWsCe0FlSzLLtIX-3TjxMbnWJ8GjebU3BFVRF0oPMbsKiqqvnOykfdLPSrA-VC3Cb0cTQ4J4Tp47mUzqxbAXw8YpWmqTPkoBp_x2lT41; path=/; HttpOnly"
        }, {
          "name" : "X-SourceFiles",
          "value" : "=?UTF-8?B?RDpcVmlydHVhbE9wdGltaXplci1SZWZhY3RvcmluZ1xDcm9wTWV0cmljcy5Wby5BcGlcQ3JvcE1ldHJpY3MuVm8uQXBpXGFwaVxtb2JpbGVcdjFcZmFybXNcNg==?="
        }, {
          "name" : "X-Powered-By",
          "value" : "ASP.NET"
        }, {
          "name" : "Date",
          "value" : "Thu, 04 Apr 2019 21:06:27 GMT"
        }, {
          "name" : "Content-Length",
          "value" : "43"
        } ],
        "content" : {
          "size" : 43,
          "mimeType" : "application/json; charset=utf-8",
          "text" : "{\"message\":\"The farm name already exists.\"}",
          "comment" : ""
        },
        "redirectURL" : "",
        "headersSize" : 944,
        "bodySize" : 43,
        "comment" : ""
      },
      "cache" : { },
      "timings" : {
        "comment" : "",
        "dns" : -1,
        "connect" : -1,
        "blocked" : -1,
        "ssl" : -1,
        "receive" : 2,
        "send" : 0,
        "wait" : 3168
      },
      "serverIPAddress" : "127.0.0.1",
      "comment" : "",
      "_katalonRequestInformation" : {
        "name" : "32",
        "testObjectId" : "Object Repository/VoGrow/Farm/FarmPut",
        "harId" : "8716ab66-ae26-44ef-9e11-d7a564b56591"
      },
      "time" : 3171
    } ],
    "comment" : ""
  }
}