{
  "log" : {
    "version" : "1.2",
    "creator" : {
      "name" : "BrowserMob Proxy",
      "version" : "2.1.5",
      "comment" : ""
    },
    "pages" : [ {
      "id" : "Page 0",
      "startedDateTime" : "2019-03-29T16:40:33.721Z",
      "title" : "Page 0",
      "pageTimings" : {
        "onLoad" : 1963,
        "comment" : ""
      },
      "comment" : ""
    } ],
    "entries" : [ {
      "pageref" : "Page 0",
      "startedDateTime" : "2019-03-29T16:40:33.722Z",
      "request" : {
        "method" : "POST",
        "url" : "http://localhost:10520/WebAPI/api/admin/v1/users/?",
        "httpVersion" : "HTTP/1.1",
        "cookies" : [ ],
        "headers" : [ {
          "name" : "User-Agent",
          "value" : "Katalon Studio"
        }, {
          "name" : "Content-Type",
          "value" : "application/x-www-form-urlencoded"
        }, {
          "name" : "Authorization",
          "value" : "Bearer eyJ0eXAiOiJKV1QiLCJhbGciOiJIUzI1NiJ9.eyJ1bmlxdWVfbmFtZSI6ImFkbWluIiwicm9sZSI6InVzZXIiLCJzdWIiOiJhZG1pbiIsImlzcyI6IkNyb3BNZXRyaWNzIiwiYXVkIjoiYWxsIiwiZXhwIjoxNTUzODgxNTMzLCJuYmYiOjE1NTM4Nzc2MzN9.w5tuugDwSERbROslkNsUGPtHHQAAbbVV2nG2YmZq4mo"
        }, {
          "name" : "Host",
          "value" : "localhost:10520"
        }, {
          "name" : "Accept",
          "value" : "text/html, image/gif, image/jpeg, *; q=.2, */*; q=.2"
        }, {
          "name" : "Proxy-Connection",
          "value" : "keep-alive"
        }, {
          "name" : "Content-Length",
          "value" : "306"
        } ],
        "queryString" : [ ],
        "postData" : {
          "mimeType" : "application/x-www-form-urlencoded",
          "params" : [ {
            "name" : "password",
            "value" : "cropmetrics",
            "comment" : ""
          }, {
            "name" : "email",
            "value" : "cropmetricsvo.zipsymbol@gmail.com",
            "comment" : ""
          }, {
            "name" : "fullname",
            "value" : "test validation",
            "comment" : ""
          }, {
            "name" : "phone",
            "value" : "123",
            "comment" : ""
          }, {
            "name" : "dealer",
            "value" : "x",
            "comment" : ""
          }, {
            "name" : "addressLine1",
            "value" : "address line 1 test validation",
            "comment" : ""
          }, {
            "name" : "addressLine2",
            "value" : "address line 12 test validation",
            "comment" : ""
          }, {
            "name" : "town",
            "value" : "townValidation",
            "comment" : ""
          }, {
            "name" : "state",
            "value" : "stateValidation",
            "comment" : ""
          }, {
            "name" : "zip",
            "value" : "!@#$%^&*(",
            "comment" : ""
          }, {
            "name" : "country",
            "value" : "countryValidation",
            "comment" : ""
          }, {
            "name" : "roles",
            "value" : "Client",
            "comment" : ""
          } ],
          "comment" : ""
        },
        "headersSize" : 544,
        "bodySize" : 306,
        "comment" : ""
      },
      "response" : {
        "status" : 200,
        "statusText" : "OK",
        "httpVersion" : "HTTP/1.1",
        "cookies" : [ {
          "name" : ".ASPROLES",
          "value" : "Re71nIjZdqItFYhoWFA5TO70d76_Sa9Y6-4KKpat59PVyIlIvhQRMlKT8WZgb6uU0KCfVlswiEivJ_9X_OGf8_0bziHrrkvTYCFvk0QSTBoMZIS2pxKdMdQgnbaM_uhzaAZfGbzK_-yDIUWCFJ0F-3PVZ0QKmfbWOJkQ2JSx3evsQknPUod2-FUSKRcclvsgG4mS6TLJYec7EBFotPRjROYHyW3rAzxhDhy9DOunCnk3DSUkdZSt8pxXdhe4wJpZb-r9C2XGN5B9JQpEQ93EryVFfZKFgrhfmfUxEKzWi2w6cLGoEcoXeZYDiM6hRqX9KZgATxdLCS4Cxst9_iRoJ8F7xuenLWQejemPontWxLD6lpG6ivQbyQ31tbtVfUPAtFuHB87PtMNExPusF8BbyTVk-wPyJNOVhkFI_mBqnA6hPEcwAqe2HPCE1VVCUrQW88gpweFTw_IWs5mIQ88TjJLhzK4pbOAyLyMWouda0bYzOhAD0",
          "path" : "/",
          "httpOnly" : true,
          "secure" : false,
          "comment" : ""
        } ],
        "headers" : [ {
          "name" : "Cache-Control",
          "value" : "private"
        }, {
          "name" : "Content-Type",
          "value" : "application/json; charset=utf-8"
        }, {
          "name" : "Server",
          "value" : "Microsoft-IIS/10.0"
        }, {
          "name" : "Set-Cookie",
          "value" : ".ASPROLES=Re71nIjZdqItFYhoWFA5TO70d76_Sa9Y6-4KKpat59PVyIlIvhQRMlKT8WZgb6uU0KCfVlswiEivJ_9X_OGf8_0bziHrrkvTYCFvk0QSTBoMZIS2pxKdMdQgnbaM_uhzaAZfGbzK_-yDIUWCFJ0F-3PVZ0QKmfbWOJkQ2JSx3evsQknPUod2-FUSKRcclvsgG4mS6TLJYec7EBFotPRjROYHyW3rAzxhDhy9DOunCnk3DSUkdZSt8pxXdhe4wJpZb-r9C2XGN5B9JQpEQ93EryVFfZKFgrhfmfUxEKzWi2w6cLGoEcoXeZYDiM6hRqX9KZgATxdLCS4Cxst9_iRoJ8F7xuenLWQejemPontWxLD6lpG6ivQbyQ31tbtVfUPAtFuHB87PtMNExPusF8BbyTVk-wPyJNOVhkFI_mBqnA6hPEcwAqe2HPCE1VVCUrQW88gpweFTw_IWs5mIQ88TjJLhzK4pbOAyLyMWouda0bYzOhAD0; path=/; HttpOnly"
        }, {
          "name" : "X-SourceFiles",
          "value" : "=?UTF-8?B?RDpcVmlydHVhbE9wdGltaXplci1SZWZhY3RvcmluZ1xDcm9wTWV0cmljcy5Wby5BcGlcQ3JvcE1ldHJpY3MuVm8uQXBpXGFwaVxhZG1pblx2MVx1c2Vyc1w=?="
        }, {
          "name" : "X-Powered-By",
          "value" : "ASP.NET"
        }, {
          "name" : "Date",
          "value" : "Fri, 29 Mar 2019 16:40:35 GMT"
        }, {
          "name" : "Content-Length",
          "value" : "9"
        } ],
        "content" : {
          "size" : 9,
          "mimeType" : "application/json; charset=utf-8",
          "text" : "{\"id\":34}",
          "comment" : ""
        },
        "redirectURL" : "",
        "headersSize" : 887,
        "bodySize" : 9,
        "comment" : ""
      },
      "cache" : { },
      "timings" : {
        "comment" : "",
        "ssl" : -1,
        "wait" : 1970,
        "connect" : -1,
        "send" : 0,
        "blocked" : -1,
        "receive" : 0,
        "dns" : -1
      },
      "serverIPAddress" : "127.0.0.1",
      "comment" : "",
      "_katalonRequestInformation" : {
        "name" : "87",
        "testObjectId" : "Object Repository/VoPro/Account/api_admin_v1_users",
        "harId" : "90021d5c-83a1-47b2-bd17-af83c2973a95"
      },
      "time" : 1972
    } ],
    "comment" : ""
  }
}