{
  "log" : {
    "version" : "1.2",
    "creator" : {
      "name" : "BrowserMob Proxy",
      "version" : "2.1.5",
      "comment" : ""
    },
    "pages" : [ {
      "id" : "Page 0",
      "startedDateTime" : "2019-04-09T21:28:02.263Z",
      "title" : "Page 0",
      "pageTimings" : {
        "onLoad" : 4570,
        "comment" : ""
      },
      "comment" : ""
    } ],
    "entries" : [ {
      "pageref" : "Page 0",
      "startedDateTime" : "2019-04-09T21:28:02.263Z",
      "request" : {
        "method" : "PUT",
        "url" : "http://localhost:10520/WebAPI/api/mobile/v1/fields/3?",
        "httpVersion" : "HTTP/1.1",
        "cookies" : [ ],
        "headers" : [ {
          "name" : "User-Agent",
          "value" : "Katalon Studio"
        }, {
          "name" : "Content-Type",
          "value" : "application/json"
        }, {
          "name" : "Authorization",
          "value" : "Bearer eyJ0eXAiOiJKV1QiLCJhbGciOiJIUzI1NiJ9.eyJ1bmlxdWVfbmFtZSI6Implbm55Lm1hbGRvbmFkby50eDFAZ21haWwuY29tIiwicm9sZSI6InVzZXIiLCJzdWIiOiJqZW5ueS5tYWxkb25hZG8udHgxQGdtYWlsLmNvbSIsImlzcyI6IkNyb3BNZXRyaWNzIiwiYXVkIjoiYWxsIiwiZXhwIjoxNTU0ODQ5MTgyLCJuYmYiOjE1NTQ4NDUyODJ9.OjKmx_givPyj1QVOe1uaN5GQ7eDlqV6oNv84A2kke5U"
        }, {
          "name" : "Host",
          "value" : "localhost:10520"
        }, {
          "name" : "Accept",
          "value" : "text/html, image/gif, image/jpeg, *; q=.2, */*; q=.2"
        }, {
          "name" : "Proxy-Connection",
          "value" : "keep-alive"
        }, {
          "name" : "Content-Length",
          "value" : "361"
        } ],
        "queryString" : [ ],
        "postData" : {
          "mimeType" : "application/json",
          "text" : "{\"field\":{\"name\":\"Field without one point in boundary\",\"boundary\":{\"boundaries\":[{\"boundary\":{\"coords\":[{\"x\":-101.49568751,\"y\":37.14976293},{\"x\":-101.50049403,\"y\":37.14647907},{\"x\":-101.50049403,\"y\":37.14264773},{\"x\":-101.49723246,\"y\":37.1411425},{\"x\":-101.49019435,\"y\":37.14223722},{\"x\":-101.48933604,\"y\":37.14620541},{\"x\":-101.49294093,\"y\":37.14866833}]}}]}}}",
          "comment" : ""
        },
        "headersSize" : 593,
        "bodySize" : 361,
        "comment" : ""
      },
      "response" : {
        "status" : 400,
        "statusText" : "Bad Request",
        "httpVersion" : "HTTP/1.1",
        "cookies" : [ {
          "name" : ".ASPROLES",
          "value" : "7f_4QRQOl9xterEMVGyNLENWFGgANp-gbAnd-MT8ouy1FRjUxZJKT8CE42PUeSAmjs03_msiqcXyQowB6bmY23ZFpA_Sp24ma38ajq1lyHWf24Oofj6cMiWx-qoFVi2_bVGBgmGGOwutBxAW8nlpheSdY9snxK26cy5fCgKLP8xHYH6hLJx0cUibUaof9eNeb5KXh-xQTY9AYBUkBFWUDBSy5U6x0P0F6QNWi1vaNqOTpExdnPjPA34JQZffW3pwyMx5jdJr9kEMj97rUgbov6D7CwoKMly8kC90_PjrTg-TPxMRN0ayrexxr5D-O_lt9SHcpnYTxAYn_6UdOSG8sbl6V_l3rGKuyJtHkqTWLZ55_OsbMtYLA1kzZjCH2su09kY7k8j32qKWV79lHcYtRuezkKGSBu7Cgb3fSze6PBs5wH0iTK5zZ-libSEDR2S458JMDjkVB3Ra1_Zpss64ayczJbQHnsvMd2I3tnPSDe-5QMFh-wlouWQOY0aaVcjWV_e6e3uRcm3gnx0nRzJs9GmzxCI1",
          "path" : "/",
          "httpOnly" : true,
          "secure" : false,
          "comment" : ""
        } ],
        "headers" : [ {
          "name" : "Cache-Control",
          "value" : "private"
        }, {
          "name" : "Content-Type",
          "value" : "application/json; charset=utf-8"
        }, {
          "name" : "Server",
          "value" : "Microsoft-IIS/10.0"
        }, {
          "name" : "Set-Cookie",
          "value" : ".ASPROLES=7f_4QRQOl9xterEMVGyNLENWFGgANp-gbAnd-MT8ouy1FRjUxZJKT8CE42PUeSAmjs03_msiqcXyQowB6bmY23ZFpA_Sp24ma38ajq1lyHWf24Oofj6cMiWx-qoFVi2_bVGBgmGGOwutBxAW8nlpheSdY9snxK26cy5fCgKLP8xHYH6hLJx0cUibUaof9eNeb5KXh-xQTY9AYBUkBFWUDBSy5U6x0P0F6QNWi1vaNqOTpExdnPjPA34JQZffW3pwyMx5jdJr9kEMj97rUgbov6D7CwoKMly8kC90_PjrTg-TPxMRN0ayrexxr5D-O_lt9SHcpnYTxAYn_6UdOSG8sbl6V_l3rGKuyJtHkqTWLZ55_OsbMtYLA1kzZjCH2su09kY7k8j32qKWV79lHcYtRuezkKGSBu7Cgb3fSze6PBs5wH0iTK5zZ-libSEDR2S458JMDjkVB3Ra1_Zpss64ayczJbQHnsvMd2I3tnPSDe-5QMFh-wlouWQOY0aaVcjWV_e6e3uRcm3gnx0nRzJs9GmzxCI1; path=/; HttpOnly"
        }, {
          "name" : "X-SourceFiles",
          "value" : "=?UTF-8?B?RDpcVmlydHVhbE9wdGltaXplci1SZWZhY3RvcmluZ1xDcm9wTWV0cmljcy5Wby5BcGlcQ3JvcE1ldHJpY3MuVm8uQXBpXGFwaVxtb2JpbGVcdjFcZmllbGRzXDM=?="
        }, {
          "name" : "X-Powered-By",
          "value" : "ASP.NET"
        }, {
          "name" : "Date",
          "value" : "Tue, 09 Apr 2019 21:28:06 GMT"
        }, {
          "name" : "Content-Length",
          "value" : "119"
        } ],
        "content" : {
          "size" : 119,
          "mimeType" : "application/json; charset=utf-8",
          "text" : "{\"message\":\"The Boundary is not valid. IllegalArgumentException: Points of LinearRing do not form a closed linestring\"}",
          "comment" : ""
        },
        "redirectURL" : "",
        "headersSize" : 945,
        "bodySize" : 119,
        "comment" : ""
      },
      "cache" : { },
      "timings" : {
        "comment" : "",
        "send" : 0,
        "connect" : -1,
        "blocked" : -1,
        "dns" : -1,
        "receive" : 0,
        "wait" : 4563,
        "ssl" : -1
      },
      "serverIPAddress" : "127.0.0.1",
      "comment" : "",
      "_katalonRequestInformation" : {
        "name" : "109",
        "testObjectId" : "Object Repository/VoGrow/Field/FieldPut",
        "harId" : "c5fa5b3a-be50-4cf0-9167-d1468e2c831d"
      },
      "time" : 4564
    } ],
    "comment" : ""
  }
}