{
  "log" : {
    "version" : "1.2",
    "creator" : {
      "name" : "BrowserMob Proxy",
      "version" : "2.1.5",
      "comment" : ""
    },
    "pages" : [ {
      "id" : "Page 0",
      "startedDateTime" : "2019-04-05T19:25:46.700Z",
      "title" : "Page 0",
      "pageTimings" : {
        "onLoad" : 4272,
        "comment" : ""
      },
      "comment" : ""
    } ],
    "entries" : [ {
      "pageref" : "Page 0",
      "startedDateTime" : "2019-04-05T19:25:46.702Z",
      "request" : {
        "method" : "PUT",
        "url" : "http://localhost:10520/WebAPI/api/mobile/v1/farms/7?",
        "httpVersion" : "HTTP/1.1",
        "cookies" : [ ],
        "headers" : [ {
          "name" : "User-Agent",
          "value" : "Katalon Studio"
        }, {
          "name" : "Content-Type",
          "value" : "application/json"
        }, {
          "name" : "Authorization",
          "value" : "Bearer eyJ0eXAiOiJKV1QiLCJhbGciOiJIUzI1NiJ9.eyJ1bmlxdWVfbmFtZSI6Implbm55Lm1hbGRvbmFkby50eDFAZ21haWwuY29tIiwicm9sZSI6InVzZXIiLCJzdWIiOiJqZW5ueS5tYWxkb25hZG8udHgxQGdtYWlsLmNvbSIsImlzcyI6IkNyb3BNZXRyaWNzIiwiYXVkIjoiYWxsIiwiZXhwIjoxNTU0NDk2MjQ2LCJuYmYiOjE1NTQ0OTIzNDZ9.sgDmcmTF2CUlSYeYf1fEQCq6oB4T8aGqeLbZhupY15s"
        }, {
          "name" : "Host",
          "value" : "localhost:10520"
        }, {
          "name" : "Accept",
          "value" : "text/html, image/gif, image/jpeg, *; q=.2, */*; q=.2"
        }, {
          "name" : "Proxy-Connection",
          "value" : "keep-alive"
        }, {
          "name" : "Content-Length",
          "value" : "20"
        } ],
        "queryString" : [ ],
        "postData" : {
          "mimeType" : "application/json",
          "text" : "{\"name\": \"!@#$%^&*\"}",
          "comment" : ""
        },
        "headersSize" : 591,
        "bodySize" : 20,
        "comment" : ""
      },
      "response" : {
        "status" : 400,
        "statusText" : "Bad Request",
        "httpVersion" : "HTTP/1.1",
        "cookies" : [ {
          "name" : ".ASPROLES",
          "value" : "zdPZ6kcp0wACR5PgMJjp0LAVU-r1uLZfS35bFgIRk7bsNGsl-9g05ldlaGJMYpVv5aCGWZmS8Mjpcg3BUv5u5O7rUqAkupk0jP2sFDWTdfB2DCxo7c9B-zoGp9tl6HxyS9bbbD_7GJfnTq8ta4VW-KmnyxSezffn1oLUYlL4EvMDEovop3c14bbxGUDcgx4ozhI6eGBDhCv7-KBmRM2CNUjnzS0jP42fffOPZ6IfRsRwINBiPYbPgV4Bn9YAQfTQkrZClTu1H2SZj6aDUz-Sow9d3fj96oYPYuttSmZyYmom5S0cQ_cmJ8IbYcLyZe_Tn5pc48Ae0TfDt3mvWw_-6OZeCC35lc5cVfW5mP7xasLBFYCV3Hteif7GwhHO7K2PZOfHRSO7CSeDBM3KMyWq4wsOuvXIQIZ9n0q-Vzhf7zu2eMKnUn-OUVSYADeobsZumfOGayBnlBGPV7IUsWXmZptt7FjsHMRkIawLmQ3FcFDRgWKIIBSyhdUeeHkYhBgu3E6l329DXyIgveh5yyrwncD4t8o1",
          "path" : "/",
          "httpOnly" : true,
          "secure" : false,
          "comment" : ""
        } ],
        "headers" : [ {
          "name" : "Cache-Control",
          "value" : "private"
        }, {
          "name" : "Content-Type",
          "value" : "application/json; charset=utf-8"
        }, {
          "name" : "Server",
          "value" : "Microsoft-IIS/10.0"
        }, {
          "name" : "Set-Cookie",
          "value" : ".ASPROLES=zdPZ6kcp0wACR5PgMJjp0LAVU-r1uLZfS35bFgIRk7bsNGsl-9g05ldlaGJMYpVv5aCGWZmS8Mjpcg3BUv5u5O7rUqAkupk0jP2sFDWTdfB2DCxo7c9B-zoGp9tl6HxyS9bbbD_7GJfnTq8ta4VW-KmnyxSezffn1oLUYlL4EvMDEovop3c14bbxGUDcgx4ozhI6eGBDhCv7-KBmRM2CNUjnzS0jP42fffOPZ6IfRsRwINBiPYbPgV4Bn9YAQfTQkrZClTu1H2SZj6aDUz-Sow9d3fj96oYPYuttSmZyYmom5S0cQ_cmJ8IbYcLyZe_Tn5pc48Ae0TfDt3mvWw_-6OZeCC35lc5cVfW5mP7xasLBFYCV3Hteif7GwhHO7K2PZOfHRSO7CSeDBM3KMyWq4wsOuvXIQIZ9n0q-Vzhf7zu2eMKnUn-OUVSYADeobsZumfOGayBnlBGPV7IUsWXmZptt7FjsHMRkIawLmQ3FcFDRgWKIIBSyhdUeeHkYhBgu3E6l329DXyIgveh5yyrwncD4t8o1; path=/; HttpOnly"
        }, {
          "name" : "X-SourceFiles",
          "value" : "=?UTF-8?B?RDpcVmlydHVhbE9wdGltaXplci1SZWZhY3RvcmluZ1xDcm9wTWV0cmljcy5Wby5BcGlcQ3JvcE1ldHJpY3MuVm8uQXBpXGFwaVxtb2JpbGVcdjFcZmFybXNcNw==?="
        }, {
          "name" : "X-Powered-By",
          "value" : "ASP.NET"
        }, {
          "name" : "Date",
          "value" : "Fri, 05 Apr 2019 19:25:50 GMT"
        }, {
          "name" : "Content-Length",
          "value" : "97"
        } ],
        "content" : {
          "size" : 97,
          "mimeType" : "application/json; charset=utf-8",
          "text" : "{\"message\":\"The farm name must contain only alphanumeric characters, apostrophes and/or spaces.\"}",
          "comment" : ""
        },
        "redirectURL" : "",
        "headersSize" : 944,
        "bodySize" : 97,
        "comment" : ""
      },
      "cache" : { },
      "timings" : {
        "comment" : "",
        "ssl" : -1,
        "receive" : 0,
        "send" : 0,
        "connect" : -1,
        "blocked" : -1,
        "wait" : 4266,
        "dns" : -1
      },
      "serverIPAddress" : "127.0.0.1",
      "comment" : "",
      "_katalonRequestInformation" : {
        "name" : "23",
        "testObjectId" : "Object Repository/VoGrow/Farm/FarmPut",
        "harId" : "44417e21-f607-4bf8-a960-f51ac13599fa"
      },
      "time" : 4267
    } ],
    "comment" : ""
  }
}