Suite/Test/Step Name,Browser,Description,Tag,Start time,End time,Duration,Status
Auto_Restore_vo_summarizeddata_database_using_flyway_script,,,,2019-10-03 08:54:45,2019-10-03 08:54:54,8.720s,PASSED
,,,,,,,
Test Cases/Databases/CreateDatabases/Functional/DB_Create_vo_summarizeddata_database,,,,2019-10-03 08:54:46,2019-10-03 08:54:52,6.485s,PASSED
server = server,,,,2019-10-03 08:54:46,2019-10-03 08:54:47,0.714s,PASSED
port = port,,,,2019-10-03 08:54:47,2019-10-03 08:54:47,0.004s,PASSED
user = userDb,,,,2019-10-03 08:54:47,2019-10-03 08:54:47,0.003s,PASSED
password = passwordDb,,,,2019-10-03 08:54:47,2019-10-03 08:54:47,0.048s,PASSED
pathPostgreSQL = pathPostgreSQLBin,,,,2019-10-03 08:54:47,2019-10-03 08:54:47,0.003s,PASSED
"database = ""vo_summarizedData""",,,,2019-10-03 08:54:47,2019-10-03 08:54:47,0.004s,PASSED
"command = String.format(""cd ""%s"" && createdb -h %s -p %d -U %s  %s"", pathPostgreSQL, server, port, user, database)",,,,2019-10-03 08:54:47,2019-10-03 08:54:47,0.003s,PASSED
"commandLine.cmd.cmdLine(command, password)",,,,2019-10-03 08:54:47,2019-10-03 08:54:52,5.153s,PASSED
"println(""The "" + database + "" database was created..."")",,,,2019-10-03 08:54:52,2019-10-03 08:54:52,0.012s,PASSED
,,,,,,,
Test Cases/Databases/DatabasesWithFlyway/Functional/DB_vo_summarizeddata_with_fkyway,,,,2019-10-03 08:54:52,2019-10-03 08:54:54,1.406s,PASSED
user = userDb,,,,2019-10-03 08:54:52,2019-10-03 08:54:52,0.001s,PASSED
password = passwordDb,,,,2019-10-03 08:54:52,2019-10-03 08:54:52,0.002s,PASSED
pathFlyWay = flyway,,,,2019-10-03 08:54:52,2019-10-03 08:54:52,0.001s,PASSED
urlPostgreSql = urlPostgreSQL,,,,2019-10-03 08:54:52,2019-10-03 08:54:52,0.005s,PASSED
fielSystenPath = fileSystemPath,,,,2019-10-03 08:54:52,2019-10-03 08:54:52,0.004s,PASSED
"urlDatabase = ""vo_summarizedData""",,,,2019-10-03 08:54:52,2019-10-03 08:54:52,0.002s,PASSED
"filesystemDatabase = ""summarizedData""",,,,2019-10-03 08:54:52,2019-10-03 08:54:52,0.006s,PASSED
"commandFlyWay = String.format(""cd ""%s"" && flyway -user=%s -password=%s -url=%s%s -locations=filesystem:""%s%s""  migrate"", pathFlyWay, user, password, urlPostgreSql, urlDatabase, fielSystenPath, filesystemDatabase)",,,,2019-10-03 08:54:52,2019-10-03 08:54:52,0.011s,PASSED
commandLine.cmd.singleCommand(commandFlyWay),,,,2019-10-03 08:54:52,2019-10-03 08:54:54,1.029s,PASSED
"println(""The vo_summarizedData database is applied with flyway scripts..."")",,,,2019-10-03 08:54:54,2019-10-03 08:54:54,0.009s,PASSED
