{
  "log" : {
    "version" : "1.2",
    "creator" : {
      "name" : "BrowserMob Proxy",
      "version" : "2.1.5",
      "comment" : ""
    },
    "pages" : [ {
      "id" : "Page 0",
      "startedDateTime" : "2019-03-27T19:54:09.016Z",
      "title" : "Page 0",
      "pageTimings" : {
        "onLoad" : 2278,
        "comment" : ""
      },
      "comment" : ""
    } ],
    "entries" : [ {
      "pageref" : "Page 0",
      "startedDateTime" : "2019-03-27T19:54:09.017Z",
      "request" : {
        "method" : "POST",
        "url" : "http://localhost:10520/WebAPI/api/Account/AdministrativeRegister/?",
        "httpVersion" : "HTTP/1.1",
        "cookies" : [ ],
        "headers" : [ {
          "name" : "User-Agent",
          "value" : "Katalon Studio"
        }, {
          "name" : "Content-Type",
          "value" : "application/x-www-form-urlencoded"
        }, {
          "name" : "Authorization",
          "value" : "Bearer eyJ0eXAiOiJKV1QiLCJhbGciOiJIUzI1NiJ9.eyJ1bmlxdWVfbmFtZSI6ImFkbWluIiwicm9sZSI6InVzZXIiLCJzdWIiOiJhZG1pbiIsImlzcyI6IkNyb3BNZXRyaWNzIiwiYXVkIjoiYWxsIiwiZXhwIjoxNTUzNzIwMzQ4LCJuYmYiOjE1NTM3MTY0NDh9.2cpw2hqEkW4mfC24c7pUOqMGI3rotMI_do1ImW6JWOw"
        }, {
          "name" : "Host",
          "value" : "localhost:10520"
        }, {
          "name" : "Accept",
          "value" : "text/html, image/gif, image/jpeg, *; q=.2, */*; q=.2"
        }, {
          "name" : "Proxy-Connection",
          "value" : "keep-alive"
        }, {
          "name" : "Content-Length",
          "value" : "397"
        } ],
        "queryString" : [ ],
        "postData" : {
          "mimeType" : "application/x-www-form-urlencoded",
          "params" : [ {
            "name" : "username",
            "value" : "kuserpassonly6spaces",
            "comment" : ""
          }, {
            "name" : "password",
            "value" : "      ",
            "comment" : ""
          }, {
            "name" : "confirmPassword",
            "value" : "cropmetrics",
            "comment" : ""
          }, {
            "name" : "email",
            "value" : "cropmetricsvo@gmail.com",
            "comment" : ""
          }, {
            "name" : "fullname",
            "value" : "test validation",
            "comment" : ""
          }, {
            "name" : "phone",
            "value" : "123",
            "comment" : ""
          }, {
            "name" : "dealer",
            "value" : "dealer test validation",
            "comment" : ""
          }, {
            "name" : "addressLine1",
            "value" : "address line 1 test validation",
            "comment" : ""
          }, {
            "name" : "addressLine2",
            "value" : "address line 1 test validation",
            "comment" : ""
          }, {
            "name" : "town",
            "value" : "townValidation",
            "comment" : ""
          }, {
            "name" : "state",
            "value" : "stateValidation",
            "comment" : ""
          }, {
            "name" : "zip",
            "value" : "zipValidation",
            "comment" : ""
          }, {
            "name" : "country",
            "value" : "countryValidation",
            "comment" : ""
          }, {
            "name" : "roles",
            "value" : "Client",
            "comment" : ""
          }, {
            "name" : "modifierUsername",
            "value" : "admin",
            "comment" : ""
          }, {
            "name" : "modifierUserId",
            "value" : "1",
            "comment" : ""
          } ],
          "comment" : ""
        },
        "headersSize" : 560,
        "bodySize" : 397,
        "comment" : ""
      },
      "response" : {
        "status" : 500,
        "statusText" : "Internal Server Error",
        "httpVersion" : "HTTP/1.1",
        "cookies" : [ {
          "name" : ".ASPROLES",
          "value" : "u_LgU8MYPaGfqgrJpLUeHQuS4LDydTzdrgAuzohPC6qOdyRqvxJd5vQ1V-p1C2hwqKbHMqUF-sz9MT6ih2kjXvrOXKG6w63x9z84oik4GLSxQYrDxUl47xYPWM0DsZAmoEA0ZWljh_nGPO9qRqkaTwVpcm0c8zHOhSuZvY6iIfvO8LSqzUnR_xot7ncMm-obtTg_K2dMH6416qJnAldQgikzDSMX08VDgk11XaF8tQVdeD5jK4XMRMK9-rJ0O4A1_udj_bZ3_Me_kX_OPIslBdPXdWCyRYiWUN2MYocNjGSEs3CR1YuLoRS3RcHWZYZ2m-D9bmB6v_O1u3vjx888R-cNRzI3upAUAqamFEj_vXMjjXTgrb9o6a3hziuS2az_oWH1AdBlil_Cp9oXNc9ugxt14gOCTwHihCB6PIPl_VDiCqRC22BpbZdD71soRlO5syvlVEG_n83UdAFUm9e83Nx4ABSLZ6uMCWh7oOxmgQmWlYmd0",
          "path" : "/",
          "httpOnly" : true,
          "secure" : false,
          "comment" : ""
        } ],
        "headers" : [ {
          "name" : "Cache-Control",
          "value" : "private"
        }, {
          "name" : "Content-Type",
          "value" : "application/json; charset=utf-8"
        }, {
          "name" : "Server",
          "value" : "Microsoft-IIS/10.0"
        }, {
          "name" : "Set-Cookie",
          "value" : ".ASPROLES=u_LgU8MYPaGfqgrJpLUeHQuS4LDydTzdrgAuzohPC6qOdyRqvxJd5vQ1V-p1C2hwqKbHMqUF-sz9MT6ih2kjXvrOXKG6w63x9z84oik4GLSxQYrDxUl47xYPWM0DsZAmoEA0ZWljh_nGPO9qRqkaTwVpcm0c8zHOhSuZvY6iIfvO8LSqzUnR_xot7ncMm-obtTg_K2dMH6416qJnAldQgikzDSMX08VDgk11XaF8tQVdeD5jK4XMRMK9-rJ0O4A1_udj_bZ3_Me_kX_OPIslBdPXdWCyRYiWUN2MYocNjGSEs3CR1YuLoRS3RcHWZYZ2m-D9bmB6v_O1u3vjx888R-cNRzI3upAUAqamFEj_vXMjjXTgrb9o6a3hziuS2az_oWH1AdBlil_Cp9oXNc9ugxt14gOCTwHihCB6PIPl_VDiCqRC22BpbZdD71soRlO5syvlVEG_n83UdAFUm9e83Nx4ABSLZ6uMCWh7oOxmgQmWlYmd0; path=/; HttpOnly"
        }, {
          "name" : "X-SourceFiles",
          "value" : "=?UTF-8?B?RDpcVmlydHVhbE9wdGltaXplci1SZWZhY3RvcmluZ1xDcm9wTWV0cmljcy5Wby5BcGlcQ3JvcE1ldHJpY3MuVm8uQXBpXGFwaVxBY2NvdW50XEFkbWluaXN0cmF0aXZlUmVnaXN0ZXJc?="
        }, {
          "name" : "X-Powered-By",
          "value" : "ASP.NET"
        }, {
          "name" : "Date",
          "value" : "Wed, 27 Mar 2019 19:54:11 GMT"
        }, {
          "name" : "Content-Length",
          "value" : "53"
        } ],
        "content" : {
          "size" : 53,
          "mimeType" : "application/json; charset=utf-8",
          "text" : "{\"message\":\"Internal server error in the processing\"}",
          "comment" : ""
        },
        "redirectURL" : "",
        "headersSize" : 927,
        "bodySize" : 53,
        "comment" : ""
      },
      "cache" : { },
      "timings" : {
        "comment" : "",
        "ssl" : -1,
        "send" : 0,
        "receive" : 0,
        "wait" : 2273,
        "connect" : -1,
        "blocked" : -1,
        "dns" : -1
      },
      "serverIPAddress" : "127.0.0.1",
      "comment" : "",
      "_katalonRequestInformation" : {
        "name" : "87",
        "testObjectId" : "Object Repository/VoPro/Account/AdministrativeRegister",
        "harId" : "9a5a87ac-58be-492c-9684-26251c3840fc"
      },
      "time" : 2274
    } ],
    "comment" : ""
  }
}