{
  "log" : {
    "version" : "1.2",
    "creator" : {
      "name" : "BrowserMob Proxy",
      "version" : "2.1.5",
      "comment" : ""
    },
    "pages" : [ {
      "id" : "Page 0",
      "startedDateTime" : "2019-03-29T22:09:53.584Z",
      "title" : "Page 0",
      "pageTimings" : {
        "onLoad" : 27,
        "comment" : ""
      },
      "comment" : ""
    } ],
    "entries" : [ {
      "pageref" : "Page 0",
      "startedDateTime" : "2019-03-29T22:09:53.585Z",
      "request" : {
        "method" : "POST",
        "url" : "http://localhost:10520/WebAPI/api/admin/v1/users/?",
        "httpVersion" : "HTTP/1.1",
        "cookies" : [ ],
        "headers" : [ {
          "name" : "User-Agent",
          "value" : "Katalon Studio"
        }, {
          "name" : "Content-Type",
          "value" : "application/x-www-form-urlencoded"
        }, {
          "name" : "Authorization",
          "value" : "Bearer eyJ0eXAiOiJKV1QiLCJhbGciOiJIUzI1NiJ9.eyJ1bmlxdWVfbmFtZSI6ImFkbWluIiwicm9sZSI6InVzZXIiLCJzdWIiOiJhZG1pbiIsImlzcyI6IkNyb3BNZXRyaWNzIiwiYXVkIjoiYWxsIiwiZXhwIjoxNTUzOTAxMjkzLCJuYmYiOjE1NTM4OTczOTN9.gqPoabrWxKUWF5ddhQY5U1E815i-eXJnlZadS6Kz4ew"
        }, {
          "name" : "Host",
          "value" : "localhost:10520"
        }, {
          "name" : "Accept",
          "value" : "text/html, image/gif, image/jpeg, *; q=.2, */*; q=.2"
        }, {
          "name" : "Proxy-Connection",
          "value" : "keep-alive"
        }, {
          "name" : "Content-Length",
          "value" : "315"
        } ],
        "queryString" : [ ],
        "postData" : {
          "mimeType" : "application/x-www-form-urlencoded",
          "params" : [ {
            "name" : "password",
            "value" : "      ",
            "comment" : ""
          }, {
            "name" : "email",
            "value" : "cropmetricsvo.passonly6spaces@gmail.com",
            "comment" : ""
          }, {
            "name" : "fullname",
            "value" : "test validation",
            "comment" : ""
          }, {
            "name" : "phone",
            "value" : "123",
            "comment" : ""
          }, {
            "name" : "dealer",
            "value" : "dealer test validation",
            "comment" : ""
          }, {
            "name" : "addressLine1",
            "value" : "address line 1 test validation",
            "comment" : ""
          }, {
            "name" : "addressLine2",
            "value" : "address line 1 test validation",
            "comment" : ""
          }, {
            "name" : "town",
            "value" : "townValidation",
            "comment" : ""
          }, {
            "name" : "state",
            "value" : "stateValidation",
            "comment" : ""
          }, {
            "name" : "zip",
            "value" : "zipValidation",
            "comment" : ""
          }, {
            "name" : "country",
            "value" : "countryValidation",
            "comment" : ""
          }, {
            "name" : "roles",
            "value" : "Client",
            "comment" : ""
          } ],
          "comment" : ""
        },
        "headersSize" : 544,
        "bodySize" : 315,
        "comment" : ""
      },
      "response" : {
        "status" : 400,
        "statusText" : "Bad Request",
        "httpVersion" : "HTTP/1.1",
        "cookies" : [ {
          "name" : ".ASPROLES",
          "value" : "KpUWL5dbae2ukJZv3q91EBmM5iSon5yvCtMl2C_ccT5IV_0ImUt43IDiNQUVciU7KgK3B5kbU2KT-at3BerFcs-kuLXXJejEbKmkOkiQatAEecncESzFxUO3UxQ6KFzxD0SLJeAx7CVvDCw1DFqJiuVVMPl65IpxWmacV-qne0B_F91HW2_O4NN_PZMAY9n-uAcIEgsuzB0hIwPrKW-59jOsFbxEbLQG1XIouu9x2u2BIM9cKbxdUkhjhR1_Xkswbw9yS4eLDaYkhcskplPUSf6aAhJNXgei_hOlFn6-I4P38Nc-v4ULA0u_IQRjUmqEDGw8A7slitK8igcA1VTHW8KuI27V3Kc8UsDMgMgeQag6e9I1Wrh_BLBSLWzoAp3bZl3EbE4qOfQ5Nzwef-NmIi1TqIUOeIKcOk57wIhvQVjUL1CAQbww3V8dS2OaBa3OvdOTQ5JCMqOIqGIn_PHw308UOiHcgqIWJ-0dok7gOXFTXa0i0",
          "path" : "/",
          "httpOnly" : true,
          "secure" : false,
          "comment" : ""
        } ],
        "headers" : [ {
          "name" : "Cache-Control",
          "value" : "private"
        }, {
          "name" : "Content-Type",
          "value" : "application/json; charset=utf-8"
        }, {
          "name" : "Server",
          "value" : "Microsoft-IIS/10.0"
        }, {
          "name" : "Set-Cookie",
          "value" : ".ASPROLES=KpUWL5dbae2ukJZv3q91EBmM5iSon5yvCtMl2C_ccT5IV_0ImUt43IDiNQUVciU7KgK3B5kbU2KT-at3BerFcs-kuLXXJejEbKmkOkiQatAEecncESzFxUO3UxQ6KFzxD0SLJeAx7CVvDCw1DFqJiuVVMPl65IpxWmacV-qne0B_F91HW2_O4NN_PZMAY9n-uAcIEgsuzB0hIwPrKW-59jOsFbxEbLQG1XIouu9x2u2BIM9cKbxdUkhjhR1_Xkswbw9yS4eLDaYkhcskplPUSf6aAhJNXgei_hOlFn6-I4P38Nc-v4ULA0u_IQRjUmqEDGw8A7slitK8igcA1VTHW8KuI27V3Kc8UsDMgMgeQag6e9I1Wrh_BLBSLWzoAp3bZl3EbE4qOfQ5Nzwef-NmIi1TqIUOeIKcOk57wIhvQVjUL1CAQbww3V8dS2OaBa3OvdOTQ5JCMqOIqGIn_PHw308UOiHcgqIWJ-0dok7gOXFTXa0i0; path=/; HttpOnly"
        }, {
          "name" : "X-SourceFiles",
          "value" : "=?UTF-8?B?RDpcVmlydHVhbE9wdGltaXplci1SZWZhY3RvcmluZ1xDcm9wTWV0cmljcy5Wby5BcGlcQ3JvcE1ldHJpY3MuVm8uQXBpXGFwaVxhZG1pblx2MVx1c2Vyc1w=?="
        }, {
          "name" : "X-Powered-By",
          "value" : "ASP.NET"
        }, {
          "name" : "Date",
          "value" : "Fri, 29 Mar 2019 22:09:52 GMT"
        }, {
          "name" : "Content-Length",
          "value" : "100"
        } ],
        "content" : {
          "size" : 100,
          "mimeType" : "application/json; charset=utf-8",
          "text" : "{\"message\":\"The request is invalid. The Password cannot be blank or the value provided is invalid.\"}",
          "comment" : ""
        },
        "redirectURL" : "",
        "headersSize" : 898,
        "bodySize" : 100,
        "comment" : ""
      },
      "cache" : { },
      "timings" : {
        "comment" : "",
        "ssl" : -1,
        "connect" : -1,
        "send" : 0,
        "receive" : 0,
        "wait" : 22,
        "dns" : -1,
        "blocked" : -1
      },
      "serverIPAddress" : "127.0.0.1",
      "comment" : "",
      "_katalonRequestInformation" : {
        "name" : "41",
        "testObjectId" : "Object Repository/VoPro/Account/api_admin_v1_users",
        "harId" : "d0479fe8-e4a5-4bae-9ac1-770695d69256"
      },
      "time" : 23
    } ],
    "comment" : ""
  }
}