{
  "log" : {
    "version" : "1.2",
    "creator" : {
      "name" : "BrowserMob Proxy",
      "version" : "2.1.5",
      "comment" : ""
    },
    "pages" : [ {
      "id" : "Page 0",
      "startedDateTime" : "2019-03-28T20:41:47.526Z",
      "title" : "Page 0",
      "pageTimings" : {
        "onLoad" : 32,
        "comment" : ""
      },
      "comment" : ""
    } ],
    "entries" : [ {
      "pageref" : "Page 0",
      "startedDateTime" : "2019-03-28T20:41:47.527Z",
      "request" : {
        "method" : "POST",
        "url" : "http://localhost:10520/WebAPI/api/admin/v1/users/?",
        "httpVersion" : "HTTP/1.1",
        "cookies" : [ ],
        "headers" : [ {
          "name" : "User-Agent",
          "value" : "Katalon Studio"
        }, {
          "name" : "Content-Type",
          "value" : "application/x-www-form-urlencoded"
        }, {
          "name" : "Authorization",
          "value" : "Bearer eyJ0eXAiOiJKV1QiLCJhbGciOiJIUzI1NiJ9.eyJ1bmlxdWVfbmFtZSI6ImFkbWluIiwicm9sZSI6InVzZXIiLCJzdWIiOiJhZG1pbiIsImlzcyI6IkNyb3BNZXRyaWNzIiwiYXVkIjoiYWxsIiwiZXhwIjoxNTUzODA5NjA3LCJuYmYiOjE1NTM4MDU3MDd9.zTgF0UpqerUlFxdMXWow5dqCvcZGQ60Nr9_vo_MJgFU"
        }, {
          "name" : "Host",
          "value" : "localhost:10520"
        }, {
          "name" : "Accept",
          "value" : "text/html, image/gif, image/jpeg, *; q=.2, */*; q=.2"
        }, {
          "name" : "Proxy-Connection",
          "value" : "keep-alive"
        }, {
          "name" : "Content-Length",
          "value" : "327"
        } ],
        "queryString" : [ ],
        "postData" : {
          "mimeType" : "application/x-www-form-urlencoded",
          "params" : [ {
            "name" : "password",
            "value" : "morethan15characters",
            "comment" : ""
          }, {
            "name" : "email",
            "value" : "cropmetricsvo.longpass@gmail.com",
            "comment" : ""
          }, {
            "name" : "fullname",
            "value" : "test validation",
            "comment" : ""
          }, {
            "name" : "phone",
            "value" : "12323456",
            "comment" : ""
          }, {
            "name" : "dealer",
            "value" : "dealer test validation",
            "comment" : ""
          }, {
            "name" : "addressLine1",
            "value" : "address line 1 test validation",
            "comment" : ""
          }, {
            "name" : "addressLine2",
            "value" : "address line 2 test validation",
            "comment" : ""
          }, {
            "name" : "town",
            "value" : "townValidation",
            "comment" : ""
          }, {
            "name" : "state",
            "value" : "stateValidation",
            "comment" : ""
          }, {
            "name" : "zip",
            "value" : "zipValidation",
            "comment" : ""
          }, {
            "name" : "country",
            "value" : "countryValidation",
            "comment" : ""
          }, {
            "name" : "roles",
            "value" : "Client",
            "comment" : ""
          } ],
          "comment" : ""
        },
        "headersSize" : 544,
        "bodySize" : 327,
        "comment" : ""
      },
      "response" : {
        "status" : 400,
        "statusText" : "Bad Request",
        "httpVersion" : "HTTP/1.1",
        "cookies" : [ {
          "name" : ".ASPROLES",
          "value" : "UbmoHuhezERacp5CnHAi4cEgaQU6QYfjPvRZpIxWDq0gSUP1t8YU_4fNNEZRbI6rNTcRxOkvnxSLrOV5fcUVWZUlGohD0Zui1c3DETh5FqtAcJowVr_BbqbvtsbYylkX40X8bG_sU-i3q9ARL8LOVKk6EmaZari_8-U0JLrGFk23v0I1jM6ivjVKeZ2q8IaxPHeWfY866S4LJjtQP5CYESmfAFpQbehEwu9vnQeUCKh3iSMFXRS1mmB4fNC9ixHNYymcpSSUvUjsFrvn4sQdnslBqfEZw9DLEqV2D7T0t9VRJLf6kRYfU-f25dtHzlPzGbk6Gwj67pup-KuxJN7oQ1h9K9GB3HivBjsx92m4jWUKvf-cn9Q9ZnstZM-vA8B3bgZ7ESZquCbvCf7cc5XX0-eIjPrutdgOEYplvuXIqwGlaftu5WdtHIozFTFAUy2E6BMUP5OhCD817CJD8BJ-gRph0vnVEKaCjT4P9X4pHqhYRlR00",
          "path" : "/",
          "httpOnly" : true,
          "secure" : false,
          "comment" : ""
        } ],
        "headers" : [ {
          "name" : "Cache-Control",
          "value" : "private"
        }, {
          "name" : "Content-Type",
          "value" : "application/json; charset=utf-8"
        }, {
          "name" : "Server",
          "value" : "Microsoft-IIS/10.0"
        }, {
          "name" : "Set-Cookie",
          "value" : ".ASPROLES=UbmoHuhezERacp5CnHAi4cEgaQU6QYfjPvRZpIxWDq0gSUP1t8YU_4fNNEZRbI6rNTcRxOkvnxSLrOV5fcUVWZUlGohD0Zui1c3DETh5FqtAcJowVr_BbqbvtsbYylkX40X8bG_sU-i3q9ARL8LOVKk6EmaZari_8-U0JLrGFk23v0I1jM6ivjVKeZ2q8IaxPHeWfY866S4LJjtQP5CYESmfAFpQbehEwu9vnQeUCKh3iSMFXRS1mmB4fNC9ixHNYymcpSSUvUjsFrvn4sQdnslBqfEZw9DLEqV2D7T0t9VRJLf6kRYfU-f25dtHzlPzGbk6Gwj67pup-KuxJN7oQ1h9K9GB3HivBjsx92m4jWUKvf-cn9Q9ZnstZM-vA8B3bgZ7ESZquCbvCf7cc5XX0-eIjPrutdgOEYplvuXIqwGlaftu5WdtHIozFTFAUy2E6BMUP5OhCD817CJD8BJ-gRph0vnVEKaCjT4P9X4pHqhYRlR00; path=/; HttpOnly"
        }, {
          "name" : "X-SourceFiles",
          "value" : "=?UTF-8?B?RDpcVmlydHVhbE9wdGltaXplci1SZWZhY3RvcmluZ1xDcm9wTWV0cmljcy5Wby5BcGlcQ3JvcE1ldHJpY3MuVm8uQXBpXGFwaVxhZG1pblx2MVx1c2Vyc1w=?="
        }, {
          "name" : "X-Powered-By",
          "value" : "ASP.NET"
        }, {
          "name" : "Date",
          "value" : "Thu, 28 Mar 2019 20:41:46 GMT"
        }, {
          "name" : "Content-Length",
          "value" : "85"
        } ],
        "content" : {
          "size" : 85,
          "mimeType" : "application/json; charset=utf-8",
          "text" : "{\"message\":\"The request is invalid. The Password must contain as max 15 characters.\"}",
          "comment" : ""
        },
        "redirectURL" : "",
        "headersSize" : 897,
        "bodySize" : 85,
        "comment" : ""
      },
      "cache" : { },
      "timings" : {
        "comment" : "",
        "ssl" : -1,
        "send" : 1,
        "receive" : 0,
        "wait" : 27,
        "connect" : -1,
        "blocked" : -1,
        "dns" : -1
      },
      "serverIPAddress" : "127.0.0.1",
      "comment" : "",
      "_katalonRequestInformation" : {
        "name" : "35",
        "testObjectId" : "Object Repository/VoPro/Account/api_admin_v1_users",
        "harId" : "1bb96564-b1b4-4864-85ab-587eccfe8657"
      },
      "time" : 30
    } ],
    "comment" : ""
  }
}