{
  "log" : {
    "version" : "1.2",
    "creator" : {
      "name" : "BrowserMob Proxy",
      "version" : "2.1.5",
      "comment" : ""
    },
    "pages" : [ {
      "id" : "Page 0",
      "startedDateTime" : "2019-04-09T21:03:17.612Z",
      "title" : "Page 0",
      "pageTimings" : {
        "onLoad" : 1036,
        "comment" : ""
      },
      "comment" : ""
    } ],
    "entries" : [ {
      "pageref" : "Page 0",
      "startedDateTime" : "2019-04-09T21:03:17.612Z",
      "request" : {
        "method" : "PUT",
        "url" : "http://localhost:10520/WebAPI/api/mobile/v1/fields/5?",
        "httpVersion" : "HTTP/1.1",
        "cookies" : [ ],
        "headers" : [ {
          "name" : "User-Agent",
          "value" : "Katalon Studio"
        }, {
          "name" : "Content-Type",
          "value" : "application/json"
        }, {
          "name" : "Authorization",
          "value" : "Bearer eyJ0eXAiOiJKV1QiLCJhbGciOiJIUzI1NiJ9.eyJ1bmlxdWVfbmFtZSI6Implbm55Lm1hbGRvbmFkby50eDFAZ21haWwuY29tIiwicm9sZSI6InVzZXIiLCJzdWIiOiJqZW5ueS5tYWxkb25hZG8udHgxQGdtYWlsLmNvbSIsImlzcyI6IkNyb3BNZXRyaWNzIiwiYXVkIjoiYWxsIiwiZXhwIjoxNTU0ODQ3Njk3LCJuYmYiOjE1NTQ4NDM3OTd9.Dy1IURc9pthieYZMXzcuc4fXussy6OE7HhZyC7fjD08"
        }, {
          "name" : "Host",
          "value" : "localhost:10520"
        }, {
          "name" : "Accept",
          "value" : "text/html, image/gif, image/jpeg, *; q=.2, */*; q=.2"
        }, {
          "name" : "Proxy-Connection",
          "value" : "keep-alive"
        }, {
          "name" : "Content-Length",
          "value" : "403"
        } ],
        "queryString" : [ ],
        "postData" : {
          "mimeType" : "application/json",
          "text" : "{\"field\":{\"name\":\"Field name UPDATED by dealer account full\",\"boundary\":{\"boundaries\":[{\"boundary\":{\"coords\":[{\"x\":-101.49568751,\"y\":37.14976293},{\"x\":-101.50049403,\"y\":37.14647907},{\"x\":-101.50049403,\"y\":37.14264773},{\"x\":-101.49723246,\"y\":37.1411425},{\"x\":-101.49019435,\"y\":37.14223722},{\"x\":-101.48933604,\"y\":37.14620541},{\"x\":-101.49294093,\"y\":37.14866833},{\"x\":-101.49568751,\"y\":37.14976293}]}}]}}}",
          "comment" : ""
        },
        "headersSize" : 593,
        "bodySize" : 403,
        "comment" : ""
      },
      "response" : {
        "status" : 200,
        "statusText" : "OK",
        "httpVersion" : "HTTP/1.1",
        "cookies" : [ {
          "name" : ".ASPROLES",
          "value" : "NKzy2bPW5AtH_TfrzBhEElz2zUkWSUSp54MpuF3dThxJx7kyfWA_28yqm-YwpxePK3V9HE_qYg6mH-caABN60zjtrYqIY9u8xb_3Tym4KyYDdqGvXVmVhgKDg1RMzMyXkQyAZaCQBhXrCMHHPbhTEZA7996nvJ59eS12WpzyPogWd2BTa9B4KRtmsOqq50Mtwve1KNFLkNdjbY6BZSOCb9mhkXAGg6--fLyIL3XsJdv9zgaGDTQqQIIScASWGrfT7LMbhgPjOa5ftOpO6eWbti6gpmgTQn5i-md4Z9uxlAohJI3tr8hiWjYSQDDhakdwrX3YDYfx4p6UFOs1gwPEhP7FhNJBZCPHWLQoEMs_dAB9rW6FqDjCiZwUsunjpeDzWgFbbDink-i00eM4R3Sd_0QOC881cbZ7cf57UPCSR-sgufZrQuTfiDGab8nhrt0ZGbCA7DwYFRoyei0ccMgYN0Ays3gG0Sc8LwgVOqidlLlu6ROcPnAf9x_vIoe9paeW5QHvSrCqaQXmQIuP66BMSaYtDR81",
          "path" : "/",
          "httpOnly" : true,
          "secure" : false,
          "comment" : ""
        } ],
        "headers" : [ {
          "name" : "Cache-Control",
          "value" : "private"
        }, {
          "name" : "Content-Type",
          "value" : "application/json; charset=utf-8"
        }, {
          "name" : "Server",
          "value" : "Microsoft-IIS/10.0"
        }, {
          "name" : "Set-Cookie",
          "value" : ".ASPROLES=NKzy2bPW5AtH_TfrzBhEElz2zUkWSUSp54MpuF3dThxJx7kyfWA_28yqm-YwpxePK3V9HE_qYg6mH-caABN60zjtrYqIY9u8xb_3Tym4KyYDdqGvXVmVhgKDg1RMzMyXkQyAZaCQBhXrCMHHPbhTEZA7996nvJ59eS12WpzyPogWd2BTa9B4KRtmsOqq50Mtwve1KNFLkNdjbY6BZSOCb9mhkXAGg6--fLyIL3XsJdv9zgaGDTQqQIIScASWGrfT7LMbhgPjOa5ftOpO6eWbti6gpmgTQn5i-md4Z9uxlAohJI3tr8hiWjYSQDDhakdwrX3YDYfx4p6UFOs1gwPEhP7FhNJBZCPHWLQoEMs_dAB9rW6FqDjCiZwUsunjpeDzWgFbbDink-i00eM4R3Sd_0QOC881cbZ7cf57UPCSR-sgufZrQuTfiDGab8nhrt0ZGbCA7DwYFRoyei0ccMgYN0Ays3gG0Sc8LwgVOqidlLlu6ROcPnAf9x_vIoe9paeW5QHvSrCqaQXmQIuP66BMSaYtDR81; path=/; HttpOnly"
        }, {
          "name" : "X-SourceFiles",
          "value" : "=?UTF-8?B?RDpcVmlydHVhbE9wdGltaXplci1SZWZhY3RvcmluZ1xDcm9wTWV0cmljcy5Wby5BcGlcQ3JvcE1ldHJpY3MuVm8uQXBpXGFwaVxtb2JpbGVcdjFcZmllbGRzXDU=?="
        }, {
          "name" : "X-Powered-By",
          "value" : "ASP.NET"
        }, {
          "name" : "Date",
          "value" : "Tue, 09 Apr 2019 21:03:18 GMT"
        }, {
          "name" : "Content-Length",
          "value" : "435"
        } ],
        "content" : {
          "size" : 435,
          "mimeType" : "application/json; charset=utf-8",
          "text" : "{\"field\":{\"id\":5,\"farm_id\":3,\"name\":\"Field name UPDATED by dealer account full\",\"boundary\":{\"boundaries\":[{\"boundary\":{\"coords\":[{\"x\":-101.49568751,\"y\":37.14976293},{\"x\":-101.49294093,\"y\":37.14866833},{\"x\":-101.48933604,\"y\":37.14620541},{\"x\":-101.49019435,\"y\":37.14223722},{\"x\":-101.49723246,\"y\":37.1411425},{\"x\":-101.50049403,\"y\":37.14264773},{\"x\":-101.50049403,\"y\":37.14647907},{\"x\":-101.49568751,\"y\":37.14976293}]},\"holes\":null}]}}}",
          "comment" : ""
        },
        "redirectURL" : "",
        "headersSize" : 936,
        "bodySize" : 435,
        "comment" : ""
      },
      "cache" : { },
      "timings" : {
        "comment" : "",
        "send" : 0,
        "connect" : -1,
        "dns" : -1,
        "receive" : 1,
        "wait" : 1027,
        "blocked" : -1,
        "ssl" : -1
      },
      "serverIPAddress" : "127.0.0.1",
      "comment" : "",
      "_katalonRequestInformation" : {
        "name" : "9",
        "testObjectId" : "Object Repository/VoGrow/Field/FieldPut",
        "harId" : "32380b7f-85a8-47cd-901f-213ec1c8565a"
      },
      "time" : 1029
    } ],
    "comment" : ""
  }
}