{
  "log" : {
    "version" : "1.2",
    "creator" : {
      "name" : "BrowserMob Proxy",
      "version" : "2.1.5",
      "comment" : ""
    },
    "pages" : [ {
      "id" : "Page 0",
      "startedDateTime" : "2019-04-05T19:26:14.926Z",
      "title" : "Page 0",
      "pageTimings" : {
        "onLoad" : 4534,
        "comment" : ""
      },
      "comment" : ""
    } ],
    "entries" : [ {
      "pageref" : "Page 0",
      "startedDateTime" : "2019-04-05T19:26:14.927Z",
      "request" : {
        "method" : "PUT",
        "url" : "http://localhost:10520/WebAPI/api/mobile/v1/farms/3?",
        "httpVersion" : "HTTP/1.1",
        "cookies" : [ ],
        "headers" : [ {
          "name" : "User-Agent",
          "value" : "Katalon Studio"
        }, {
          "name" : "Content-Type",
          "value" : "application/json"
        }, {
          "name" : "Authorization",
          "value" : "Bearer eyJ0eXAiOiJKV1QiLCJhbGciOiJIUzI1NiJ9.eyJ1bmlxdWVfbmFtZSI6Implbm55Lm1hbGRvbmFkby50eEBnbWFpbC5jb20iLCJyb2xlIjoidXNlciIsInN1YiI6Implbm55Lm1hbGRvbmFkby50eEBnbWFpbC5jb20iLCJpc3MiOiJDcm9wTWV0cmljcyIsImF1ZCI6ImFsbCIsImV4cCI6MTU1NDQ5NjI3NCwibmJmIjoxNTU0NDkyMzc0fQ.kdY0ySbrVkYq8efVVPikwwAXntBOfUUeqneYaHYme3k"
        }, {
          "name" : "Host",
          "value" : "localhost:10520"
        }, {
          "name" : "Accept",
          "value" : "text/html, image/gif, image/jpeg, *; q=.2, */*; q=.2"
        }, {
          "name" : "Proxy-Connection",
          "value" : "keep-alive"
        }, {
          "name" : "Content-Length",
          "value" : "34"
        } ],
        "queryString" : [ ],
        "postData" : {
          "mimeType" : "application/json",
          "text" : "{\"name\": \"Test Farm Id parameter\"}",
          "comment" : ""
        },
        "headersSize" : 589,
        "bodySize" : 34,
        "comment" : ""
      },
      "response" : {
        "status" : 400,
        "statusText" : "Bad Request",
        "httpVersion" : "HTTP/1.1",
        "cookies" : [ {
          "name" : ".ASPROLES",
          "value" : "_nwulQk8bAM6nDgPvuoS1NfSWxqBUaDjm9skaeHppZhJ5ENfcQ4lQx_X8dUHuOLYABOKAF-eZz4gb466fcnXCrEUqp81rFfsxUa_R_wBDJz8LOQxgMj4ozpcRyXrFnL2O7Mo19DNnuMVDsTzbzeiPIGPQ_6GtZv3Ob5fhZVU3LJmZ_N5eoKS--VSsXhdbyn7rfq1p3CfKsqpPw-aIJxg16jRP0BmKtfND_zQ_c0huYN44PBdwkKawgUxGq2k5GKiAoW3pK96IuJ2wHcyW5d213_9OCi-lA3lKRDBr053U53adpSgwcSSKZR-Zf8gH2-3M6kJIBYRcsX19_s0OJ2E0PeCsaD7KXbQST3dX76AkvK2xRBPE-EarCTJTFWOjFrM97PswY8EKxPlsYerFmzNDW0_zwXJLfiy_ZIw-3r3njn6TNJyC2RLt3l3oa8AVUXBDLTJHeIwBfZBDkM4VkJtKWYo4w4Iga0bQSmYs3cbEr-JGXREnmRhh3ONMDoId4jrlSdP-Q2",
          "path" : "/",
          "httpOnly" : true,
          "secure" : false,
          "comment" : ""
        } ],
        "headers" : [ {
          "name" : "Cache-Control",
          "value" : "private"
        }, {
          "name" : "Content-Type",
          "value" : "application/json; charset=utf-8"
        }, {
          "name" : "Server",
          "value" : "Microsoft-IIS/10.0"
        }, {
          "name" : "Set-Cookie",
          "value" : ".ASPROLES=_nwulQk8bAM6nDgPvuoS1NfSWxqBUaDjm9skaeHppZhJ5ENfcQ4lQx_X8dUHuOLYABOKAF-eZz4gb466fcnXCrEUqp81rFfsxUa_R_wBDJz8LOQxgMj4ozpcRyXrFnL2O7Mo19DNnuMVDsTzbzeiPIGPQ_6GtZv3Ob5fhZVU3LJmZ_N5eoKS--VSsXhdbyn7rfq1p3CfKsqpPw-aIJxg16jRP0BmKtfND_zQ_c0huYN44PBdwkKawgUxGq2k5GKiAoW3pK96IuJ2wHcyW5d213_9OCi-lA3lKRDBr053U53adpSgwcSSKZR-Zf8gH2-3M6kJIBYRcsX19_s0OJ2E0PeCsaD7KXbQST3dX76AkvK2xRBPE-EarCTJTFWOjFrM97PswY8EKxPlsYerFmzNDW0_zwXJLfiy_ZIw-3r3njn6TNJyC2RLt3l3oa8AVUXBDLTJHeIwBfZBDkM4VkJtKWYo4w4Iga0bQSmYs3cbEr-JGXREnmRhh3ONMDoId4jrlSdP-Q2; path=/; HttpOnly"
        }, {
          "name" : "X-SourceFiles",
          "value" : "=?UTF-8?B?RDpcVmlydHVhbE9wdGltaXplci1SZWZhY3RvcmluZ1xDcm9wTWV0cmljcy5Wby5BcGlcQ3JvcE1ldHJpY3MuVm8uQXBpXGFwaVxtb2JpbGVcdjFcZmFybXNcMw==?="
        }, {
          "name" : "X-Powered-By",
          "value" : "ASP.NET"
        }, {
          "name" : "Date",
          "value" : "Fri, 05 Apr 2019 19:26:19 GMT"
        }, {
          "name" : "Content-Length",
          "value" : "81"
        } ],
        "content" : {
          "size" : 81,
          "mimeType" : "application/json; charset=utf-8",
          "text" : "{\"message\":\"The modifier doesn't have permissions to modify the farm requested.\"}",
          "comment" : ""
        },
        "redirectURL" : "",
        "headersSize" : 923,
        "bodySize" : 81,
        "comment" : ""
      },
      "cache" : { },
      "timings" : {
        "comment" : "",
        "ssl" : -1,
        "receive" : 0,
        "send" : 0,
        "connect" : -1,
        "blocked" : -1,
        "wait" : 4528,
        "dns" : -1
      },
      "serverIPAddress" : "127.0.0.1",
      "comment" : "",
      "_katalonRequestInformation" : {
        "name" : "49",
        "testObjectId" : "Object Repository/VoGrow/Farm/FarmPut",
        "harId" : "845b6f2c-f861-4ffc-adbd-edc818662648"
      },
      "time" : 4529
    } ],
    "comment" : ""
  }
}