{
  "log" : {
    "version" : "1.2",
    "creator" : {
      "name" : "BrowserMob Proxy",
      "version" : "2.1.5",
      "comment" : ""
    },
    "pages" : [ {
      "id" : "Page 0",
      "startedDateTime" : "2019-03-29T20:32:32.806Z",
      "title" : "Page 0",
      "pageTimings" : {
        "onLoad" : 26,
        "comment" : ""
      },
      "comment" : ""
    } ],
    "entries" : [ {
      "pageref" : "Page 0",
      "startedDateTime" : "2019-03-29T20:32:32.808Z",
      "request" : {
        "method" : "POST",
        "url" : "http://localhost:10520/WebAPI/api/admin/v1/users/?",
        "httpVersion" : "HTTP/1.1",
        "cookies" : [ ],
        "headers" : [ {
          "name" : "User-Agent",
          "value" : "Katalon Studio"
        }, {
          "name" : "Content-Type",
          "value" : "application/x-www-form-urlencoded"
        }, {
          "name" : "Authorization",
          "value" : "Bearer eyJ0eXAiOiJKV1QiLCJhbGciOiJIUzI1NiJ9.eyJ1bmlxdWVfbmFtZSI6ImNyb3BtZXRyaWNzdm8uY2xpZW50QGdtYWlsLmNvbSIsInJvbGUiOiJ1c2VyIiwic3ViIjoiY3JvcG1ldHJpY3N2by5jbGllbnRAZ21haWwuY29tIiwiaXNzIjoiQ3JvcE1ldHJpY3MiLCJhdWQiOiJhbGwiLCJleHAiOjE1NTM4OTU0NTIsIm5iZiI6MTU1Mzg5MTU1Mn0.NrzBxCj1Ad7OA17XjB_sWSsZ2my52fRmvOc598ZfnIE"
        }, {
          "name" : "Host",
          "value" : "localhost:10520"
        }, {
          "name" : "Accept",
          "value" : "text/html, image/gif, image/jpeg, *; q=.2, */*; q=.2"
        }, {
          "name" : "Proxy-Connection",
          "value" : "keep-alive"
        }, {
          "name" : "Content-Length",
          "value" : "272"
        } ],
        "queryString" : [ ],
        "postData" : {
          "mimeType" : "application/x-www-form-urlencoded",
          "params" : [ {
            "name" : "password",
            "value" : "cropmetrics",
            "comment" : ""
          }, {
            "name" : "email",
            "value" : "cropmetricsvo.clientbyclient@gmail.com",
            "comment" : ""
          }, {
            "name" : "fullname",
            "value" : "test validation",
            "comment" : ""
          }, {
            "name" : "phone",
            "value" : "123",
            "comment" : ""
          }, {
            "name" : "dealer",
            "value" : "x",
            "comment" : ""
          }, {
            "name" : "addressLine1",
            "value" : "address line 1 test validation",
            "comment" : ""
          }, {
            "name" : "addressLine2",
            "value" : "address line 2 test validation",
            "comment" : ""
          }, {
            "name" : "town",
            "value" : "townValidation",
            "comment" : ""
          }, {
            "name" : "state",
            "value" : "stateValidation",
            "comment" : ""
          }, {
            "name" : "zip",
            "value" : "xx",
            "comment" : ""
          }, {
            "name" : "country",
            "value" : "xx",
            "comment" : ""
          }, {
            "name" : "roles",
            "value" : "Client",
            "comment" : ""
          } ],
          "comment" : ""
        },
        "headersSize" : 611,
        "bodySize" : 272,
        "comment" : ""
      },
      "response" : {
        "status" : 401,
        "statusText" : "Unauthorized",
        "httpVersion" : "HTTP/1.1",
        "cookies" : [ {
          "name" : ".ASPROLES",
          "value" : "8JKlBKKYC-dcw83PyTLDtN693mph8QdwqeQLwQtwQ_zVIYeYTLLec-Y1nvPQ86R1dNoCJgLBSBIqV9JZJ_yHkj52T8iySDyE8cb4ZhpTje66IG94cVD3nYCRuzmOD0hHNNMthXEgXDb7RMrY43xI4iN4Gn2Fp7ZzezVJVIzs-eHLP6HENFLcqTTmhn4UuVm7c23TM_2xMSniYQbz3SUGlSmia6_U4A9HENmY81ta8VczRuGfPM1vM1jezUUm0yc5sa2WEguBL-IdMB7Va6zepB9JueNKfPwxzbHI1BQcUBwmiv_zZ0aDRMKcdpPhdgUQOCmivVQJ-xax0nPmQr7LM9daxTXOeN-JaOw3dpE7mJJ5z9tViFnhp4gjGuAhnhWgoTxgWNqzJmwcuGijQHg-wntjOeptEu-nJA3p80NZF39F46jP5pVDutKavm71VdpKpdZrz_qlvydL46b990aWdZICqIJwd0-fvMGJya9YXWO0OJxsc9B4n0vemdc0HxwvRt1jpA2",
          "path" : "/",
          "httpOnly" : true,
          "secure" : false,
          "comment" : ""
        } ],
        "headers" : [ {
          "name" : "Cache-Control",
          "value" : "private"
        }, {
          "name" : "Content-Type",
          "value" : "application/json; charset=utf-8"
        }, {
          "name" : "Server",
          "value" : "Microsoft-IIS/10.0"
        }, {
          "name" : "Set-Cookie",
          "value" : ".ASPROLES=8JKlBKKYC-dcw83PyTLDtN693mph8QdwqeQLwQtwQ_zVIYeYTLLec-Y1nvPQ86R1dNoCJgLBSBIqV9JZJ_yHkj52T8iySDyE8cb4ZhpTje66IG94cVD3nYCRuzmOD0hHNNMthXEgXDb7RMrY43xI4iN4Gn2Fp7ZzezVJVIzs-eHLP6HENFLcqTTmhn4UuVm7c23TM_2xMSniYQbz3SUGlSmia6_U4A9HENmY81ta8VczRuGfPM1vM1jezUUm0yc5sa2WEguBL-IdMB7Va6zepB9JueNKfPwxzbHI1BQcUBwmiv_zZ0aDRMKcdpPhdgUQOCmivVQJ-xax0nPmQr7LM9daxTXOeN-JaOw3dpE7mJJ5z9tViFnhp4gjGuAhnhWgoTxgWNqzJmwcuGijQHg-wntjOeptEu-nJA3p80NZF39F46jP5pVDutKavm71VdpKpdZrz_qlvydL46b990aWdZICqIJwd0-fvMGJya9YXWO0OJxsc9B4n0vemdc0HxwvRt1jpA2; path=/; HttpOnly"
        }, {
          "name" : "X-SourceFiles",
          "value" : "=?UTF-8?B?RDpcVmlydHVhbE9wdGltaXplci1SZWZhY3RvcmluZ1xDcm9wTWV0cmljcy5Wby5BcGlcQ3JvcE1ldHJpY3MuVm8uQXBpXGFwaVxhZG1pblx2MVx1c2Vyc1w=?="
        }, {
          "name" : "X-Powered-By",
          "value" : "ASP.NET"
        }, {
          "name" : "Date",
          "value" : "Fri, 29 Mar 2019 20:32:32 GMT"
        }, {
          "name" : "Content-Length",
          "value" : "61"
        } ],
        "content" : {
          "size" : 61,
          "mimeType" : "application/json; charset=utf-8",
          "text" : "{\"message\":\"Authorization has been denied for this request.\"}",
          "comment" : ""
        },
        "redirectURL" : "",
        "headersSize" : 920,
        "bodySize" : 61,
        "comment" : ""
      },
      "cache" : { },
      "timings" : {
        "comment" : "",
        "ssl" : -1,
        "send" : 0,
        "wait" : 18,
        "connect" : -1,
        "blocked" : -1,
        "receive" : 0,
        "dns" : -1
      },
      "serverIPAddress" : "127.0.0.1",
      "comment" : "",
      "_katalonRequestInformation" : {
        "name" : "89",
        "testObjectId" : "Object Repository/VoPro/Account/api_admin_v1_users",
        "harId" : "4b09d7d1-f7fa-497c-bcee-058e2fa558f7"
      },
      "time" : 19
    } ],
    "comment" : ""
  }
}