{
  "log" : {
    "version" : "1.2",
    "creator" : {
      "name" : "BrowserMob Proxy",
      "version" : "2.1.5",
      "comment" : ""
    },
    "pages" : [ {
      "id" : "Page 0",
      "startedDateTime" : "2019-03-29T13:17:13.186Z",
      "title" : "Page 0",
      "pageTimings" : {
        "onLoad" : 39,
        "comment" : ""
      },
      "comment" : ""
    } ],
    "entries" : [ {
      "pageref" : "Page 0",
      "startedDateTime" : "2019-03-29T13:17:13.186Z",
      "request" : {
        "method" : "POST",
        "url" : "http://localhost:10520/WebAPI/api/admin/v1/users/?",
        "httpVersion" : "HTTP/1.1",
        "cookies" : [ ],
        "headers" : [ {
          "name" : "User-Agent",
          "value" : "Katalon Studio"
        }, {
          "name" : "Content-Type",
          "value" : "application/x-www-form-urlencoded"
        }, {
          "name" : "Authorization",
          "value" : "Bearer eyJ0eXAiOiJKV1QiLCJhbGciOiJIUzI1NiJ9.eyJ1bmlxdWVfbmFtZSI6ImFkbWluIiwicm9sZSI6InVzZXIiLCJzdWIiOiJhZG1pbiIsImlzcyI6IkNyb3BNZXRyaWNzIiwiYXVkIjoiYWxsIiwiZXhwIjoxNTUzODY5MzMzLCJuYmYiOjE1NTM4NjU0MzN9.uYMxaMeVJd9ZMNfzi__rX7hHa5rPXf9XthvpYQ_ng6o"
        }, {
          "name" : "Host",
          "value" : "localhost:10520"
        }, {
          "name" : "Accept",
          "value" : "text/html, image/gif, image/jpeg, *; q=.2, */*; q=.2"
        }, {
          "name" : "Proxy-Connection",
          "value" : "keep-alive"
        }, {
          "name" : "Content-Length",
          "value" : "285"
        } ],
        "queryString" : [ ],
        "postData" : {
          "mimeType" : "application/x-www-form-urlencoded",
          "params" : [ {
            "name" : "password",
            "value" : "cropmetrics",
            "comment" : ""
          }, {
            "name" : "email",
            "value" : "cropmetricsvo.rolesymbols@gmail.com",
            "comment" : ""
          }, {
            "name" : "fullname",
            "value" : "test validation",
            "comment" : ""
          }, {
            "name" : "phone",
            "value" : "123",
            "comment" : ""
          }, {
            "name" : "dealer",
            "value" : "x",
            "comment" : ""
          }, {
            "name" : "addressLine1",
            "value" : "address line 1 test validation",
            "comment" : ""
          }, {
            "name" : "addressLine2",
            "value" : "address line 2 test validation",
            "comment" : ""
          }, {
            "name" : "town",
            "value" : "townValidation",
            "comment" : ""
          }, {
            "name" : "state",
            "value" : "stateValidation",
            "comment" : ""
          }, {
            "name" : "zip",
            "value" : "xx",
            "comment" : ""
          }, {
            "name" : "country",
            "value" : "xx",
            "comment" : ""
          }, {
            "name" : "roles",
            "value" : "!@#$%^&*",
            "comment" : ""
          } ],
          "comment" : ""
        },
        "headersSize" : 544,
        "bodySize" : 285,
        "comment" : ""
      },
      "response" : {
        "status" : 400,
        "statusText" : "Bad Request",
        "httpVersion" : "HTTP/1.1",
        "cookies" : [ {
          "name" : ".ASPROLES",
          "value" : "U7tbgVsp0uELqvPW-59N5OYKQkFYi1iKrsfwF4e0K539QhyZ3ZyG00fs6FNFY9kRGdtb-ZDka9UwAv191j_F1TowH_Bi4DCFx1JQc3pEOyUqErfTEOOolvsQ8QcJqCdNe2ttuszVER6pwMbRNnBT6bNUBc1_eM5FqjU5UAS0QwUmj-wKmIqXFQqOaNkqsAAnKdWIf4PvzBL4oltE9IbCecZ8aMow5y1hQHqX1hrLml0K4HnUBJwqvlwdT687tgyJw2PkefruzroVwiayKbyhGi8fNd1IetJHnwSm5kI-B0Di_quK69P8n4QB3oas_8tC8Adl2SOKaFQNYv4ewcnnVwMPZvTbhTYdFPt9Lb1A3QtBjlYY1k-VQyYh7uVfS4v8o2p4cVrWHPecOg5b6K00DBdcPqk4uceJMIFGqnInd8nIQ5T0sKKQsJZv1_SJQfVSXwIQRH_gjPTqmaJaH6h9ZbrSRy3tibQF8HdUoTMcnFrBNfwZ0",
          "path" : "/",
          "httpOnly" : true,
          "secure" : false,
          "comment" : ""
        } ],
        "headers" : [ {
          "name" : "Cache-Control",
          "value" : "private"
        }, {
          "name" : "Content-Type",
          "value" : "application/json; charset=utf-8"
        }, {
          "name" : "Server",
          "value" : "Microsoft-IIS/10.0"
        }, {
          "name" : "Set-Cookie",
          "value" : ".ASPROLES=U7tbgVsp0uELqvPW-59N5OYKQkFYi1iKrsfwF4e0K539QhyZ3ZyG00fs6FNFY9kRGdtb-ZDka9UwAv191j_F1TowH_Bi4DCFx1JQc3pEOyUqErfTEOOolvsQ8QcJqCdNe2ttuszVER6pwMbRNnBT6bNUBc1_eM5FqjU5UAS0QwUmj-wKmIqXFQqOaNkqsAAnKdWIf4PvzBL4oltE9IbCecZ8aMow5y1hQHqX1hrLml0K4HnUBJwqvlwdT687tgyJw2PkefruzroVwiayKbyhGi8fNd1IetJHnwSm5kI-B0Di_quK69P8n4QB3oas_8tC8Adl2SOKaFQNYv4ewcnnVwMPZvTbhTYdFPt9Lb1A3QtBjlYY1k-VQyYh7uVfS4v8o2p4cVrWHPecOg5b6K00DBdcPqk4uceJMIFGqnInd8nIQ5T0sKKQsJZv1_SJQfVSXwIQRH_gjPTqmaJaH6h9ZbrSRy3tibQF8HdUoTMcnFrBNfwZ0; path=/; HttpOnly"
        }, {
          "name" : "X-SourceFiles",
          "value" : "=?UTF-8?B?RDpcVmlydHVhbE9wdGltaXplci1SZWZhY3RvcmluZ1xDcm9wTWV0cmljcy5Wby5BcGlcQ3JvcE1ldHJpY3MuVm8uQXBpXGFwaVxhZG1pblx2MVx1c2Vyc1w=?="
        }, {
          "name" : "X-Powered-By",
          "value" : "ASP.NET"
        }, {
          "name" : "Date",
          "value" : "Fri, 29 Mar 2019 13:17:12 GMT"
        }, {
          "name" : "Content-Length",
          "value" : "92"
        } ],
        "content" : {
          "size" : 92,
          "mimeType" : "application/json; charset=utf-8",
          "text" : "{\"message\":\"The request is invalid. The role  !@#$%^&* requested to assign is not a valid.\"}",
          "comment" : ""
        },
        "redirectURL" : "",
        "headersSize" : 897,
        "bodySize" : 92,
        "comment" : ""
      },
      "cache" : { },
      "timings" : {
        "comment" : "",
        "ssl" : -1,
        "receive" : 0,
        "wait" : 38,
        "send" : 0,
        "connect" : -1,
        "dns" : -1,
        "blocked" : -1
      },
      "serverIPAddress" : "127.0.0.1",
      "comment" : "",
      "_katalonRequestInformation" : {
        "name" : "105",
        "testObjectId" : "Object Repository/VoPro/Account/api_admin_v1_users",
        "harId" : "5d2cc88e-9053-4462-9ad9-145896360e62"
      },
      "time" : 39
    } ],
    "comment" : ""
  }
}