{
  "log" : {
    "version" : "1.2",
    "creator" : {
      "name" : "BrowserMob Proxy",
      "version" : "2.1.5",
      "comment" : ""
    },
    "pages" : [ {
      "id" : "Page 0",
      "startedDateTime" : "2019-04-09T21:25:25.504Z",
      "title" : "Page 0",
      "pageTimings" : {
        "onLoad" : 21,
        "comment" : ""
      },
      "comment" : ""
    } ],
    "entries" : [ {
      "pageref" : "Page 0",
      "startedDateTime" : "2019-04-09T21:25:25.511Z",
      "request" : {
        "method" : "PUT",
        "url" : "http://localhost:10520/WebAPI/api/mobile/v1/fields/one?",
        "httpVersion" : "HTTP/1.1",
        "cookies" : [ ],
        "headers" : [ {
          "name" : "User-Agent",
          "value" : "Katalon Studio"
        }, {
          "name" : "Content-Type",
          "value" : "application/json"
        }, {
          "name" : "Authorization",
          "value" : "Bearer eyJ0eXAiOiJKV1QiLCJhbGciOiJIUzI1NiJ9.eyJ1bmlxdWVfbmFtZSI6Implbm55Lm1hbGRvbmFkby50eDFAZ21haWwuY29tIiwicm9sZSI6InVzZXIiLCJzdWIiOiJqZW5ueS5tYWxkb25hZG8udHgxQGdtYWlsLmNvbSIsImlzcyI6IkNyb3BNZXRyaWNzIiwiYXVkIjoiYWxsIiwiZXhwIjoxNTU0ODQ5MDI1LCJuYmYiOjE1NTQ4NDUxMjV9.Ghx4_YrlPXHz9grEQsQGKgPcXpB754t3eUj1GcOcdM0"
        }, {
          "name" : "Host",
          "value" : "localhost:10520"
        }, {
          "name" : "Accept",
          "value" : "text/html, image/gif, image/jpeg, *; q=.2, */*; q=.2"
        }, {
          "name" : "Proxy-Connection",
          "value" : "keep-alive"
        }, {
          "name" : "Content-Length",
          "value" : "389"
        } ],
        "queryString" : [ ],
        "postData" : {
          "mimeType" : "application/json",
          "text" : "{\"field\":{\"name\":\"Field by agent not assigned\",\"boundary\":{\"boundaries\":[{\"boundary\":{\"coords\":[{\"x\":-101.49568751,\"y\":37.14976293},{\"x\":-101.50049403,\"y\":37.14647907},{\"x\":-101.50049403,\"y\":37.14264773},{\"x\":-101.49723246,\"y\":37.1411425},{\"x\":-101.49019435,\"y\":37.14223722},{\"x\":-101.48933604,\"y\":37.14620541},{\"x\":-101.49294093,\"y\":37.14866833},{\"x\":-101.49568751,\"y\":37.14976293}]}}]}}}",
          "comment" : ""
        },
        "headersSize" : 595,
        "bodySize" : 389,
        "comment" : ""
      },
      "response" : {
        "status" : 400,
        "statusText" : "Bad Request",
        "httpVersion" : "HTTP/1.1",
        "cookies" : [ {
          "name" : ".ASPROLES",
          "value" : "a3RSvYkBpngNa6fPt585hxC02qsZ988jHtIzNx2-9cr2Jy_RNJLw9K45H0v-saFhjOF6hgIDDUroVSmn5Z1WGAFC475i2p0iWvV85oPyXWSxsRJN1ZyQ5bp6JixRV1WRkwhswV7nwcsDN65w46voD6z7GH1ctbjgFMppsTOQCG--0WsyjpImSKFv6G_yvnVX4TFLiVnF6gfW0hhkdsMrtJWMjVSWRQpXnfcBlVMMlQp5YCDyNtFrtbqSYqfHKgQdWLq7CvwwE32kqr8bxJUh4N1L-PiUcdZ0qNEGJ_zUd3sA-YbzdHlRehisAxr5n8dvOVCsJUGBYhYitks2zY3zDIhwBpKTH0uxW_XWtlU856zRZvhlk8mKWKDCIMbrd9CQvpH5wWwA93Q-chxjsWItp2DBjfL7dPAF1-zULb-XvCC_25-4B2aahIeJmlxjbD8IzUquoE8B8CA_tbB_ioGzQ68xKwgsDea7MbBny5A6rWI6J7OL_J5C6XPAxLLPxytRHZ3ID2DAkIezYkiz-V9A7_x4LuY1",
          "path" : "/",
          "httpOnly" : true,
          "secure" : false,
          "comment" : ""
        } ],
        "headers" : [ {
          "name" : "Cache-Control",
          "value" : "private"
        }, {
          "name" : "Content-Type",
          "value" : "application/json; charset=utf-8"
        }, {
          "name" : "Server",
          "value" : "Microsoft-IIS/10.0"
        }, {
          "name" : "Set-Cookie",
          "value" : ".ASPROLES=a3RSvYkBpngNa6fPt585hxC02qsZ988jHtIzNx2-9cr2Jy_RNJLw9K45H0v-saFhjOF6hgIDDUroVSmn5Z1WGAFC475i2p0iWvV85oPyXWSxsRJN1ZyQ5bp6JixRV1WRkwhswV7nwcsDN65w46voD6z7GH1ctbjgFMppsTOQCG--0WsyjpImSKFv6G_yvnVX4TFLiVnF6gfW0hhkdsMrtJWMjVSWRQpXnfcBlVMMlQp5YCDyNtFrtbqSYqfHKgQdWLq7CvwwE32kqr8bxJUh4N1L-PiUcdZ0qNEGJ_zUd3sA-YbzdHlRehisAxr5n8dvOVCsJUGBYhYitks2zY3zDIhwBpKTH0uxW_XWtlU856zRZvhlk8mKWKDCIMbrd9CQvpH5wWwA93Q-chxjsWItp2DBjfL7dPAF1-zULb-XvCC_25-4B2aahIeJmlxjbD8IzUquoE8B8CA_tbB_ioGzQ68xKwgsDea7MbBny5A6rWI6J7OL_J5C6XPAxLLPxytRHZ3ID2DAkIezYkiz-V9A7_x4LuY1; path=/; HttpOnly"
        }, {
          "name" : "X-SourceFiles",
          "value" : "=?UTF-8?B?RDpcVmlydHVhbE9wdGltaXplci1SZWZhY3RvcmluZ1xDcm9wTWV0cmljcy5Wby5BcGlcQ3JvcE1ldHJpY3MuVm8uQXBpXGFwaVxtb2JpbGVcdjFcZmllbGRzXG9uZQ==?="
        }, {
          "name" : "X-Powered-By",
          "value" : "ASP.NET"
        }, {
          "name" : "Date",
          "value" : "Tue, 09 Apr 2019 21:25:25 GMT"
        }, {
          "name" : "Content-Length",
          "value" : "77"
        } ],
        "content" : {
          "size" : 77,
          "mimeType" : "application/json; charset=utf-8",
          "text" : "{\"message\":\"The request is invalid. The value 'one' is not valid for Int32.\"}",
          "comment" : ""
        },
        "redirectURL" : "",
        "headersSize" : 948,
        "bodySize" : 77,
        "comment" : ""
      },
      "cache" : { },
      "timings" : {
        "comment" : "",
        "send" : 0,
        "connect" : -1,
        "blocked" : -1,
        "dns" : -1,
        "receive" : 0,
        "wait" : 15,
        "ssl" : -1
      },
      "serverIPAddress" : "127.0.0.1",
      "comment" : "",
      "_katalonRequestInformation" : {
        "name" : "15",
        "testObjectId" : "Object Repository/VoGrow/Field/FieldPut",
        "harId" : "b6f44ac5-3c5b-4197-882f-3bbb74dcf70e"
      },
      "time" : 17
    } ],
    "comment" : ""
  }
}