Suite/Test/Step Name,Browser,Description,Start time,End time,Duration,Status
Auto_Put_Field,,,2019-04-11 12:08:45,2019-04-11 12:09:13,27.574s,FAILED
,,,,,,
Test Cases/VoGrow/API/Field/Put/1 API_FIELD_When_field_is_updated_as_grower_Expected_status_code_200,,,2019-04-11 12:08:46,2019-04-11 12:08:50,4.225s,FAILED
"fieldId = ""1""",,,2019-04-11 12:08:46,2019-04-11 12:08:46,0.002s,PASSED
"nameField = ""Field only grower Updated""",,,2019-04-11 12:08:46,2019-04-11 12:08:46,0.002s,PASSED
"boundaryField = ""{""boundaries"":[{""boundary"":{""coords"":[{""x"":-101.49568751,""y"":37.14976293},{""x"":-101.50049403,""y"":37.14647907},{""x"":-101.50049403,""y"":37.14264773},{""x"":-101.49723246,""y"":37.1411425},{""x"":-101.49019435,""y"":37.14223722},{""x"":-101.48933604,""y"":37.14620541},{""x"":-101.49294093,""y"":37.14866833},{""x"":-101.49568751,""y"":37.14976293}]}}]}""",,,2019-04-11 12:08:46,2019-04-11 12:08:46,0.001s,PASSED
"tokenUserName = ""jenny.maldonado.tx2@gmail.com""",,,2019-04-11 12:08:46,2019-04-11 12:08:46,0.001s,PASSED
"tokenPassword = ""cropmetrics""",,,2019-04-11 12:08:46,2019-04-11 12:08:46,0.001s,PASSED
"responseToken = sendRequest(findTestObject(""VoPro/Token"", [""usernameToken"":tokenUserName, ""passwordToken"":tokenPassword]))",,,2019-04-11 12:08:46,2019-04-11 12:08:50,3.251s,PASSED
slurper = new groovy.json.JsonSlurper(),,,2019-04-11 12:08:50,2019-04-11 12:08:50,0.014s,PASSED
tokenResult = slurper.parseText(responseToken.getResponseBodyContent()),,,2019-04-11 12:08:50,2019-04-11 12:08:50,0.024s,PASSED
accessToken = access_token,,,2019-04-11 12:08:50,2019-04-11 12:08:50,0.006s,PASSED
"println("".. Current access token generated for admin user : "" + accessToken)",,,2019-04-11 12:08:50,2019-04-11 12:08:50,0.004s,PASSED
"requestFieldPut = findTestObject(""VoGrow/Field/FieldPut"", [""access_token"":accessToken, ""fieldId"":fieldId])",,,2019-04-11 12:08:50,2019-04-11 12:08:50,0.045s,PASSED
"bodyRequest = ""{""field"":{""name"":"""" + nameField + """",""boundary"":"" + boundaryField + ""}}""",,,2019-04-11 12:08:50,2019-04-11 12:08:50,0.001s,PASSED
try,,,2019-04-11 12:08:50,2019-04-11 12:08:50,0.008s,PASSED
responseField = sendRequest(requestFieldPut),,,2019-04-11 12:08:50,2019-04-11 12:08:50,0.068s,PASSED
"verifyResponseStatusCode(responseField, 200)",,,2019-04-11 12:08:50,2019-04-11 12:08:50,0.025s,FAILED
,,,,,,
Test Cases/VoGrow/API/Field/Put/2 API_FIELD_When_field_is_updated_as_grower_Expected_field_is_updated_in_database,,,2019-04-11 12:08:50,2019-04-11 12:08:50,0.522s,ERROR
"connectionCmDatabase.CmConnection.connectDB(""localhost"", ""virtualoptimizer"", ""5432"", ""postgres"", ""admin"")",,,2019-04-11 12:08:50,2019-04-11 12:08:50,0.246s,ERROR
,,,,,,
Test Cases/VoGrow/API/Field/Put/3 API_FIELD_When_field_is_updated_as_grower_Expected_only_one_field_is_updated_in_the_database,,,2019-04-11 12:08:50,2019-04-11 12:08:51,0.292s,ERROR
"connectionCmDatabase.CmConnection.connectDB(""localhost"", ""virtualoptimizer"", ""5432"", ""postgres"", ""admin"")",,,2019-04-11 12:08:51,2019-04-11 12:08:51,0.070s,ERROR
,,,,,,
Test Cases/VoGrow/API/Field/Put/4 API_FIELD_When_field_is_updated_as_dealer_for_one_of_the_grower_assigned_Expected_status_code_200,,,2019-04-11 12:08:51,2019-04-11 12:08:52,1.125s,ERROR
"fieldId = ""5""",,,2019-04-11 12:08:51,2019-04-11 12:08:51,0.000s,PASSED
"nameField = ""Field Updated by dealer full access""",,,2019-04-11 12:08:51,2019-04-11 12:08:51,0.000s,PASSED
"boundaryField = ""{""boundaries"":[{""boundary"":{""coords"":[{""x"":-101.49568751,""y"":37.14976293},{""x"":-101.50049403,""y"":37.14647907},{""x"":-101.50049403,""y"":37.14264773},{""x"":-101.49723246,""y"":37.1411425},{""x"":-101.49019435,""y"":37.14223722},{""x"":-101.48933604,""y"":37.14620541},{""x"":-101.49294093,""y"":37.14866833},{""x"":-101.49568751,""y"":37.14976293}]}}]}""",,,2019-04-11 12:08:51,2019-04-11 12:08:51,0.001s,PASSED
"tokenUserName = ""jenny.maldonado.tx1@gmail.com""",,,2019-04-11 12:08:51,2019-04-11 12:08:51,0.000s,PASSED
"tokenPassword = ""cropmetrics""",,,2019-04-11 12:08:51,2019-04-11 12:08:51,0.001s,PASSED
"responseToken = sendRequest(findTestObject(""VoPro/Token"", [""usernameToken"":tokenUserName, ""passwordToken"":tokenPassword]))",,,2019-04-11 12:08:51,2019-04-11 12:08:52,0.795s,PASSED
slurper = new groovy.json.JsonSlurper(),,,2019-04-11 12:08:52,2019-04-11 12:08:52,0.001s,PASSED
tokenResult = slurper.parseText(responseToken.getResponseBodyContent()),,,2019-04-11 12:08:52,2019-04-11 12:08:52,0.002s,ERROR
,,,,,,
Test Cases/VoGrow/API/Field/Put/5 API_FIELD_When_field_is_updated_as_dealer_for_grower_not_assigned_Expected_status_code_400,,,2019-04-11 12:08:52,2019-04-11 12:08:52,0.473s,ERROR
"fieldId = ""1""",,,2019-04-11 12:08:52,2019-04-11 12:08:52,0.001s,PASSED
"nameField = ""Field updated by agent not assigned""",,,2019-04-11 12:08:52,2019-04-11 12:08:52,0.001s,PASSED
"boundaryField = ""{""boundaries"":[{""boundary"":{""coords"":[{""x"":-101.49568751,""y"":37.14976293},{""x"":-101.50049403,""y"":37.14647907},{""x"":-101.50049403,""y"":37.14264773},{""x"":-101.49723246,""y"":37.1411425},{""x"":-101.49019435,""y"":37.14223722},{""x"":-101.48933604,""y"":37.14620541},{""x"":-101.49294093,""y"":37.14866833},{""x"":-101.49568751,""y"":37.14976293}]}}]}""",,,2019-04-11 12:08:52,2019-04-11 12:08:52,0.002s,PASSED
"tokenUserName = ""jenny.maldonado.tx1@gmail.com""",,,2019-04-11 12:08:52,2019-04-11 12:08:52,0.001s,PASSED
"tokenPassword = ""cropmetrics""",,,2019-04-11 12:08:52,2019-04-11 12:08:52,0.001s,PASSED
"responseToken = sendRequest(findTestObject(""VoPro/Token"", [""usernameToken"":tokenUserName, ""passwordToken"":tokenPassword]))",,,2019-04-11 12:08:52,2019-04-11 12:08:52,0.151s,PASSED
slurper = new groovy.json.JsonSlurper(),,,2019-04-11 12:08:52,2019-04-11 12:08:52,0.001s,PASSED
tokenResult = slurper.parseText(responseToken.getResponseBodyContent()),,,2019-04-11 12:08:52,2019-04-11 12:08:52,0.002s,ERROR
,,,,,,
Test Cases/VoGrow/API/Field/Put/6 API_FIELD_When_field_is_updated_as_dealer_for_grower_not_assigned_Expected_properly_error_message_is_displayed,,,2019-04-11 12:08:52,2019-04-11 12:08:53,0.377s,ERROR
"fieldId = ""1""",,,2019-04-11 12:08:53,2019-04-11 12:08:53,0.001s,PASSED
"nameField = ""Field updated by agent not assigned""",,,2019-04-11 12:08:53,2019-04-11 12:08:53,0.001s,PASSED
"boundaryField = ""{""boundaries"":[{""boundary"":{""coords"":[{""x"":-101.49568751,""y"":37.14976293},{""x"":-101.50049403,""y"":37.14647907},{""x"":-101.50049403,""y"":37.14264773},{""x"":-101.49723246,""y"":37.1411425},{""x"":-101.49019435,""y"":37.14223722},{""x"":-101.48933604,""y"":37.14620541},{""x"":-101.49294093,""y"":37.14866833},{""x"":-101.49568751,""y"":37.14976293}]}}]}""",,,2019-04-11 12:08:53,2019-04-11 12:08:53,0.001s,PASSED
"tokenUserName = ""jenny.maldonado.tx1@gmail.com""",,,2019-04-11 12:08:53,2019-04-11 12:08:53,0.001s,PASSED
"tokenPassword = ""cropmetrics""",,,2019-04-11 12:08:53,2019-04-11 12:08:53,0.001s,PASSED
"responseToken = sendRequest(findTestObject(""VoPro/Token"", [""usernameToken"":tokenUserName, ""passwordToken"":tokenPassword]))",,,2019-04-11 12:08:53,2019-04-11 12:08:53,0.084s,PASSED
slurper = new groovy.json.JsonSlurper(),,,2019-04-11 12:08:53,2019-04-11 12:08:53,0.003s,PASSED
tokenResult = slurper.parseText(responseToken.getResponseBodyContent()),,,2019-04-11 12:08:53,2019-04-11 12:08:53,0.003s,ERROR
,,,,,,
Test Cases/VoGrow/API/Field/Put/6.1 API_FIELD_When_field_is_updated_as_dealer_for_one_grower_assigned_Expected_status_code_200,,,2019-04-11 12:08:53,2019-04-11 12:08:53,0.565s,ERROR
"fieldId = ""5""",,,2019-04-11 12:08:53,2019-04-11 12:08:53,0.000s,PASSED
"nameField = ""Field name UPDATED by dealer account full""",,,2019-04-11 12:08:53,2019-04-11 12:08:53,0.002s,PASSED
"boundaryField = ""{""boundaries"":[{""boundary"":{""coords"":[{""x"":-101.49568751,""y"":37.14976293},{""x"":-101.50049403,""y"":37.14647907},{""x"":-101.50049403,""y"":37.14264773},{""x"":-101.49723246,""y"":37.1411425},{""x"":-101.49019435,""y"":37.14223722},{""x"":-101.48933604,""y"":37.14620541},{""x"":-101.49294093,""y"":37.14866833},{""x"":-101.49568751,""y"":37.14976293}]}}]}""",,,2019-04-11 12:08:53,2019-04-11 12:08:53,0.001s,PASSED
"tokenUserName = ""jenny.maldonado.tx1@gmail.com""",,,2019-04-11 12:08:53,2019-04-11 12:08:53,0.001s,PASSED
"tokenPassword = ""cropmetrics""",,,2019-04-11 12:08:53,2019-04-11 12:08:53,0.001s,PASSED
"responseToken = sendRequest(findTestObject(""VoPro/Token"", [""usernameToken"":tokenUserName, ""passwordToken"":tokenPassword]))",,,2019-04-11 12:08:53,2019-04-11 12:08:53,0.173s,PASSED
slurper = new groovy.json.JsonSlurper(),,,2019-04-11 12:08:53,2019-04-11 12:08:53,0.000s,PASSED
tokenResult = slurper.parseText(responseToken.getResponseBodyContent()),,,2019-04-11 12:08:53,2019-04-11 12:08:53,0.003s,ERROR
,,,,,,
Test Cases/VoGrow/API/Field/Put/7 API_FIELD_When_field_is_updated_as_dealer_for_one_grower_assigned_Expected_field_is_updated_in_database,,,2019-04-11 12:08:53,2019-04-11 12:08:54,0.275s,ERROR
"connectionCmDatabase.CmConnection.connectDB(""localhost"", ""virtualoptimizer"", ""5432"", ""postgres"", ""admin"")",,,2019-04-11 12:08:54,2019-04-11 12:08:54,0.050s,ERROR
,,,,,,
Test Cases/VoGrow/API/Field/Put/9 API_FIELD_When_field_updated_has_the_fieldid_parameter_as_empty_Expected_status_code_405,,,2019-04-11 12:08:54,2019-04-11 12:08:54,0.417s,ERROR
"fieldId = """"",,,2019-04-11 12:08:54,2019-04-11 12:08:54,0.001s,PASSED
"nameField = ""Field by agent not assigned""",,,2019-04-11 12:08:54,2019-04-11 12:08:54,0.001s,PASSED
"boundaryField = ""{""boundaries"":[{""boundary"":{""coords"":[{""x"":-101.49568751,""y"":37.14976293},{""x"":-101.50049403,""y"":37.14647907},{""x"":-101.50049403,""y"":37.14264773},{""x"":-101.49723246,""y"":37.1411425},{""x"":-101.49019435,""y"":37.14223722},{""x"":-101.48933604,""y"":37.14620541},{""x"":-101.49294093,""y"":37.14866833},{""x"":-101.49568751,""y"":37.14976293}]}}]}""",,,2019-04-11 12:08:54,2019-04-11 12:08:54,0.001s,PASSED
"tokenUserName = ""jenny.maldonado.tx1@gmail.com""",,,2019-04-11 12:08:54,2019-04-11 12:08:54,0.004s,PASSED
"tokenPassword = ""cropmetrics""",,,2019-04-11 12:08:54,2019-04-11 12:08:54,0.001s,PASSED
"responseToken = sendRequest(findTestObject(""VoPro/Token"", [""usernameToken"":tokenUserName, ""passwordToken"":tokenPassword]))",,,2019-04-11 12:08:54,2019-04-11 12:08:54,0.164s,PASSED
slurper = new groovy.json.JsonSlurper(),,,2019-04-11 12:08:54,2019-04-11 12:08:54,0.001s,PASSED
tokenResult = slurper.parseText(responseToken.getResponseBodyContent()),,,2019-04-11 12:08:54,2019-04-11 12:08:54,0.002s,ERROR
,,,,,,
Test Cases/VoGrow/API/Field/Put/9.1 API_FIELD_When_field_updated_has_the_fieldid_parameter_as_empty_Expected_properly_error_message_is_displayed,,,2019-04-11 12:08:54,2019-04-11 12:08:54,0.344s,ERROR
"fieldId = """"",,,2019-04-11 12:08:54,2019-04-11 12:08:54,0.001s,PASSED
"nameField = ""Field by agent not assigned""",,,2019-04-11 12:08:54,2019-04-11 12:08:54,0.001s,PASSED
"boundaryField = ""{""boundaries"":[{""boundary"":{""coords"":[{""x"":-101.49568751,""y"":37.14976293},{""x"":-101.50049403,""y"":37.14647907},{""x"":-101.50049403,""y"":37.14264773},{""x"":-101.49723246,""y"":37.1411425},{""x"":-101.49019435,""y"":37.14223722},{""x"":-101.48933604,""y"":37.14620541},{""x"":-101.49294093,""y"":37.14866833},{""x"":-101.49568751,""y"":37.14976293}]}}]}""",,,2019-04-11 12:08:54,2019-04-11 12:08:54,0.001s,PASSED
"tokenUserName = ""jenny.maldonado.tx1@gmail.com""",,,2019-04-11 12:08:54,2019-04-11 12:08:54,0.002s,PASSED
"tokenPassword = ""cropmetrics""",,,2019-04-11 12:08:54,2019-04-11 12:08:54,0.000s,PASSED
"responseToken = sendRequest(findTestObject(""VoPro/Token"", [""usernameToken"":tokenUserName, ""passwordToken"":tokenPassword]))",,,2019-04-11 12:08:54,2019-04-11 12:08:54,0.097s,PASSED
slurper = new groovy.json.JsonSlurper(),,,2019-04-11 12:08:54,2019-04-11 12:08:54,0.000s,PASSED
tokenResult = slurper.parseText(responseToken.getResponseBodyContent()),,,2019-04-11 12:08:54,2019-04-11 12:08:54,0.002s,ERROR
,,,,,,
Test Cases/VoGrow/API/Field/Put/9.2 API_FIELD_When_field_updated_has_the_fieldid_parameter_with_chars_Expected_status_code_400,,,2019-04-11 12:08:54,2019-04-11 12:08:55,0.276s,ERROR
"fieldId = ""one""",,,2019-04-11 12:08:55,2019-04-11 12:08:55,0.001s,PASSED
"nameField = ""Field by agent not assigned""",,,2019-04-11 12:08:55,2019-04-11 12:08:55,0.002s,PASSED
"boundaryField = ""{""boundaries"":[{""boundary"":{""coords"":[{""x"":-101.49568751,""y"":37.14976293},{""x"":-101.50049403,""y"":37.14647907},{""x"":-101.50049403,""y"":37.14264773},{""x"":-101.49723246,""y"":37.1411425},{""x"":-101.49019435,""y"":37.14223722},{""x"":-101.48933604,""y"":37.14620541},{""x"":-101.49294093,""y"":37.14866833},{""x"":-101.49568751,""y"":37.14976293}]}}]}""",,,2019-04-11 12:08:55,2019-04-11 12:08:55,0.000s,PASSED
"tokenUserName = ""jenny.maldonado.tx1@gmail.com""",,,2019-04-11 12:08:55,2019-04-11 12:08:55,0.002s,PASSED
"tokenPassword = ""cropmetrics""",,,2019-04-11 12:08:55,2019-04-11 12:08:55,0.000s,PASSED
"responseToken = sendRequest(findTestObject(""VoPro/Token"", [""usernameToken"":tokenUserName, ""passwordToken"":tokenPassword]))",,,2019-04-11 12:08:55,2019-04-11 12:08:55,0.085s,PASSED
slurper = new groovy.json.JsonSlurper(),,,2019-04-11 12:08:55,2019-04-11 12:08:55,0.000s,PASSED
tokenResult = slurper.parseText(responseToken.getResponseBodyContent()),,,2019-04-11 12:08:55,2019-04-11 12:08:55,0.002s,ERROR
,,,,,,
Test Cases/VoGrow/API/Field/Put/9.3 API_FIELD_When_field_updated_has_the_fieldid_parameter_with_chars_Expected_properly_error_message_is_displayed,,,2019-04-11 12:08:55,2019-04-11 12:08:55,0.331s,ERROR
"fieldId = ""one""",,,2019-04-11 12:08:55,2019-04-11 12:08:55,0.001s,PASSED
"nameField = ""Field by agent not assigned""",,,2019-04-11 12:08:55,2019-04-11 12:08:55,0.000s,PASSED
"boundaryField = ""{""boundaries"":[{""boundary"":{""coords"":[{""x"":-101.49568751,""y"":37.14976293},{""x"":-101.50049403,""y"":37.14647907},{""x"":-101.50049403,""y"":37.14264773},{""x"":-101.49723246,""y"":37.1411425},{""x"":-101.49019435,""y"":37.14223722},{""x"":-101.48933604,""y"":37.14620541},{""x"":-101.49294093,""y"":37.14866833},{""x"":-101.49568751,""y"":37.14976293}]}}]}""",,,2019-04-11 12:08:55,2019-04-11 12:08:55,0.000s,PASSED
"tokenUserName = ""jenny.maldonado.tx1@gmail.com""",,,2019-04-11 12:08:55,2019-04-11 12:08:55,0.000s,PASSED
"tokenPassword = ""cropmetrics""",,,2019-04-11 12:08:55,2019-04-11 12:08:55,0.000s,PASSED
"responseToken = sendRequest(findTestObject(""VoPro/Token"", [""usernameToken"":tokenUserName, ""passwordToken"":tokenPassword]))",,,2019-04-11 12:08:55,2019-04-11 12:08:55,0.081s,PASSED
slurper = new groovy.json.JsonSlurper(),,,2019-04-11 12:08:55,2019-04-11 12:08:55,0.000s,PASSED
tokenResult = slurper.parseText(responseToken.getResponseBodyContent()),,,2019-04-11 12:08:55,2019-04-11 12:08:55,0.001s,ERROR
,,,,,,
Test Cases/VoGrow/API/Field/Put/9.4 API_FIELD_When_field_updated_has_the_fieldid_paramert_with_spaces_Expected_status_code_405,,,2019-04-11 12:08:55,2019-04-11 12:08:55,0.287s,ERROR
"fieldId = ""    """,,,2019-04-11 12:08:55,2019-04-11 12:08:55,0.001s,PASSED
"nameField = ""Field by agent not assigned""",,,2019-04-11 12:08:55,2019-04-11 12:08:55,0.001s,PASSED
"boundaryField = ""{""boundaries"":[{""boundary"":{""coords"":[{""x"":-101.49568751,""y"":37.14976293},{""x"":-101.50049403,""y"":37.14647907},{""x"":-101.50049403,""y"":37.14264773},{""x"":-101.49723246,""y"":37.1411425},{""x"":-101.49019435,""y"":37.14223722},{""x"":-101.48933604,""y"":37.14620541},{""x"":-101.49294093,""y"":37.14866833},{""x"":-101.49568751,""y"":37.14976293}]}}]}""",,,2019-04-11 12:08:55,2019-04-11 12:08:55,0.000s,PASSED
"tokenUserName = ""jenny.maldonado.tx1@gmail.com""",,,2019-04-11 12:08:55,2019-04-11 12:08:55,0.000s,PASSED
"tokenPassword = ""cropmetrics""",,,2019-04-11 12:08:55,2019-04-11 12:08:55,0.001s,PASSED
"responseToken = sendRequest(findTestObject(""VoPro/Token"", [""usernameToken"":tokenUserName, ""passwordToken"":tokenPassword]))",,,2019-04-11 12:08:55,2019-04-11 12:08:55,0.086s,PASSED
slurper = new groovy.json.JsonSlurper(),,,2019-04-11 12:08:55,2019-04-11 12:08:55,0.000s,PASSED
tokenResult = slurper.parseText(responseToken.getResponseBodyContent()),,,2019-04-11 12:08:55,2019-04-11 12:08:55,0.002s,ERROR
,,,,,,
Test Cases/VoGrow/API/Field/Put/9.6 API_FIELD_When_field_updated_has_the_valid_fieldid_parameter_but_different_of_the_user_token_Expected_status_code_400,,,2019-04-11 12:08:55,2019-04-11 12:08:56,0.340s,ERROR
"fieldId = ""1""",,,2019-04-11 12:08:55,2019-04-11 12:08:55,0.000s,PASSED
"nameField = ""Field by agent not assigned""",,,2019-04-11 12:08:55,2019-04-11 12:08:55,0.001s,PASSED
"boundaryField = ""{""boundaries"":[{""boundary"":{""coords"":[{""x"":-101.49568751,""y"":37.14976293},{""x"":-101.50049403,""y"":37.14647907},{""x"":-101.50049403,""y"":37.14264773},{""x"":-101.49723246,""y"":37.1411425},{""x"":-101.49019435,""y"":37.14223722},{""x"":-101.48933604,""y"":37.14620541},{""x"":-101.49294093,""y"":37.14866833},{""x"":-101.49568751,""y"":37.14976293}]}}]}""",,,2019-04-11 12:08:55,2019-04-11 12:08:55,0.000s,PASSED
"tokenUserName = ""jenny.maldonado.tx@gmail.com""",,,2019-04-11 12:08:55,2019-04-11 12:08:55,0.001s,PASSED
"tokenPassword = ""cropmetrics""",,,2019-04-11 12:08:55,2019-04-11 12:08:55,0.000s,PASSED
"responseToken = sendRequest(findTestObject(""VoPro/Token"", [""usernameToken"":tokenUserName, ""passwordToken"":tokenPassword]))",,,2019-04-11 12:08:55,2019-04-11 12:08:56,0.097s,PASSED
slurper = new groovy.json.JsonSlurper(),,,2019-04-11 12:08:56,2019-04-11 12:08:56,0.000s,PASSED
tokenResult = slurper.parseText(responseToken.getResponseBodyContent()),,,2019-04-11 12:08:56,2019-04-11 12:08:56,0.003s,ERROR
,,,,,,
Test Cases/VoGrow/API/Field/Put/9.7 API_FIELD_When_field_updated_has_valid_fieldid_parameter_but_different_of_user_token_Expected_properly_error_message_is_displayed,,,2019-04-11 12:08:56,2019-04-11 12:08:56,0.390s,ERROR
"fieldId = ""1""",,,2019-04-11 12:08:56,2019-04-11 12:08:56,0.004s,PASSED
"nameField = ""Field by agent not assigned""",,,2019-04-11 12:08:56,2019-04-11 12:08:56,0.000s,PASSED
"boundaryField = ""{""boundaries"":[{""boundary"":{""coords"":[{""x"":-101.49568751,""y"":37.14976293},{""x"":-101.50049403,""y"":37.14647907},{""x"":-101.50049403,""y"":37.14264773},{""x"":-101.49723246,""y"":37.1411425},{""x"":-101.49019435,""y"":37.14223722},{""x"":-101.48933604,""y"":37.14620541},{""x"":-101.49294093,""y"":37.14866833},{""x"":-101.49568751,""y"":37.14976293}]}}]}""",,,2019-04-11 12:08:56,2019-04-11 12:08:56,0.001s,PASSED
"tokenUserName = ""jenny.maldonado.tx@gmail.com""",,,2019-04-11 12:08:56,2019-04-11 12:08:56,0.001s,PASSED
"tokenPassword = ""cropmetrics""",,,2019-04-11 12:08:56,2019-04-11 12:08:56,0.001s,PASSED
"responseToken = sendRequest(findTestObject(""VoPro/Token"", [""usernameToken"":tokenUserName, ""passwordToken"":tokenPassword]))",,,2019-04-11 12:08:56,2019-04-11 12:08:56,0.130s,PASSED
slurper = new groovy.json.JsonSlurper(),,,2019-04-11 12:08:56,2019-04-11 12:08:56,0.001s,PASSED
tokenResult = slurper.parseText(responseToken.getResponseBodyContent()),,,2019-04-11 12:08:56,2019-04-11 12:08:56,0.001s,ERROR
,,,,,,
Test Cases/VoGrow/API/Field/Put/9.8 API_FIELD_When_field_updated_has_an_invalid_fieldid_parameter_Expected_status_code_400,,,2019-04-11 12:08:56,2019-04-11 12:08:56,0.363s,ERROR
"fieldId = ""11111111""",,,2019-04-11 12:08:56,2019-04-11 12:08:56,0.000s,PASSED
"nameField = ""Field by agent not assigned""",,,2019-04-11 12:08:56,2019-04-11 12:08:56,0.000s,PASSED
"boundaryField = ""{""boundaries"":[{""boundary"":{""coords"":[{""x"":-101.49568751,""y"":37.14976293},{""x"":-101.50049403,""y"":37.14647907},{""x"":-101.50049403,""y"":37.14264773},{""x"":-101.49723246,""y"":37.1411425},{""x"":-101.49019435,""y"":37.14223722},{""x"":-101.48933604,""y"":37.14620541},{""x"":-101.49294093,""y"":37.14866833},{""x"":-101.49568751,""y"":37.14976293}]}}]}""",,,2019-04-11 12:08:56,2019-04-11 12:08:56,0.001s,PASSED
"tokenUserName = ""jenny.maldonado.tx1@gmail.com""",,,2019-04-11 12:08:56,2019-04-11 12:08:56,0.000s,PASSED
"tokenPassword = ""cropmetrics""",,,2019-04-11 12:08:56,2019-04-11 12:08:56,0.000s,PASSED
"responseToken = sendRequest(findTestObject(""VoPro/Token"", [""usernameToken"":tokenUserName, ""passwordToken"":tokenPassword]))",,,2019-04-11 12:08:56,2019-04-11 12:08:56,0.082s,PASSED
slurper = new groovy.json.JsonSlurper(),,,2019-04-11 12:08:56,2019-04-11 12:08:56,0.001s,PASSED
tokenResult = slurper.parseText(responseToken.getResponseBodyContent()),,,2019-04-11 12:08:56,2019-04-11 12:08:56,0.002s,ERROR
,,,,,,
Test Cases/VoGrow/API/Field/Put/9.9 API_FIELD_When_field_updated_has_an_invalid_fieldid_parameter_Expected_properly_error_message_is_displayed,,,2019-04-11 12:08:56,2019-04-11 12:08:57,0.321s,ERROR
"fieldId = ""11111111""",,,2019-04-11 12:08:57,2019-04-11 12:08:57,0.000s,PASSED
"nameField = ""Field by agent not assigned""",,,2019-04-11 12:08:57,2019-04-11 12:08:57,0.002s,PASSED
"boundaryField = ""{""boundaries"":[{""boundary"":{""coords"":[{""x"":-101.49568751,""y"":37.14976293},{""x"":-101.50049403,""y"":37.14647907},{""x"":-101.50049403,""y"":37.14264773},{""x"":-101.49723246,""y"":37.1411425},{""x"":-101.49019435,""y"":37.14223722},{""x"":-101.48933604,""y"":37.14620541},{""x"":-101.49294093,""y"":37.14866833},{""x"":-101.49568751,""y"":37.14976293}]}}]}""",,,2019-04-11 12:08:57,2019-04-11 12:08:57,0.001s,PASSED
"tokenUserName = ""jenny.maldonado.tx1@gmail.com""",,,2019-04-11 12:08:57,2019-04-11 12:08:57,0.002s,PASSED
"tokenPassword = ""cropmetrics""",,,2019-04-11 12:08:57,2019-04-11 12:08:57,0.001s,PASSED
"responseToken = sendRequest(findTestObject(""VoPro/Token"", [""usernameToken"":tokenUserName, ""passwordToken"":tokenPassword]))",,,2019-04-11 12:08:57,2019-04-11 12:08:57,0.105s,PASSED
slurper = new groovy.json.JsonSlurper(),,,2019-04-11 12:08:57,2019-04-11 12:08:57,0.001s,PASSED
tokenResult = slurper.parseText(responseToken.getResponseBodyContent()),,,2019-04-11 12:08:57,2019-04-11 12:08:57,0.002s,ERROR
,,,,,,
Test Cases/VoGrow/API/Field/Put/15 API_FIELD_When_field_updated_has_the_fieldid_attribute_with_symbols_Expected_status_code_400,,,2019-04-11 12:08:57,2019-04-11 12:08:57,0.358s,ERROR
"fieldId = ""!!!!!""",,,2019-04-11 12:08:57,2019-04-11 12:08:57,0.000s,PASSED
"nameField = ""Field by agent not assigned""",,,2019-04-11 12:08:57,2019-04-11 12:08:57,0.000s,PASSED
"boundaryField = ""{""boundaries"":[{""boundary"":{""coords"":[{""x"":-101.49568751,""y"":37.14976293},{""x"":-101.50049403,""y"":37.14647907},{""x"":-101.50049403,""y"":37.14264773},{""x"":-101.49723246,""y"":37.1411425},{""x"":-101.49019435,""y"":37.14223722},{""x"":-101.48933604,""y"":37.14620541},{""x"":-101.49294093,""y"":37.14866833},{""x"":-101.49568751,""y"":37.14976293}]}}]}""",,,2019-04-11 12:08:57,2019-04-11 12:08:57,0.001s,PASSED
"tokenUserName = ""jenny.maldonado.tx1@gmail.com""",,,2019-04-11 12:08:57,2019-04-11 12:08:57,0.001s,PASSED
"tokenPassword = ""cropmetrics""",,,2019-04-11 12:08:57,2019-04-11 12:08:57,0.001s,PASSED
"responseToken = sendRequest(findTestObject(""VoPro/Token"", [""usernameToken"":tokenUserName, ""passwordToken"":tokenPassword]))",,,2019-04-11 12:08:57,2019-04-11 12:08:57,0.141s,PASSED
slurper = new groovy.json.JsonSlurper(),,,2019-04-11 12:08:57,2019-04-11 12:08:57,0.001s,PASSED
tokenResult = slurper.parseText(responseToken.getResponseBodyContent()),,,2019-04-11 12:08:57,2019-04-11 12:08:57,0.002s,ERROR
,,,,,,
Test Cases/VoGrow/API/Field/Put/16 API_FIELD_When_field_updated_has_the_fieldid_attribute_with_symbols_Expected_properly_error_message_is_displayed,,,2019-04-11 12:08:57,2019-04-11 12:08:57,0.472s,ERROR
"fieldId = ""!!!!!""",,,2019-04-11 12:08:57,2019-04-11 12:08:57,0.001s,PASSED
"nameField = ""Field by agent not assigned""",,,2019-04-11 12:08:57,2019-04-11 12:08:57,0.001s,PASSED
"boundaryField = ""{""boundaries"":[{""boundary"":{""coords"":[{""x"":-101.49568751,""y"":37.14976293},{""x"":-101.50049403,""y"":37.14647907},{""x"":-101.50049403,""y"":37.14264773},{""x"":-101.49723246,""y"":37.1411425},{""x"":-101.49019435,""y"":37.14223722},{""x"":-101.48933604,""y"":37.14620541},{""x"":-101.49294093,""y"":37.14866833},{""x"":-101.49568751,""y"":37.14976293}]}}]}""",,,2019-04-11 12:08:57,2019-04-11 12:08:57,0.000s,PASSED
"tokenUserName = ""jenny.maldonado.tx1@gmail.com""",,,2019-04-11 12:08:57,2019-04-11 12:08:57,0.001s,PASSED
"tokenPassword = ""cropmetrics""",,,2019-04-11 12:08:57,2019-04-11 12:08:57,0.000s,PASSED
"responseToken = sendRequest(findTestObject(""VoPro/Token"", [""usernameToken"":tokenUserName, ""passwordToken"":tokenPassword]))",,,2019-04-11 12:08:57,2019-04-11 12:08:57,0.116s,PASSED
slurper = new groovy.json.JsonSlurper(),,,2019-04-11 12:08:57,2019-04-11 12:08:57,0.001s,PASSED
tokenResult = slurper.parseText(responseToken.getResponseBodyContent()),,,2019-04-11 12:08:57,2019-04-11 12:08:57,0.003s,ERROR
,,,,,,
Test Cases/VoGrow/API/Field/Put/21 API_FIELD_When_field_updated_has_name_attribute_with_more_than_128_chars_Expected_status_code_400,,,2019-04-11 12:08:58,2019-04-11 12:08:58,0.343s,ERROR
"fieldId = ""5""",,,2019-04-11 12:08:58,2019-04-11 12:08:58,0.000s,PASSED
"nameField = ""API_FIELD_When_new_field_has_name_attribute_with_more_than_128_chars_Expected_status_code_400 API_FIELD_When_new_field_has_name_attribute_with_more_than_128_chars_Expected_status_code_400 API_FIELD_When_new_field_has_name_attribute_with_more_than_128_chars_Expected_status_code_400""",,,2019-04-11 12:08:58,2019-04-11 12:08:58,0.001s,PASSED
"boundaryField = ""{""boundaries"":[{""boundary"":{""coords"":[{""x"":-101.49568751,""y"":37.14976293},{""x"":-101.50049403,""y"":37.14647907},{""x"":-101.50049403,""y"":37.14264773},{""x"":-101.49723246,""y"":37.1411425},{""x"":-101.49019435,""y"":37.14223722},{""x"":-101.48933604,""y"":37.14620541},{""x"":-101.49294093,""y"":37.14866833},{""x"":-101.49568751,""y"":37.14976293}]}}]}""",,,2019-04-11 12:08:58,2019-04-11 12:08:58,0.000s,PASSED
"tokenUserName = ""jenny.maldonado.tx1@gmail.com""",,,2019-04-11 12:08:58,2019-04-11 12:08:58,0.001s,PASSED
"tokenPassword = ""cropmetrics""",,,2019-04-11 12:08:58,2019-04-11 12:08:58,0.000s,PASSED
"responseToken = sendRequest(findTestObject(""VoPro/Token"", [""usernameToken"":tokenUserName, ""passwordToken"":tokenPassword]))",,,2019-04-11 12:08:58,2019-04-11 12:08:58,0.090s,PASSED
slurper = new groovy.json.JsonSlurper(),,,2019-04-11 12:08:58,2019-04-11 12:08:58,0.000s,PASSED
tokenResult = slurper.parseText(responseToken.getResponseBodyContent()),,,2019-04-11 12:08:58,2019-04-11 12:08:58,0.001s,ERROR
,,,,,,
Test Cases/VoGrow/API/Field/Put/22 API_FIELD_When_field_updated_has_name_attribute_with_more_than_128_chars_Expected_properly_error_message_is_displayed,,,2019-04-11 12:08:58,2019-04-11 12:08:58,0.320s,ERROR
"fieldId = ""5""",,,2019-04-11 12:08:58,2019-04-11 12:08:58,0.001s,PASSED
"nameField = ""API_FIELD_When_new_field_has_name_attribute_with_more_than_128_chars_Expected_status_code_400 API_FIELD_When_new_field_has_name_attribute_with_more_than_128_chars_Expected_status_code_400 API_FIELD_When_new_field_has_name_attribute_with_more_than_128_chars_Expected_status_code_400""",,,2019-04-11 12:08:58,2019-04-11 12:08:58,0.000s,PASSED
"boundaryField = ""{""boundaries"":[{""boundary"":{""coords"":[{""x"":-101.49568751,""y"":37.14976293},{""x"":-101.50049403,""y"":37.14647907},{""x"":-101.50049403,""y"":37.14264773},{""x"":-101.49723246,""y"":37.1411425},{""x"":-101.49019435,""y"":37.14223722},{""x"":-101.48933604,""y"":37.14620541},{""x"":-101.49294093,""y"":37.14866833},{""x"":-101.49568751,""y"":37.14976293}]}}]}""",,,2019-04-11 12:08:58,2019-04-11 12:08:58,0.000s,PASSED
"tokenUserName = ""jenny.maldonado.tx1@gmail.com""",,,2019-04-11 12:08:58,2019-04-11 12:08:58,0.001s,PASSED
"tokenPassword = ""cropmetrics""",,,2019-04-11 12:08:58,2019-04-11 12:08:58,0.001s,PASSED
"responseToken = sendRequest(findTestObject(""VoPro/Token"", [""usernameToken"":tokenUserName, ""passwordToken"":tokenPassword]))",,,2019-04-11 12:08:58,2019-04-11 12:08:58,0.089s,PASSED
slurper = new groovy.json.JsonSlurper(),,,2019-04-11 12:08:58,2019-04-11 12:08:58,0.001s,PASSED
tokenResult = slurper.parseText(responseToken.getResponseBodyContent()),,,2019-04-11 12:08:58,2019-04-11 12:08:58,0.002s,ERROR
,,,,,,
Test Cases/VoGrow/API/Field/Put/23 API_FIELD_When_field_updated_has_name_attribute_with_128_chars_Expected_status_code_200,,,2019-04-11 12:08:58,2019-04-11 12:08:59,0.333s,ERROR
"fieldId = ""6""",,,2019-04-11 12:08:58,2019-04-11 12:08:58,0.001s,PASSED
"nameField = ""128 chars as field name API FIELD When new field has name attribute with 128 chars Expected status code 201 API FIELD When new f""",,,2019-04-11 12:08:58,2019-04-11 12:08:58,0.000s,PASSED
"boundaryField = ""{""boundaries"":[{""boundary"":{""coords"":[{""x"":-101.49568751,""y"":37.14976293},{""x"":-101.50049403,""y"":37.14647907},{""x"":-101.50049403,""y"":37.14264773},{""x"":-101.49723246,""y"":37.1411425},{""x"":-101.49019435,""y"":37.14223722},{""x"":-101.48933604,""y"":37.14620541},{""x"":-101.49294093,""y"":37.14866833},{""x"":-101.49568751,""y"":37.14976293}]}}]}""",,,2019-04-11 12:08:58,2019-04-11 12:08:58,0.001s,PASSED
"tokenUserName = ""jenny.maldonado.tx1@gmail.com""",,,2019-04-11 12:08:58,2019-04-11 12:08:58,0.000s,PASSED
"tokenPassword = ""cropmetrics""",,,2019-04-11 12:08:58,2019-04-11 12:08:58,0.001s,PASSED
"responseToken = sendRequest(findTestObject(""VoPro/Token"", [""usernameToken"":tokenUserName, ""passwordToken"":tokenPassword]))",,,2019-04-11 12:08:58,2019-04-11 12:08:59,0.099s,PASSED
slurper = new groovy.json.JsonSlurper(),,,2019-04-11 12:08:59,2019-04-11 12:08:59,0.000s,PASSED
tokenResult = slurper.parseText(responseToken.getResponseBodyContent()),,,2019-04-11 12:08:59,2019-04-11 12:08:59,0.001s,ERROR
,,,,,,
Test Cases/VoGrow/API/Field/Put/24 API_FIELD_When_field_updated_has_name_attribute_with_128_chars_Expected_new_field_is_added_in_database,,,2019-04-11 12:08:59,2019-04-11 12:08:59,0.383s,ERROR
"connectionCmDatabase.CmConnection.connectDB(""localhost"", ""virtualoptimizer"", ""5432"", ""postgres"", ""admin"")",,,2019-04-11 12:08:59,2019-04-11 12:08:59,0.051s,ERROR
,,,,,,
Test Cases/VoGrow/API/Field/Put/25 API_FIELD_When_field_updated_has_name_attribute_with_only_spaces_Expected_status_code_400,,,2019-04-11 12:08:59,2019-04-11 12:08:59,0.353s,ERROR
"fieldId = ""14""",,,2019-04-11 12:08:59,2019-04-11 12:08:59,0.000s,PASSED
"nameField = ""    """,,,2019-04-11 12:08:59,2019-04-11 12:08:59,0.000s,PASSED
"boundaryField = ""{""boundaries"":[{""boundary"":{""coords"":[{""x"":-101.49568751,""y"":37.14976293},{""x"":-101.50049403,""y"":37.14647907},{""x"":-101.50049403,""y"":37.14264773},{""x"":-101.49723246,""y"":37.1411425},{""x"":-101.49019435,""y"":37.14223722},{""x"":-101.48933604,""y"":37.14620541},{""x"":-101.49294093,""y"":37.14866833},{""x"":-101.49568751,""y"":37.14976293}]}}]}""",,,2019-04-11 12:08:59,2019-04-11 12:08:59,0.001s,PASSED
"tokenUserName = ""jenny.maldonado.tx1@gmail.com""",,,2019-04-11 12:08:59,2019-04-11 12:08:59,0.000s,PASSED
"tokenPassword = ""cropmetrics""",,,2019-04-11 12:08:59,2019-04-11 12:08:59,0.001s,PASSED
"responseToken = sendRequest(findTestObject(""VoPro/Token"", [""usernameToken"":tokenUserName, ""passwordToken"":tokenPassword]))",,,2019-04-11 12:08:59,2019-04-11 12:08:59,0.097s,PASSED
slurper = new groovy.json.JsonSlurper(),,,2019-04-11 12:08:59,2019-04-11 12:08:59,0.001s,PASSED
tokenResult = slurper.parseText(responseToken.getResponseBodyContent()),,,2019-04-11 12:08:59,2019-04-11 12:08:59,0.001s,ERROR
,,,,,,
Test Cases/VoGrow/API/Field/Put/26 API_FIELD_When_field_updated_has_name_attribute_with_only_spaces_Expected_properly_error_message_is_displayed,,,2019-04-11 12:08:59,2019-04-11 12:09:00,0.320s,ERROR
"fieldId = ""6""",,,2019-04-11 12:08:59,2019-04-11 12:08:59,0.001s,PASSED
"nameField = ""    """,,,2019-04-11 12:08:59,2019-04-11 12:08:59,0.000s,PASSED
"boundaryField = ""{""boundaries"":[{""boundary"":{""coords"":[{""x"":-101.49568751,""y"":37.14976293},{""x"":-101.50049403,""y"":37.14647907},{""x"":-101.50049403,""y"":37.14264773},{""x"":-101.49723246,""y"":37.1411425},{""x"":-101.49019435,""y"":37.14223722},{""x"":-101.48933604,""y"":37.14620541},{""x"":-101.49294093,""y"":37.14866833},{""x"":-101.49568751,""y"":37.14976293}]}}]}""",,,2019-04-11 12:08:59,2019-04-11 12:08:59,0.001s,PASSED
"tokenUserName = ""jenny.maldonado.tx1@gmail.com""",,,2019-04-11 12:08:59,2019-04-11 12:08:59,0.000s,PASSED
"tokenPassword = ""cropmetrics""",,,2019-04-11 12:08:59,2019-04-11 12:08:59,0.001s,PASSED
"responseToken = sendRequest(findTestObject(""VoPro/Token"", [""usernameToken"":tokenUserName, ""passwordToken"":tokenPassword]))",,,2019-04-11 12:08:59,2019-04-11 12:09:00,0.103s,PASSED
slurper = new groovy.json.JsonSlurper(),,,2019-04-11 12:09:00,2019-04-11 12:09:00,0.001s,PASSED
tokenResult = slurper.parseText(responseToken.getResponseBodyContent()),,,2019-04-11 12:09:00,2019-04-11 12:09:00,0.003s,ERROR
,,,,,,
Test Cases/VoGrow/API/Field/Put/27 API_FIELD_When_field_updated_has_name_attribute_as_empty_Expected_status_code_400,,,2019-04-11 12:09:00,2019-04-11 12:09:00,0.377s,ERROR
"fieldId = ""14""",,,2019-04-11 12:09:00,2019-04-11 12:09:00,0.002s,PASSED
"nameField = """"",,,2019-04-11 12:09:00,2019-04-11 12:09:00,0.001s,PASSED
"boundaryField = ""{""boundaries"":[{""boundary"":{""coords"":[{""x"":-101.49568751,""y"":37.14976293},{""x"":-101.50049403,""y"":37.14647907},{""x"":-101.50049403,""y"":37.14264773},{""x"":-101.49723246,""y"":37.1411425},{""x"":-101.49019435,""y"":37.14223722},{""x"":-101.48933604,""y"":37.14620541},{""x"":-101.49294093,""y"":37.14866833},{""x"":-101.49568751,""y"":37.14976293}]}}]}""",,,2019-04-11 12:09:00,2019-04-11 12:09:00,0.000s,PASSED
"tokenUserName = ""jenny.maldonado.tx1@gmail.com""",,,2019-04-11 12:09:00,2019-04-11 12:09:00,0.000s,PASSED
"tokenPassword = ""cropmetrics""",,,2019-04-11 12:09:00,2019-04-11 12:09:00,0.001s,PASSED
"responseToken = sendRequest(findTestObject(""VoPro/Token"", [""usernameToken"":tokenUserName, ""passwordToken"":tokenPassword]))",,,2019-04-11 12:09:00,2019-04-11 12:09:00,0.143s,PASSED
slurper = new groovy.json.JsonSlurper(),,,2019-04-11 12:09:00,2019-04-11 12:09:00,0.002s,PASSED
tokenResult = slurper.parseText(responseToken.getResponseBodyContent()),,,2019-04-11 12:09:00,2019-04-11 12:09:00,0.003s,ERROR
,,,,,,
Test Cases/VoGrow/API/Field/Put/28 API_FIELD_When_field_updated_has_name_attribute_as_empty_Expected_properly_error_message_is_displayed,,,2019-04-11 12:09:00,2019-04-11 12:09:01,0.932s,ERROR
"fieldId = ""6""",,,2019-04-11 12:09:01,2019-04-11 12:09:01,0.000s,PASSED
"nameField = """"",,,2019-04-11 12:09:01,2019-04-11 12:09:01,0.001s,PASSED
"boundaryField = ""{""boundaries"":[{""boundary"":{""coords"":[{""x"":-101.49568751,""y"":37.14976293},{""x"":-101.50049403,""y"":37.14647907},{""x"":-101.50049403,""y"":37.14264773},{""x"":-101.49723246,""y"":37.1411425},{""x"":-101.49019435,""y"":37.14223722},{""x"":-101.48933604,""y"":37.14620541},{""x"":-101.49294093,""y"":37.14866833},{""x"":-101.49568751,""y"":37.14976293}]}}]}""",,,2019-04-11 12:09:01,2019-04-11 12:09:01,0.004s,PASSED
"tokenUserName = ""jenny.maldonado.tx1@gmail.com""",,,2019-04-11 12:09:01,2019-04-11 12:09:01,0.002s,PASSED
"tokenPassword = ""cropmetrics""",,,2019-04-11 12:09:01,2019-04-11 12:09:01,0.002s,PASSED
"responseToken = sendRequest(findTestObject(""VoPro/Token"", [""usernameToken"":tokenUserName, ""passwordToken"":tokenPassword]))",,,2019-04-11 12:09:01,2019-04-11 12:09:01,0.248s,PASSED
slurper = new groovy.json.JsonSlurper(),,,2019-04-11 12:09:01,2019-04-11 12:09:01,0.000s,PASSED
tokenResult = slurper.parseText(responseToken.getResponseBodyContent()),,,2019-04-11 12:09:01,2019-04-11 12:09:01,0.001s,ERROR
,,,,,,
Test Cases/VoGrow/API/Field/Put/29 API_FIELD_When_field_updated_has_name_attribute_as_symbols_Expected_status_code_400,,,2019-04-11 12:09:01,2019-04-11 12:09:01,0.296s,ERROR
"fieldId = ""14""",,,2019-04-11 12:09:01,2019-04-11 12:09:01,0.001s,PASSED
"nameField = ""!@#$%^""",,,2019-04-11 12:09:01,2019-04-11 12:09:01,0.000s,PASSED
"boundaryField = ""{""boundaries"":[{""boundary"":{""coords"":[{""x"":-101.49568751,""y"":37.14976293},{""x"":-101.50049403,""y"":37.14647907},{""x"":-101.50049403,""y"":37.14264773},{""x"":-101.49723246,""y"":37.1411425},{""x"":-101.49019435,""y"":37.14223722},{""x"":-101.48933604,""y"":37.14620541},{""x"":-101.49294093,""y"":37.14866833},{""x"":-101.49568751,""y"":37.14976293}]}}]}""",,,2019-04-11 12:09:01,2019-04-11 12:09:01,0.001s,PASSED
"tokenUserName = ""jenny.maldonado.tx1@gmail.com""",,,2019-04-11 12:09:01,2019-04-11 12:09:01,0.001s,PASSED
"tokenPassword = ""cropmetrics""",,,2019-04-11 12:09:01,2019-04-11 12:09:01,0.001s,PASSED
"responseToken = sendRequest(findTestObject(""VoPro/Token"", [""usernameToken"":tokenUserName, ""passwordToken"":tokenPassword]))",,,2019-04-11 12:09:01,2019-04-11 12:09:01,0.099s,PASSED
slurper = new groovy.json.JsonSlurper(),,,2019-04-11 12:09:01,2019-04-11 12:09:01,0.001s,PASSED
tokenResult = slurper.parseText(responseToken.getResponseBodyContent()),,,2019-04-11 12:09:01,2019-04-11 12:09:01,0.001s,ERROR
,,,,,,
Test Cases/VoGrow/API/Field/Put/30 API_FIELD_When_field_updated_has_name_attribute_as_symbols_Expected_properly_error_message_is_displayed,,,2019-04-11 12:09:01,2019-04-11 12:09:02,0.334s,ERROR
"fieldId = ""6""",,,2019-04-11 12:09:01,2019-04-11 12:09:01,0.003s,PASSED
"nameField = ""!@#$%^""",,,2019-04-11 12:09:01,2019-04-11 12:09:01,0.000s,PASSED
"boundaryField = ""{""boundaries"":[{""boundary"":{""coords"":[{""x"":-101.49568751,""y"":37.14976293},{""x"":-101.50049403,""y"":37.14647907},{""x"":-101.50049403,""y"":37.14264773},{""x"":-101.49723246,""y"":37.1411425},{""x"":-101.49019435,""y"":37.14223722},{""x"":-101.48933604,""y"":37.14620541},{""x"":-101.49294093,""y"":37.14866833},{""x"":-101.49568751,""y"":37.14976293}]}}]}""",,,2019-04-11 12:09:01,2019-04-11 12:09:01,0.000s,PASSED
"tokenUserName = ""jenny.maldonado.tx1@gmail.com""",,,2019-04-11 12:09:01,2019-04-11 12:09:01,0.001s,PASSED
"tokenPassword = ""cropmetrics""",,,2019-04-11 12:09:01,2019-04-11 12:09:01,0.000s,PASSED
"responseToken = sendRequest(findTestObject(""VoPro/Token"", [""usernameToken"":tokenUserName, ""passwordToken"":tokenPassword]))",,,2019-04-11 12:09:01,2019-04-11 12:09:02,0.101s,PASSED
slurper = new groovy.json.JsonSlurper(),,,2019-04-11 12:09:02,2019-04-11 12:09:02,0.000s,PASSED
tokenResult = slurper.parseText(responseToken.getResponseBodyContent()),,,2019-04-11 12:09:02,2019-04-11 12:09:02,0.001s,ERROR
,,,,,,
Test Cases/VoGrow/API/Field/Put/31 API_FIELD_When_field_updated_has_name_attribute_with_spaces_and_chars_Expected_status_code_200,,,2019-04-11 12:09:02,2019-04-11 12:09:02,0.265s,ERROR
"fieldId = ""6""",,,2019-04-11 12:09:02,2019-04-11 12:09:02,0.000s,PASSED
"nameField = ""Field name with spaces updated""",,,2019-04-11 12:09:02,2019-04-11 12:09:02,0.000s,PASSED
"boundaryField = ""{""boundaries"":[{""boundary"":{""coords"":[{""x"":-101.49568751,""y"":37.14976293},{""x"":-101.50049403,""y"":37.14647907},{""x"":-101.50049403,""y"":37.14264773},{""x"":-101.49723246,""y"":37.1411425},{""x"":-101.49019435,""y"":37.14223722},{""x"":-101.48933604,""y"":37.14620541},{""x"":-101.49294093,""y"":37.14866833},{""x"":-101.49568751,""y"":37.14976293}]}}]}""",,,2019-04-11 12:09:02,2019-04-11 12:09:02,0.000s,PASSED
"tokenUserName = ""jenny.maldonado.tx1@gmail.com""",,,2019-04-11 12:09:02,2019-04-11 12:09:02,0.000s,PASSED
"tokenPassword = ""cropmetrics""",,,2019-04-11 12:09:02,2019-04-11 12:09:02,0.001s,PASSED
"responseToken = sendRequest(findTestObject(""VoPro/Token"", [""usernameToken"":tokenUserName, ""passwordToken"":tokenPassword]))",,,2019-04-11 12:09:02,2019-04-11 12:09:02,0.075s,PASSED
slurper = new groovy.json.JsonSlurper(),,,2019-04-11 12:09:02,2019-04-11 12:09:02,0.000s,PASSED
tokenResult = slurper.parseText(responseToken.getResponseBodyContent()),,,2019-04-11 12:09:02,2019-04-11 12:09:02,0.001s,ERROR
,,,,,,
Test Cases/VoGrow/API/Field/Put/32 API_FIELD_When_field_updated_has_name_attribute_with_apostrophes_and_chars_Expected_status_code_200,,,2019-04-11 12:09:02,2019-04-11 12:09:02,0.292s,ERROR
"fieldId = ""6""",,,2019-04-11 12:09:02,2019-04-11 12:09:02,0.001s,PASSED
"nameField = ""Field chars and 'values 'updated""",,,2019-04-11 12:09:02,2019-04-11 12:09:02,0.000s,PASSED
"boundaryField = ""{""boundaries"":[{""boundary"":{""coords"":[{""x"":-101.49568751,""y"":37.14976293},{""x"":-101.50049403,""y"":37.14647907},{""x"":-101.50049403,""y"":37.14264773},{""x"":-101.49723246,""y"":37.1411425},{""x"":-101.49019435,""y"":37.14223722},{""x"":-101.48933604,""y"":37.14620541},{""x"":-101.49294093,""y"":37.14866833},{""x"":-101.49568751,""y"":37.14976293}]}}]}""",,,2019-04-11 12:09:02,2019-04-11 12:09:02,0.000s,PASSED
"tokenUserName = ""jenny.maldonado.tx1@gmail.com""",,,2019-04-11 12:09:02,2019-04-11 12:09:02,0.001s,PASSED
"tokenPassword = ""cropmetrics""",,,2019-04-11 12:09:02,2019-04-11 12:09:02,0.000s,PASSED
"responseToken = sendRequest(findTestObject(""VoPro/Token"", [""usernameToken"":tokenUserName, ""passwordToken"":tokenPassword]))",,,2019-04-11 12:09:02,2019-04-11 12:09:02,0.089s,PASSED
slurper = new groovy.json.JsonSlurper(),,,2019-04-11 12:09:02,2019-04-11 12:09:02,0.000s,PASSED
tokenResult = slurper.parseText(responseToken.getResponseBodyContent()),,,2019-04-11 12:09:02,2019-04-11 12:09:02,0.002s,ERROR
,,,,,,
Test Cases/VoGrow/API/Field/Put/33 API_FIELD_When_field_updated_has_name_attribute_with_only_numbers_Expected_status_code_200,,,2019-04-11 12:09:02,2019-04-11 12:09:02,0.365s,ERROR
"fieldId = ""6""",,,2019-04-11 12:09:02,2019-04-11 12:09:02,0.000s,PASSED
"nameField = ""5555555""",,,2019-04-11 12:09:02,2019-04-11 12:09:02,0.001s,PASSED
"boundaryField = ""{""boundaries"":[{""boundary"":{""coords"":[{""x"":-101.49568751,""y"":37.14976293},{""x"":-101.50049403,""y"":37.14647907},{""x"":-101.50049403,""y"":37.14264773},{""x"":-101.49723246,""y"":37.1411425},{""x"":-101.49019435,""y"":37.14223722},{""x"":-101.48933604,""y"":37.14620541},{""x"":-101.49294093,""y"":37.14866833},{""x"":-101.49568751,""y"":37.14976293}]}}]}""",,,2019-04-11 12:09:02,2019-04-11 12:09:02,0.000s,PASSED
"tokenUserName = ""jenny.maldonado.tx1@gmail.com""",,,2019-04-11 12:09:02,2019-04-11 12:09:02,0.000s,PASSED
"tokenPassword = ""cropmetrics""",,,2019-04-11 12:09:02,2019-04-11 12:09:02,0.000s,PASSED
"responseToken = sendRequest(findTestObject(""VoPro/Token"", [""usernameToken"":tokenUserName, ""passwordToken"":tokenPassword]))",,,2019-04-11 12:09:02,2019-04-11 12:09:02,0.108s,PASSED
slurper = new groovy.json.JsonSlurper(),,,2019-04-11 12:09:02,2019-04-11 12:09:02,0.002s,PASSED
tokenResult = slurper.parseText(responseToken.getResponseBodyContent()),,,2019-04-11 12:09:02,2019-04-11 12:09:02,0.001s,ERROR
,,,,,,
Test Cases/VoGrow/API/Field/Put/34 API_FIELD_When_field_updated_has_name_attribute_with_only_chars_Expected_status_code_200,,,2019-04-11 12:09:02,2019-04-11 12:09:03,0.386s,ERROR
"fieldId = ""10""",,,2019-04-11 12:09:03,2019-04-11 12:09:03,0.001s,PASSED
"nameField = ""FieldNameWithOnlyCharsUpdated""",,,2019-04-11 12:09:03,2019-04-11 12:09:03,0.000s,PASSED
"boundaryField = ""{""boundaries"":[{""boundary"":{""coords"":[{""x"":-101.49568751,""y"":37.14976293},{""x"":-101.50049403,""y"":37.14647907},{""x"":-101.50049403,""y"":37.14264773},{""x"":-101.49723246,""y"":37.1411425},{""x"":-101.49019435,""y"":37.14223722},{""x"":-101.48933604,""y"":37.14620541},{""x"":-101.49294093,""y"":37.14866833},{""x"":-101.49568751,""y"":37.14976293}]}}]}""",,,2019-04-11 12:09:03,2019-04-11 12:09:03,0.001s,PASSED
"tokenUserName = ""jenny.maldonado.tx1@gmail.com""",,,2019-04-11 12:09:03,2019-04-11 12:09:03,0.001s,PASSED
"tokenPassword = ""cropmetrics""",,,2019-04-11 12:09:03,2019-04-11 12:09:03,0.000s,PASSED
"responseToken = sendRequest(findTestObject(""VoPro/Token"", [""usernameToken"":tokenUserName, ""passwordToken"":tokenPassword]))",,,2019-04-11 12:09:03,2019-04-11 12:09:03,0.101s,PASSED
slurper = new groovy.json.JsonSlurper(),,,2019-04-11 12:09:03,2019-04-11 12:09:03,0.000s,PASSED
tokenResult = slurper.parseText(responseToken.getResponseBodyContent()),,,2019-04-11 12:09:03,2019-04-11 12:09:03,0.004s,ERROR
,,,,,,
Test Cases/VoGrow/API/Field/Put/35 API_FIELD_When_field_updated_has_an_existing_name_in_farm_id_Expected_status_code_400,,,2019-04-11 12:09:03,2019-04-11 12:09:03,0.387s,ERROR
"fieldId = ""6""",,,2019-04-11 12:09:03,2019-04-11 12:09:03,0.001s,PASSED
"nameField = ""FieldNameWithOnlyCharsUpdated""",,,2019-04-11 12:09:03,2019-04-11 12:09:03,0.001s,PASSED
"boundaryField = ""{""boundaries"":[{""boundary"":{""coords"":[{""x"":-101.49568751,""y"":37.14976293},{""x"":-101.50049403,""y"":37.14647907},{""x"":-101.50049403,""y"":37.14264773},{""x"":-101.49723246,""y"":37.1411425},{""x"":-101.49019435,""y"":37.14223722},{""x"":-101.48933604,""y"":37.14620541},{""x"":-101.49294093,""y"":37.14866833},{""x"":-101.49568751,""y"":37.14976293}]}}]}""",,,2019-04-11 12:09:03,2019-04-11 12:09:03,0.001s,PASSED
"tokenUserName = ""jenny.maldonado.tx1@gmail.com""",,,2019-04-11 12:09:03,2019-04-11 12:09:03,0.001s,PASSED
"tokenPassword = ""cropmetrics""",,,2019-04-11 12:09:03,2019-04-11 12:09:03,0.002s,PASSED
"responseToken = sendRequest(findTestObject(""VoPro/Token"", [""usernameToken"":tokenUserName, ""passwordToken"":tokenPassword]))",,,2019-04-11 12:09:03,2019-04-11 12:09:03,0.120s,PASSED
slurper = new groovy.json.JsonSlurper(),,,2019-04-11 12:09:03,2019-04-11 12:09:03,0.000s,PASSED
tokenResult = slurper.parseText(responseToken.getResponseBodyContent()),,,2019-04-11 12:09:03,2019-04-11 12:09:03,0.002s,ERROR
,,,,,,
Test Cases/VoGrow/API/Field/Put/36 API_FIELD_When_field_updated_has_an_existing_name_in_farm_id_Expected_properly_error_message_is_displayed,,,2019-04-11 12:09:03,2019-04-11 12:09:04,0.380s,ERROR
"fieldId = ""6""",,,2019-04-11 12:09:04,2019-04-11 12:09:04,0.001s,PASSED
"nameField = ""FieldNameWithOnlyCharsUpdated""",,,2019-04-11 12:09:04,2019-04-11 12:09:04,0.000s,PASSED
"boundaryField = ""{""boundaries"":[{""boundary"":{""coords"":[{""x"":-101.49568751,""y"":37.14976293},{""x"":-101.50049403,""y"":37.14647907},{""x"":-101.50049403,""y"":37.14264773},{""x"":-101.49723246,""y"":37.1411425},{""x"":-101.49019435,""y"":37.14223722},{""x"":-101.48933604,""y"":37.14620541},{""x"":-101.49294093,""y"":37.14866833},{""x"":-101.49568751,""y"":37.14976293}]}}]}""",,,2019-04-11 12:09:04,2019-04-11 12:09:04,0.000s,PASSED
"tokenUserName = ""jenny.maldonado.tx1@gmail.com""",,,2019-04-11 12:09:04,2019-04-11 12:09:04,0.000s,PASSED
"tokenPassword = ""cropmetrics""",,,2019-04-11 12:09:04,2019-04-11 12:09:04,0.001s,PASSED
"responseToken = sendRequest(findTestObject(""VoPro/Token"", [""usernameToken"":tokenUserName, ""passwordToken"":tokenPassword]))",,,2019-04-11 12:09:04,2019-04-11 12:09:04,0.084s,PASSED
slurper = new groovy.json.JsonSlurper(),,,2019-04-11 12:09:04,2019-04-11 12:09:04,0.000s,PASSED
tokenResult = slurper.parseText(responseToken.getResponseBodyContent()),,,2019-04-11 12:09:04,2019-04-11 12:09:04,0.001s,ERROR
,,,,,,
Test Cases/VoGrow/API/Field/Put/37 API_FIELD_When_field_updated_has_the_name_of_the_other_farm_id_Expected_status_code_200,,,2019-04-11 12:09:04,2019-04-11 12:09:04,0.369s,ERROR
"fieldId = ""10""",,,2019-04-11 12:09:04,2019-04-11 12:09:04,0.000s,PASSED
"nameField = ""Field IN FARM ID 4""",,,2019-04-11 12:09:04,2019-04-11 12:09:04,0.000s,PASSED
"boundaryField = ""{""boundaries"":[{""boundary"":{""coords"":[{""x"":-101.49568751,""y"":37.14976293},{""x"":-101.50049403,""y"":37.14647907},{""x"":-101.50049403,""y"":37.14264773},{""x"":-101.49723246,""y"":37.1411425},{""x"":-101.49019435,""y"":37.14223722},{""x"":-101.48933604,""y"":37.14620541},{""x"":-101.49294093,""y"":37.14866833},{""x"":-101.49568751,""y"":37.14976293}]}}]}""",,,2019-04-11 12:09:04,2019-04-11 12:09:04,0.001s,PASSED
"tokenUserName = ""jenny.maldonado.tx1@gmail.com""",,,2019-04-11 12:09:04,2019-04-11 12:09:04,0.000s,PASSED
"tokenPassword = ""cropmetrics""",,,2019-04-11 12:09:04,2019-04-11 12:09:04,0.000s,PASSED
"responseToken = sendRequest(findTestObject(""VoPro/Token"", [""usernameToken"":tokenUserName, ""passwordToken"":tokenPassword]))",,,2019-04-11 12:09:04,2019-04-11 12:09:04,0.095s,PASSED
slurper = new groovy.json.JsonSlurper(),,,2019-04-11 12:09:04,2019-04-11 12:09:04,0.000s,PASSED
tokenResult = slurper.parseText(responseToken.getResponseBodyContent()),,,2019-04-11 12:09:04,2019-04-11 12:09:04,0.002s,ERROR
,,,,,,
Test Cases/VoGrow/API/Field/Put/38 API_FIELD_When_field_updated_is_created_as_dealer_read_only_for_one_of_the_grower_assigned_Expected_status_code_200,,,2019-04-11 12:09:04,2019-04-11 12:09:04,0.375s,ERROR
"fieldId = ""11""",,,2019-04-11 12:09:04,2019-04-11 12:09:04,0.001s,PASSED
"nameField = ""Field updated by dealer with access as Read Only""",,,2019-04-11 12:09:04,2019-04-11 12:09:04,0.001s,PASSED
"boundaryField = ""{""boundaries"":[{""boundary"":{""coords"":[{""x"":-101.49568751,""y"":37.14976293},{""x"":-101.50049403,""y"":37.14647907},{""x"":-101.50049403,""y"":37.14264773},{""x"":-101.49723246,""y"":37.1411425},{""x"":-101.49019435,""y"":37.14223722},{""x"":-101.48933604,""y"":37.14620541},{""x"":-101.49294093,""y"":37.14866833},{""x"":-101.49568751,""y"":37.14976293}]}}]}""",,,2019-04-11 12:09:04,2019-04-11 12:09:04,0.001s,PASSED
"tokenUserName = ""jenny.maldonado.tx.agent.ro@gmail.com""",,,2019-04-11 12:09:04,2019-04-11 12:09:04,0.001s,PASSED
"tokenPassword = ""cropmetrics""",,,2019-04-11 12:09:04,2019-04-11 12:09:04,0.000s,PASSED
"responseToken = sendRequest(findTestObject(""VoPro/Token"", [""usernameToken"":tokenUserName, ""passwordToken"":tokenPassword]))",,,2019-04-11 12:09:04,2019-04-11 12:09:04,0.097s,PASSED
slurper = new groovy.json.JsonSlurper(),,,2019-04-11 12:09:04,2019-04-11 12:09:04,0.000s,PASSED
tokenResult = slurper.parseText(responseToken.getResponseBodyContent()),,,2019-04-11 12:09:04,2019-04-11 12:09:04,0.001s,ERROR
,,,,,,
Test Cases/VoGrow/API/Field/Put/39 API_FIELD_When_field_updated_is_created_into_farm_with_flag_isvalid_false_Expected_status_code_400,,,2019-04-11 12:09:04,2019-04-11 12:09:05,0.298s,ERROR
"fieldId = ""3""",,,2019-04-11 12:09:05,2019-04-11 12:09:05,0.001s,PASSED
"nameField = ""Field added on farm disabled1""",,,2019-04-11 12:09:05,2019-04-11 12:09:05,0.000s,PASSED
"boundaryField = ""{""boundaries"":[{""boundary"":{""coords"":[{""x"":-101.49568751,""y"":37.14976293},{""x"":-101.50049403,""y"":37.14647907},{""x"":-101.50049403,""y"":37.14264773},{""x"":-101.49723246,""y"":37.1411425},{""x"":-101.49019435,""y"":37.14223722},{""x"":-101.48933604,""y"":37.14620541},{""x"":-101.49294093,""y"":37.14866833},{""x"":-101.49568751,""y"":37.14976293}]}}]}""",,,2019-04-11 12:09:05,2019-04-11 12:09:05,0.001s,PASSED
"connectionCmDatabase.CmConnection.connectDB(""localhost"", ""virtualoptimizer"", ""5432"", ""postgres"", ""admin"")",,,2019-04-11 12:09:05,2019-04-11 12:09:05,0.046s,ERROR
,,,,,,
Test Cases/VoGrow/API/Field/Put/40 API_FIELD_When_field_updated_is_created_into_farm_with_flag_isvalid_false_Expected_properly_error_message_is_displayed,,,2019-04-11 12:09:05,2019-04-11 12:09:05,0.378s,ERROR
"fieldId = ""3""",,,2019-04-11 12:09:05,2019-04-11 12:09:05,0.001s,PASSED
"nameField = ""Field added on farm disabled1""",,,2019-04-11 12:09:05,2019-04-11 12:09:05,0.000s,PASSED
"boundaryField = ""{""boundaries"":[{""boundary"":{""coords"":[{""x"":-101.49568751,""y"":37.14976293},{""x"":-101.50049403,""y"":37.14647907},{""x"":-101.50049403,""y"":37.14264773},{""x"":-101.49723246,""y"":37.1411425},{""x"":-101.49019435,""y"":37.14223722},{""x"":-101.48933604,""y"":37.14620541},{""x"":-101.49294093,""y"":37.14866833},{""x"":-101.49568751,""y"":37.14976293}]}}]}""",,,2019-04-11 12:09:05,2019-04-11 12:09:05,0.001s,PASSED
"tokenUserName = ""jenny.maldonado.tx1@gmail.com""",,,2019-04-11 12:09:05,2019-04-11 12:09:05,0.000s,PASSED
"tokenPassword = ""cropmetrics""",,,2019-04-11 12:09:05,2019-04-11 12:09:05,0.000s,PASSED
"responseToken = sendRequest(findTestObject(""VoPro/Token"", [""usernameToken"":tokenUserName, ""passwordToken"":tokenPassword]))",,,2019-04-11 12:09:05,2019-04-11 12:09:05,0.090s,PASSED
slurper = new groovy.json.JsonSlurper(),,,2019-04-11 12:09:05,2019-04-11 12:09:05,0.000s,PASSED
tokenResult = slurper.parseText(responseToken.getResponseBodyContent()),,,2019-04-11 12:09:05,2019-04-11 12:09:05,0.001s,ERROR
,,,,,,
Test Cases/VoGrow/API/Field/Put/41 API_FIELD_When_field_is_updated_with_boundary_attribute_as_empty_Expected_status_code_400,,,2019-04-11 12:09:05,2019-04-11 12:09:05,0.361s,ERROR
"fieldId = ""3""",,,2019-04-11 12:09:05,2019-04-11 12:09:05,0.001s,PASSED
"nameField = ""Field whit empty boundary""",,,2019-04-11 12:09:05,2019-04-11 12:09:05,0.000s,PASSED
"boundaryField = ""{""boundaries"":[]}""",,,2019-04-11 12:09:05,2019-04-11 12:09:05,0.000s,PASSED
"tokenUserName = ""jenny.maldonado.tx1@gmail.com""",,,2019-04-11 12:09:05,2019-04-11 12:09:05,0.001s,PASSED
"tokenPassword = ""cropmetrics""",,,2019-04-11 12:09:05,2019-04-11 12:09:05,0.000s,PASSED
"responseToken = sendRequest(findTestObject(""VoPro/Token"", [""usernameToken"":tokenUserName, ""passwordToken"":tokenPassword]))",,,2019-04-11 12:09:05,2019-04-11 12:09:05,0.097s,PASSED
slurper = new groovy.json.JsonSlurper(),,,2019-04-11 12:09:05,2019-04-11 12:09:05,0.000s,PASSED
tokenResult = slurper.parseText(responseToken.getResponseBodyContent()),,,2019-04-11 12:09:05,2019-04-11 12:09:05,0.002s,ERROR
,,,,,,
Test Cases/VoGrow/API/Field/Put/42 API_FIELD_When_field_is_updated_with_boundary_attribute_as_empty_Expected_properly_error_message_is_displayed,,,2019-04-11 12:09:05,2019-04-11 12:09:06,0.300s,ERROR
"fieldId = ""3""",,,2019-04-11 12:09:06,2019-04-11 12:09:06,0.001s,PASSED
"nameField = ""Field whit empty boundary""",,,2019-04-11 12:09:06,2019-04-11 12:09:06,0.000s,PASSED
"boundaryField = ""{""boundaries"":[]}""",,,2019-04-11 12:09:06,2019-04-11 12:09:06,0.001s,PASSED
"tokenUserName = ""jenny.maldonado.tx1@gmail.com""",,,2019-04-11 12:09:06,2019-04-11 12:09:06,0.000s,PASSED
"tokenPassword = ""cropmetrics""",,,2019-04-11 12:09:06,2019-04-11 12:09:06,0.000s,PASSED
"responseToken = sendRequest(findTestObject(""VoPro/Token"", [""usernameToken"":tokenUserName, ""passwordToken"":tokenPassword]))",,,2019-04-11 12:09:06,2019-04-11 12:09:06,0.080s,PASSED
slurper = new groovy.json.JsonSlurper(),,,2019-04-11 12:09:06,2019-04-11 12:09:06,0.001s,PASSED
tokenResult = slurper.parseText(responseToken.getResponseBodyContent()),,,2019-04-11 12:09:06,2019-04-11 12:09:06,0.001s,ERROR
,,,,,,
Test Cases/VoGrow/API/Field/Put/43 API_FIELD_When_field_is_updated_with_boundary_attribute_as_chars_Expected_status_code_400,,,2019-04-11 12:09:06,2019-04-11 12:09:06,0.436s,ERROR
"fieldId = ""3""",,,2019-04-11 12:09:06,2019-04-11 12:09:06,0.000s,PASSED
"nameField = ""Field whit chars in boundary""",,,2019-04-11 12:09:06,2019-04-11 12:09:06,0.001s,PASSED
"boundaryField = ""{""boundaries"":[""Kansas""]}""",,,2019-04-11 12:09:06,2019-04-11 12:09:06,0.000s,PASSED
"tokenUserName = ""jenny.maldonado.tx1@gmail.com""",,,2019-04-11 12:09:06,2019-04-11 12:09:06,0.000s,PASSED
"tokenPassword = ""cropmetrics""",,,2019-04-11 12:09:06,2019-04-11 12:09:06,0.000s,PASSED
"responseToken = sendRequest(findTestObject(""VoPro/Token"", [""usernameToken"":tokenUserName, ""passwordToken"":tokenPassword]))",,,2019-04-11 12:09:06,2019-04-11 12:09:06,0.114s,PASSED
slurper = new groovy.json.JsonSlurper(),,,2019-04-11 12:09:06,2019-04-11 12:09:06,0.000s,PASSED
tokenResult = slurper.parseText(responseToken.getResponseBodyContent()),,,2019-04-11 12:09:06,2019-04-11 12:09:06,0.002s,ERROR
,,,,,,
Test Cases/VoGrow/API/Field/Put/44 API_FIELD_When_field_is_updated_with_boundary_attribute_as_chars_Expected_properly_error_message_is_displayed,,,2019-04-11 12:09:06,2019-04-11 12:09:07,0.383s,ERROR
"fieldId = ""3""",,,2019-04-11 12:09:06,2019-04-11 12:09:06,0.000s,PASSED
"nameField = ""Field whit chars in boundary""",,,2019-04-11 12:09:06,2019-04-11 12:09:06,0.000s,PASSED
"boundaryField = ""{""boundaries"":[""Kansas""]}""",,,2019-04-11 12:09:06,2019-04-11 12:09:06,0.001s,PASSED
"tokenUserName = ""jenny.maldonado.tx1@gmail.com""",,,2019-04-11 12:09:06,2019-04-11 12:09:06,0.000s,PASSED
"tokenPassword = ""cropmetrics""",,,2019-04-11 12:09:06,2019-04-11 12:09:06,0.000s,PASSED
"responseToken = sendRequest(findTestObject(""VoPro/Token"", [""usernameToken"":tokenUserName, ""passwordToken"":tokenPassword]))",,,2019-04-11 12:09:06,2019-04-11 12:09:07,0.089s,PASSED
slurper = new groovy.json.JsonSlurper(),,,2019-04-11 12:09:07,2019-04-11 12:09:07,0.001s,PASSED
tokenResult = slurper.parseText(responseToken.getResponseBodyContent()),,,2019-04-11 12:09:07,2019-04-11 12:09:07,0.002s,ERROR
,,,,,,
Test Cases/VoGrow/API/Field/Put/45 API_FIELD_When_field_is_updated_with_boundary_attribute_with_spaces_Expected_status_code_400,,,2019-04-11 12:09:07,2019-04-11 12:09:07,0.349s,ERROR
"fieldId = ""3""",,,2019-04-11 12:09:07,2019-04-11 12:09:07,0.000s,PASSED
"nameField = ""Field whit spaces in boundary""",,,2019-04-11 12:09:07,2019-04-11 12:09:07,0.001s,PASSED
"boundaryField = ""{""boundaries"":[""     ""]}""",,,2019-04-11 12:09:07,2019-04-11 12:09:07,0.000s,PASSED
"tokenUserName = ""jenny.maldonado.tx1@gmail.com""",,,2019-04-11 12:09:07,2019-04-11 12:09:07,0.000s,PASSED
"tokenPassword = ""cropmetrics""",,,2019-04-11 12:09:07,2019-04-11 12:09:07,0.001s,PASSED
"responseToken = sendRequest(findTestObject(""VoPro/Token"", [""usernameToken"":tokenUserName, ""passwordToken"":tokenPassword]))",,,2019-04-11 12:09:07,2019-04-11 12:09:07,0.083s,PASSED
slurper = new groovy.json.JsonSlurper(),,,2019-04-11 12:09:07,2019-04-11 12:09:07,0.000s,PASSED
tokenResult = slurper.parseText(responseToken.getResponseBodyContent()),,,2019-04-11 12:09:07,2019-04-11 12:09:07,0.001s,ERROR
,,,,,,
Test Cases/VoGrow/API/Field/Put/46 API_FIELD_When_field_is_updated_with_boundary_attribute_with_spaces_Expected_properly_error_message_is_displayed,,,2019-04-11 12:09:07,2019-04-11 12:09:07,0.381s,ERROR
"fieldId = ""3""",,,2019-04-11 12:09:07,2019-04-11 12:09:07,0.000s,PASSED
"nameField = ""Field whit spaces in boundary""",,,2019-04-11 12:09:07,2019-04-11 12:09:07,0.000s,PASSED
"boundaryField = ""{""boundaries"":[""     ""]}""",,,2019-04-11 12:09:07,2019-04-11 12:09:07,0.002s,PASSED
"tokenUserName = ""jenny.maldonado.tx1@gmail.com""",,,2019-04-11 12:09:07,2019-04-11 12:09:07,0.000s,PASSED
"tokenPassword = ""cropmetrics""",,,2019-04-11 12:09:07,2019-04-11 12:09:07,0.001s,PASSED
"responseToken = sendRequest(findTestObject(""VoPro/Token"", [""usernameToken"":tokenUserName, ""passwordToken"":tokenPassword]))",,,2019-04-11 12:09:07,2019-04-11 12:09:07,0.085s,PASSED
slurper = new groovy.json.JsonSlurper(),,,2019-04-11 12:09:07,2019-04-11 12:09:07,0.000s,PASSED
tokenResult = slurper.parseText(responseToken.getResponseBodyContent()),,,2019-04-11 12:09:07,2019-04-11 12:09:07,0.001s,ERROR
,,,,,,
Test Cases/VoGrow/API/Field/Put/47 API_FIELD_When_field_is_updated_with_boundary_attribute_without_coords_values_Expected_status_code_400,,,2019-04-11 12:09:07,2019-04-11 12:09:08,0.397s,ERROR
"fieldId = ""3""",,,2019-04-11 12:09:08,2019-04-11 12:09:08,0.001s,PASSED
"nameField = ""Field whit sno coords in boundary""",,,2019-04-11 12:09:08,2019-04-11 12:09:08,0.000s,PASSED
"boundaryField = ""{""boundaries"":[{""boundary"":{}}]}""",,,2019-04-11 12:09:08,2019-04-11 12:09:08,0.001s,PASSED
"tokenUserName = ""jenny.maldonado.tx1@gmail.com""",,,2019-04-11 12:09:08,2019-04-11 12:09:08,0.000s,PASSED
"tokenPassword = ""cropmetrics""",,,2019-04-11 12:09:08,2019-04-11 12:09:08,0.000s,PASSED
"responseToken = sendRequest(findTestObject(""VoPro/Token"", [""usernameToken"":tokenUserName, ""passwordToken"":tokenPassword]))",,,2019-04-11 12:09:08,2019-04-11 12:09:08,0.139s,PASSED
slurper = new groovy.json.JsonSlurper(),,,2019-04-11 12:09:08,2019-04-11 12:09:08,0.000s,PASSED
tokenResult = slurper.parseText(responseToken.getResponseBodyContent()),,,2019-04-11 12:09:08,2019-04-11 12:09:08,0.003s,ERROR
,,,,,,
Test Cases/VoGrow/API/Field/Put/48 API_FIELD_When_field_is_updated_with_boundary_attribute_without_coords_values_Expected_properly_error_message_is_displayed,,,2019-04-11 12:09:08,2019-04-11 12:09:08,0.406s,ERROR
"fieldId = ""3""",,,2019-04-11 12:09:08,2019-04-11 12:09:08,0.000s,PASSED
"nameField = ""Field whit sno coords in boundary""",,,2019-04-11 12:09:08,2019-04-11 12:09:08,0.000s,PASSED
"boundaryField = ""{""boundaries"":[{""boundary"":{}}]}""",,,2019-04-11 12:09:08,2019-04-11 12:09:08,0.001s,PASSED
"tokenUserName = ""jenny.maldonado.tx1@gmail.com""",,,2019-04-11 12:09:08,2019-04-11 12:09:08,0.000s,PASSED
"tokenPassword = ""cropmetrics""",,,2019-04-11 12:09:08,2019-04-11 12:09:08,0.000s,PASSED
"responseToken = sendRequest(findTestObject(""VoPro/Token"", [""usernameToken"":tokenUserName, ""passwordToken"":tokenPassword]))",,,2019-04-11 12:09:08,2019-04-11 12:09:08,0.097s,PASSED
slurper = new groovy.json.JsonSlurper(),,,2019-04-11 12:09:08,2019-04-11 12:09:08,0.000s,PASSED
tokenResult = slurper.parseText(responseToken.getResponseBodyContent()),,,2019-04-11 12:09:08,2019-04-11 12:09:08,0.002s,ERROR
,,,,,,
Test Cases/VoGrow/API/Field/Put/49 API_FIELD_When_field_is_updated_with_boundary_attribute_with_invalid_x_value_Expected_status_code_400,,,2019-04-11 12:09:08,2019-04-11 12:09:08,0.410s,ERROR
"fieldId = ""3""",,,2019-04-11 12:09:08,2019-04-11 12:09:08,0.001s,PASSED
"nameField = ""Field whit invalid xy value on boundary""",,,2019-04-11 12:09:08,2019-04-11 12:09:08,0.001s,PASSED
"boundaryField = ""{""boundaries"":[{""boundary"":{""coords"":[{""x"":-301.49568751,""y"":37.14976293},{""x"":-101.50049403,""y"":37.14647907},{""x"":-101.50049403,""y"":37.14264773},{""x"":-101.49723246,""y"":37.1411425},{""x"":-101.49019435,""y"":37.14223722},{""x"":-101.48933604,""y"":37.14620541},{""x"":-101.49294093,""y"":37.14866833},{""x"":-101.49568751,""y"":37.14976293}]}}]}""",,,2019-04-11 12:09:08,2019-04-11 12:09:08,0.000s,PASSED
"tokenUserName = ""jenny.maldonado.tx1@gmail.com""",,,2019-04-11 12:09:08,2019-04-11 12:09:08,0.000s,PASSED
"tokenPassword = ""cropmetrics""",,,2019-04-11 12:09:08,2019-04-11 12:09:08,0.000s,PASSED
"responseToken = sendRequest(findTestObject(""VoPro/Token"", [""usernameToken"":tokenUserName, ""passwordToken"":tokenPassword]))",,,2019-04-11 12:09:08,2019-04-11 12:09:08,0.089s,PASSED
slurper = new groovy.json.JsonSlurper(),,,2019-04-11 12:09:08,2019-04-11 12:09:08,0.000s,PASSED
tokenResult = slurper.parseText(responseToken.getResponseBodyContent()),,,2019-04-11 12:09:08,2019-04-11 12:09:08,0.001s,ERROR
,,,,,,
Test Cases/VoGrow/API/Field/Put/50 API_FIELD_When_field_is_updated_with_boundary_attribute_with_invalid_x_value_Expected_properly_error_message_is_displayed,,,2019-04-11 12:09:09,2019-04-11 12:09:09,0.418s,ERROR
"fieldId = ""3""",,,2019-04-11 12:09:09,2019-04-11 12:09:09,0.001s,PASSED
"nameField = ""Field whit invalid xy value on boundary""",,,2019-04-11 12:09:09,2019-04-11 12:09:09,0.003s,PASSED
"boundaryField = ""{""boundaries"":[{""boundary"":{""coords"":[{""x"":-301.49568751,""y"":37.14976293},{""x"":-101.50049403,""y"":37.14647907},{""x"":-101.50049403,""y"":37.14264773},{""x"":-101.49723246,""y"":37.1411425},{""x"":-101.49019435,""y"":37.14223722},{""x"":-101.48933604,""y"":37.14620541},{""x"":-101.49294093,""y"":37.14866833},{""x"":-101.49568751,""y"":37.14976293}]}}]}""",,,2019-04-11 12:09:09,2019-04-11 12:09:09,0.001s,PASSED
"tokenUserName = ""jenny.maldonado.tx1@gmail.com""",,,2019-04-11 12:09:09,2019-04-11 12:09:09,0.001s,PASSED
"tokenPassword = ""cropmetrics""",,,2019-04-11 12:09:09,2019-04-11 12:09:09,0.000s,PASSED
"responseToken = sendRequest(findTestObject(""VoPro/Token"", [""usernameToken"":tokenUserName, ""passwordToken"":tokenPassword]))",,,2019-04-11 12:09:09,2019-04-11 12:09:09,0.107s,PASSED
slurper = new groovy.json.JsonSlurper(),,,2019-04-11 12:09:09,2019-04-11 12:09:09,0.001s,PASSED
tokenResult = slurper.parseText(responseToken.getResponseBodyContent()),,,2019-04-11 12:09:09,2019-04-11 12:09:09,0.001s,ERROR
,,,,,,
Test Cases/VoGrow/API/Field/Put/51 API_FIELD_When_field_is_updated_with_boundary_attribute_with_invalid_y_values_Expected_status_code_400,,,2019-04-11 12:09:09,2019-04-11 12:09:09,0.455s,ERROR
"fieldId = ""3""",,,2019-04-11 12:09:09,2019-04-11 12:09:09,0.000s,PASSED
"nameField = ""Field whit invalid y value on boundary""",,,2019-04-11 12:09:09,2019-04-11 12:09:09,0.000s,PASSED
"boundaryField = ""{""boundaries"":[{""boundary"":{""coords"":[{""x"":-101.49568751,""y"":137.14976293},{""x"":-101.50049403,""y"":37.14647907},{""x"":-101.50049403,""y"":37.14264773},{""x"":-101.49723246,""y"":37.1411425},{""x"":-101.49019435,""y"":37.14223722},{""x"":-101.48933604,""y"":37.14620541},{""x"":-101.49294093,""y"":37.14866833},{""x"":-101.49568751,""y"":37.14976293}]}}]}""",,,2019-04-11 12:09:09,2019-04-11 12:09:09,0.001s,PASSED
"tokenUserName = ""jenny.maldonado.tx1@gmail.com""",,,2019-04-11 12:09:09,2019-04-11 12:09:09,0.000s,PASSED
"tokenPassword = ""cropmetrics""",,,2019-04-11 12:09:09,2019-04-11 12:09:09,0.000s,PASSED
"responseToken = sendRequest(findTestObject(""VoPro/Token"", [""usernameToken"":tokenUserName, ""passwordToken"":tokenPassword]))",,,2019-04-11 12:09:09,2019-04-11 12:09:09,0.127s,PASSED
slurper = new groovy.json.JsonSlurper(),,,2019-04-11 12:09:09,2019-04-11 12:09:09,0.000s,PASSED
tokenResult = slurper.parseText(responseToken.getResponseBodyContent()),,,2019-04-11 12:09:09,2019-04-11 12:09:09,0.002s,ERROR
,,,,,,
Test Cases/VoGrow/API/Field/Put/52 API_FIELD_When_field_is_updated_with_boundary_attribute_with_invalid_y_values_Expected_properly_error_message_is_displayed,,,2019-04-11 12:09:09,2019-04-11 12:09:10,0.347s,ERROR
"fieldId = ""3""",,,2019-04-11 12:09:10,2019-04-11 12:09:10,0.000s,PASSED
"nameField = ""Field whit invalid y value on boundary""",,,2019-04-11 12:09:10,2019-04-11 12:09:10,0.000s,PASSED
"boundaryField = ""{""boundaries"":[{""boundary"":{""coords"":[{""x"":-101.49568751,""y"":137.14976293},{""x"":-101.50049403,""y"":37.14647907},{""x"":-101.50049403,""y"":37.14264773},{""x"":-101.49723246,""y"":37.1411425},{""x"":-101.49019435,""y"":37.14223722},{""x"":-101.48933604,""y"":37.14620541},{""x"":-101.49294093,""y"":37.14866833},{""x"":-101.49568751,""y"":37.14976293}]}}]}""",,,2019-04-11 12:09:10,2019-04-11 12:09:10,0.001s,PASSED
"tokenUserName = ""jenny.maldonado.tx1@gmail.com""",,,2019-04-11 12:09:10,2019-04-11 12:09:10,0.000s,PASSED
"tokenPassword = ""cropmetrics""",,,2019-04-11 12:09:10,2019-04-11 12:09:10,0.001s,PASSED
"responseToken = sendRequest(findTestObject(""VoPro/Token"", [""usernameToken"":tokenUserName, ""passwordToken"":tokenPassword]))",,,2019-04-11 12:09:10,2019-04-11 12:09:10,0.086s,PASSED
slurper = new groovy.json.JsonSlurper(),,,2019-04-11 12:09:10,2019-04-11 12:09:10,0.001s,PASSED
tokenResult = slurper.parseText(responseToken.getResponseBodyContent()),,,2019-04-11 12:09:10,2019-04-11 12:09:10,0.001s,ERROR
,,,,,,
Test Cases/VoGrow/API/Field/Put/53 API_FIELD_When_field_is_updated_with_boundary_attribute_with_spaces_Expected_status_code_400,,,2019-04-11 12:09:10,2019-04-11 12:09:10,0.319s,ERROR
"fieldId = ""3""",,,2019-04-11 12:09:10,2019-04-11 12:09:10,0.001s,PASSED
"nameField = ""Field whit invalid spaces values on boundary""",,,2019-04-11 12:09:10,2019-04-11 12:09:10,0.000s,PASSED
"boundaryField = ""{""boundaries"":[{""boundary"":{""coords"":[{""x"":"" "",""y"":"" ""},{""x"":-101.50049403,""y"":37.14647907},{""x"":-101.50049403,""y"":37.14264773},{""x"":-101.49723246,""y"":37.1411425},{""x"":-101.49019435,""y"":37.14223722},{""x"":-101.48933604,""y"":37.14620541},{""x"":-101.49294093,""y"":37.14866833},{""x"":-101.49568751,""y"":37.14976293}]}}]}""",,,2019-04-11 12:09:10,2019-04-11 12:09:10,0.000s,PASSED
"tokenUserName = ""jenny.maldonado.tx1@gmail.com""",,,2019-04-11 12:09:10,2019-04-11 12:09:10,0.001s,PASSED
"tokenPassword = ""cropmetrics""",,,2019-04-11 12:09:10,2019-04-11 12:09:10,0.000s,PASSED
"responseToken = sendRequest(findTestObject(""VoPro/Token"", [""usernameToken"":tokenUserName, ""passwordToken"":tokenPassword]))",,,2019-04-11 12:09:10,2019-04-11 12:09:10,0.101s,PASSED
slurper = new groovy.json.JsonSlurper(),,,2019-04-11 12:09:10,2019-04-11 12:09:10,0.001s,PASSED
tokenResult = slurper.parseText(responseToken.getResponseBodyContent()),,,2019-04-11 12:09:10,2019-04-11 12:09:10,0.002s,ERROR
,,,,,,
Test Cases/VoGrow/API/Field/Put/54 API_FIELD_When_field_is_updated_with_boundary_attribute_with_spaces_Expected_properly_error_message_is_displayed,,,2019-04-11 12:09:10,2019-04-11 12:09:10,0.429s,ERROR
"fieldId = ""3""",,,2019-04-11 12:09:10,2019-04-11 12:09:10,0.000s,PASSED
"nameField = ""Field whit invalid spaces values on boundary""",,,2019-04-11 12:09:10,2019-04-11 12:09:10,0.000s,PASSED
"boundaryField = ""{""boundaries"":[{""boundary"":{""coords"":[{""x"":"" "",""y"":"" ""},{""x"":-101.50049403,""y"":37.14647907},{""x"":-101.50049403,""y"":37.14264773},{""x"":-101.49723246,""y"":37.1411425},{""x"":-101.49019435,""y"":37.14223722},{""x"":-101.48933604,""y"":37.14620541},{""x"":-101.49294093,""y"":37.14866833},{""x"":-101.49568751,""y"":37.14976293}]}}]}""",,,2019-04-11 12:09:10,2019-04-11 12:09:10,0.000s,PASSED
"tokenUserName = ""jenny.maldonado.tx1@gmail.com""",,,2019-04-11 12:09:10,2019-04-11 12:09:10,0.000s,PASSED
"tokenPassword = ""cropmetrics""",,,2019-04-11 12:09:10,2019-04-11 12:09:10,0.000s,PASSED
"responseToken = sendRequest(findTestObject(""VoPro/Token"", [""usernameToken"":tokenUserName, ""passwordToken"":tokenPassword]))",,,2019-04-11 12:09:10,2019-04-11 12:09:10,0.101s,PASSED
slurper = new groovy.json.JsonSlurper(),,,2019-04-11 12:09:10,2019-04-11 12:09:10,0.001s,PASSED
tokenResult = slurper.parseText(responseToken.getResponseBodyContent()),,,2019-04-11 12:09:10,2019-04-11 12:09:10,0.001s,ERROR
,,,,,,
Test Cases/VoGrow/API/Field/Put/55 API_FIELD_When_field_is_updated_with_boundary_attribute_without_x_values_Expected_status_code_400,,,2019-04-11 12:09:10,2019-04-11 12:09:11,0.377s,ERROR
"fieldId = ""3""",,,2019-04-11 12:09:11,2019-04-11 12:09:11,0.000s,PASSED
"nameField = ""Field without x value in boundary""",,,2019-04-11 12:09:11,2019-04-11 12:09:11,0.000s,PASSED
"boundaryField = ""{""boundaries"":[{""boundary"":{""coords"":[{""y"":37.14976293},{""x"":-101.50049403,""y"":37.14647907},{""x"":-101.50049403,""y"":37.14264773},{""x"":-101.49723246,""y"":37.1411425},{""x"":-101.49019435,""y"":37.14223722},{""x"":-101.48933604,""y"":37.14620541},{""x"":-101.49294093,""y"":37.14866833},{""x"":-101.49568751,""y"":37.14976293}]}}]}""",,,2019-04-11 12:09:11,2019-04-11 12:09:11,0.000s,PASSED
"tokenUserName = ""jenny.maldonado.tx1@gmail.com""",,,2019-04-11 12:09:11,2019-04-11 12:09:11,0.000s,PASSED
"tokenPassword = ""cropmetrics""",,,2019-04-11 12:09:11,2019-04-11 12:09:11,0.000s,PASSED
"responseToken = sendRequest(findTestObject(""VoPro/Token"", [""usernameToken"":tokenUserName, ""passwordToken"":tokenPassword]))",,,2019-04-11 12:09:11,2019-04-11 12:09:11,0.112s,PASSED
slurper = new groovy.json.JsonSlurper(),,,2019-04-11 12:09:11,2019-04-11 12:09:11,0.000s,PASSED
tokenResult = slurper.parseText(responseToken.getResponseBodyContent()),,,2019-04-11 12:09:11,2019-04-11 12:09:11,0.001s,ERROR
,,,,,,
Test Cases/VoGrow/API/Field/Put/56 API_FIELD_When_field_is_updated_with_boundary_attribute_without_x_values_Expected_properly_error_message_is_displayed,,,2019-04-11 12:09:11,2019-04-11 12:09:11,0.467s,ERROR
"fieldId = ""3""",,,2019-04-11 12:09:11,2019-04-11 12:09:11,0.000s,PASSED
"nameField = ""Field without x value in boundary""",,,2019-04-11 12:09:11,2019-04-11 12:09:11,0.000s,PASSED
"boundaryField = ""{""boundaries"":[{""boundary"":{""coords"":[{""y"":37.14976293},{""x"":-101.50049403,""y"":37.14647907},{""x"":-101.50049403,""y"":37.14264773},{""x"":-101.49723246,""y"":37.1411425},{""x"":-101.49019435,""y"":37.14223722},{""x"":-101.48933604,""y"":37.14620541},{""x"":-101.49294093,""y"":37.14866833},{""x"":-101.49568751,""y"":37.14976293}]}}]}""",,,2019-04-11 12:09:11,2019-04-11 12:09:11,0.001s,PASSED
"tokenUserName = ""jenny.maldonado.tx1@gmail.com""",,,2019-04-11 12:09:11,2019-04-11 12:09:11,0.001s,PASSED
"tokenPassword = ""cropmetrics""",,,2019-04-11 12:09:11,2019-04-11 12:09:11,0.000s,PASSED
"responseToken = sendRequest(findTestObject(""VoPro/Token"", [""usernameToken"":tokenUserName, ""passwordToken"":tokenPassword]))",,,2019-04-11 12:09:11,2019-04-11 12:09:11,0.076s,PASSED
slurper = new groovy.json.JsonSlurper(),,,2019-04-11 12:09:11,2019-04-11 12:09:11,0.001s,PASSED
tokenResult = slurper.parseText(responseToken.getResponseBodyContent()),,,2019-04-11 12:09:11,2019-04-11 12:09:11,0.002s,ERROR
,,,,,,
Test Cases/VoGrow/API/Field/Put/57 API_FIELD_When_field_is_updated_with_boundary_attribute_without_y_values_Expected_status_code_400,,,2019-04-11 12:09:11,2019-04-11 12:09:12,0.417s,ERROR
"fieldId = ""3""",,,2019-04-11 12:09:12,2019-04-11 12:09:12,0.000s,PASSED
"nameField = ""Field without y value in boundary""",,,2019-04-11 12:09:12,2019-04-11 12:09:12,0.001s,PASSED
"boundaryField = ""{""boundaries"":[{""boundary"":{""coords"":[{""x"":-101.49568751},{""x"":-101.50049403,""y"":37.14647907},{""x"":-101.50049403,""y"":37.14264773},{""x"":-101.49723246,""y"":37.1411425},{""x"":-101.49019435,""y"":37.14223722},{""x"":-101.48933604,""y"":37.14620541},{""x"":-101.49294093,""y"":37.14866833},{""x"":-101.49568751,""y"":37.14976293}]}}]}""",,,2019-04-11 12:09:12,2019-04-11 12:09:12,0.001s,PASSED
"tokenUserName = ""jenny.maldonado.tx1@gmail.com""",,,2019-04-11 12:09:12,2019-04-11 12:09:12,0.000s,PASSED
"tokenPassword = ""cropmetrics""",,,2019-04-11 12:09:12,2019-04-11 12:09:12,0.001s,PASSED
"responseToken = sendRequest(findTestObject(""VoPro/Token"", [""usernameToken"":tokenUserName, ""passwordToken"":tokenPassword]))",,,2019-04-11 12:09:12,2019-04-11 12:09:12,0.092s,PASSED
slurper = new groovy.json.JsonSlurper(),,,2019-04-11 12:09:12,2019-04-11 12:09:12,0.000s,PASSED
tokenResult = slurper.parseText(responseToken.getResponseBodyContent()),,,2019-04-11 12:09:12,2019-04-11 12:09:12,0.001s,ERROR
,,,,,,
Test Cases/VoGrow/API/Field/Put/58 API_FIELD_When_field_is_updated_with_boundary_attribute_without_y_values_Expected_properly_error_message_is_displayed,,,2019-04-11 12:09:12,2019-04-11 12:09:12,0.322s,ERROR
"fieldId = ""3""",,,2019-04-11 12:09:12,2019-04-11 12:09:12,0.001s,PASSED
"nameField = ""Field without y value in boundary""",,,2019-04-11 12:09:12,2019-04-11 12:09:12,0.000s,PASSED
"boundaryField = ""{""boundaries"":[{""boundary"":{""coords"":[{""x"":-101.49568751},{""x"":-101.50049403,""y"":37.14647907},{""x"":-101.50049403,""y"":37.14264773},{""x"":-101.49723246,""y"":37.1411425},{""x"":-101.49019435,""y"":37.14223722},{""x"":-101.48933604,""y"":37.14620541},{""x"":-101.49294093,""y"":37.14866833},{""x"":-101.49568751,""y"":37.14976293}]}}]}""",,,2019-04-11 12:09:12,2019-04-11 12:09:12,0.000s,PASSED
"tokenUserName = ""jenny.maldonado.tx1@gmail.com""",,,2019-04-11 12:09:12,2019-04-11 12:09:12,0.001s,PASSED
"tokenPassword = ""cropmetrics""",,,2019-04-11 12:09:12,2019-04-11 12:09:12,0.000s,PASSED
"responseToken = sendRequest(findTestObject(""VoPro/Token"", [""usernameToken"":tokenUserName, ""passwordToken"":tokenPassword]))",,,2019-04-11 12:09:12,2019-04-11 12:09:12,0.111s,PASSED
slurper = new groovy.json.JsonSlurper(),,,2019-04-11 12:09:12,2019-04-11 12:09:12,0.001s,PASSED
tokenResult = slurper.parseText(responseToken.getResponseBodyContent()),,,2019-04-11 12:09:12,2019-04-11 12:09:12,0.001s,ERROR
,,,,,,
Test Cases/VoGrow/API/Field/Put/59 API_FIELD_When_field_is_updated_with_boundary_attribute_without_one_point_Expected_status_code_400,,,2019-04-11 12:09:12,2019-04-11 12:09:12,0.407s,ERROR
"fieldId = ""3""",,,2019-04-11 12:09:12,2019-04-11 12:09:12,0.001s,PASSED
"nameField = ""Field without one point in boundary""",,,2019-04-11 12:09:12,2019-04-11 12:09:12,0.001s,PASSED
"boundaryField = ""{""boundaries"":[{""boundary"":{""coords"":[{""x"":-101.49568751,""y"":37.14976293},{""x"":-101.50049403,""y"":37.14647907},{""x"":-101.50049403,""y"":37.14264773},{""x"":-101.49723246,""y"":37.1411425},{""x"":-101.49019435,""y"":37.14223722},{""x"":-101.48933604,""y"":37.14620541},{""x"":-101.49294093,""y"":37.14866833}]}}]}""",,,2019-04-11 12:09:12,2019-04-11 12:09:12,0.001s,PASSED
"tokenUserName = ""jenny.maldonado.tx1@gmail.com""",,,2019-04-11 12:09:12,2019-04-11 12:09:12,0.000s,PASSED
"tokenPassword = ""cropmetrics""",,,2019-04-11 12:09:12,2019-04-11 12:09:12,0.001s,PASSED
"responseToken = sendRequest(findTestObject(""VoPro/Token"", [""usernameToken"":tokenUserName, ""passwordToken"":tokenPassword]))",,,2019-04-11 12:09:12,2019-04-11 12:09:12,0.090s,PASSED
slurper = new groovy.json.JsonSlurper(),,,2019-04-11 12:09:12,2019-04-11 12:09:12,0.000s,PASSED
tokenResult = slurper.parseText(responseToken.getResponseBodyContent()),,,2019-04-11 12:09:12,2019-04-11 12:09:12,0.001s,ERROR
,,,,,,
Test Cases/VoGrow/API/Field/Put/60 API_FIELD_When_field_is_updated_with_boundary_attribute_without_one_point_Expected_properly_error_message_is_displayed,,,2019-04-11 12:09:12,2019-04-11 12:09:13,0.358s,ERROR
"fieldId = ""3""",,,2019-04-11 12:09:13,2019-04-11 12:09:13,0.001s,PASSED
"nameField = ""Field without one point in boundary""",,,2019-04-11 12:09:13,2019-04-11 12:09:13,0.000s,PASSED
"boundaryField = ""{""boundaries"":[{""boundary"":{""coords"":[{""x"":-101.49568751,""y"":37.14976293},{""x"":-101.50049403,""y"":37.14647907},{""x"":-101.50049403,""y"":37.14264773},{""x"":-101.49723246,""y"":37.1411425},{""x"":-101.49019435,""y"":37.14223722},{""x"":-101.48933604,""y"":37.14620541},{""x"":-101.49294093,""y"":37.14866833}]}}]}""",,,2019-04-11 12:09:13,2019-04-11 12:09:13,0.000s,PASSED
"tokenUserName = ""jenny.maldonado.tx1@gmail.com""",,,2019-04-11 12:09:13,2019-04-11 12:09:13,0.002s,PASSED
"tokenPassword = ""cropmetrics""",,,2019-04-11 12:09:13,2019-04-11 12:09:13,0.001s,PASSED
"responseToken = sendRequest(findTestObject(""VoPro/Token"", [""usernameToken"":tokenUserName, ""passwordToken"":tokenPassword]))",,,2019-04-11 12:09:13,2019-04-11 12:09:13,0.114s,PASSED
slurper = new groovy.json.JsonSlurper(),,,2019-04-11 12:09:13,2019-04-11 12:09:13,0.001s,PASSED
tokenResult = slurper.parseText(responseToken.getResponseBodyContent()),,,2019-04-11 12:09:13,2019-04-11 12:09:13,0.001s,ERROR
