{
  "log" : {
    "version" : "1.2",
    "creator" : {
      "name" : "BrowserMob Proxy",
      "version" : "2.1.5",
      "comment" : ""
    },
    "pages" : [ {
      "id" : "Page 0",
      "startedDateTime" : "2019-03-27T19:35:20.567Z",
      "title" : "Page 0",
      "pageTimings" : {
        "onLoad" : 1298,
        "comment" : ""
      },
      "comment" : ""
    } ],
    "entries" : [ {
      "pageref" : "Page 0",
      "startedDateTime" : "2019-03-27T19:35:20.567Z",
      "request" : {
        "method" : "POST",
        "url" : "http://localhost:10520/WebAPI/api/Account/AdministrativeRegister/?",
        "httpVersion" : "HTTP/1.1",
        "cookies" : [ ],
        "headers" : [ {
          "name" : "User-Agent",
          "value" : "Katalon Studio"
        }, {
          "name" : "Content-Type",
          "value" : "application/x-www-form-urlencoded"
        }, {
          "name" : "Authorization",
          "value" : "Bearer eyJ0eXAiOiJKV1QiLCJhbGciOiJIUzI1NiJ9.eyJ1bmlxdWVfbmFtZSI6ImFkbWluIiwicm9sZSI6InVzZXIiLCJzdWIiOiJhZG1pbiIsImlzcyI6IkNyb3BNZXRyaWNzIiwiYXVkIjoiYWxsIiwiZXhwIjoxNTUzNzE5MjIwLCJuYmYiOjE1NTM3MTUzMjB9.ccw1ZVDb3VWUZqZM8zfWfKcSNf-GwoSb6758k1JZ3lo"
        }, {
          "name" : "Host",
          "value" : "localhost:10520"
        }, {
          "name" : "Accept",
          "value" : "text/html, image/gif, image/jpeg, *; q=.2, */*; q=.2"
        }, {
          "name" : "Proxy-Connection",
          "value" : "keep-alive"
        }, {
          "name" : "Content-Length",
          "value" : "388"
        } ],
        "queryString" : [ ],
        "postData" : {
          "mimeType" : "application/x-www-form-urlencoded",
          "params" : [ {
            "name" : "username",
            "value" : "kuserzipsymbol",
            "comment" : ""
          }, {
            "name" : "password",
            "value" : "cropmetrics",
            "comment" : ""
          }, {
            "name" : "confirmPassword",
            "value" : "cropmetrics",
            "comment" : ""
          }, {
            "name" : "email",
            "value" : "cropmetricsvo@gmail.com",
            "comment" : ""
          }, {
            "name" : "fullname",
            "value" : "test validation",
            "comment" : ""
          }, {
            "name" : "phone",
            "value" : "123",
            "comment" : ""
          }, {
            "name" : "dealer",
            "value" : "x",
            "comment" : ""
          }, {
            "name" : "addressLine1",
            "value" : "address line 1 test validation",
            "comment" : ""
          }, {
            "name" : "addressLine2",
            "value" : "address line 12 test validation",
            "comment" : ""
          }, {
            "name" : "town",
            "value" : "townValidation",
            "comment" : ""
          }, {
            "name" : "state",
            "value" : "stateValidation",
            "comment" : ""
          }, {
            "name" : "zip",
            "value" : "!@#$%^&*(",
            "comment" : ""
          }, {
            "name" : "country",
            "value" : "countryValidation",
            "comment" : ""
          }, {
            "name" : "roles",
            "value" : "Client",
            "comment" : ""
          }, {
            "name" : "modifierUsername",
            "value" : "admin",
            "comment" : ""
          }, {
            "name" : "modifierUserId",
            "value" : "1",
            "comment" : ""
          } ],
          "comment" : ""
        },
        "headersSize" : 560,
        "bodySize" : 388,
        "comment" : ""
      },
      "response" : {
        "status" : 200,
        "statusText" : "OK",
        "httpVersion" : "HTTP/1.1",
        "cookies" : [ {
          "name" : ".ASPROLES",
          "value" : "AaPyTRDpLOUu1S5H11BETme0eH7wwnpr558HBNXL_SVkk59srqSaO5YHH3HNL16qMEK5Efw3b9vzH6iN_hkyzUhB-lvVzACpNsCpG9EGSZojggeiNgGl0TGZelUqrxK3CqdOI5TFZooxogeECWlCTqxQ3OitUIqVz8yJMigL3e5mMQp068ZLRdDGlDuewDEHdO1EgM0soMa-XmQd-ts3rLNT-rizf0C_D78iOQqm80CtDOVMeigaymDGHRXgcohkTDVcSPdMJYY6z1NCUp8LQVMKkpLSB6FRS3pFVDpURa9wkMcoUayM_KmoLCPNsXMEJii1UCGDOCeQI3HUrGMHSefPPepHp7IG0_ff543xrc0DfBJVyOPhnTTs8AoDNQNLFQgwkthti_qf6HjDGM7iooiOfGBF5VyUYhm8kmXpH8x3bRb8JeLFkWEvPpcnAmx3OdX8l9Lqe-M9vlxj15VePPLTBTpUaU8qEeaaqPCl5j_GunAi0",
          "path" : "/",
          "httpOnly" : true,
          "secure" : false,
          "comment" : ""
        } ],
        "headers" : [ {
          "name" : "Cache-Control",
          "value" : "private"
        }, {
          "name" : "Content-Type",
          "value" : "application/json; charset=utf-8"
        }, {
          "name" : "Server",
          "value" : "Microsoft-IIS/10.0"
        }, {
          "name" : "Set-Cookie",
          "value" : ".ASPROLES=AaPyTRDpLOUu1S5H11BETme0eH7wwnpr558HBNXL_SVkk59srqSaO5YHH3HNL16qMEK5Efw3b9vzH6iN_hkyzUhB-lvVzACpNsCpG9EGSZojggeiNgGl0TGZelUqrxK3CqdOI5TFZooxogeECWlCTqxQ3OitUIqVz8yJMigL3e5mMQp068ZLRdDGlDuewDEHdO1EgM0soMa-XmQd-ts3rLNT-rizf0C_D78iOQqm80CtDOVMeigaymDGHRXgcohkTDVcSPdMJYY6z1NCUp8LQVMKkpLSB6FRS3pFVDpURa9wkMcoUayM_KmoLCPNsXMEJii1UCGDOCeQI3HUrGMHSefPPepHp7IG0_ff543xrc0DfBJVyOPhnTTs8AoDNQNLFQgwkthti_qf6HjDGM7iooiOfGBF5VyUYhm8kmXpH8x3bRb8JeLFkWEvPpcnAmx3OdX8l9Lqe-M9vlxj15VePPLTBTpUaU8qEeaaqPCl5j_GunAi0; path=/; HttpOnly"
        }, {
          "name" : "X-SourceFiles",
          "value" : "=?UTF-8?B?RDpcVmlydHVhbE9wdGltaXplci1SZWZhY3RvcmluZ1xDcm9wTWV0cmljcy5Wby5BcGlcQ3JvcE1ldHJpY3MuVm8uQXBpXGFwaVxBY2NvdW50XEFkbWluaXN0cmF0aXZlUmVnaXN0ZXJc?="
        }, {
          "name" : "X-Powered-By",
          "value" : "ASP.NET"
        }, {
          "name" : "Date",
          "value" : "Wed, 27 Mar 2019 19:35:21 GMT"
        }, {
          "name" : "Content-Length",
          "value" : "9"
        } ],
        "content" : {
          "size" : 9,
          "mimeType" : "application/json; charset=utf-8",
          "text" : "{\"id\":34}",
          "comment" : ""
        },
        "redirectURL" : "",
        "headersSize" : 907,
        "bodySize" : 9,
        "comment" : ""
      },
      "cache" : { },
      "timings" : {
        "comment" : "",
        "ssl" : -1,
        "dns" : -1,
        "receive" : 0,
        "blocked" : -1,
        "wait" : 1293,
        "send" : 0,
        "connect" : -1
      },
      "serverIPAddress" : "127.0.0.1",
      "comment" : "",
      "_katalonRequestInformation" : {
        "name" : "79",
        "testObjectId" : "Object Repository/VoPro/Account/AdministrativeRegister",
        "harId" : "4505e0e1-d2b7-43e8-bb5c-1853b43bbd8c"
      },
      "time" : 1294
    } ],
    "comment" : ""
  }
}