{
  "log" : {
    "version" : "1.2",
    "creator" : {
      "name" : "BrowserMob Proxy",
      "version" : "2.1.5",
      "comment" : ""
    },
    "pages" : [ {
      "id" : "Page 0",
      "startedDateTime" : "2019-04-09T20:38:07.016Z",
      "title" : "Page 0",
      "pageTimings" : {
        "onLoad" : 87,
        "comment" : ""
      },
      "comment" : ""
    } ],
    "entries" : [ {
      "pageref" : "Page 0",
      "startedDateTime" : "2019-04-09T20:38:07.017Z",
      "request" : {
        "method" : "POST",
        "url" : "http://localhost:10520/WebAPI/api/mobile/v1/farms/?",
        "httpVersion" : "HTTP/1.1",
        "cookies" : [ ],
        "headers" : [ {
          "name" : "User-Agent",
          "value" : "Katalon Studio"
        }, {
          "name" : "Content-Type",
          "value" : "application/json"
        }, {
          "name" : "Authorization",
          "value" : "Bearer eyJ0eXAiOiJKV1QiLCJhbGciOiJIUzI1NiJ9.eyJ1bmlxdWVfbmFtZSI6Implbm55Lm1hbGRvbmFkby50eDFAZ21haWwuY29tIiwicm9sZSI6InVzZXIiLCJzdWIiOiJqZW5ueS5tYWxkb25hZG8udHgxQGdtYWlsLmNvbSIsImlzcyI6IkNyb3BNZXRyaWNzIiwiYXVkIjoiYWxsIiwiZXhwIjoxNTU0ODQ2MTg2LCJuYmYiOjE1NTQ4NDIyODZ9.PVRME7qyDP0549wOg7hg81FpQPczjDb-YJ2lluOUJQE"
        }, {
          "name" : "Host",
          "value" : "localhost:10520"
        }, {
          "name" : "Accept",
          "value" : "text/html, image/gif, image/jpeg, *; q=.2, */*; q=.2"
        }, {
          "name" : "Proxy-Connection",
          "value" : "keep-alive"
        }, {
          "name" : "Content-Length",
          "value" : "47"
        } ],
        "queryString" : [ ],
        "postData" : {
          "mimeType" : "application/json",
          "text" : "{\"name\": \"FarmNameWithOnlychars\", \"user_id\": 2}",
          "comment" : ""
        },
        "headersSize" : 591,
        "bodySize" : 47,
        "comment" : ""
      },
      "response" : {
        "status" : 201,
        "statusText" : "Created",
        "httpVersion" : "HTTP/1.1",
        "cookies" : [ {
          "name" : ".ASPROLES",
          "value" : "mIZy1vNKN_wDHQlFrb7bFsr_700tkCXhouFVy1sdjNHoGGYjYx-DYrv2-XflWcURWXtgZVAd_rVC3_fUQdfNvddk9gtp8P-hdbFbmu188aRrPr-YsSX5LICTRr3yzOtvju-ZuYMwo7w51y_PzRyNcmw3FUBImqMeNVgIE-FcLSoZuC67oTqMzBrhi36_zGR7wcDweCqEOOK86LM997flZ7jz6vpkHHNi0PEINpFcr45M1KGrWI6cXYqXGEzP5q-trWOCBMcSQ_KORBxejmx4bl70krEwPwHCYr1ICR2wTJHWuULtPUSTUdDfkeqEi2sx0lm8pGnrBh3qOiwn75hDFIf2Ur_Ncgx1OMEZtxkEltA8KRgjsibIQplWuB4e3DO_xQ8k8RBiERxjBu49dFApLxBzZJda5vTxDjqdvi9QGPl_VADlInZ_uK7k7sybsQYN7dDpx7AsJ3ryXg1_K2-tbcQHEOVANnLa8EnL_uClniJJHl-0h-PQNoL14ftkPt-OzC7dERuVtbExHQg5PMQNV79DBrE1",
          "path" : "/",
          "httpOnly" : true,
          "secure" : false,
          "comment" : ""
        } ],
        "headers" : [ {
          "name" : "Cache-Control",
          "value" : "private"
        }, {
          "name" : "Content-Type",
          "value" : "application/json; charset=utf-8"
        }, {
          "name" : "Location",
          "value" : "api/mobile/v1/farms/6"
        }, {
          "name" : "Server",
          "value" : "Microsoft-IIS/10.0"
        }, {
          "name" : "Set-Cookie",
          "value" : ".ASPROLES=mIZy1vNKN_wDHQlFrb7bFsr_700tkCXhouFVy1sdjNHoGGYjYx-DYrv2-XflWcURWXtgZVAd_rVC3_fUQdfNvddk9gtp8P-hdbFbmu188aRrPr-YsSX5LICTRr3yzOtvju-ZuYMwo7w51y_PzRyNcmw3FUBImqMeNVgIE-FcLSoZuC67oTqMzBrhi36_zGR7wcDweCqEOOK86LM997flZ7jz6vpkHHNi0PEINpFcr45M1KGrWI6cXYqXGEzP5q-trWOCBMcSQ_KORBxejmx4bl70krEwPwHCYr1ICR2wTJHWuULtPUSTUdDfkeqEi2sx0lm8pGnrBh3qOiwn75hDFIf2Ur_Ncgx1OMEZtxkEltA8KRgjsibIQplWuB4e3DO_xQ8k8RBiERxjBu49dFApLxBzZJda5vTxDjqdvi9QGPl_VADlInZ_uK7k7sybsQYN7dDpx7AsJ3ryXg1_K2-tbcQHEOVANnLa8EnL_uClniJJHl-0h-PQNoL14ftkPt-OzC7dERuVtbExHQg5PMQNV79DBrE1; path=/; HttpOnly"
        }, {
          "name" : "X-SourceFiles",
          "value" : "=?UTF-8?B?RDpcVmlydHVhbE9wdGltaXplci1SZWZhY3RvcmluZ1xDcm9wTWV0cmljcy5Wby5BcGlcQ3JvcE1ldHJpY3MuVm8uQXBpXGFwaVxtb2JpbGVcdjFcZmFybXNc?="
        }, {
          "name" : "X-Powered-By",
          "value" : "ASP.NET"
        }, {
          "name" : "Date",
          "value" : "Tue, 09 Apr 2019 20:38:07 GMT"
        }, {
          "name" : "Content-Length",
          "value" : "51"
        } ],
        "content" : {
          "size" : 51,
          "mimeType" : "application/json; charset=utf-8",
          "text" : "{\"id\":6,\"name\":\"FarmNameWithOnlychars\",\"user_id\":2}",
          "comment" : ""
        },
        "redirectURL" : "",
        "headersSize" : 969,
        "bodySize" : 51,
        "comment" : ""
      },
      "cache" : { },
      "timings" : {
        "comment" : "",
        "wait" : 82,
        "receive" : 0,
        "dns" : -1,
        "send" : 0,
        "connect" : -1,
        "blocked" : -1,
        "ssl" : -1
      },
      "serverIPAddress" : "127.0.0.1",
      "comment" : "",
      "_katalonRequestInformation" : {
        "name" : "29",
        "testObjectId" : "Object Repository/VoGrow/Farm/FarmPost",
        "harId" : "49758543-3ee8-46dc-af32-ebbe53132abc"
      },
      "time" : 83
    } ],
    "comment" : ""
  }
}