{
  "log" : {
    "version" : "1.2",
    "creator" : {
      "name" : "BrowserMob Proxy",
      "version" : "2.1.5",
      "comment" : ""
    },
    "pages" : [ {
      "id" : "Page 0",
      "startedDateTime" : "2019-03-29T22:28:01.476Z",
      "title" : "Page 0",
      "pageTimings" : {
        "onLoad" : 35,
        "comment" : ""
      },
      "comment" : ""
    } ],
    "entries" : [ {
      "pageref" : "Page 0",
      "startedDateTime" : "2019-03-29T22:28:01.477Z",
      "request" : {
        "method" : "POST",
        "url" : "http://localhost:10520/WebAPI/api/admin/v1/users/?",
        "httpVersion" : "HTTP/1.1",
        "cookies" : [ ],
        "headers" : [ {
          "name" : "User-Agent",
          "value" : "Katalon Studio"
        }, {
          "name" : "Content-Type",
          "value" : "application/x-www-form-urlencoded"
        }, {
          "name" : "Authorization",
          "value" : "Bearer eyJ0eXAiOiJKV1QiLCJhbGciOiJIUzI1NiJ9.eyJ1bmlxdWVfbmFtZSI6ImNyb3BtZXRyaWNzdm8uZmllbGRjcmV3QGdtYWlsLmNvbSIsInJvbGUiOiJ1c2VyIiwic3ViIjoiY3JvcG1ldHJpY3N2by5maWVsZGNyZXdAZ21haWwuY29tIiwiaXNzIjoiQ3JvcE1ldHJpY3MiLCJhdWQiOiJhbGwiLCJleHAiOjE1NTM5MDIzODEsIm5iZiI6MTU1Mzg5ODQ4MX0.P3Mlx2xtlq6z7Ko0v4GrNBxPU0QLyRSqZuBE12IKgt4"
        }, {
          "name" : "Host",
          "value" : "localhost:10520"
        }, {
          "name" : "Accept",
          "value" : "text/html, image/gif, image/jpeg, *; q=.2, */*; q=.2"
        }, {
          "name" : "Proxy-Connection",
          "value" : "keep-alive"
        }, {
          "name" : "Content-Length",
          "value" : "275"
        } ],
        "queryString" : [ ],
        "postData" : {
          "mimeType" : "application/x-www-form-urlencoded",
          "params" : [ {
            "name" : "password",
            "value" : "cropmetrics",
            "comment" : ""
          }, {
            "name" : "email",
            "value" : "cropmetricsvo.clientByFieldCrew@gmail.com",
            "comment" : ""
          }, {
            "name" : "fullname",
            "value" : "test validation",
            "comment" : ""
          }, {
            "name" : "phone",
            "value" : "123",
            "comment" : ""
          }, {
            "name" : "dealer",
            "value" : "x",
            "comment" : ""
          }, {
            "name" : "addressLine1",
            "value" : "address line 1 test validation",
            "comment" : ""
          }, {
            "name" : "addressLine2",
            "value" : "address line 2 test validation",
            "comment" : ""
          }, {
            "name" : "town",
            "value" : "townValidation",
            "comment" : ""
          }, {
            "name" : "state",
            "value" : "stateValidation",
            "comment" : ""
          }, {
            "name" : "zip",
            "value" : "xx",
            "comment" : ""
          }, {
            "name" : "country",
            "value" : "xx",
            "comment" : ""
          }, {
            "name" : "roles",
            "value" : "Client",
            "comment" : ""
          } ],
          "comment" : ""
        },
        "headersSize" : 619,
        "bodySize" : 275,
        "comment" : ""
      },
      "response" : {
        "status" : 401,
        "statusText" : "Unauthorized",
        "httpVersion" : "HTTP/1.1",
        "cookies" : [ {
          "name" : ".ASPROLES",
          "value" : "FI7x86HFJTrSkV5SAg0QvdlZgLBHG_GaKiN6ubhnqjfsJ0aZJjQInfHCe91a_l7dBgyw2tNlwpHKkcOx-xBlB2IBXdQqh_YrefwC3BtHff-hpnuwe0NA8wurZPrTznqtIFDWjDAQO8VYRdM0cF0gK6gPTYf64zFuZ6ztTocOO6wt55ioVGEjE6ntssrGyL_XCS5qQcjo_0k5jFu-SqmDCLZwOU3zFCxgOVvIRmnYFdYAIwuD3nUYuswbtMvFfAwwUZrmzkhhFrkuNFOhzbDtvwaHd3_6todRKIDff2QAI39C0BIPgwgxC7bWwJiiAExkJxTlCB-I3PRiO_5lMTsyPNEHGYRZ4qlem1MVylA9nAA2NLc1gEQC_Dj4vIfqhIT-6bHl0i04j-bhtZMFn2EtvDp2b3VHzVZG6HikI0rGdjtlkPw_3tYOAWbMZOFiLnNTSPzC2T589dHogXQs0O4rZo3e4HgvqhwVyiKWjJe1e0AEHv_JBdq7i0aHRxBN-4Y5zAGHzZ_fr4orRuctizzhbHqdly01",
          "path" : "/",
          "httpOnly" : true,
          "secure" : false,
          "comment" : ""
        } ],
        "headers" : [ {
          "name" : "Cache-Control",
          "value" : "private"
        }, {
          "name" : "Content-Type",
          "value" : "application/json; charset=utf-8"
        }, {
          "name" : "Server",
          "value" : "Microsoft-IIS/10.0"
        }, {
          "name" : "Set-Cookie",
          "value" : ".ASPROLES=FI7x86HFJTrSkV5SAg0QvdlZgLBHG_GaKiN6ubhnqjfsJ0aZJjQInfHCe91a_l7dBgyw2tNlwpHKkcOx-xBlB2IBXdQqh_YrefwC3BtHff-hpnuwe0NA8wurZPrTznqtIFDWjDAQO8VYRdM0cF0gK6gPTYf64zFuZ6ztTocOO6wt55ioVGEjE6ntssrGyL_XCS5qQcjo_0k5jFu-SqmDCLZwOU3zFCxgOVvIRmnYFdYAIwuD3nUYuswbtMvFfAwwUZrmzkhhFrkuNFOhzbDtvwaHd3_6todRKIDff2QAI39C0BIPgwgxC7bWwJiiAExkJxTlCB-I3PRiO_5lMTsyPNEHGYRZ4qlem1MVylA9nAA2NLc1gEQC_Dj4vIfqhIT-6bHl0i04j-bhtZMFn2EtvDp2b3VHzVZG6HikI0rGdjtlkPw_3tYOAWbMZOFiLnNTSPzC2T589dHogXQs0O4rZo3e4HgvqhwVyiKWjJe1e0AEHv_JBdq7i0aHRxBN-4Y5zAGHzZ_fr4orRuctizzhbHqdly01; path=/; HttpOnly"
        }, {
          "name" : "X-SourceFiles",
          "value" : "=?UTF-8?B?RDpcVmlydHVhbE9wdGltaXplci1SZWZhY3RvcmluZ1xDcm9wTWV0cmljcy5Wby5BcGlcQ3JvcE1ldHJpY3MuVm8uQXBpXGFwaVxhZG1pblx2MVx1c2Vyc1w=?="
        }, {
          "name" : "X-Powered-By",
          "value" : "ASP.NET"
        }, {
          "name" : "Date",
          "value" : "Fri, 29 Mar 2019 22:28:01 GMT"
        }, {
          "name" : "Content-Length",
          "value" : "61"
        } ],
        "content" : {
          "size" : 61,
          "mimeType" : "application/json; charset=utf-8",
          "text" : "{\"message\":\"Authorization has been denied for this request.\"}",
          "comment" : ""
        },
        "redirectURL" : "",
        "headersSize" : 941,
        "bodySize" : 61,
        "comment" : ""
      },
      "cache" : { },
      "timings" : {
        "comment" : "",
        "ssl" : -1,
        "wait" : 30,
        "send" : 0,
        "receive" : 0,
        "dns" : -1,
        "connect" : -1,
        "blocked" : -1
      },
      "serverIPAddress" : "127.0.0.1",
      "comment" : "",
      "_katalonRequestInformation" : {
        "name" : "127",
        "testObjectId" : "Object Repository/VoPro/Account/api_admin_v1_users",
        "harId" : "5bae02c7-c1dd-4972-96c7-dd12b303004b"
      },
      "time" : 31
    } ],
    "comment" : ""
  }
}