{
  "log" : {
    "version" : "1.2",
    "creator" : {
      "name" : "BrowserMob Proxy",
      "version" : "2.1.5",
      "comment" : ""
    },
    "pages" : [ {
      "id" : "Page 0",
      "startedDateTime" : "2019-03-28T21:51:33.094Z",
      "title" : "Page 0",
      "pageTimings" : {
        "onLoad" : 1282,
        "comment" : ""
      },
      "comment" : ""
    } ],
    "entries" : [ {
      "pageref" : "Page 0",
      "startedDateTime" : "2019-03-28T21:51:33.096Z",
      "request" : {
        "method" : "POST",
        "url" : "http://localhost:10520/WebAPI/api/admin/v1/users/?",
        "httpVersion" : "HTTP/1.1",
        "cookies" : [ ],
        "headers" : [ {
          "name" : "User-Agent",
          "value" : "Katalon Studio"
        }, {
          "name" : "Content-Type",
          "value" : "application/x-www-form-urlencoded"
        }, {
          "name" : "Authorization",
          "value" : "Bearer eyJ0eXAiOiJKV1QiLCJhbGciOiJIUzI1NiJ9.eyJ1bmlxdWVfbmFtZSI6ImFkbWluIiwicm9sZSI6InVzZXIiLCJzdWIiOiJhZG1pbiIsImlzcyI6IkNyb3BNZXRyaWNzIiwiYXVkIjoiYWxsIiwiZXhwIjoxNTUzODEzNzkzLCJuYmYiOjE1NTM4MDk4OTN9.IIro03NBd68O7Vyg4zowsJ67rQjN3YdnxhywrVu2J1g"
        }, {
          "name" : "Host",
          "value" : "localhost:10520"
        }, {
          "name" : "Accept",
          "value" : "text/html, image/gif, image/jpeg, *; q=.2, */*; q=.2"
        }, {
          "name" : "Proxy-Connection",
          "value" : "keep-alive"
        }, {
          "name" : "Content-Length",
          "value" : "315"
        } ],
        "queryString" : [ ],
        "postData" : {
          "mimeType" : "application/x-www-form-urlencoded",
          "params" : [ {
            "name" : "password",
            "value" : "cropmetrics",
            "comment" : ""
          }, {
            "name" : "email",
            "value" : "cropmetricsvo.statespaces@gmail.com",
            "comment" : ""
          }, {
            "name" : "fullname",
            "value" : "x",
            "comment" : ""
          }, {
            "name" : "phone",
            "value" : "1",
            "comment" : ""
          }, {
            "name" : "dealer",
            "value" : "xx",
            "comment" : ""
          }, {
            "name" : "addressLine1",
            "value" : "address line 1 test validation",
            "comment" : ""
          }, {
            "name" : "addressLine2",
            "value" : "address line 2 test validation",
            "comment" : ""
          }, {
            "name" : "town",
            "value" : "townValidation",
            "comment" : ""
          }, {
            "name" : "state",
            "value" : "      state Validation     state Validation       ",
            "comment" : ""
          }, {
            "name" : "zip",
            "value" : "zipValidation",
            "comment" : ""
          }, {
            "name" : "country",
            "value" : "countryValidation",
            "comment" : ""
          }, {
            "name" : "roles",
            "value" : "Client",
            "comment" : ""
          } ],
          "comment" : ""
        },
        "headersSize" : 544,
        "bodySize" : 315,
        "comment" : ""
      },
      "response" : {
        "status" : 200,
        "statusText" : "OK",
        "httpVersion" : "HTTP/1.1",
        "cookies" : [ {
          "name" : ".ASPROLES",
          "value" : "NFjcH-7C6IYconMfI745CHdB85dtvF-zSCdwEbI5SBEt6M5qSnDl2MgR3iy5vmphFaclfWFuGLxqOrJuB_cmQYewbdVFsHpMc3eCdiH4m__81ySlmkRt5_h93kBx1gX6tfK_jInLSo3gjCGcGFEgVViJaMzI8wOnpnk0sOLZGpwrmKXkVSdXkFODDsH0C8IyU15vGRbLQYrfNkFV-C5LTRSZjQVY4tL5bjc9eoQ27AShzPZXhsrcbHJnTFkVGXxqz-ERjpxtoh_ztLJ-0Hv8EGJL6cYbikEe_-FEHC3ILeaRxPnZxl9ioyjLe_OS3mR67hdiSIaTL_JbEy1ilKD9vHve9qnawvH-38z7g3KXqBEqrqKIgoUUOTnhH9RwL8YArnR2MYqjFJICkrwC4ATYBlfUXFNiqDHy1sZUzm3w2OIJFRSG0RvAeBncMFv68F0zH3bakwNWbCMMuNCf_ajb_hfhNVFOqR-mGDi_JrxRDv0r4MRi0",
          "path" : "/",
          "httpOnly" : true,
          "secure" : false,
          "comment" : ""
        } ],
        "headers" : [ {
          "name" : "Cache-Control",
          "value" : "private"
        }, {
          "name" : "Content-Type",
          "value" : "application/json; charset=utf-8"
        }, {
          "name" : "Server",
          "value" : "Microsoft-IIS/10.0"
        }, {
          "name" : "Set-Cookie",
          "value" : ".ASPROLES=NFjcH-7C6IYconMfI745CHdB85dtvF-zSCdwEbI5SBEt6M5qSnDl2MgR3iy5vmphFaclfWFuGLxqOrJuB_cmQYewbdVFsHpMc3eCdiH4m__81ySlmkRt5_h93kBx1gX6tfK_jInLSo3gjCGcGFEgVViJaMzI8wOnpnk0sOLZGpwrmKXkVSdXkFODDsH0C8IyU15vGRbLQYrfNkFV-C5LTRSZjQVY4tL5bjc9eoQ27AShzPZXhsrcbHJnTFkVGXxqz-ERjpxtoh_ztLJ-0Hv8EGJL6cYbikEe_-FEHC3ILeaRxPnZxl9ioyjLe_OS3mR67hdiSIaTL_JbEy1ilKD9vHve9qnawvH-38z7g3KXqBEqrqKIgoUUOTnhH9RwL8YArnR2MYqjFJICkrwC4ATYBlfUXFNiqDHy1sZUzm3w2OIJFRSG0RvAeBncMFv68F0zH3bakwNWbCMMuNCf_ajb_hfhNVFOqR-mGDi_JrxRDv0r4MRi0; path=/; HttpOnly"
        }, {
          "name" : "X-SourceFiles",
          "value" : "=?UTF-8?B?RDpcVmlydHVhbE9wdGltaXplci1SZWZhY3RvcmluZ1xDcm9wTWV0cmljcy5Wby5BcGlcQ3JvcE1ldHJpY3MuVm8uQXBpXGFwaVxhZG1pblx2MVx1c2Vyc1w=?="
        }, {
          "name" : "X-Powered-By",
          "value" : "ASP.NET"
        }, {
          "name" : "Date",
          "value" : "Thu, 28 Mar 2019 21:51:34 GMT"
        }, {
          "name" : "Content-Length",
          "value" : "9"
        } ],
        "content" : {
          "size" : 9,
          "mimeType" : "application/json; charset=utf-8",
          "text" : "{\"id\":29}",
          "comment" : ""
        },
        "redirectURL" : "",
        "headersSize" : 887,
        "bodySize" : 9,
        "comment" : ""
      },
      "cache" : { },
      "timings" : {
        "comment" : "",
        "blocked" : -1,
        "wait" : 1275,
        "receive" : 0,
        "dns" : -1,
        "send" : 0,
        "connect" : -1,
        "ssl" : -1
      },
      "serverIPAddress" : "127.0.0.1",
      "comment" : "",
      "_katalonRequestInformation" : {
        "name" : "77",
        "testObjectId" : "Object Repository/VoPro/Account/api_admin_v1_users",
        "harId" : "54debbd8-79af-4cf5-a273-bbb53e41c928"
      },
      "time" : 1276
    } ],
    "comment" : ""
  }
}