{
  "log" : {
    "version" : "1.2",
    "creator" : {
      "name" : "BrowserMob Proxy",
      "version" : "2.1.5",
      "comment" : ""
    },
    "pages" : [ {
      "id" : "Page 0",
      "startedDateTime" : "2019-04-11T16:03:47.270Z",
      "title" : "Page 0",
      "pageTimings" : {
        "onLoad" : 3183,
        "comment" : ""
      },
      "comment" : ""
    } ],
    "entries" : [ {
      "pageref" : "Page 0",
      "startedDateTime" : "2019-04-11T16:03:47.272Z",
      "request" : {
        "method" : "POST",
        "url" : "http://localhost:10520/WebAPI/api/mobile/v1/farms/?",
        "httpVersion" : "HTTP/1.1",
        "cookies" : [ ],
        "headers" : [ {
          "name" : "User-Agent",
          "value" : "Katalon Studio"
        }, {
          "name" : "Content-Type",
          "value" : "application/json"
        }, {
          "name" : "Authorization",
          "value" : "Bearer eyJ0eXAiOiJKV1QiLCJhbGciOiJIUzI1NiJ9.eyJ1bmlxdWVfbmFtZSI6Implbm55Lm1hbGRvbmFkby50eDFAZ21haWwuY29tIiwicm9sZSI6InVzZXIiLCJzdWIiOiJqZW5ueS5tYWxkb25hZG8udHgxQGdtYWlsLmNvbSIsImlzcyI6IkNyb3BNZXRyaWNzIiwiYXVkIjoiYWxsIiwiZXhwIjoxNTU1MDAyNTI3LCJuYmYiOjE1NTQ5OTg2Mjd9.48ZI7JbBmOUIR0mgbMkcbNhLUaQNTICXGLufarOMFfw"
        }, {
          "name" : "Host",
          "value" : "localhost:10520"
        }, {
          "name" : "Accept",
          "value" : "text/html, image/gif, image/jpeg, *; q=.2, */*; q=.2"
        }, {
          "name" : "Proxy-Connection",
          "value" : "keep-alive"
        }, {
          "name" : "Content-Length",
          "value" : "26"
        } ],
        "queryString" : [ ],
        "postData" : {
          "mimeType" : "application/json",
          "text" : "{\"name\": \"\", \"user_id\": 2}",
          "comment" : ""
        },
        "headersSize" : 591,
        "bodySize" : 26,
        "comment" : ""
      },
      "response" : {
        "status" : 400,
        "statusText" : "Bad Request",
        "httpVersion" : "HTTP/1.1",
        "cookies" : [ {
          "name" : ".ASPROLES",
          "value" : "HyUXgMaqGx1P0bIspwQLWZtwcyDJd6od7-9zqa49k2dmr5D4bKN3cCMZu7oTz5ax2hhqFUpqJafZMzKOel-hFLbmXUZeLQs9phQYnbXj-sdcBUXIX-oocbl7zS_ELI_4Vje8KAp4UPdd3d7u_CBArkOeoKPkhvhgz6YJi8YFFXhvQRr6vj4LOd3lEZQRgrHmcKPwpB3ZIqwg3WvE6djGs4CfpWdyGBXZ1BlxtL9bM88zhj6NcwYNLhJUbZDpLO_Yh3jCIrm0stOXqSsKGU0lUhypC-a14WOTLJVN-U0CbeOFIg58kLzCIHPQvybUIVwZoqqf98scFs0WF9RKaJi1JVljsjA3pmSJO1iVRUMtBjvE7QpHD4dg6yRAt2notS5tsdnBZOz78IhSukqlSqDJl-U11-hjSdQLjA42fseC-9vRcB08Olxhui0uSrC2XmAbC9CtcUTMXeJnHFJudGjqyT7bIQG7KHp4JVYJNakz2iM6VpBoHirtkAOzfEQdawcL1BfZ1ROJHJNjXR8tBEpw3Ud7wWg1",
          "path" : "/",
          "httpOnly" : true,
          "secure" : false,
          "comment" : ""
        } ],
        "headers" : [ {
          "name" : "Cache-Control",
          "value" : "private"
        }, {
          "name" : "Content-Type",
          "value" : "application/json; charset=utf-8"
        }, {
          "name" : "Server",
          "value" : "Microsoft-IIS/10.0"
        }, {
          "name" : "Set-Cookie",
          "value" : ".ASPROLES=HyUXgMaqGx1P0bIspwQLWZtwcyDJd6od7-9zqa49k2dmr5D4bKN3cCMZu7oTz5ax2hhqFUpqJafZMzKOel-hFLbmXUZeLQs9phQYnbXj-sdcBUXIX-oocbl7zS_ELI_4Vje8KAp4UPdd3d7u_CBArkOeoKPkhvhgz6YJi8YFFXhvQRr6vj4LOd3lEZQRgrHmcKPwpB3ZIqwg3WvE6djGs4CfpWdyGBXZ1BlxtL9bM88zhj6NcwYNLhJUbZDpLO_Yh3jCIrm0stOXqSsKGU0lUhypC-a14WOTLJVN-U0CbeOFIg58kLzCIHPQvybUIVwZoqqf98scFs0WF9RKaJi1JVljsjA3pmSJO1iVRUMtBjvE7QpHD4dg6yRAt2notS5tsdnBZOz78IhSukqlSqDJl-U11-hjSdQLjA42fseC-9vRcB08Olxhui0uSrC2XmAbC9CtcUTMXeJnHFJudGjqyT7bIQG7KHp4JVYJNakz2iM6VpBoHirtkAOzfEQdawcL1BfZ1ROJHJNjXR8tBEpw3Ud7wWg1; path=/; HttpOnly"
        }, {
          "name" : "X-SourceFiles",
          "value" : "=?UTF-8?B?RDpcVmlydHVhbE9wdGltaXplci1SZWZhY3RvcmluZ1xDcm9wTWV0cmljcy5Wby5BcGlcQ3JvcE1ldHJpY3MuVm8uQXBpXGFwaVxtb2JpbGVcdjFcZmFybXNc?="
        }, {
          "name" : "X-Powered-By",
          "value" : "ASP.NET"
        }, {
          "name" : "Date",
          "value" : "Thu, 11 Apr 2019 16:03:50 GMT"
        }, {
          "name" : "Content-Length",
          "value" : "45"
        } ],
        "content" : {
          "size" : 45,
          "mimeType" : "application/json; charset=utf-8",
          "text" : "{\"message\":\"The farm name must be provided.\"}",
          "comment" : ""
        },
        "redirectURL" : "",
        "headersSize" : 940,
        "bodySize" : 45,
        "comment" : ""
      },
      "cache" : { },
      "timings" : {
        "comment" : "",
        "ssl" : -1,
        "send" : 0,
        "dns" : -1,
        "blocked" : -1,
        "connect" : -1,
        "wait" : 3176,
        "receive" : 0
      },
      "serverIPAddress" : "127.0.0.1",
      "comment" : "",
      "_katalonRequestInformation" : {
        "name" : "19",
        "testObjectId" : "Object Repository/VoGrow/Farm/FarmPost",
        "harId" : "8f18b935-7002-4085-b10b-e25b2cde3cff"
      },
      "time" : 3177
    } ],
    "comment" : ""
  }
}