{
  "log" : {
    "version" : "1.2",
    "creator" : {
      "name" : "BrowserMob Proxy",
      "version" : "2.1.5",
      "comment" : ""
    },
    "pages" : [ {
      "id" : "Page 0",
      "startedDateTime" : "2019-03-28T20:42:26.149Z",
      "title" : "Page 0",
      "pageTimings" : {
        "onLoad" : 1251,
        "comment" : ""
      },
      "comment" : ""
    } ],
    "entries" : [ {
      "pageref" : "Page 0",
      "startedDateTime" : "2019-03-28T20:42:26.150Z",
      "request" : {
        "method" : "POST",
        "url" : "http://localhost:10520/WebAPI/api/admin/v1/users/?",
        "httpVersion" : "HTTP/1.1",
        "cookies" : [ ],
        "headers" : [ {
          "name" : "User-Agent",
          "value" : "Katalon Studio"
        }, {
          "name" : "Content-Type",
          "value" : "application/x-www-form-urlencoded"
        }, {
          "name" : "Authorization",
          "value" : "Bearer eyJ0eXAiOiJKV1QiLCJhbGciOiJIUzI1NiJ9.eyJ1bmlxdWVfbmFtZSI6ImFkbWluIiwicm9sZSI6InVzZXIiLCJzdWIiOiJhZG1pbiIsImlzcyI6IkNyb3BNZXRyaWNzIiwiYXVkIjoiYWxsIiwiZXhwIjoxNTUzODA5NjQ2LCJuYmYiOjE1NTM4MDU3NDZ9.DG3oYHkhqSBlwy0XRclBlD-flIqmeeuAvlDrxYPYl_U"
        }, {
          "name" : "Host",
          "value" : "localhost:10520"
        }, {
          "name" : "Accept",
          "value" : "text/html, image/gif, image/jpeg, *; q=.2, */*; q=.2"
        }, {
          "name" : "Proxy-Connection",
          "value" : "keep-alive"
        }, {
          "name" : "Content-Length",
          "value" : "586"
        } ],
        "queryString" : [ ],
        "postData" : {
          "mimeType" : "application/x-www-form-urlencoded",
          "params" : [ {
            "name" : "password",
            "value" : "cropmetrics",
            "comment" : ""
          }, {
            "name" : "email",
            "value" : "cropmetricsvo.ziplong@gmail.com",
            "comment" : ""
          }, {
            "name" : "fullname",
            "value" : "test validation",
            "comment" : ""
          }, {
            "name" : "phone",
            "value" : "123",
            "comment" : ""
          }, {
            "name" : "dealer",
            "value" : "x",
            "comment" : ""
          }, {
            "name" : "addressLine1",
            "value" : "address line 1 test validation",
            "comment" : ""
          }, {
            "name" : "addressLine2",
            "value" : "address line 2 test validation",
            "comment" : ""
          }, {
            "name" : "town",
            "value" : "townValidation",
            "comment" : ""
          }, {
            "name" : "state",
            "value" : "stateValidation",
            "comment" : ""
          }, {
            "name" : "zip",
            "value" : "23 API_ACNT_When_new_account_have_long_zip_attribute_Expected_status_code_20023 API_ACNT_When_new_account_have_long_zip_attribute_Expected_status_code_20023 API_ACNT_When_new_account_have_long_zip_attribute_Expected_status_code_20023 API_ACNT_When_new_account_have_long_zip_attribute_Expected_status_code_200",
            "comment" : ""
          }, {
            "name" : "country",
            "value" : "countryValidation",
            "comment" : ""
          }, {
            "name" : "roles",
            "value" : "Client",
            "comment" : ""
          } ],
          "comment" : ""
        },
        "headersSize" : 544,
        "bodySize" : 586,
        "comment" : ""
      },
      "response" : {
        "status" : 200,
        "statusText" : "OK",
        "httpVersion" : "HTTP/1.1",
        "cookies" : [ {
          "name" : ".ASPROLES",
          "value" : "4RfkD2FKKdglayGjF8bfuPMp7iMTh5xc1st_vYsMAVIXKO4xcmWVLyt88Vc4eXLFCW-KlVfCz83n6ouambKjNFY6guDlS7uzE77HH8cEsfvcee7DsMTdI4JQjTqJvZUztsl-DtUFKGVIzDWXT9_RdcNkVboMeLp7WPGW5HUV8vsPgrz_yk244QosiJM7wJiUA80nAuGEAkYET-5JEaAG0TlkQkJ9SWJ9jpXmA8yXxo6tDECs1M7m6NEcfg_tyWwBQZVwQG2gKAVdQnEC4G0zJcQz6q653J9NzPFPnjyjRHcEnOdYx5kWA_t6BvjU1qxnPeN6HMtStKOOwjjs9I_oNl0CRFGLIWIdiQGRZKBHPtv5e7BuV8yuIhWHPn8fAwqG8YyAlJBHXUpxRQ01k2I1BMtLBEmCIVZvlvblPcoucTySAfa1IY0e9V9cSBhRsjX7z9j4qNyFwqCfP1gcNrEhHRxmTAS97FvJ-nXVc-cKvmgLC7js0",
          "path" : "/",
          "httpOnly" : true,
          "secure" : false,
          "comment" : ""
        } ],
        "headers" : [ {
          "name" : "Cache-Control",
          "value" : "private"
        }, {
          "name" : "Content-Type",
          "value" : "application/json; charset=utf-8"
        }, {
          "name" : "Server",
          "value" : "Microsoft-IIS/10.0"
        }, {
          "name" : "Set-Cookie",
          "value" : ".ASPROLES=4RfkD2FKKdglayGjF8bfuPMp7iMTh5xc1st_vYsMAVIXKO4xcmWVLyt88Vc4eXLFCW-KlVfCz83n6ouambKjNFY6guDlS7uzE77HH8cEsfvcee7DsMTdI4JQjTqJvZUztsl-DtUFKGVIzDWXT9_RdcNkVboMeLp7WPGW5HUV8vsPgrz_yk244QosiJM7wJiUA80nAuGEAkYET-5JEaAG0TlkQkJ9SWJ9jpXmA8yXxo6tDECs1M7m6NEcfg_tyWwBQZVwQG2gKAVdQnEC4G0zJcQz6q653J9NzPFPnjyjRHcEnOdYx5kWA_t6BvjU1qxnPeN6HMtStKOOwjjs9I_oNl0CRFGLIWIdiQGRZKBHPtv5e7BuV8yuIhWHPn8fAwqG8YyAlJBHXUpxRQ01k2I1BMtLBEmCIVZvlvblPcoucTySAfa1IY0e9V9cSBhRsjX7z9j4qNyFwqCfP1gcNrEhHRxmTAS97FvJ-nXVc-cKvmgLC7js0; path=/; HttpOnly"
        }, {
          "name" : "X-SourceFiles",
          "value" : "=?UTF-8?B?RDpcVmlydHVhbE9wdGltaXplci1SZWZhY3RvcmluZ1xDcm9wTWV0cmljcy5Wby5BcGlcQ3JvcE1ldHJpY3MuVm8uQXBpXGFwaVxhZG1pblx2MVx1c2Vyc1w=?="
        }, {
          "name" : "X-Powered-By",
          "value" : "ASP.NET"
        }, {
          "name" : "Date",
          "value" : "Thu, 28 Mar 2019 20:42:27 GMT"
        }, {
          "name" : "Content-Length",
          "value" : "9"
        } ],
        "content" : {
          "size" : 9,
          "mimeType" : "application/json; charset=utf-8",
          "text" : "{\"id\":31}",
          "comment" : ""
        },
        "redirectURL" : "",
        "headersSize" : 887,
        "bodySize" : 9,
        "comment" : ""
      },
      "cache" : { },
      "timings" : {
        "comment" : "",
        "ssl" : -1,
        "send" : 0,
        "receive" : 0,
        "wait" : 1247,
        "connect" : -1,
        "blocked" : -1,
        "dns" : -1
      },
      "serverIPAddress" : "127.0.0.1",
      "comment" : "",
      "_katalonRequestInformation" : {
        "name" : "81",
        "testObjectId" : "Object Repository/VoPro/Account/api_admin_v1_users",
        "harId" : "dc0b811e-c798-49ac-9960-fec7219ff196"
      },
      "time" : 1249
    } ],
    "comment" : ""
  }
}