{
  "log" : {
    "version" : "1.2",
    "creator" : {
      "name" : "BrowserMob Proxy",
      "version" : "2.1.5",
      "comment" : ""
    },
    "pages" : [ {
      "id" : "Page 0",
      "startedDateTime" : "2019-03-29T22:13:39.535Z",
      "title" : "Page 0",
      "pageTimings" : {
        "onLoad" : 1857,
        "comment" : ""
      },
      "comment" : ""
    } ],
    "entries" : [ {
      "pageref" : "Page 0",
      "startedDateTime" : "2019-03-29T22:13:39.537Z",
      "request" : {
        "method" : "PUT",
        "url" : "http://localhost:10520/WebAPI/api/admin/v1/users/18?",
        "httpVersion" : "HTTP/1.1",
        "cookies" : [ ],
        "headers" : [ {
          "name" : "User-Agent",
          "value" : "Katalon Studio"
        }, {
          "name" : "Content-Type",
          "value" : "application/x-www-form-urlencoded"
        }, {
          "name" : "Authorization",
          "value" : "Bearer eyJ0eXAiOiJKV1QiLCJhbGciOiJIUzI1NiJ9.eyJ1bmlxdWVfbmFtZSI6ImFkbWluIiwicm9sZSI6InVzZXIiLCJzdWIiOiJhZG1pbiIsImlzcyI6IkNyb3BNZXRyaWNzIiwiYXVkIjoiYWxsIiwiZXhwIjoxNTUzOTAxNTE5LCJuYmYiOjE1NTM4OTc2MTl9.pN42ZTZjtRx2dFH0_kPJOP4TNs3fJAEGTgH-_tmNyQk"
        }, {
          "name" : "Host",
          "value" : "localhost:10520"
        }, {
          "name" : "Accept",
          "value" : "text/html, image/gif, image/jpeg, *; q=.2, */*; q=.2"
        }, {
          "name" : "Proxy-Connection",
          "value" : "keep-alive"
        }, {
          "name" : "Content-Length",
          "value" : "314"
        } ],
        "queryString" : [ ],
        "postData" : {
          "mimeType" : "application/x-www-form-urlencoded",
          "params" : [ {
            "name" : "password",
            "value" : "cropmetrics",
            "comment" : ""
          }, {
            "name" : "email",
            "value" : "cropmetricsvo.phonesymbols@gmail.com",
            "comment" : ""
          }, {
            "name" : "fullname",
            "value" : "x",
            "comment" : ""
          }, {
            "name" : "phone",
            "value" : "!!!!!!",
            "comment" : ""
          }, {
            "name" : "dealer",
            "value" : "x",
            "comment" : ""
          }, {
            "name" : "addressLine1",
            "value" : "address line 1 test validation",
            "comment" : ""
          }, {
            "name" : "addressLine2",
            "value" : "address line 2 test validation",
            "comment" : ""
          }, {
            "name" : "town",
            "value" : "townValidation",
            "comment" : ""
          }, {
            "name" : "state",
            "value" : "stateValidation",
            "comment" : ""
          }, {
            "name" : "zip",
            "value" : "zipValidation",
            "comment" : ""
          }, {
            "name" : "country",
            "value" : "countryValidation",
            "comment" : ""
          }, {
            "name" : "roles",
            "value" : "Client",
            "comment" : ""
          }, {
            "name" : "userProfileId",
            "value" : "18",
            "comment" : ""
          } ],
          "comment" : ""
        },
        "headersSize" : 545,
        "bodySize" : 314,
        "comment" : ""
      },
      "response" : {
        "status" : 200,
        "statusText" : "OK",
        "httpVersion" : "HTTP/1.1",
        "cookies" : [ {
          "name" : ".ASPROLES",
          "value" : "aJnrgHAlq08Zvb6Hxj3w-FFCgMYKJtS5XOu-HkgZ04CEf7o5Xuq-CLRDY9WlPFSTe8NSMCLAj_xE3PHeZos0Rz60OtS_6DoJk67sRyenYnucU2EbQiLXBy9WOla2-IKP7F4PZ0XYrtVOYzEuenBN4GbWlEzDG4KO3DSpC4Hy5xjScPaKXxyx9Y6i42xZYMWdL8YA2_p4C-ekioGl4gHdEtxVGKu0bWfH_AGS1SrEAM5CfUTQ6WvtWSdzx6_7M7eBi8ZD31YvgrBOYFk04hactLVYM8F91vq9g2bkmZwo2XpH3S9010jwjoBzQbw4KRFNH7DmrnxPmeFOHjYhs7gOvY7Lr3xm0CyNRHE-BQ8WbtQSqwL__Eue_zjkivY0wzmxZd86f2uERw8wLPX3fPy1IlhCcKajRovhQoYx1wSiMc2SPbrs1nZaAX_oG0mh_BzLM_ZD3aA-bwxcQdZsBrfiZ17QYg72wxgWvnAEF6i7eyGrvdBc0",
          "path" : "/",
          "httpOnly" : true,
          "secure" : false,
          "comment" : ""
        } ],
        "headers" : [ {
          "name" : "Cache-Control",
          "value" : "private"
        }, {
          "name" : "Server",
          "value" : "Microsoft-IIS/10.0"
        }, {
          "name" : "Set-Cookie",
          "value" : ".ASPROLES=aJnrgHAlq08Zvb6Hxj3w-FFCgMYKJtS5XOu-HkgZ04CEf7o5Xuq-CLRDY9WlPFSTe8NSMCLAj_xE3PHeZos0Rz60OtS_6DoJk67sRyenYnucU2EbQiLXBy9WOla2-IKP7F4PZ0XYrtVOYzEuenBN4GbWlEzDG4KO3DSpC4Hy5xjScPaKXxyx9Y6i42xZYMWdL8YA2_p4C-ekioGl4gHdEtxVGKu0bWfH_AGS1SrEAM5CfUTQ6WvtWSdzx6_7M7eBi8ZD31YvgrBOYFk04hactLVYM8F91vq9g2bkmZwo2XpH3S9010jwjoBzQbw4KRFNH7DmrnxPmeFOHjYhs7gOvY7Lr3xm0CyNRHE-BQ8WbtQSqwL__Eue_zjkivY0wzmxZd86f2uERw8wLPX3fPy1IlhCcKajRovhQoYx1wSiMc2SPbrs1nZaAX_oG0mh_BzLM_ZD3aA-bwxcQdZsBrfiZ17QYg72wxgWvnAEF6i7eyGrvdBc0; path=/; HttpOnly"
        }, {
          "name" : "X-SourceFiles",
          "value" : "=?UTF-8?B?RDpcVmlydHVhbE9wdGltaXplci1SZWZhY3RvcmluZ1xDcm9wTWV0cmljcy5Wby5BcGlcQ3JvcE1ldHJpY3MuVm8uQXBpXGFwaVxhZG1pblx2MVx1c2Vyc1wxOA==?="
        }, {
          "name" : "X-Powered-By",
          "value" : "ASP.NET"
        }, {
          "name" : "Date",
          "value" : "Fri, 29 Mar 2019 22:13:41 GMT"
        }, {
          "name" : "Content-Length",
          "value" : "0"
        } ],
        "content" : {
          "size" : 0,
          "mimeType" : "",
          "text" : "",
          "encoding" : "base64",
          "comment" : ""
        },
        "redirectURL" : "",
        "headersSize" : 844,
        "bodySize" : 0,
        "comment" : ""
      },
      "cache" : { },
      "timings" : {
        "comment" : "",
        "connect" : -1,
        "wait" : 1851,
        "receive" : 0,
        "dns" : -1,
        "send" : 0,
        "blocked" : -1,
        "ssl" : -1
      },
      "serverIPAddress" : "127.0.0.1",
      "comment" : "",
      "_katalonRequestInformation" : {
        "name" : "27",
        "testObjectId" : "Object Repository/VoPro/Account/api_admin_v1_users_userprofileid",
        "harId" : "0d9adf8d-1d39-4cf7-9f67-26018baba615"
      },
      "time" : 1852
    } ],
    "comment" : ""
  }
}