{
  "log" : {
    "version" : "1.2",
    "creator" : {
      "name" : "BrowserMob Proxy",
      "version" : "2.1.5",
      "comment" : ""
    },
    "pages" : [ {
      "id" : "Page 0",
      "startedDateTime" : "2019-03-28T19:46:43.507Z",
      "title" : "Page 0",
      "pageTimings" : {
        "onLoad" : 2317,
        "comment" : ""
      },
      "comment" : ""
    } ],
    "entries" : [ {
      "pageref" : "Page 0",
      "startedDateTime" : "2019-03-28T19:46:43.508Z",
      "request" : {
        "method" : "POST",
        "url" : "http://localhost:10520/WebAPI/api/admin/v1/users/?",
        "httpVersion" : "HTTP/1.1",
        "cookies" : [ ],
        "headers" : [ {
          "name" : "User-Agent",
          "value" : "Katalon Studio"
        }, {
          "name" : "Content-Type",
          "value" : "application/x-www-form-urlencoded"
        }, {
          "name" : "Authorization",
          "value" : "Bearer eyJ0eXAiOiJKV1QiLCJhbGciOiJIUzI1NiJ9.eyJ1bmlxdWVfbmFtZSI6ImFkbWluIiwicm9sZSI6InVzZXIiLCJzdWIiOiJhZG1pbiIsImlzcyI6IkNyb3BNZXRyaWNzIiwiYXVkIjoiYWxsIiwiZXhwIjoxNTUzODA2MzAzLCJuYmYiOjE1NTM4MDI0MDN9.lrFHIb-joJwQzkKUqaNgagbMH-RVDuaWzmY912OhMDw"
        }, {
          "name" : "Host",
          "value" : "localhost:10520"
        }, {
          "name" : "Accept",
          "value" : "text/html, image/gif, image/jpeg, *; q=.2, */*; q=.2"
        }, {
          "name" : "Proxy-Connection",
          "value" : "keep-alive"
        }, {
          "name" : "Content-Length",
          "value" : "279"
        } ],
        "queryString" : [ ],
        "postData" : {
          "mimeType" : "application/x-www-form-urlencoded",
          "params" : [ {
            "name" : "password",
            "value" : "cropmetrics",
            "comment" : ""
          }, {
            "name" : "email",
            "value" : "",
            "comment" : ""
          }, {
            "name" : "fullname",
            "value" : "test validation",
            "comment" : ""
          }, {
            "name" : "phone",
            "value" : "123",
            "comment" : ""
          }, {
            "name" : "dealer",
            "value" : "dealer test validation",
            "comment" : ""
          }, {
            "name" : "addressLine1",
            "value" : "address line 1 test validation",
            "comment" : ""
          }, {
            "name" : "addressLine2",
            "value" : "address line 2 test validation",
            "comment" : ""
          }, {
            "name" : "town",
            "value" : "townValidation",
            "comment" : ""
          }, {
            "name" : "state",
            "value" : "stateValidation",
            "comment" : ""
          }, {
            "name" : "zip",
            "value" : "zipValidation",
            "comment" : ""
          }, {
            "name" : "country",
            "value" : "countryValidation",
            "comment" : ""
          }, {
            "name" : "roles",
            "value" : "Client",
            "comment" : ""
          } ],
          "comment" : ""
        },
        "headersSize" : 544,
        "bodySize" : 279,
        "comment" : ""
      },
      "response" : {
        "status" : 500,
        "statusText" : "Internal Server Error",
        "httpVersion" : "HTTP/1.1",
        "cookies" : [ {
          "name" : ".ASPROLES",
          "value" : "8QDnPYw1jYaBBHpq5UjEJDGEvg9u5jK25WefZLaWSVLw1Qb9MS370BIaimr4OOSj5xnSKfty0indiXpJ3FrAoedfHJ7em7IAXmsz6oGxEqV1TEKHP_7-54OpZLedJ_stYC5QPx4QBjZ6meHuq0MKIg8G1_1irwWnxwuagWHbvIh_x5LGrCwbe8xhj7rveRrIQgw5Qd-DCFmI_OcsSMJ81Jq8t3ApnOOZzNmRla10blQd0WccPZ-7zHhwJeEv-11s7Xoy6orzn0GkBAIAC5f7P02wog2ykosT5WdyKij9sXVq0ffaVveAeoaHsn22T0ZGYjJ3bOU0sZAufwlNJPthPA9QEKja9ESC2ghW5TmccAgBdZTuKne1G3i-BeLmVonbKbiWOGSgAWNYxUi8ldVoLqUhsEYgP8h86idcR9zV9I5PML3pdQRTCH0SZl8MGkQhatLeFv6pIZGXVYlkfG66S6ixUwwnhkYp8pISxdpDPdi5NftH0",
          "path" : "/",
          "httpOnly" : true,
          "secure" : false,
          "comment" : ""
        } ],
        "headers" : [ {
          "name" : "Cache-Control",
          "value" : "private"
        }, {
          "name" : "Content-Type",
          "value" : "application/json; charset=utf-8"
        }, {
          "name" : "Server",
          "value" : "Microsoft-IIS/10.0"
        }, {
          "name" : "Set-Cookie",
          "value" : ".ASPROLES=8QDnPYw1jYaBBHpq5UjEJDGEvg9u5jK25WefZLaWSVLw1Qb9MS370BIaimr4OOSj5xnSKfty0indiXpJ3FrAoedfHJ7em7IAXmsz6oGxEqV1TEKHP_7-54OpZLedJ_stYC5QPx4QBjZ6meHuq0MKIg8G1_1irwWnxwuagWHbvIh_x5LGrCwbe8xhj7rveRrIQgw5Qd-DCFmI_OcsSMJ81Jq8t3ApnOOZzNmRla10blQd0WccPZ-7zHhwJeEv-11s7Xoy6orzn0GkBAIAC5f7P02wog2ykosT5WdyKij9sXVq0ffaVveAeoaHsn22T0ZGYjJ3bOU0sZAufwlNJPthPA9QEKja9ESC2ghW5TmccAgBdZTuKne1G3i-BeLmVonbKbiWOGSgAWNYxUi8ldVoLqUhsEYgP8h86idcR9zV9I5PML3pdQRTCH0SZl8MGkQhatLeFv6pIZGXVYlkfG66S6ixUwwnhkYp8pISxdpDPdi5NftH0; path=/; HttpOnly"
        }, {
          "name" : "X-SourceFiles",
          "value" : "=?UTF-8?B?RDpcVmlydHVhbE9wdGltaXplci1SZWZhY3RvcmluZ1xDcm9wTWV0cmljcy5Wby5BcGlcQ3JvcE1ldHJpY3MuVm8uQXBpXGFwaVxhZG1pblx2MVx1c2Vyc1w=?="
        }, {
          "name" : "X-Powered-By",
          "value" : "ASP.NET"
        }, {
          "name" : "Date",
          "value" : "Thu, 28 Mar 2019 19:46:45 GMT"
        }, {
          "name" : "Content-Length",
          "value" : "53"
        } ],
        "content" : {
          "size" : 53,
          "mimeType" : "application/json; charset=utf-8",
          "text" : "{\"message\":\"Internal server error in the processing\"}",
          "comment" : ""
        },
        "redirectURL" : "",
        "headersSize" : 907,
        "bodySize" : 53,
        "comment" : ""
      },
      "cache" : { },
      "timings" : {
        "comment" : "",
        "ssl" : -1,
        "send" : 0,
        "wait" : 2307,
        "receive" : 1,
        "dns" : -1,
        "blocked" : -1,
        "connect" : -1
      },
      "serverIPAddress" : "127.0.0.1",
      "comment" : "",
      "_katalonRequestInformation" : {
        "name" : "7",
        "testObjectId" : "Object Repository/VoPro/Account/api_admin_v1_users",
        "harId" : "3d7c1082-31f3-4aaf-9cb8-c7c3c819369f"
      },
      "time" : 2310
    } ],
    "comment" : ""
  }
}