Suite/Test/Step Name,Browser,Description,Tag,Start time,End time,Duration,Status
Restore_vo_summarizeddata_database_using_backup_file,,,,2019-08-02 11:14:13,2019-08-02 11:14:26,12.064s,PASSED
,,,,,,,
Test Cases/Databases/CreateDatabases/Functional/DB_Create_vo_summarizeddata_database,,,,2019-08-02 11:14:14,2019-08-02 11:14:20,6.307s,PASSED
server = server,,,,2019-08-02 11:14:14,2019-08-02 11:14:15,0.677s,PASSED
port = port,,,,2019-08-02 11:14:15,2019-08-02 11:14:15,0.001s,PASSED
user = userDb,,,,2019-08-02 11:14:15,2019-08-02 11:14:15,0.001s,PASSED
password = passwordDb,,,,2019-08-02 11:14:15,2019-08-02 11:14:15,0.004s,PASSED
pathPostgreSQL = pathPostgreSQLBin,,,,2019-08-02 11:14:15,2019-08-02 11:14:15,0.001s,PASSED
"database = ""vo_summarizedData""",,,,2019-08-02 11:14:15,2019-08-02 11:14:15,0.002s,PASSED
"command = String.format(""cd ""%s"" && createdb -h %s -p %d -U %s  %s"", pathPostgreSQL, server, port, user, database)",,,,2019-08-02 11:14:15,2019-08-02 11:14:15,0.002s,PASSED
"commandLine.cmd.cmdLine(command, password)",,,,2019-08-02 11:14:15,2019-08-02 11:14:20,5.120s,PASSED
"println(""The vo_summarizedData database was created..."")",,,,2019-08-02 11:14:20,2019-08-02 11:14:20,0.007s,PASSED
,,,,,,,
Test Cases/Databases/DatabasesRestoreWithBakcupFiles/Functional/DB_Restore_vo_summarizeddata_wiht_backup_file,,,,2019-08-02 11:14:20,2019-08-02 11:14:25,5.262s,PASSED
server = server,,,,2019-08-02 11:14:20,2019-08-02 11:14:20,0.000s,PASSED
port = port,,,,2019-08-02 11:14:20,2019-08-02 11:14:20,0.000s,PASSED
user = userDb,,,,2019-08-02 11:14:20,2019-08-02 11:14:20,0.000s,PASSED
password = passwordDb,,,,2019-08-02 11:14:20,2019-08-02 11:14:20,0.002s,PASSED
pathPostgreSQL = pathPostgreSQLBin,,,,2019-08-02 11:14:20,2019-08-02 11:14:20,0.001s,PASSED
"database = ""vo_summarizedData""",,,,2019-08-02 11:14:20,2019-08-02 11:14:20,0.002s,PASSED
"pathDumpFile = ""C:\KatalonFiles\vo_summarizedData.dump""",,,,2019-08-02 11:14:20,2019-08-02 11:14:20,0.001s,PASSED
"cRestore = String.format(""cd ""%s"" && pg_restore -U %s -h %s -p %d -c -C -d %s -v ""%s"""", pathPostgreSQL, user, server, port, database, pathDumpFile)",,,,2019-08-02 11:14:20,2019-08-02 11:14:20,0.003s,PASSED
"commandLine.cmd.cmdLine(cRestore, password)",,,,2019-08-02 11:14:20,2019-08-02 11:14:25,5.021s,PASSED
"println(""The restore vo_summarizedData database was completed..."")",,,,2019-08-02 11:14:25,2019-08-02 11:14:25,0.005s,PASSED
