{
  "log" : {
    "version" : "1.2",
    "creator" : {
      "name" : "BrowserMob Proxy",
      "version" : "2.1.5",
      "comment" : ""
    },
    "pages" : [ {
      "id" : "Page 0",
      "startedDateTime" : "2019-04-09T20:48:57.438Z",
      "title" : "Page 0",
      "pageTimings" : {
        "onLoad" : 51,
        "comment" : ""
      },
      "comment" : ""
    } ],
    "entries" : [ {
      "pageref" : "Page 0",
      "startedDateTime" : "2019-04-09T20:48:57.440Z",
      "request" : {
        "method" : "PUT",
        "url" : "http://localhost:10520/WebAPI/api/mobile/v1/fields/one?",
        "httpVersion" : "HTTP/1.1",
        "cookies" : [ ],
        "headers" : [ {
          "name" : "User-Agent",
          "value" : "Katalon Studio"
        }, {
          "name" : "Content-Type",
          "value" : "application/json"
        }, {
          "name" : "Authorization",
          "value" : "Bearer eyJ0eXAiOiJKV1QiLCJhbGciOiJIUzI1NiJ9.eyJ1bmlxdWVfbmFtZSI6Implbm55Lm1hbGRvbmFkby50eDFAZ21haWwuY29tIiwicm9sZSI6InVzZXIiLCJzdWIiOiJqZW5ueS5tYWxkb25hZG8udHgxQGdtYWlsLmNvbSIsImlzcyI6IkNyb3BNZXRyaWNzIiwiYXVkIjoiYWxsIiwiZXhwIjoxNTU0ODQ2ODM3LCJuYmYiOjE1NTQ4NDI5Mzd9.TkWc_DbznRYmkkx0qAEhlUp4kAf4tIHMUCJly1VWzSY"
        }, {
          "name" : "Host",
          "value" : "localhost:10520"
        }, {
          "name" : "Accept",
          "value" : "text/html, image/gif, image/jpeg, *; q=.2, */*; q=.2"
        }, {
          "name" : "Proxy-Connection",
          "value" : "keep-alive"
        }, {
          "name" : "Content-Length",
          "value" : "389"
        } ],
        "queryString" : [ ],
        "postData" : {
          "mimeType" : "application/json",
          "text" : "{\"field\":{\"name\":\"Field by agent not assigned\",\"boundary\":{\"boundaries\":[{\"boundary\":{\"coords\":[{\"x\":-101.49568751,\"y\":37.14976293},{\"x\":-101.50049403,\"y\":37.14647907},{\"x\":-101.50049403,\"y\":37.14264773},{\"x\":-101.49723246,\"y\":37.1411425},{\"x\":-101.49019435,\"y\":37.14223722},{\"x\":-101.48933604,\"y\":37.14620541},{\"x\":-101.49294093,\"y\":37.14866833},{\"x\":-101.49568751,\"y\":37.14976293}]}}]}}}",
          "comment" : ""
        },
        "headersSize" : 595,
        "bodySize" : 389,
        "comment" : ""
      },
      "response" : {
        "status" : 400,
        "statusText" : "Bad Request",
        "httpVersion" : "HTTP/1.1",
        "cookies" : [ {
          "name" : ".ASPROLES",
          "value" : "jqlUV-SvVEqx3UooCHlfu2lWY2LysF4OJW0Y3hiYpGWMkCdYTmf0Z-zW-Te-N7GfsmntFbZykfmUHjzjj7qBJaS1IR6Z-VceWRUigOIx1nCx_8v9-sLocW9waJoUD1vSMo1kNc9YIOZUhRngYciHbu1LMsE-Sym0AY6eOX5INQk_yAHlnsAmmKg95OG-VPFUuJC-2lFyWeLplgeiUODUsQ9FEzXREGhu1oegvzxyJi3GugHEEfvwYgxgmJAdV8JF0y8OUisjW3qHVF7C_rqr8SvcgiREA5ZQ2WcWCZVf7bhx5tQROSbu9rrRa1jOtbY4PhWu3qR4iOzQQzm8__xxcvGHJ2vWkRNAGXYemcE2rF8lhZ9wNiX8z0uFSPf6gAxgp-rsF0AgXKVKmwbG4GNqHzxCNybd3s2uGGS435PtvjBICa_Lerop1sWlEOYqS4lSWfto5bbjCg1ujzNUHmFGgSqVtUEZmb84Lr9ZV4N2PwqfYY2mTK4-a5TLAH5aNwfqqGF8bMxR7Od45Db6VdKM1Cwt_ys1",
          "path" : "/",
          "httpOnly" : true,
          "secure" : false,
          "comment" : ""
        } ],
        "headers" : [ {
          "name" : "Cache-Control",
          "value" : "private"
        }, {
          "name" : "Content-Type",
          "value" : "application/json; charset=utf-8"
        }, {
          "name" : "Server",
          "value" : "Microsoft-IIS/10.0"
        }, {
          "name" : "Set-Cookie",
          "value" : ".ASPROLES=jqlUV-SvVEqx3UooCHlfu2lWY2LysF4OJW0Y3hiYpGWMkCdYTmf0Z-zW-Te-N7GfsmntFbZykfmUHjzjj7qBJaS1IR6Z-VceWRUigOIx1nCx_8v9-sLocW9waJoUD1vSMo1kNc9YIOZUhRngYciHbu1LMsE-Sym0AY6eOX5INQk_yAHlnsAmmKg95OG-VPFUuJC-2lFyWeLplgeiUODUsQ9FEzXREGhu1oegvzxyJi3GugHEEfvwYgxgmJAdV8JF0y8OUisjW3qHVF7C_rqr8SvcgiREA5ZQ2WcWCZVf7bhx5tQROSbu9rrRa1jOtbY4PhWu3qR4iOzQQzm8__xxcvGHJ2vWkRNAGXYemcE2rF8lhZ9wNiX8z0uFSPf6gAxgp-rsF0AgXKVKmwbG4GNqHzxCNybd3s2uGGS435PtvjBICa_Lerop1sWlEOYqS4lSWfto5bbjCg1ujzNUHmFGgSqVtUEZmb84Lr9ZV4N2PwqfYY2mTK4-a5TLAH5aNwfqqGF8bMxR7Od45Db6VdKM1Cwt_ys1; path=/; HttpOnly"
        }, {
          "name" : "X-SourceFiles",
          "value" : "=?UTF-8?B?RDpcVmlydHVhbE9wdGltaXplci1SZWZhY3RvcmluZ1xDcm9wTWV0cmljcy5Wby5BcGlcQ3JvcE1ldHJpY3MuVm8uQXBpXGFwaVxtb2JpbGVcdjFcZmllbGRzXG9uZQ==?="
        }, {
          "name" : "X-Powered-By",
          "value" : "ASP.NET"
        }, {
          "name" : "Date",
          "value" : "Tue, 09 Apr 2019 20:48:56 GMT"
        }, {
          "name" : "Content-Length",
          "value" : "77"
        } ],
        "content" : {
          "size" : 77,
          "mimeType" : "application/json; charset=utf-8",
          "text" : "{\"message\":\"The request is invalid. The value 'one' is not valid for Int32.\"}",
          "comment" : ""
        },
        "redirectURL" : "",
        "headersSize" : 948,
        "bodySize" : 77,
        "comment" : ""
      },
      "cache" : { },
      "timings" : {
        "comment" : "",
        "send" : 0,
        "wait" : 45,
        "receive" : 0,
        "connect" : -1,
        "blocked" : -1,
        "dns" : -1,
        "ssl" : -1
      },
      "serverIPAddress" : "127.0.0.1",
      "comment" : "",
      "_katalonRequestInformation" : {
        "name" : "15",
        "testObjectId" : "Object Repository/VoGrow/Field/FieldPut",
        "harId" : "a126e968-de05-4ed3-800d-15c32c65f5a5"
      },
      "time" : 46
    } ],
    "comment" : ""
  }
}