{
  "log" : {
    "version" : "1.2",
    "creator" : {
      "name" : "BrowserMob Proxy",
      "version" : "2.1.5",
      "comment" : ""
    },
    "pages" : [ {
      "id" : "Page 0",
      "startedDateTime" : "2019-04-24T20:26:27.191Z",
      "title" : "Page 0",
      "pageTimings" : {
        "onLoad" : 3719,
        "comment" : ""
      },
      "comment" : ""
    } ],
    "entries" : [ {
      "pageref" : "Page 0",
      "startedDateTime" : "2019-04-24T20:26:27.193Z",
      "request" : {
        "method" : "PUT",
        "url" : "http://localhost:10520/WebAPI/api/mobile/v1/farms/7?",
        "httpVersion" : "HTTP/1.1",
        "cookies" : [ ],
        "headers" : [ {
          "name" : "User-Agent",
          "value" : "Katalon Studio"
        }, {
          "name" : "Content-Type",
          "value" : "application/json"
        }, {
          "name" : "Authorization",
          "value" : "Bearer eyJ0eXAiOiJKV1QiLCJhbGciOiJIUzI1NiJ9.eyJ1bmlxdWVfbmFtZSI6Implbm55Lm1hbGRvbmFkby50eDFAZ21haWwuY29tIiwicm9sZSI6InVzZXIiLCJzdWIiOiJqZW5ueS5tYWxkb25hZG8udHgxQGdtYWlsLmNvbSIsImlzcyI6IkNyb3BNZXRyaWNzIiwiYXVkIjoiYWxsIiwiZXhwIjoxNTU2MTQxNDg3LCJuYmYiOjE1NTYxMzc1ODd9.vb94biyL1NPhVcWizASv_VpaOfomwRI_g8tcsiM6pRw"
        }, {
          "name" : "Host",
          "value" : "localhost:10520"
        }, {
          "name" : "Accept",
          "value" : "text/html, image/gif, image/jpeg, *; q=.2, */*; q=.2"
        }, {
          "name" : "Proxy-Connection",
          "value" : "keep-alive"
        }, {
          "name" : "Content-Length",
          "value" : "16"
        } ],
        "queryString" : [ ],
        "postData" : {
          "mimeType" : "application/json",
          "text" : "{\"name\": \"    \"}",
          "comment" : ""
        },
        "headersSize" : 591,
        "bodySize" : 16,
        "comment" : ""
      },
      "response" : {
        "status" : 400,
        "statusText" : "Bad Request",
        "httpVersion" : "HTTP/1.1",
        "cookies" : [ {
          "name" : ".ASPROLES",
          "value" : "sA4RqE9MktpKcXPxLGHp2XgkgbYC51zc0RrUJBxofGPTrbRRihWSteojtBX8OjrSiiS5lnmML-TfeFgY2CktUI7iAty_GrGzXpo4GM2fJZVEN8x1WUNX6Oui5xeu7pT94fgvkpkToGCayHD21PmAUQGFaQnBW9oX_u3kmu6Jzj0Gcm8tRTZx5fPiybdDd9tqhELmm5q09IriMipxpEjFneQ8x0cZeeE8L40oI-J_2c4GQsJ_KhCCBGdyncNTz8UT9nU6_NwQ4Zo_uAA4dNtDF9Xtukkbx2kzMbWB02ILGmMO6uKxiUb8F1RiKH5rGtiyu2kvofgfnaPDhkcJ9dMXUGz_0CRP2xz_266kOEz5tK2RDfc4cSgB9Af9UnQKCEXLijgVXdv6z6-UnHh49F3n0g7y6vYdwx_HwMBIXHS2agIvd4pAAE5EMuKvV0XL29jo4Z8-owKBZgCOT_eHnlzmfcwzccksS9Iz43NCIYWEmtPnKxLitB68pjT-d1J2x8G-wl-URLfskR4oeIKYYg50-Ai4iWw1",
          "path" : "/",
          "httpOnly" : true,
          "secure" : false,
          "comment" : ""
        } ],
        "headers" : [ {
          "name" : "Cache-Control",
          "value" : "private"
        }, {
          "name" : "Content-Type",
          "value" : "application/json; charset=utf-8"
        }, {
          "name" : "Server",
          "value" : "Microsoft-IIS/10.0"
        }, {
          "name" : "Set-Cookie",
          "value" : ".ASPROLES=sA4RqE9MktpKcXPxLGHp2XgkgbYC51zc0RrUJBxofGPTrbRRihWSteojtBX8OjrSiiS5lnmML-TfeFgY2CktUI7iAty_GrGzXpo4GM2fJZVEN8x1WUNX6Oui5xeu7pT94fgvkpkToGCayHD21PmAUQGFaQnBW9oX_u3kmu6Jzj0Gcm8tRTZx5fPiybdDd9tqhELmm5q09IriMipxpEjFneQ8x0cZeeE8L40oI-J_2c4GQsJ_KhCCBGdyncNTz8UT9nU6_NwQ4Zo_uAA4dNtDF9Xtukkbx2kzMbWB02ILGmMO6uKxiUb8F1RiKH5rGtiyu2kvofgfnaPDhkcJ9dMXUGz_0CRP2xz_266kOEz5tK2RDfc4cSgB9Af9UnQKCEXLijgVXdv6z6-UnHh49F3n0g7y6vYdwx_HwMBIXHS2agIvd4pAAE5EMuKvV0XL29jo4Z8-owKBZgCOT_eHnlzmfcwzccksS9Iz43NCIYWEmtPnKxLitB68pjT-d1J2x8G-wl-URLfskR4oeIKYYg50-Ai4iWw1; path=/; HttpOnly"
        }, {
          "name" : "X-SourceFiles",
          "value" : "=?UTF-8?B?RDpcVmlydHVhbE9wdGltaXplci1SZWZhY3RvcmluZ1xDcm9wTWV0cmljcy5Wby5BcGlcQ3JvcE1ldHJpY3MuVm8uQXBpXGFwaVxtb2JpbGVcdjFcZmFybXNcNw==?="
        }, {
          "name" : "X-Powered-By",
          "value" : "ASP.NET"
        }, {
          "name" : "Date",
          "value" : "Wed, 24 Apr 2019 20:26:30 GMT"
        }, {
          "name" : "Content-Length",
          "value" : "45"
        } ],
        "content" : {
          "size" : 45,
          "mimeType" : "application/json; charset=utf-8",
          "text" : "{\"message\":\"The farm name must be provided.\"}",
          "comment" : ""
        },
        "redirectURL" : "",
        "headersSize" : 944,
        "bodySize" : 45,
        "comment" : ""
      },
      "cache" : { },
      "timings" : {
        "comment" : "",
        "connect" : -1,
        "wait" : 3713,
        "send" : 0,
        "receive" : 0,
        "dns" : -1,
        "blocked" : -1,
        "ssl" : -1
      },
      "serverIPAddress" : "127.0.0.1",
      "comment" : "",
      "_katalonRequestInformation" : {
        "name" : "15",
        "testObjectId" : "Object Repository/VoGrow/Farm/FarmPut",
        "harId" : "c73e5fa8-6778-470b-b1e2-bf69e0b44285"
      },
      "time" : 3714
    } ],
    "comment" : ""
  }
}