{
  "log" : {
    "version" : "1.2",
    "creator" : {
      "name" : "BrowserMob Proxy",
      "version" : "2.1.5",
      "comment" : ""
    },
    "pages" : [ {
      "id" : "Page 0",
      "startedDateTime" : "2019-04-04T21:06:12.565Z",
      "title" : "Page 0",
      "pageTimings" : {
        "onLoad" : 3306,
        "comment" : ""
      },
      "comment" : ""
    } ],
    "entries" : [ {
      "pageref" : "Page 0",
      "startedDateTime" : "2019-04-04T21:06:12.566Z",
      "request" : {
        "method" : "PUT",
        "url" : "http://localhost:10520/WebAPI/api/mobile/v1/farms/7?",
        "httpVersion" : "HTTP/1.1",
        "cookies" : [ ],
        "headers" : [ {
          "name" : "User-Agent",
          "value" : "Katalon Studio"
        }, {
          "name" : "Content-Type",
          "value" : "application/json"
        }, {
          "name" : "Authorization",
          "value" : "Bearer eyJ0eXAiOiJKV1QiLCJhbGciOiJIUzI1NiJ9.eyJ1bmlxdWVfbmFtZSI6Implbm55Lm1hbGRvbmFkby50eDFAZ21haWwuY29tIiwicm9sZSI6InVzZXIiLCJzdWIiOiJqZW5ueS5tYWxkb25hZG8udHgxQGdtYWlsLmNvbSIsImlzcyI6IkNyb3BNZXRyaWNzIiwiYXVkIjoiYWxsIiwiZXhwIjoxNTU0NDE1ODcyLCJuYmYiOjE1NTQ0MTE5NzJ9.CmyW_BSg6lCCEMrWG9qkDd82s3sz1GykPhJslmCI1M4"
        }, {
          "name" : "Host",
          "value" : "localhost:10520"
        }, {
          "name" : "Accept",
          "value" : "text/html, image/gif, image/jpeg, *; q=.2, */*; q=.2"
        }, {
          "name" : "Proxy-Connection",
          "value" : "keep-alive"
        }, {
          "name" : "Content-Length",
          "value" : "12"
        } ],
        "queryString" : [ ],
        "postData" : {
          "mimeType" : "application/json",
          "text" : "{\"name\": \"\"}",
          "comment" : ""
        },
        "headersSize" : 591,
        "bodySize" : 12,
        "comment" : ""
      },
      "response" : {
        "status" : 400,
        "statusText" : "Bad Request",
        "httpVersion" : "HTTP/1.1",
        "cookies" : [ {
          "name" : ".ASPROLES",
          "value" : "2oW7VzNfOE1z8HSgcc4X67UKLdkdKjQvG7ynXhEV8YraxNfjRFPMTPiywe3UxZqzUnrqUCheOBQnrkvstEasrwbivaadT-wnH9n_gtHSpAtJGHJC3lXjO_tZbfOcYd8r4dqs-EqLx0V_kJbBjl0Hgj6QEBspMLTIXzpGpReayMrY2nrJEwHw7ZuRJ2_g0A8J1TajZ1PGq4mPMlL1RzNQFcfuVXQhmNEpd9QGoO3j9KEBLBaIpoN1EaYAEGXD2YOTOZheCgLHI1E_g3sglPS22Bf-KrV0b75FZoPnAgJwfZXONcqCUUDzWcuplxXfj1O2ZV4N-YMBQ5TbN6rGPjjbZuSI_njm3wzJoewLnKQFaKkGcwr0BrAnqB-80a2QFurd71yXRcYbP8UNTxLC1__DeHfv8scmFMBieL1jk1XZ3jpjumM-Gs4_yqMPcSnj0jichFhCLThZWHh59ENtiIBYQwC1hjNFagRcPVLvplZrgJBd9T_YaXXlWQP6NKHDx_yQHdnnvuq6i0flDUmbwKEswBr-R-Q1",
          "path" : "/",
          "httpOnly" : true,
          "secure" : false,
          "comment" : ""
        } ],
        "headers" : [ {
          "name" : "Cache-Control",
          "value" : "private"
        }, {
          "name" : "Content-Type",
          "value" : "application/json; charset=utf-8"
        }, {
          "name" : "Server",
          "value" : "Microsoft-IIS/10.0"
        }, {
          "name" : "Set-Cookie",
          "value" : ".ASPROLES=2oW7VzNfOE1z8HSgcc4X67UKLdkdKjQvG7ynXhEV8YraxNfjRFPMTPiywe3UxZqzUnrqUCheOBQnrkvstEasrwbivaadT-wnH9n_gtHSpAtJGHJC3lXjO_tZbfOcYd8r4dqs-EqLx0V_kJbBjl0Hgj6QEBspMLTIXzpGpReayMrY2nrJEwHw7ZuRJ2_g0A8J1TajZ1PGq4mPMlL1RzNQFcfuVXQhmNEpd9QGoO3j9KEBLBaIpoN1EaYAEGXD2YOTOZheCgLHI1E_g3sglPS22Bf-KrV0b75FZoPnAgJwfZXONcqCUUDzWcuplxXfj1O2ZV4N-YMBQ5TbN6rGPjjbZuSI_njm3wzJoewLnKQFaKkGcwr0BrAnqB-80a2QFurd71yXRcYbP8UNTxLC1__DeHfv8scmFMBieL1jk1XZ3jpjumM-Gs4_yqMPcSnj0jichFhCLThZWHh59ENtiIBYQwC1hjNFagRcPVLvplZrgJBd9T_YaXXlWQP6NKHDx_yQHdnnvuq6i0flDUmbwKEswBr-R-Q1; path=/; HttpOnly"
        }, {
          "name" : "X-SourceFiles",
          "value" : "=?UTF-8?B?RDpcVmlydHVhbE9wdGltaXplci1SZWZhY3RvcmluZ1xDcm9wTWV0cmljcy5Wby5BcGlcQ3JvcE1ldHJpY3MuVm8uQXBpXGFwaVxtb2JpbGVcdjFcZmFybXNcNw==?="
        }, {
          "name" : "X-Powered-By",
          "value" : "ASP.NET"
        }, {
          "name" : "Date",
          "value" : "Thu, 04 Apr 2019 21:06:15 GMT"
        }, {
          "name" : "Content-Length",
          "value" : "45"
        } ],
        "content" : {
          "size" : 45,
          "mimeType" : "application/json; charset=utf-8",
          "text" : "{\"message\":\"The farm name must be provided.\"}",
          "comment" : ""
        },
        "redirectURL" : "",
        "headersSize" : 944,
        "bodySize" : 45,
        "comment" : ""
      },
      "cache" : { },
      "timings" : {
        "comment" : "",
        "dns" : -1,
        "connect" : -1,
        "blocked" : -1,
        "ssl" : -1,
        "receive" : 1,
        "send" : 0,
        "wait" : 3301
      },
      "serverIPAddress" : "127.0.0.1",
      "comment" : "",
      "_katalonRequestInformation" : {
        "name" : "20",
        "testObjectId" : "Object Repository/VoGrow/Farm/FarmPut",
        "harId" : "b8237f93-46a5-4131-bfa6-c3aa412d8fcd"
      },
      "time" : 3302
    } ],
    "comment" : ""
  }
}