{
  "log" : {
    "version" : "1.2",
    "creator" : {
      "name" : "BrowserMob Proxy",
      "version" : "2.1.5",
      "comment" : ""
    },
    "pages" : [ {
      "id" : "Page 0",
      "startedDateTime" : "2019-04-11T16:40:51.556Z",
      "title" : "Page 0",
      "pageTimings" : {
        "onLoad" : 76,
        "comment" : ""
      },
      "comment" : ""
    } ],
    "entries" : [ {
      "pageref" : "Page 0",
      "startedDateTime" : "2019-04-11T16:40:51.557Z",
      "request" : {
        "method" : "PUT",
        "url" : "http://localhost:10520/WebAPI/api/mobile/v1/farms/7?",
        "httpVersion" : "HTTP/1.1",
        "cookies" : [ ],
        "headers" : [ {
          "name" : "User-Agent",
          "value" : "Katalon Studio"
        }, {
          "name" : "Content-Type",
          "value" : "application/json"
        }, {
          "name" : "Authorization",
          "value" : "Bearer eyJ0eXAiOiJKV1QiLCJhbGciOiJIUzI1NiJ9.eyJ1bmlxdWVfbmFtZSI6Implbm55Lm1hbGRvbmFkby50eDFAZ21haWwuY29tIiwicm9sZSI6InVzZXIiLCJzdWIiOiJqZW5ueS5tYWxkb25hZG8udHgxQGdtYWlsLmNvbSIsImlzcyI6IkNyb3BNZXRyaWNzIiwiYXVkIjoiYWxsIiwiZXhwIjoxNTU1MDA0NzUxLCJuYmYiOjE1NTUwMDA4NTF9.qs_rZQsPX9dW7CTn9Ak64Xf80e0M5UtzTL9raZpcLi8"
        }, {
          "name" : "Host",
          "value" : "localhost:10520"
        }, {
          "name" : "Accept",
          "value" : "text/html, image/gif, image/jpeg, *; q=.2, */*; q=.2"
        }, {
          "name" : "Proxy-Connection",
          "value" : "keep-alive"
        }, {
          "name" : "Content-Length",
          "value" : "51"
        } ],
        "queryString" : [ ],
        "postData" : {
          "mimeType" : "application/json",
          "text" : "{\"name\": \"   Farm name with spaces is UPDATED    \"}",
          "comment" : ""
        },
        "headersSize" : 591,
        "bodySize" : 51,
        "comment" : ""
      },
      "response" : {
        "status" : 200,
        "statusText" : "OK",
        "httpVersion" : "HTTP/1.1",
        "cookies" : [ {
          "name" : ".ASPROLES",
          "value" : "-fvY2kffkWneCsnYUoQD-AWSqTcSzgSAIF6XFk6bxu69zw-Yx5PmRZSLU8sB2ea6pv9Z-3QdFmQHzhGPE9VnAsDq4Ak54jQxd6zMFCBr7rOgpoUaIacaCdqK0gjoFUkgsZ38Xu8T7mNCKURGPSt65OYkcvYVCIqSbc3ppeHYGbVken3b-lud89R-Q2MJuE9plie-Cv4tcfjushDufY6cPOHYWJ4ATxFtIfjFpv1u78K0N8aALtJ6x9cPn-oLfKx9zwtyBkL4TzP1s0KOLImsF-5VvpmpQ4PyPgY5UFGElEyBA1H_COrtahaeNuOaa0yNcQFpFASuMtiLLHCmeEKHBl4rDopYs873ggQVj7hWzFrgc7sUhD19mlT4JL1lK1Kdltjdjjm4H1vBKe_mUHZhlensFlx-6eKkL41aMP2RXBln1ZpsGtEcKrgqCnBaeZh07VveM3cEbG1XMdmVRZJp7rcF9Ttt-IHuluS2rHJzLPvdM4s8rOSdayfm7Z8h38Tn92MKfSzt8I0DF6Yo_EFqbZdF-x01",
          "path" : "/",
          "httpOnly" : true,
          "secure" : false,
          "comment" : ""
        } ],
        "headers" : [ {
          "name" : "Cache-Control",
          "value" : "private"
        }, {
          "name" : "Content-Type",
          "value" : "application/json; charset=utf-8"
        }, {
          "name" : "Server",
          "value" : "Microsoft-IIS/10.0"
        }, {
          "name" : "Set-Cookie",
          "value" : ".ASPROLES=-fvY2kffkWneCsnYUoQD-AWSqTcSzgSAIF6XFk6bxu69zw-Yx5PmRZSLU8sB2ea6pv9Z-3QdFmQHzhGPE9VnAsDq4Ak54jQxd6zMFCBr7rOgpoUaIacaCdqK0gjoFUkgsZ38Xu8T7mNCKURGPSt65OYkcvYVCIqSbc3ppeHYGbVken3b-lud89R-Q2MJuE9plie-Cv4tcfjushDufY6cPOHYWJ4ATxFtIfjFpv1u78K0N8aALtJ6x9cPn-oLfKx9zwtyBkL4TzP1s0KOLImsF-5VvpmpQ4PyPgY5UFGElEyBA1H_COrtahaeNuOaa0yNcQFpFASuMtiLLHCmeEKHBl4rDopYs873ggQVj7hWzFrgc7sUhD19mlT4JL1lK1Kdltjdjjm4H1vBKe_mUHZhlensFlx-6eKkL41aMP2RXBln1ZpsGtEcKrgqCnBaeZh07VveM3cEbG1XMdmVRZJp7rcF9Ttt-IHuluS2rHJzLPvdM4s8rOSdayfm7Z8h38Tn92MKfSzt8I0DF6Yo_EFqbZdF-x01; path=/; HttpOnly"
        }, {
          "name" : "X-SourceFiles",
          "value" : "=?UTF-8?B?RDpcVmlydHVhbE9wdGltaXplci1SZWZhY3RvcmluZ1xDcm9wTWV0cmljcy5Wby5BcGlcQ3JvcE1ldHJpY3MuVm8uQXBpXGFwaVxtb2JpbGVcdjFcZmFybXNcNw==?="
        }, {
          "name" : "X-Powered-By",
          "value" : "ASP.NET"
        }, {
          "name" : "Date",
          "value" : "Thu, 11 Apr 2019 16:40:51 GMT"
        }, {
          "name" : "Content-Length",
          "value" : "62"
        } ],
        "content" : {
          "size" : 62,
          "mimeType" : "application/json; charset=utf-8",
          "text" : "{\"id\":7,\"name\":\"Farm name with spaces is UPDATED\",\"user_id\":3}",
          "comment" : ""
        },
        "redirectURL" : "",
        "headersSize" : 935,
        "bodySize" : 62,
        "comment" : ""
      },
      "cache" : { },
      "timings" : {
        "comment" : "",
        "ssl" : -1,
        "wait" : 71,
        "dns" : -1,
        "blocked" : -1,
        "send" : 0,
        "receive" : 0,
        "connect" : -1
      },
      "serverIPAddress" : "127.0.0.1",
      "comment" : "",
      "_katalonRequestInformation" : {
        "name" : "27",
        "testObjectId" : "Object Repository/VoGrow/Farm/FarmPut",
        "harId" : "604a3833-a56c-403a-b7d2-a3b251d3cbb2"
      },
      "time" : 73
    } ],
    "comment" : ""
  }
}