{
  "log" : {
    "version" : "1.2",
    "creator" : {
      "name" : "BrowserMob Proxy",
      "version" : "2.1.5",
      "comment" : ""
    },
    "pages" : [ {
      "id" : "Page 0",
      "startedDateTime" : "2019-04-11T16:39:21.857Z",
      "title" : "Page 0",
      "pageTimings" : {
        "onLoad" : 3174,
        "comment" : ""
      },
      "comment" : ""
    } ],
    "entries" : [ {
      "pageref" : "Page 0",
      "startedDateTime" : "2019-04-11T16:39:21.858Z",
      "request" : {
        "method" : "POST",
        "url" : "http://localhost:10520/WebAPI/api/mobile/v1/farms/?",
        "httpVersion" : "HTTP/1.1",
        "cookies" : [ ],
        "headers" : [ {
          "name" : "User-Agent",
          "value" : "Katalon Studio"
        }, {
          "name" : "Content-Type",
          "value" : "application/json"
        }, {
          "name" : "Authorization",
          "value" : "Bearer eyJ0eXAiOiJKV1QiLCJhbGciOiJIUzI1NiJ9.eyJ1bmlxdWVfbmFtZSI6Implbm55Lm1hbGRvbmFkby50eDFAZ21haWwuY29tIiwicm9sZSI6InVzZXIiLCJzdWIiOiJqZW5ueS5tYWxkb25hZG8udHgxQGdtYWlsLmNvbSIsImlzcyI6IkNyb3BNZXRyaWNzIiwiYXVkIjoiYWxsIiwiZXhwIjoxNTU1MDA0NjYxLCJuYmYiOjE1NTUwMDA3NjF9.UjL-x3s6ak9uxcFFWCqHmLoKkW_MuhhLJuXGP23OZDM"
        }, {
          "name" : "Host",
          "value" : "localhost:10520"
        }, {
          "name" : "Accept",
          "value" : "text/html, image/gif, image/jpeg, *; q=.2, */*; q=.2"
        }, {
          "name" : "Proxy-Connection",
          "value" : "keep-alive"
        }, {
          "name" : "Content-Length",
          "value" : "33"
        } ],
        "queryString" : [ ],
        "postData" : {
          "mimeType" : "application/json",
          "text" : "{\"name\": \"!@#$%^&\", \"user_id\": 2}",
          "comment" : ""
        },
        "headersSize" : 591,
        "bodySize" : 33,
        "comment" : ""
      },
      "response" : {
        "status" : 400,
        "statusText" : "Bad Request",
        "httpVersion" : "HTTP/1.1",
        "cookies" : [ {
          "name" : ".ASPROLES",
          "value" : "yb_AdYavNYyIl_DGo4aeX8ORL4Tk-RgFzekfS5lLqhQx1WEX6RQ7pcohJjxIFOjmeTne3pOOzRruEJlLTQ0OiRzHaci1Z7CMK64cyr1h5WdMuAqTtMpnzqUQZAvtI1jFpI12-YGQgE1u_V7o9bLfNEKTESCzNq2LOYBXTxpuItjJOaImq6by1x74Di89I64dRM-SQTtj-CgAbPSlo0FxwHkxFprJKxAoK5vsnnCZyXWkPXK000vyqZAguJiTVQigUe5dEsKOVZkxZfFIcab0OszbfCIaes_CdKGKfUR2EAQOV9QwcHvooeAw7-mqmYbPZ7Ge4ByGDnKEDPMAQbe9RmeDUlxRB1HUdBWKVtaD3cN1wNlNq-teOtauOlmUhgxvnKQXA0BOj52bUcseG9Lxn0ZgTL5NGw-pr5eQN_Wrow97aI_XybDp3zW0sAndoXb4LrWpONfvgF4KwD-ABWu8rxcHbKueSg5CFYHyrT2x7BEEo8Vz0NmPGQAq-lvEvuGyWdiP2XpsuyZ3Dq9fZd-VQ6eVAAQ1",
          "path" : "/",
          "httpOnly" : true,
          "secure" : false,
          "comment" : ""
        } ],
        "headers" : [ {
          "name" : "Cache-Control",
          "value" : "private"
        }, {
          "name" : "Content-Type",
          "value" : "application/json; charset=utf-8"
        }, {
          "name" : "Server",
          "value" : "Microsoft-IIS/10.0"
        }, {
          "name" : "Set-Cookie",
          "value" : ".ASPROLES=yb_AdYavNYyIl_DGo4aeX8ORL4Tk-RgFzekfS5lLqhQx1WEX6RQ7pcohJjxIFOjmeTne3pOOzRruEJlLTQ0OiRzHaci1Z7CMK64cyr1h5WdMuAqTtMpnzqUQZAvtI1jFpI12-YGQgE1u_V7o9bLfNEKTESCzNq2LOYBXTxpuItjJOaImq6by1x74Di89I64dRM-SQTtj-CgAbPSlo0FxwHkxFprJKxAoK5vsnnCZyXWkPXK000vyqZAguJiTVQigUe5dEsKOVZkxZfFIcab0OszbfCIaes_CdKGKfUR2EAQOV9QwcHvooeAw7-mqmYbPZ7Ge4ByGDnKEDPMAQbe9RmeDUlxRB1HUdBWKVtaD3cN1wNlNq-teOtauOlmUhgxvnKQXA0BOj52bUcseG9Lxn0ZgTL5NGw-pr5eQN_Wrow97aI_XybDp3zW0sAndoXb4LrWpONfvgF4KwD-ABWu8rxcHbKueSg5CFYHyrT2x7BEEo8Vz0NmPGQAq-lvEvuGyWdiP2XpsuyZ3Dq9fZd-VQ6eVAAQ1; path=/; HttpOnly"
        }, {
          "name" : "X-SourceFiles",
          "value" : "=?UTF-8?B?RDpcVmlydHVhbE9wdGltaXplci1SZWZhY3RvcmluZ1xDcm9wTWV0cmljcy5Wby5BcGlcQ3JvcE1ldHJpY3MuVm8uQXBpXGFwaVxtb2JpbGVcdjFcZmFybXNc?="
        }, {
          "name" : "X-Powered-By",
          "value" : "ASP.NET"
        }, {
          "name" : "Date",
          "value" : "Thu, 11 Apr 2019 16:39:25 GMT"
        }, {
          "name" : "Content-Length",
          "value" : "97"
        } ],
        "content" : {
          "size" : 97,
          "mimeType" : "application/json; charset=utf-8",
          "text" : "{\"message\":\"The farm name must contain only alphanumeric characters, apostrophes and/or spaces.\"}",
          "comment" : ""
        },
        "redirectURL" : "",
        "headersSize" : 940,
        "bodySize" : 97,
        "comment" : ""
      },
      "cache" : { },
      "timings" : {
        "comment" : "",
        "ssl" : -1,
        "send" : 0,
        "wait" : 3169,
        "receive" : 1,
        "connect" : -1,
        "dns" : -1,
        "blocked" : -1
      },
      "serverIPAddress" : "127.0.0.1",
      "comment" : "",
      "_katalonRequestInformation" : {
        "name" : "21",
        "testObjectId" : "Object Repository/VoGrow/Farm/FarmPost",
        "harId" : "d3b781ca-7025-4d55-a0ca-3845f72cff70"
      },
      "time" : 3171
    } ],
    "comment" : ""
  }
}