{
  "log" : {
    "version" : "1.2",
    "creator" : {
      "name" : "BrowserMob Proxy",
      "version" : "2.1.5",
      "comment" : ""
    },
    "pages" : [ {
      "id" : "Page 0",
      "startedDateTime" : "2019-04-04T00:28:59.422Z",
      "title" : "Page 0",
      "pageTimings" : {
        "onLoad" : 7067,
        "comment" : ""
      },
      "comment" : ""
    } ],
    "entries" : [ {
      "pageref" : "Page 0",
      "startedDateTime" : "2019-04-04T00:28:59.424Z",
      "request" : {
        "method" : "POST",
        "url" : "http://localhost:10520/WebAPI/api/mobile/v1/farms/?",
        "httpVersion" : "HTTP/1.1",
        "cookies" : [ ],
        "headers" : [ {
          "name" : "User-Agent",
          "value" : "Katalon Studio"
        }, {
          "name" : "Content-Type",
          "value" : "application/json"
        }, {
          "name" : "Authorization",
          "value" : "Bearer eyJ0eXAiOiJKV1QiLCJhbGciOiJIUzI1NiJ9.eyJ1bmlxdWVfbmFtZSI6Implbm55Lm1hbGRvbmFkby50eDFAZ21haWwuY29tIiwicm9sZSI6InVzZXIiLCJzdWIiOiJqZW5ueS5tYWxkb25hZG8udHgxQGdtYWlsLmNvbSIsImlzcyI6IkNyb3BNZXRyaWNzIiwiYXVkIjoiYWxsIiwiZXhwIjoxNTU0MzQxNjM5LCJuYmYiOjE1NTQzMzc3Mzl9.YxB0nlUrezYUsUHc0KSf1Z61aa_a1aOmr1wEhogQzjw"
        }, {
          "name" : "Host",
          "value" : "localhost:10520"
        }, {
          "name" : "Accept",
          "value" : "text/html, image/gif, image/jpeg, *; q=.2, */*; q=.2"
        }, {
          "name" : "Proxy-Connection",
          "value" : "keep-alive"
        }, {
          "name" : "Content-Length",
          "value" : "30"
        } ],
        "queryString" : [ ],
        "postData" : {
          "mimeType" : "application/json",
          "text" : "{\"name\": \"    \", \"user_id\": 2}",
          "comment" : ""
        },
        "headersSize" : 591,
        "bodySize" : 30,
        "comment" : ""
      },
      "response" : {
        "status" : 400,
        "statusText" : "Bad Request",
        "httpVersion" : "HTTP/1.1",
        "cookies" : [ {
          "name" : ".ASPROLES",
          "value" : "ZhC0d1D4yz0d0Mc4V4es9K0MlUVv82Reyy2x0r73uKyomUs0YGhSe5EDuXS_OzeimwP07je05cN_8qwv5MvIn6FAoR57y4tHW3RNVuZWtZKeEZMrhWe7ncBu8cIA-RwbsFD7vC9sUSNvftireBGhWRKsjru_87qzPRbM5xRtOgyYWaDi2bRKHHzuOXE_t5Q78BpIQRgAYpaCMFsf7OeRG7hbv4q01Ba-zm5MlSFR8YQDWH0b6MP1lqxsNF8AZGpr-FkMhKNtpQp5zLAhV1W6PVfwQ1VG-pLT6gpGcs9MYdZYoznlJ51R3LklqvGbThUEQhnDzzMPErikf_1k8_LLLeaygm16yif5mBjfH5E_6wBxNqbl__FkR-l5BRC2_DysJJbMqBf78KqQ-LWaHGmdVFFb9b3rVCChbYXDDfGZ0PcVSWZoJ-vTiX3HppktaZjbGxxlJ1dbgZFiPiHFwblthihvRgfwf3Z8tP27d10mXlLQ2VSCjUkkE2zF5pKyD-EBTQtQZ8ASTZsFXemhOcAxZ3NaFlU1",
          "path" : "/",
          "httpOnly" : true,
          "secure" : false,
          "comment" : ""
        } ],
        "headers" : [ {
          "name" : "Cache-Control",
          "value" : "private"
        }, {
          "name" : "Content-Type",
          "value" : "application/json; charset=utf-8"
        }, {
          "name" : "Server",
          "value" : "Microsoft-IIS/10.0"
        }, {
          "name" : "Set-Cookie",
          "value" : ".ASPROLES=ZhC0d1D4yz0d0Mc4V4es9K0MlUVv82Reyy2x0r73uKyomUs0YGhSe5EDuXS_OzeimwP07je05cN_8qwv5MvIn6FAoR57y4tHW3RNVuZWtZKeEZMrhWe7ncBu8cIA-RwbsFD7vC9sUSNvftireBGhWRKsjru_87qzPRbM5xRtOgyYWaDi2bRKHHzuOXE_t5Q78BpIQRgAYpaCMFsf7OeRG7hbv4q01Ba-zm5MlSFR8YQDWH0b6MP1lqxsNF8AZGpr-FkMhKNtpQp5zLAhV1W6PVfwQ1VG-pLT6gpGcs9MYdZYoznlJ51R3LklqvGbThUEQhnDzzMPErikf_1k8_LLLeaygm16yif5mBjfH5E_6wBxNqbl__FkR-l5BRC2_DysJJbMqBf78KqQ-LWaHGmdVFFb9b3rVCChbYXDDfGZ0PcVSWZoJ-vTiX3HppktaZjbGxxlJ1dbgZFiPiHFwblthihvRgfwf3Z8tP27d10mXlLQ2VSCjUkkE2zF5pKyD-EBTQtQZ8ASTZsFXemhOcAxZ3NaFlU1; path=/; HttpOnly"
        }, {
          "name" : "X-SourceFiles",
          "value" : "=?UTF-8?B?RDpcVmlydHVhbE9wdGltaXplci1SZWZhY3RvcmluZ1xDcm9wTWV0cmljcy5Wby5BcGlcQ3JvcE1ldHJpY3MuVm8uQXBpXGFwaVxtb2JpbGVcdjFcZmFybXNc?="
        }, {
          "name" : "X-Powered-By",
          "value" : "ASP.NET"
        }, {
          "name" : "Date",
          "value" : "Thu, 04 Apr 2019 00:29:06 GMT"
        }, {
          "name" : "Content-Length",
          "value" : "45"
        } ],
        "content" : {
          "size" : 45,
          "mimeType" : "application/json; charset=utf-8",
          "text" : "{\"message\":\"The farm name must be provided.\"}",
          "comment" : ""
        },
        "redirectURL" : "",
        "headersSize" : 940,
        "bodySize" : 45,
        "comment" : ""
      },
      "cache" : { },
      "timings" : {
        "comment" : "",
        "ssl" : -1,
        "send" : 0,
        "receive" : 1,
        "wait" : 7059,
        "blocked" : -1,
        "dns" : -1,
        "connect" : -1
      },
      "serverIPAddress" : "127.0.0.1",
      "comment" : "",
      "_katalonRequestInformation" : {
        "name" : "15",
        "testObjectId" : "Object Repository/VoGrow/Farm/FarmPost",
        "harId" : "0f46a2b0-91f5-4544-a0a0-a2c54a7495e3"
      },
      "time" : 7061
    } ],
    "comment" : ""
  }
}