{
  "log" : {
    "version" : "1.2",
    "creator" : {
      "name" : "BrowserMob Proxy",
      "version" : "2.1.5",
      "comment" : ""
    },
    "pages" : [ {
      "id" : "Page 0",
      "startedDateTime" : "2019-03-29T20:33:09.598Z",
      "title" : "Page 0",
      "pageTimings" : {
        "onLoad" : 1870,
        "comment" : ""
      },
      "comment" : ""
    } ],
    "entries" : [ {
      "pageref" : "Page 0",
      "startedDateTime" : "2019-03-29T20:33:09.598Z",
      "request" : {
        "method" : "PUT",
        "url" : "http://localhost:10520/WebAPI/api/admin/v1/users/14?",
        "httpVersion" : "HTTP/1.1",
        "cookies" : [ ],
        "headers" : [ {
          "name" : "User-Agent",
          "value" : "Katalon Studio"
        }, {
          "name" : "Content-Type",
          "value" : "application/x-www-form-urlencoded"
        }, {
          "name" : "Authorization",
          "value" : "Bearer eyJ0eXAiOiJKV1QiLCJhbGciOiJIUzI1NiJ9.eyJ1bmlxdWVfbmFtZSI6ImFkbWluIiwicm9sZSI6InVzZXIiLCJzdWIiOiJhZG1pbiIsImlzcyI6IkNyb3BNZXRyaWNzIiwiYXVkIjoiYWxsIiwiZXhwIjoxNTUzODk1NDg5LCJuYmYiOjE1NTM4OTE1ODl9.N5Aije7l6hEYLRKiUtS7C26eTVAKLa_MS6Yowj-WBz0"
        }, {
          "name" : "Host",
          "value" : "localhost:10520"
        }, {
          "name" : "Accept",
          "value" : "text/html, image/gif, image/jpeg, *; q=.2, */*; q=.2"
        }, {
          "name" : "Proxy-Connection",
          "value" : "keep-alive"
        }, {
          "name" : "Content-Length",
          "value" : "286"
        } ],
        "queryString" : [ ],
        "postData" : {
          "mimeType" : "application/x-www-form-urlencoded",
          "params" : [ {
            "name" : "password",
            "value" : "cropmetrics",
            "comment" : ""
          }, {
            "name" : "email",
            "value" : "cropmetricsvo.passwithsymbols@gmail.com",
            "comment" : ""
          }, {
            "name" : "fullname",
            "value" : "test validation",
            "comment" : ""
          }, {
            "name" : "phone",
            "value" : "123",
            "comment" : ""
          }, {
            "name" : "dealer",
            "value" : "x",
            "comment" : ""
          }, {
            "name" : "addressLine1",
            "value" : "address line 1 test validation",
            "comment" : ""
          }, {
            "name" : "addressLine2",
            "value" : "",
            "comment" : ""
          }, {
            "name" : "town",
            "value" : "townValidation",
            "comment" : ""
          }, {
            "name" : "state",
            "value" : "stateValidation",
            "comment" : ""
          }, {
            "name" : "zip",
            "value" : "zipValidation",
            "comment" : ""
          }, {
            "name" : "country",
            "value" : "countryValidation",
            "comment" : ""
          }, {
            "name" : "roles",
            "value" : "Client",
            "comment" : ""
          }, {
            "name" : "userProfileId",
            "value" : "14",
            "comment" : ""
          } ],
          "comment" : ""
        },
        "headersSize" : 545,
        "bodySize" : 286,
        "comment" : ""
      },
      "response" : {
        "status" : 200,
        "statusText" : "OK",
        "httpVersion" : "HTTP/1.1",
        "cookies" : [ {
          "name" : ".ASPROLES",
          "value" : "ZxlI4HTFfMLtPqO5ea0pJYUd06JnG_e2-HOKXACPooOeCjRGrWYNg1qxY5rZSvsKk6YtG0F0p2HCQlw1nRQHSKNQTz4atjpUnVFd5dIrGp6hkd2K_JV71ciFGHPFmXuz1FouUXgSD4ZnOaEetHX3iHKlvqd6FCj_MTW-P_6o-1P-KtIoRgcHxuK7rZ21fIDUpyNcaaz17Q-_rq1NY57eM8I8TUSdQC8QuxiKdfxwWMW3bER-QU9SRLKk3OC1YXpz_GH4ZCA3tAIdJMhbFAB9oiq9SFVqoxoOXEhc-9k2Ab-9kbpSNyX5CcZJKgS11ef4Ga80MV-hQ_UWhGTdpk1Hfi-1aRa7RbVNk1D-XfpY3_um-J8AfKM3inTFpA0oS7stlVVvSA5JWH_sIE61nmRE3SGrkiTtOaieLvFa3n2otfiJGb2BGd_Z9sLSy_nL43FCt-Zw2hXE3539jQjkXY5rYSK3ejMMUoU4vAQHpx8i_N8BSnyA0",
          "path" : "/",
          "httpOnly" : true,
          "secure" : false,
          "comment" : ""
        } ],
        "headers" : [ {
          "name" : "Cache-Control",
          "value" : "private"
        }, {
          "name" : "Server",
          "value" : "Microsoft-IIS/10.0"
        }, {
          "name" : "Set-Cookie",
          "value" : ".ASPROLES=ZxlI4HTFfMLtPqO5ea0pJYUd06JnG_e2-HOKXACPooOeCjRGrWYNg1qxY5rZSvsKk6YtG0F0p2HCQlw1nRQHSKNQTz4atjpUnVFd5dIrGp6hkd2K_JV71ciFGHPFmXuz1FouUXgSD4ZnOaEetHX3iHKlvqd6FCj_MTW-P_6o-1P-KtIoRgcHxuK7rZ21fIDUpyNcaaz17Q-_rq1NY57eM8I8TUSdQC8QuxiKdfxwWMW3bER-QU9SRLKk3OC1YXpz_GH4ZCA3tAIdJMhbFAB9oiq9SFVqoxoOXEhc-9k2Ab-9kbpSNyX5CcZJKgS11ef4Ga80MV-hQ_UWhGTdpk1Hfi-1aRa7RbVNk1D-XfpY3_um-J8AfKM3inTFpA0oS7stlVVvSA5JWH_sIE61nmRE3SGrkiTtOaieLvFa3n2otfiJGb2BGd_Z9sLSy_nL43FCt-Zw2hXE3539jQjkXY5rYSK3ejMMUoU4vAQHpx8i_N8BSnyA0; path=/; HttpOnly"
        }, {
          "name" : "X-SourceFiles",
          "value" : "=?UTF-8?B?RDpcVmlydHVhbE9wdGltaXplci1SZWZhY3RvcmluZ1xDcm9wTWV0cmljcy5Wby5BcGlcQ3JvcE1ldHJpY3MuVm8uQXBpXGFwaVxhZG1pblx2MVx1c2Vyc1wxNA==?="
        }, {
          "name" : "X-Powered-By",
          "value" : "ASP.NET"
        }, {
          "name" : "Date",
          "value" : "Fri, 29 Mar 2019 20:33:11 GMT"
        }, {
          "name" : "Content-Length",
          "value" : "0"
        } ],
        "content" : {
          "size" : 0,
          "mimeType" : "",
          "text" : "",
          "encoding" : "base64",
          "comment" : ""
        },
        "redirectURL" : "",
        "headersSize" : 844,
        "bodySize" : 0,
        "comment" : ""
      },
      "cache" : { },
      "timings" : {
        "comment" : "",
        "ssl" : -1,
        "send" : 0,
        "wait" : 1872,
        "connect" : -1,
        "blocked" : -1,
        "receive" : 0,
        "dns" : -1
      },
      "serverIPAddress" : "127.0.0.1",
      "comment" : "",
      "_katalonRequestInformation" : {
        "name" : "101",
        "testObjectId" : "Object Repository/VoPro/Account/api_admin_v1_users_userprofileid",
        "harId" : "54da53d2-5169-4530-98d8-a87384efe034"
      },
      "time" : 1873
    } ],
    "comment" : ""
  }
}