{
  "log" : {
    "version" : "1.2",
    "creator" : {
      "name" : "BrowserMob Proxy",
      "version" : "2.1.5",
      "comment" : ""
    },
    "pages" : [ {
      "id" : "Page 0",
      "startedDateTime" : "2019-03-29T22:42:39.615Z",
      "title" : "Page 0",
      "pageTimings" : {
        "onLoad" : 3088,
        "comment" : ""
      },
      "comment" : ""
    } ],
    "entries" : [ {
      "pageref" : "Page 0",
      "startedDateTime" : "2019-03-29T22:42:39.616Z",
      "request" : {
        "method" : "POST",
        "url" : "http://localhost:10520/WebAPI/api/admin/v1/users/?",
        "httpVersion" : "HTTP/1.1",
        "cookies" : [ ],
        "headers" : [ {
          "name" : "User-Agent",
          "value" : "Katalon Studio"
        }, {
          "name" : "Content-Type",
          "value" : "application/x-www-form-urlencoded"
        }, {
          "name" : "Authorization",
          "value" : "Bearer eyJ0eXAiOiJKV1QiLCJhbGciOiJIUzI1NiJ9.eyJ1bmlxdWVfbmFtZSI6ImFkbWluIiwicm9sZSI6InVzZXIiLCJzdWIiOiJhZG1pbiIsImlzcyI6IkNyb3BNZXRyaWNzIiwiYXVkIjoiYWxsIiwiZXhwIjoxNTUzOTAzMjU5LCJuYmYiOjE1NTM4OTkzNTl9.2mE4xg53CeVDjcgq6wWpsUPK_hiThlfYnDTXgihZbCw"
        }, {
          "name" : "Host",
          "value" : "localhost:10520"
        }, {
          "name" : "Accept",
          "value" : "text/html, image/gif, image/jpeg, *; q=.2, */*; q=.2"
        }, {
          "name" : "Proxy-Connection",
          "value" : "keep-alive"
        }, {
          "name" : "Content-Length",
          "value" : "264"
        } ],
        "queryString" : [ ],
        "postData" : {
          "mimeType" : "application/x-www-form-urlencoded",
          "params" : [ {
            "name" : "password",
            "value" : "cropmetrics",
            "comment" : ""
          }, {
            "name" : "email",
            "value" : "cropmetricsvo.client@gmail.com",
            "comment" : ""
          }, {
            "name" : "fullname",
            "value" : "test validation",
            "comment" : ""
          }, {
            "name" : "phone",
            "value" : "123",
            "comment" : ""
          }, {
            "name" : "dealer",
            "value" : "x",
            "comment" : ""
          }, {
            "name" : "addressLine1",
            "value" : "address line 1 test validation",
            "comment" : ""
          }, {
            "name" : "addressLine2",
            "value" : "address line 2 test validation",
            "comment" : ""
          }, {
            "name" : "town",
            "value" : "townValidation",
            "comment" : ""
          }, {
            "name" : "state",
            "value" : "stateValidation",
            "comment" : ""
          }, {
            "name" : "zip",
            "value" : "xx",
            "comment" : ""
          }, {
            "name" : "country",
            "value" : "xx",
            "comment" : ""
          }, {
            "name" : "roles",
            "value" : "Client",
            "comment" : ""
          } ],
          "comment" : ""
        },
        "headersSize" : 544,
        "bodySize" : 264,
        "comment" : ""
      },
      "response" : {
        "status" : 400,
        "statusText" : "Bad Request",
        "httpVersion" : "HTTP/1.1",
        "cookies" : [ {
          "name" : ".ASPROLES",
          "value" : "hy2dR5sGnWCSkBZ2k8nNQn9wP5keheHWU3vU6H9E_fhsrImFnhPISfUuLuTnuFNOy8hghvMQhqTPzedIqBP9Wjl4B4lvqbAmLxFkjx-lEBN2PQrZB2Pbe2G-ryestecHQbjAw83PY5JQkohOxHW9FiMTvEveNyQ8kVfCb3SLJifKyH919acTJdCoPOrZdH4GvTgzLxy93UsZCuHS-MD8QhpR0ywZMnrQG8WkPpHWBV7GQNA79U_smoxmOBXDeu_FobRyPsA8B4Pz5V-03BZKUf3e4a5QxbuSuPaFpfGCzzD6-jfzJ88ebMW4X6gi-UOw_TTtcdsIcAHvW6HW5LDIep7JSi6AjNDZZjotkHH3vECPDIW5E9nee7To1C1qIlbQu1mlbfCLfrN8_pvfocE_sfqBOgewXtibEVsm39hXIZ4ka4U86vOkDnn1R6LjgQQ3kdT3ftt2rc5r4BcN0h-Ie6zhbLrBB_5hv6TIuXfdT6R8Obah0",
          "path" : "/",
          "httpOnly" : true,
          "secure" : false,
          "comment" : ""
        } ],
        "headers" : [ {
          "name" : "Cache-Control",
          "value" : "private"
        }, {
          "name" : "Content-Type",
          "value" : "application/json; charset=utf-8"
        }, {
          "name" : "Server",
          "value" : "Microsoft-IIS/10.0"
        }, {
          "name" : "Set-Cookie",
          "value" : ".ASPROLES=hy2dR5sGnWCSkBZ2k8nNQn9wP5keheHWU3vU6H9E_fhsrImFnhPISfUuLuTnuFNOy8hghvMQhqTPzedIqBP9Wjl4B4lvqbAmLxFkjx-lEBN2PQrZB2Pbe2G-ryestecHQbjAw83PY5JQkohOxHW9FiMTvEveNyQ8kVfCb3SLJifKyH919acTJdCoPOrZdH4GvTgzLxy93UsZCuHS-MD8QhpR0ywZMnrQG8WkPpHWBV7GQNA79U_smoxmOBXDeu_FobRyPsA8B4Pz5V-03BZKUf3e4a5QxbuSuPaFpfGCzzD6-jfzJ88ebMW4X6gi-UOw_TTtcdsIcAHvW6HW5LDIep7JSi6AjNDZZjotkHH3vECPDIW5E9nee7To1C1qIlbQu1mlbfCLfrN8_pvfocE_sfqBOgewXtibEVsm39hXIZ4ka4U86vOkDnn1R6LjgQQ3kdT3ftt2rc5r4BcN0h-Ie6zhbLrBB_5hv6TIuXfdT6R8Obah0; path=/; HttpOnly"
        }, {
          "name" : "X-SourceFiles",
          "value" : "=?UTF-8?B?RDpcVmlydHVhbE9wdGltaXplci1SZWZhY3RvcmluZ1xDcm9wTWV0cmljcy5Wby5BcGlcQ3JvcE1ldHJpY3MuVm8uQXBpXGFwaVxhZG1pblx2MVx1c2Vyc1w=?="
        }, {
          "name" : "X-Powered-By",
          "value" : "ASP.NET"
        }, {
          "name" : "Date",
          "value" : "Fri, 29 Mar 2019 22:42:42 GMT"
        }, {
          "name" : "Content-Length",
          "value" : "67"
        } ],
        "content" : {
          "size" : 67,
          "mimeType" : "application/json; charset=utf-8",
          "text" : "{\"message\":\"Name cropmetricsvo.client@gmail.com is already taken.\"}",
          "comment" : ""
        },
        "redirectURL" : "",
        "headersSize" : 897,
        "bodySize" : 67,
        "comment" : ""
      },
      "cache" : { },
      "timings" : {
        "comment" : "",
        "ssl" : -1,
        "wait" : 3083,
        "dns" : -1,
        "send" : 0,
        "receive" : 1,
        "connect" : -1,
        "blocked" : -1
      },
      "serverIPAddress" : "127.0.0.1",
      "comment" : "",
      "_katalonRequestInformation" : {
        "name" : "87",
        "testObjectId" : "Object Repository/VoPro/Account/api_admin_v1_users",
        "harId" : "18c80ae7-e389-4101-82c9-c2446e5dd751"
      },
      "time" : 3084
    } ],
    "comment" : ""
  }
}