{
  "log" : {
    "version" : "1.2",
    "creator" : {
      "name" : "BrowserMob Proxy",
      "version" : "2.1.5",
      "comment" : ""
    },
    "pages" : [ {
      "id" : "Page 0",
      "startedDateTime" : "2019-03-29T22:26:32.601Z",
      "title" : "Page 0",
      "pageTimings" : {
        "onLoad" : 80,
        "comment" : ""
      },
      "comment" : ""
    } ],
    "entries" : [ {
      "pageref" : "Page 0",
      "startedDateTime" : "2019-03-29T22:26:32.604Z",
      "request" : {
        "method" : "POST",
        "url" : "http://localhost:10520/WebAPI/api/admin/v1/users/?",
        "httpVersion" : "HTTP/1.1",
        "cookies" : [ ],
        "headers" : [ {
          "name" : "User-Agent",
          "value" : "Katalon Studio"
        }, {
          "name" : "Content-Type",
          "value" : "application/x-www-form-urlencoded"
        }, {
          "name" : "Authorization",
          "value" : "Bearer eyJ0eXAiOiJKV1QiLCJhbGciOiJIUzI1NiJ9.eyJ1bmlxdWVfbmFtZSI6ImFkbWluIiwicm9sZSI6InVzZXIiLCJzdWIiOiJhZG1pbiIsImlzcyI6IkNyb3BNZXRyaWNzIiwiYXVkIjoiYWxsIiwiZXhwIjoxNTUzOTAyMjkyLCJuYmYiOjE1NTM4OTgzOTJ9.VAhJaSAskCqxwxOU2MObCYmti3so7-9Ho_AAyk745iM"
        }, {
          "name" : "Host",
          "value" : "localhost:10520"
        }, {
          "name" : "Accept",
          "value" : "text/html, image/gif, image/jpeg, *; q=.2, */*; q=.2"
        }, {
          "name" : "Proxy-Connection",
          "value" : "keep-alive"
        }, {
          "name" : "Content-Length",
          "value" : "298"
        } ],
        "queryString" : [ ],
        "postData" : {
          "mimeType" : "application/x-www-form-urlencoded",
          "params" : [ {
            "name" : "password",
            "value" : "cropmetrics",
            "comment" : ""
          }, {
            "name" : "email",
            "value" : "cropmetricsvo emailwrongformat gmail.com",
            "comment" : ""
          }, {
            "name" : "fullname",
            "value" : "test validation",
            "comment" : ""
          }, {
            "name" : "phone",
            "value" : "123",
            "comment" : ""
          }, {
            "name" : "dealer",
            "value" : "x",
            "comment" : ""
          }, {
            "name" : "addressLine1",
            "value" : "address line 1 test validation",
            "comment" : ""
          }, {
            "name" : "addressLine2",
            "value" : "address line 1 test validation",
            "comment" : ""
          }, {
            "name" : "town",
            "value" : "townValidation",
            "comment" : ""
          }, {
            "name" : "state",
            "value" : "stateValidation",
            "comment" : ""
          }, {
            "name" : "zip",
            "value" : "zipValidation",
            "comment" : ""
          }, {
            "name" : "country",
            "value" : "countryValidation",
            "comment" : ""
          }, {
            "name" : "roles",
            "value" : "Client",
            "comment" : ""
          } ],
          "comment" : ""
        },
        "headersSize" : 544,
        "bodySize" : 298,
        "comment" : ""
      },
      "response" : {
        "status" : 400,
        "statusText" : "Bad Request",
        "httpVersion" : "HTTP/1.1",
        "cookies" : [ {
          "name" : ".ASPROLES",
          "value" : "QVI_2k87hYAr2SAqUUYHhkYYWZ2ENkA44HV3oSXaqIndxf1hXh-hYpuWHnRv8sPRV45L65jsGriBASG8Z8HtPwEgYpzDPItHHwD7QJzeD5sk-sSwO6ZayvuexSCNB37f0twHeVTOMWnm2APbkb-MmtfxKRWcvowrWfJ3va-pz2yXOAutJQp_W5KWhjoYQGopLc4mDk6_GTsuLCNOHNMBB-0_nqhnI7oMXoR-FLrIIiI-L6ULDqpuVjBw8aJ-sNVuv8j0PQEkIoX1QrrXF1BdhvTPe7e3cfbvtdfXZeU8qLtdHTVjJRbpD4XZvIX-hIjZCCznih8tEO7yu1daY1MvBCUhXXvUPVIPccK5ZcABmZpF8lBZBYxvV3Z3abf_cAddRu1VFeDDPpzXy8C7G5efuhNQo1Y14XEexif9eCYH8kOMM03Sy9VKgUL999V-4Aa0kh-yFlf-kX_WKBlGLSijmYvNQlWAxdMxqjje5dJsTsbtqwNx0",
          "path" : "/",
          "httpOnly" : true,
          "secure" : false,
          "comment" : ""
        } ],
        "headers" : [ {
          "name" : "Cache-Control",
          "value" : "private"
        }, {
          "name" : "Content-Type",
          "value" : "application/json; charset=utf-8"
        }, {
          "name" : "Server",
          "value" : "Microsoft-IIS/10.0"
        }, {
          "name" : "Set-Cookie",
          "value" : ".ASPROLES=QVI_2k87hYAr2SAqUUYHhkYYWZ2ENkA44HV3oSXaqIndxf1hXh-hYpuWHnRv8sPRV45L65jsGriBASG8Z8HtPwEgYpzDPItHHwD7QJzeD5sk-sSwO6ZayvuexSCNB37f0twHeVTOMWnm2APbkb-MmtfxKRWcvowrWfJ3va-pz2yXOAutJQp_W5KWhjoYQGopLc4mDk6_GTsuLCNOHNMBB-0_nqhnI7oMXoR-FLrIIiI-L6ULDqpuVjBw8aJ-sNVuv8j0PQEkIoX1QrrXF1BdhvTPe7e3cfbvtdfXZeU8qLtdHTVjJRbpD4XZvIX-hIjZCCznih8tEO7yu1daY1MvBCUhXXvUPVIPccK5ZcABmZpF8lBZBYxvV3Z3abf_cAddRu1VFeDDPpzXy8C7G5efuhNQo1Y14XEexif9eCYH8kOMM03Sy9VKgUL999V-4Aa0kh-yFlf-kX_WKBlGLSijmYvNQlWAxdMxqjje5dJsTsbtqwNx0; path=/; HttpOnly"
        }, {
          "name" : "X-SourceFiles",
          "value" : "=?UTF-8?B?RDpcVmlydHVhbE9wdGltaXplci1SZWZhY3RvcmluZ1xDcm9wTWV0cmljcy5Wby5BcGlcQ3JvcE1ldHJpY3MuVm8uQXBpXGFwaVxhZG1pblx2MVx1c2Vyc1w=?="
        }, {
          "name" : "X-Powered-By",
          "value" : "ASP.NET"
        }, {
          "name" : "Date",
          "value" : "Fri, 29 Mar 2019 22:26:31 GMT"
        }, {
          "name" : "Content-Length",
          "value" : "127"
        } ],
        "content" : {
          "size" : 127,
          "mimeType" : "application/json; charset=utf-8",
          "text" : "{\"message\":\"The request is invalid. The Email provided is not a valid email address. cropmetricsvo emailwrongformat gmail.com\"}",
          "comment" : ""
        },
        "redirectURL" : "",
        "headersSize" : 898,
        "bodySize" : 127,
        "comment" : ""
      },
      "cache" : { },
      "timings" : {
        "comment" : "",
        "ssl" : -1,
        "wait" : 73,
        "send" : 0,
        "receive" : 0,
        "dns" : -1,
        "connect" : -1,
        "blocked" : -1
      },
      "serverIPAddress" : "127.0.0.1",
      "comment" : "",
      "_katalonRequestInformation" : {
        "name" : "49",
        "testObjectId" : "Object Repository/VoPro/Account/api_admin_v1_users",
        "harId" : "86c43f69-52d6-44a5-81e4-e096c1baa054"
      },
      "time" : 74
    } ],
    "comment" : ""
  }
}