{
  "log" : {
    "version" : "1.2",
    "creator" : {
      "name" : "BrowserMob Proxy",
      "version" : "2.1.5",
      "comment" : ""
    },
    "pages" : [ {
      "id" : "Page 0",
      "startedDateTime" : "2019-03-29T21:02:31.882Z",
      "title" : "Page 0",
      "pageTimings" : {
        "onLoad" : 2549,
        "comment" : ""
      },
      "comment" : ""
    } ],
    "entries" : [ {
      "pageref" : "Page 0",
      "startedDateTime" : "2019-03-29T21:02:31.882Z",
      "request" : {
        "method" : "PUT",
        "url" : "http://localhost:10520/WebAPI/api/admin/v1/users/19?",
        "httpVersion" : "HTTP/1.1",
        "cookies" : [ ],
        "headers" : [ {
          "name" : "User-Agent",
          "value" : "Katalon Studio"
        }, {
          "name" : "Content-Type",
          "value" : "application/x-www-form-urlencoded"
        }, {
          "name" : "Authorization",
          "value" : "Bearer eyJ0eXAiOiJKV1QiLCJhbGciOiJIUzI1NiJ9.eyJ1bmlxdWVfbmFtZSI6ImFkbWluIiwicm9sZSI6InVzZXIiLCJzdWIiOiJhZG1pbiIsImlzcyI6IkNyb3BNZXRyaWNzIiwiYXVkIjoiYWxsIiwiZXhwIjoxNTUzODk3MjUxLCJuYmYiOjE1NTM4OTMzNTF9.4EE23cg7LGIT_YlEqisCTh-7BGQmHslf5MEQJZnQUuY"
        }, {
          "name" : "Host",
          "value" : "localhost:10520"
        }, {
          "name" : "Accept",
          "value" : "text/html, image/gif, image/jpeg, *; q=.2, */*; q=.2"
        }, {
          "name" : "Proxy-Connection",
          "value" : "keep-alive"
        }, {
          "name" : "Content-Length",
          "value" : "774"
        } ],
        "queryString" : [ ],
        "postData" : {
          "mimeType" : "application/x-www-form-urlencoded",
          "params" : [ {
            "name" : "password",
            "value" : "cropmetrics",
            "comment" : ""
          }, {
            "name" : "email",
            "value" : "cropmetricsvo.dealerlong@gmail.com",
            "comment" : ""
          }, {
            "name" : "fullname",
            "value" : "x",
            "comment" : ""
          }, {
            "name" : "phone",
            "value" : "1",
            "comment" : ""
          }, {
            "name" : "dealer",
            "value" : "12 API_ACNT_When_new_account_have_long_dealer_attribute_Expected_status_code_20012 API_ACNT_When_new_account_have_long_dealer_attribute_Expected_status_code_20012 API_ACNT_When_new_account_have_long_dealer_attribute_Expected_status_code_20012 API_ACNT_When_new_account_have_long_dealer_attribute_Expected_status_code_20012 API_ACNT_When_new_account_have_long_dealer_attribute_Expected_status_code_20012 API_ACNT_When_new_account_have_long_dealer_attribute_Expected_status_code_200",
            "comment" : ""
          }, {
            "name" : "addressLine1",
            "value" : "address line 1 test validation",
            "comment" : ""
          }, {
            "name" : "addressLine2",
            "value" : "address line 2 test validation",
            "comment" : ""
          }, {
            "name" : "town",
            "value" : "townValidation",
            "comment" : ""
          }, {
            "name" : "state",
            "value" : "stateValidation",
            "comment" : ""
          }, {
            "name" : "zip",
            "value" : "zipValidation",
            "comment" : ""
          }, {
            "name" : "country",
            "value" : "countryValidation",
            "comment" : ""
          }, {
            "name" : "roles",
            "value" : "Client",
            "comment" : ""
          }, {
            "name" : "userProfileId",
            "value" : "19",
            "comment" : ""
          } ],
          "comment" : ""
        },
        "headersSize" : 545,
        "bodySize" : 774,
        "comment" : ""
      },
      "response" : {
        "status" : 200,
        "statusText" : "OK",
        "httpVersion" : "HTTP/1.1",
        "cookies" : [ {
          "name" : ".ASPROLES",
          "value" : "f0Z4kYUKj8-K37Yp7qB_ncptSmfvG8uthjqz76dG6gI7c68BiH8YclPNn4IO7IxM3m6B7gM2cN0T_40Hu6aSoZpxxuiKjWGYzb9_RdK76kXsGCXr0f0bwJYAMJ4eO1FUO7pfqngObddUStPYkU-mMvdH2FxxAKC3g1Wz99FOHDHmp2qmlKTynvFoIhsUSm4qU3rAOs3I0uH9AwMhX9xGvdYfWQIFiHwDnb73pQlKVN2I6d5mtPloyFzt0SbZHYqd772xg63YLTihDDLitefpBO2NGskTIKbK_J6BdMDmQTgt_u0yggMkun_Su9RYV1ffxQExkHtuGtDst4nvoJE1nN4zextjc74o592wD2xm5gKrUODul1_rmvPJG4Z84i8c3EvqEUfUv672ddZpCi7YyMNJwZ1cb0lvm3y52bAgfdcCPPlNlSpqvghbuZ-TE-IM_skbTb1e24wG7xCxH9lHwpYrKdDH-M3CejYVoMm0pmfnXp7u0",
          "path" : "/",
          "httpOnly" : true,
          "secure" : false,
          "comment" : ""
        } ],
        "headers" : [ {
          "name" : "Cache-Control",
          "value" : "private"
        }, {
          "name" : "Server",
          "value" : "Microsoft-IIS/10.0"
        }, {
          "name" : "Set-Cookie",
          "value" : ".ASPROLES=f0Z4kYUKj8-K37Yp7qB_ncptSmfvG8uthjqz76dG6gI7c68BiH8YclPNn4IO7IxM3m6B7gM2cN0T_40Hu6aSoZpxxuiKjWGYzb9_RdK76kXsGCXr0f0bwJYAMJ4eO1FUO7pfqngObddUStPYkU-mMvdH2FxxAKC3g1Wz99FOHDHmp2qmlKTynvFoIhsUSm4qU3rAOs3I0uH9AwMhX9xGvdYfWQIFiHwDnb73pQlKVN2I6d5mtPloyFzt0SbZHYqd772xg63YLTihDDLitefpBO2NGskTIKbK_J6BdMDmQTgt_u0yggMkun_Su9RYV1ffxQExkHtuGtDst4nvoJE1nN4zextjc74o592wD2xm5gKrUODul1_rmvPJG4Z84i8c3EvqEUfUv672ddZpCi7YyMNJwZ1cb0lvm3y52bAgfdcCPPlNlSpqvghbuZ-TE-IM_skbTb1e24wG7xCxH9lHwpYrKdDH-M3CejYVoMm0pmfnXp7u0; path=/; HttpOnly"
        }, {
          "name" : "X-SourceFiles",
          "value" : "=?UTF-8?B?RDpcVmlydHVhbE9wdGltaXplci1SZWZhY3RvcmluZ1xDcm9wTWV0cmljcy5Wby5BcGlcQ3JvcE1ldHJpY3MuVm8uQXBpXGFwaVxhZG1pblx2MVx1c2Vyc1wxOQ==?="
        }, {
          "name" : "X-Powered-By",
          "value" : "ASP.NET"
        }, {
          "name" : "Date",
          "value" : "Fri, 29 Mar 2019 21:02:34 GMT"
        }, {
          "name" : "Content-Length",
          "value" : "0"
        } ],
        "content" : {
          "size" : 0,
          "mimeType" : "",
          "text" : "",
          "encoding" : "base64",
          "comment" : ""
        },
        "redirectURL" : "",
        "headersSize" : 844,
        "bodySize" : 0,
        "comment" : ""
      },
      "cache" : { },
      "timings" : {
        "comment" : "",
        "dns" : -1,
        "wait" : 2549,
        "send" : 0,
        "receive" : 0,
        "connect" : -1,
        "blocked" : -1,
        "ssl" : -1
      },
      "serverIPAddress" : "127.0.0.1",
      "comment" : "",
      "_katalonRequestInformation" : {
        "name" : "29",
        "testObjectId" : "Object Repository/VoPro/Account/api_admin_v1_users_userprofileid",
        "harId" : "544d0f52-c775-4a64-a28c-c41d4317b971"
      },
      "time" : 2550
    } ],
    "comment" : ""
  }
}