{
  "log" : {
    "version" : "1.2",
    "creator" : {
      "name" : "BrowserMob Proxy",
      "version" : "2.1.5",
      "comment" : ""
    },
    "pages" : [ {
      "id" : "Page 0",
      "startedDateTime" : "2019-04-09T20:38:20.551Z",
      "title" : "Page 0",
      "pageTimings" : {
        "onLoad" : 3102,
        "comment" : ""
      },
      "comment" : ""
    } ],
    "entries" : [ {
      "pageref" : "Page 0",
      "startedDateTime" : "2019-04-09T20:38:20.552Z",
      "request" : {
        "method" : "POST",
        "url" : "http://localhost:10520/WebAPI/api/mobile/v1/farms/?",
        "httpVersion" : "HTTP/1.1",
        "cookies" : [ ],
        "headers" : [ {
          "name" : "User-Agent",
          "value" : "Katalon Studio"
        }, {
          "name" : "Content-Type",
          "value" : "application/json"
        }, {
          "name" : "Authorization",
          "value" : "Bearer eyJ0eXAiOiJKV1QiLCJhbGciOiJIUzI1NiJ9.eyJ1bmlxdWVfbmFtZSI6Implbm55Lm1hbGRvbmFkby50eEBnbWFpbC5jb20iLCJyb2xlIjoidXNlciIsInN1YiI6Implbm55Lm1hbGRvbmFkby50eEBnbWFpbC5jb20iLCJpc3MiOiJDcm9wTWV0cmljcyIsImF1ZCI6ImFsbCIsImV4cCI6MTU1NDg0NjIwMCwibmJmIjoxNTU0ODQyMzAwfQ.lzMCuLqdKZVVegisXLC7MoZhXY-kBR24tKOiMoBFijI"
        }, {
          "name" : "Host",
          "value" : "localhost:10520"
        }, {
          "name" : "Accept",
          "value" : "text/html, image/gif, image/jpeg, *; q=.2, */*; q=.2"
        }, {
          "name" : "Proxy-Connection",
          "value" : "keep-alive"
        }, {
          "name" : "Content-Length",
          "value" : "76"
        } ],
        "queryString" : [ ],
        "postData" : {
          "mimeType" : "application/json",
          "text" : "{\"name\": \"New Farm with userID different of the user token\", \"user_id\": \"4\"}",
          "comment" : ""
        },
        "headersSize" : 589,
        "bodySize" : 76,
        "comment" : ""
      },
      "response" : {
        "status" : 400,
        "statusText" : "Bad Request",
        "httpVersion" : "HTTP/1.1",
        "cookies" : [ {
          "name" : ".ASPROLES",
          "value" : "D-HKmO9E13ICohlcgmD4Lb_ZSJ-GF63ouLcFEU81W14bKgxYC0wckdJ0aMQhcPTpOOY3JPx5h5047zWXgFcEQHBzeR5pr72luH4dhkiAXOfC02oR3DyYrc6hoPvbzvXigBHBgT0O3hzxzhKYHP83gi2il6vzCH7O2vZpKHRshJGLqjwPix2xznhX8OgcdRwU_qVjJTDPITQViDw2B8dVdqK1DUfNcTxu_VWal9GGXram5G4ZChGU014RmD5eGKcG4tEGfTn2ltuduJpMwO871UGgNz9fH79iWAVU8VgJ1OLqc4GUjpeRXphQYZTm5gP-xjdqHOhXcoaeYsV_mdjEPrgixgUPVUf51TEz-ZV3PgD06CvylcJ4rEcwPqHMqsq5ROiYDK9MRbqsxn7oREVQnZ0FmdW9vvmh1HyDxNG0jmZND8Y7H19yFkxzCnCjVahDkfVyr60SKBsMnIN_lImdGrpwQyvRjlSs28CWexWJBaNW-TV5cIywLD9qEOFz2OKQp1nuFA2",
          "path" : "/",
          "httpOnly" : true,
          "secure" : false,
          "comment" : ""
        } ],
        "headers" : [ {
          "name" : "Cache-Control",
          "value" : "private"
        }, {
          "name" : "Content-Type",
          "value" : "application/json; charset=utf-8"
        }, {
          "name" : "Server",
          "value" : "Microsoft-IIS/10.0"
        }, {
          "name" : "Set-Cookie",
          "value" : ".ASPROLES=D-HKmO9E13ICohlcgmD4Lb_ZSJ-GF63ouLcFEU81W14bKgxYC0wckdJ0aMQhcPTpOOY3JPx5h5047zWXgFcEQHBzeR5pr72luH4dhkiAXOfC02oR3DyYrc6hoPvbzvXigBHBgT0O3hzxzhKYHP83gi2il6vzCH7O2vZpKHRshJGLqjwPix2xznhX8OgcdRwU_qVjJTDPITQViDw2B8dVdqK1DUfNcTxu_VWal9GGXram5G4ZChGU014RmD5eGKcG4tEGfTn2ltuduJpMwO871UGgNz9fH79iWAVU8VgJ1OLqc4GUjpeRXphQYZTm5gP-xjdqHOhXcoaeYsV_mdjEPrgixgUPVUf51TEz-ZV3PgD06CvylcJ4rEcwPqHMqsq5ROiYDK9MRbqsxn7oREVQnZ0FmdW9vvmh1HyDxNG0jmZND8Y7H19yFkxzCnCjVahDkfVyr60SKBsMnIN_lImdGrpwQyvRjlSs28CWexWJBaNW-TV5cIywLD9qEOFz2OKQp1nuFA2; path=/; HttpOnly"
        }, {
          "name" : "X-SourceFiles",
          "value" : "=?UTF-8?B?RDpcVmlydHVhbE9wdGltaXplci1SZWZhY3RvcmluZ1xDcm9wTWV0cmljcy5Wby5BcGlcQ3JvcE1ldHJpY3MuVm8uQXBpXGFwaVxtb2JpbGVcdjFcZmFybXNc?="
        }, {
          "name" : "X-Powered-By",
          "value" : "ASP.NET"
        }, {
          "name" : "Date",
          "value" : "Tue, 09 Apr 2019 20:38:23 GMT"
        }, {
          "name" : "Content-Length",
          "value" : "57"
        } ],
        "content" : {
          "size" : 57,
          "mimeType" : "application/json; charset=utf-8",
          "text" : "{\"message\":\"The request is not valid for a grower role.\"}",
          "comment" : ""
        },
        "redirectURL" : "",
        "headersSize" : 919,
        "bodySize" : 57,
        "comment" : ""
      },
      "cache" : { },
      "timings" : {
        "comment" : "",
        "wait" : 3097,
        "receive" : 0,
        "dns" : -1,
        "send" : 0,
        "connect" : -1,
        "blocked" : -1,
        "ssl" : -1
      },
      "serverIPAddress" : "127.0.0.1",
      "comment" : "",
      "_katalonRequestInformation" : {
        "name" : "51",
        "testObjectId" : "Object Repository/VoGrow/Farm/FarmPost",
        "harId" : "03abd60e-ecd8-43cb-8580-a0cdf4d3a7dd"
      },
      "time" : 3098
    } ],
    "comment" : ""
  }
}