{
  "log" : {
    "version" : "1.2",
    "creator" : {
      "name" : "BrowserMob Proxy",
      "version" : "2.1.5",
      "comment" : ""
    },
    "pages" : [ {
      "id" : "Page 0",
      "startedDateTime" : "2019-03-29T21:04:03.249Z",
      "title" : "Page 0",
      "pageTimings" : {
        "onLoad" : 26,
        "comment" : ""
      },
      "comment" : ""
    } ],
    "entries" : [ {
      "pageref" : "Page 0",
      "startedDateTime" : "2019-03-29T21:04:03.249Z",
      "request" : {
        "method" : "POST",
        "url" : "http://localhost:10520/WebAPI/api/admin/v1/users/?",
        "httpVersion" : "HTTP/1.1",
        "cookies" : [ ],
        "headers" : [ {
          "name" : "User-Agent",
          "value" : "Katalon Studio"
        }, {
          "name" : "Content-Type",
          "value" : "application/x-www-form-urlencoded"
        }, {
          "name" : "Authorization",
          "value" : "Bearer eyJ0eXAiOiJKV1QiLCJhbGciOiJIUzI1NiJ9.eyJ1bmlxdWVfbmFtZSI6ImNyb3BtZXRyaWNzdm8uY2xpZW50QGdtYWlsLmNvbSIsInJvbGUiOiJ1c2VyIiwic3ViIjoiY3JvcG1ldHJpY3N2by5jbGllbnRAZ21haWwuY29tIiwiaXNzIjoiQ3JvcE1ldHJpY3MiLCJhdWQiOiJhbGwiLCJleHAiOjE1NTM4OTczNDMsIm5iZiI6MTU1Mzg5MzQ0M30.bbCVyYWLlVwW25m_d4Q-DFQwUm2nbbXhcOKB8L0-ZhE"
        }, {
          "name" : "Host",
          "value" : "localhost:10520"
        }, {
          "name" : "Accept",
          "value" : "text/html, image/gif, image/jpeg, *; q=.2, */*; q=.2"
        }, {
          "name" : "Proxy-Connection",
          "value" : "keep-alive"
        }, {
          "name" : "Content-Length",
          "value" : "272"
        } ],
        "queryString" : [ ],
        "postData" : {
          "mimeType" : "application/x-www-form-urlencoded",
          "params" : [ {
            "name" : "password",
            "value" : "cropmetrics",
            "comment" : ""
          }, {
            "name" : "email",
            "value" : "cropmetricsvo.clientbyclient@gmail.com",
            "comment" : ""
          }, {
            "name" : "fullname",
            "value" : "test validation",
            "comment" : ""
          }, {
            "name" : "phone",
            "value" : "123",
            "comment" : ""
          }, {
            "name" : "dealer",
            "value" : "x",
            "comment" : ""
          }, {
            "name" : "addressLine1",
            "value" : "address line 1 test validation",
            "comment" : ""
          }, {
            "name" : "addressLine2",
            "value" : "address line 2 test validation",
            "comment" : ""
          }, {
            "name" : "town",
            "value" : "townValidation",
            "comment" : ""
          }, {
            "name" : "state",
            "value" : "stateValidation",
            "comment" : ""
          }, {
            "name" : "zip",
            "value" : "xx",
            "comment" : ""
          }, {
            "name" : "country",
            "value" : "xx",
            "comment" : ""
          }, {
            "name" : "roles",
            "value" : "Client",
            "comment" : ""
          } ],
          "comment" : ""
        },
        "headersSize" : 611,
        "bodySize" : 272,
        "comment" : ""
      },
      "response" : {
        "status" : 401,
        "statusText" : "Unauthorized",
        "httpVersion" : "HTTP/1.1",
        "cookies" : [ {
          "name" : ".ASPROLES",
          "value" : "4wN9VHATCblku9G8HEkALoaMMfloEAm1HVyaN7X-8ZOJDHSl6V2oRD_0PuyQgyNwt_p1KvdfgvchnI1BRVgiGYKhzodIIDQgG5_W7zqMJrZA2akJQ0YL1xlGIno2tckhtgQMJKEVilj2IGXLs-VJ_jIxbKRHevV7itFaOT22zXTomIdD508kuIujTQqc_fBxbvgn60rgD45Zvo_rpP3VrXKtlRIRSb0ryp3TwlvKWwOXSZ_8PXofDGXSIZGHJ1ojCN_bg3zaXJh1YwBxnE0vFLKCSrao4zKf_-YeDsGlU6KkFC2nlo4U5qnUlja0X9nkM6CPLCUhGXDqPjqVBlmKgQhIaWvIc6nBDi1m3YP1hgJMy-xo_zir6V2L0ieUj-OnW-PA66NsDtFBtyFhXOM-J9jBCag2pbq36HBTVKm8KI89WnN5IpyDPRECAsOZZEEKEYveEEzkTeoYcawL8P7Xn2am5BaMVpvp81WL3fUs459Y9kiL7e5LUHsP3iKunBecY2zhjQ2",
          "path" : "/",
          "httpOnly" : true,
          "secure" : false,
          "comment" : ""
        } ],
        "headers" : [ {
          "name" : "Cache-Control",
          "value" : "private"
        }, {
          "name" : "Content-Type",
          "value" : "application/json; charset=utf-8"
        }, {
          "name" : "Server",
          "value" : "Microsoft-IIS/10.0"
        }, {
          "name" : "Set-Cookie",
          "value" : ".ASPROLES=4wN9VHATCblku9G8HEkALoaMMfloEAm1HVyaN7X-8ZOJDHSl6V2oRD_0PuyQgyNwt_p1KvdfgvchnI1BRVgiGYKhzodIIDQgG5_W7zqMJrZA2akJQ0YL1xlGIno2tckhtgQMJKEVilj2IGXLs-VJ_jIxbKRHevV7itFaOT22zXTomIdD508kuIujTQqc_fBxbvgn60rgD45Zvo_rpP3VrXKtlRIRSb0ryp3TwlvKWwOXSZ_8PXofDGXSIZGHJ1ojCN_bg3zaXJh1YwBxnE0vFLKCSrao4zKf_-YeDsGlU6KkFC2nlo4U5qnUlja0X9nkM6CPLCUhGXDqPjqVBlmKgQhIaWvIc6nBDi1m3YP1hgJMy-xo_zir6V2L0ieUj-OnW-PA66NsDtFBtyFhXOM-J9jBCag2pbq36HBTVKm8KI89WnN5IpyDPRECAsOZZEEKEYveEEzkTeoYcawL8P7Xn2am5BaMVpvp81WL3fUs459Y9kiL7e5LUHsP3iKunBecY2zhjQ2; path=/; HttpOnly"
        }, {
          "name" : "X-SourceFiles",
          "value" : "=?UTF-8?B?RDpcVmlydHVhbE9wdGltaXplci1SZWZhY3RvcmluZ1xDcm9wTWV0cmljcy5Wby5BcGlcQ3JvcE1ldHJpY3MuVm8uQXBpXGFwaVxhZG1pblx2MVx1c2Vyc1w=?="
        }, {
          "name" : "X-Powered-By",
          "value" : "ASP.NET"
        }, {
          "name" : "Date",
          "value" : "Fri, 29 Mar 2019 21:04:03 GMT"
        }, {
          "name" : "Content-Length",
          "value" : "61"
        } ],
        "content" : {
          "size" : 61,
          "mimeType" : "application/json; charset=utf-8",
          "text" : "{\"message\":\"Authorization has been denied for this request.\"}",
          "comment" : ""
        },
        "redirectURL" : "",
        "headersSize" : 920,
        "bodySize" : 61,
        "comment" : ""
      },
      "cache" : { },
      "timings" : {
        "comment" : "",
        "dns" : -1,
        "wait" : 17,
        "send" : 0,
        "receive" : 0,
        "connect" : -1,
        "blocked" : -1,
        "ssl" : -1
      },
      "serverIPAddress" : "127.0.0.1",
      "comment" : "",
      "_katalonRequestInformation" : {
        "name" : "89",
        "testObjectId" : "Object Repository/VoPro/Account/api_admin_v1_users",
        "harId" : "a6f669c3-6051-4290-9599-72651da1b16d"
      },
      "time" : 18
    } ],
    "comment" : ""
  }
}