{
  "log" : {
    "version" : "1.2",
    "creator" : {
      "name" : "BrowserMob Proxy",
      "version" : "2.1.5",
      "comment" : ""
    },
    "pages" : [ {
      "id" : "Page 0",
      "startedDateTime" : "2019-03-29T20:33:19.819Z",
      "title" : "Page 0",
      "pageTimings" : {
        "onLoad" : 31,
        "comment" : ""
      },
      "comment" : ""
    } ],
    "entries" : [ {
      "pageref" : "Page 0",
      "startedDateTime" : "2019-03-29T20:33:19.819Z",
      "request" : {
        "method" : "PUT",
        "url" : "http://localhost:10520/WebAPI/api/admin/v1/users/14?",
        "httpVersion" : "HTTP/1.1",
        "cookies" : [ ],
        "headers" : [ {
          "name" : "User-Agent",
          "value" : "Katalon Studio"
        }, {
          "name" : "Content-Type",
          "value" : "application/x-www-form-urlencoded"
        }, {
          "name" : "Authorization",
          "value" : "Bearer eyJ0eXAiOiJKV1QiLCJhbGciOiJIUzI1NiJ9.eyJ1bmlxdWVfbmFtZSI6ImFkbWluIiwicm9sZSI6InVzZXIiLCJzdWIiOiJhZG1pbiIsImlzcyI6IkNyb3BNZXRyaWNzIiwiYXVkIjoiYWxsIiwiZXhwIjoxNTUzODk1NDk5LCJuYmYiOjE1NTM4OTE1OTl9.Q3SmJwyE0HuGbSXQi4YX3C1rhkAxKJ4AouJzUiBLqPs"
        }, {
          "name" : "Host",
          "value" : "localhost:10520"
        }, {
          "name" : "Accept",
          "value" : "text/html, image/gif, image/jpeg, *; q=.2, */*; q=.2"
        }, {
          "name" : "Proxy-Connection",
          "value" : "keep-alive"
        }, {
          "name" : "Content-Length",
          "value" : "305"
        } ],
        "queryString" : [ ],
        "postData" : {
          "mimeType" : "application/x-www-form-urlencoded",
          "params" : [ {
            "name" : "password",
            "value" : "",
            "comment" : ""
          }, {
            "name" : "email",
            "value" : "cropmetricsvo.passwithsymbols@gmail.com",
            "comment" : ""
          }, {
            "name" : "fullname",
            "value" : "test validation",
            "comment" : ""
          }, {
            "name" : "phone",
            "value" : "123",
            "comment" : ""
          }, {
            "name" : "dealer",
            "value" : "x",
            "comment" : ""
          }, {
            "name" : "addressLine1",
            "value" : "address line 1 test validation",
            "comment" : ""
          }, {
            "name" : "addressLine2",
            "value" : "address line 2 test validation",
            "comment" : ""
          }, {
            "name" : "town",
            "value" : "townValidation",
            "comment" : ""
          }, {
            "name" : "state",
            "value" : "stateValidation",
            "comment" : ""
          }, {
            "name" : "zip",
            "value" : "zipValidation",
            "comment" : ""
          }, {
            "name" : "country",
            "value" : "countryValidation",
            "comment" : ""
          }, {
            "name" : "roles",
            "value" : "Client",
            "comment" : ""
          }, {
            "name" : "userProfileId",
            "value" : "14",
            "comment" : ""
          } ],
          "comment" : ""
        },
        "headersSize" : 545,
        "bodySize" : 305,
        "comment" : ""
      },
      "response" : {
        "status" : 200,
        "statusText" : "OK",
        "httpVersion" : "HTTP/1.1",
        "cookies" : [ {
          "name" : ".ASPROLES",
          "value" : "XJGMR8ki8hJPHTz2lIcFLZE5bymPVnzyIjadFumkCCpqG956u_MCw46nbwKHhzpA-EYIeep-eByhZHJCnJD_k2glaDlEwqp-jHmwWC3BkCu9QH1Tz1Coee1gBxeosfAapx9y7Hg00-bTfEvUGUehdGdYl4VzvxfjMLQicqfG0aVwz-A7dnTMYdEbmBJMpPRf9kgz5yY0vUJ0re8xZnysAoj38c73ANM0CdZUT9aHUsI-iqOCd-SxwRLV9_AIyDI2VSxtQyh_c2fY0TDp_OA6q0gX47GJmx8yTN4gwHJdLMzuLcJwzHsx_9ppNTxbvc8U7Njsoi-qNuwNhBtB6-15FHnIGP6CJdl26ZYL1qdHTwhPVKos29MfARmI3-d1Qhc3cbQhJjzKbYCyZoYav0XkzgGHUgUMdxCNXf8hiIILvf_ArW6iaPSxcqC7211a4f__VYAk0nbHcRejvsFoWqKNEvFJDpM4SJJA4Y9TPno4vkfC7MOq0",
          "path" : "/",
          "httpOnly" : true,
          "secure" : false,
          "comment" : ""
        } ],
        "headers" : [ {
          "name" : "Cache-Control",
          "value" : "private"
        }, {
          "name" : "Server",
          "value" : "Microsoft-IIS/10.0"
        }, {
          "name" : "Set-Cookie",
          "value" : ".ASPROLES=XJGMR8ki8hJPHTz2lIcFLZE5bymPVnzyIjadFumkCCpqG956u_MCw46nbwKHhzpA-EYIeep-eByhZHJCnJD_k2glaDlEwqp-jHmwWC3BkCu9QH1Tz1Coee1gBxeosfAapx9y7Hg00-bTfEvUGUehdGdYl4VzvxfjMLQicqfG0aVwz-A7dnTMYdEbmBJMpPRf9kgz5yY0vUJ0re8xZnysAoj38c73ANM0CdZUT9aHUsI-iqOCd-SxwRLV9_AIyDI2VSxtQyh_c2fY0TDp_OA6q0gX47GJmx8yTN4gwHJdLMzuLcJwzHsx_9ppNTxbvc8U7Njsoi-qNuwNhBtB6-15FHnIGP6CJdl26ZYL1qdHTwhPVKos29MfARmI3-d1Qhc3cbQhJjzKbYCyZoYav0XkzgGHUgUMdxCNXf8hiIILvf_ArW6iaPSxcqC7211a4f__VYAk0nbHcRejvsFoWqKNEvFJDpM4SJJA4Y9TPno4vkfC7MOq0; path=/; HttpOnly"
        }, {
          "name" : "X-SourceFiles",
          "value" : "=?UTF-8?B?RDpcVmlydHVhbE9wdGltaXplci1SZWZhY3RvcmluZ1xDcm9wTWV0cmljcy5Wby5BcGlcQ3JvcE1ldHJpY3MuVm8uQXBpXGFwaVxhZG1pblx2MVx1c2Vyc1wxNA==?="
        }, {
          "name" : "X-Powered-By",
          "value" : "ASP.NET"
        }, {
          "name" : "Date",
          "value" : "Fri, 29 Mar 2019 20:33:19 GMT"
        }, {
          "name" : "Content-Length",
          "value" : "0"
        } ],
        "content" : {
          "size" : 0,
          "mimeType" : "",
          "text" : "",
          "encoding" : "base64",
          "comment" : ""
        },
        "redirectURL" : "",
        "headersSize" : 844,
        "bodySize" : 0,
        "comment" : ""
      },
      "cache" : { },
      "timings" : {
        "comment" : "",
        "ssl" : -1,
        "send" : 0,
        "wait" : 28,
        "connect" : -1,
        "blocked" : -1,
        "receive" : 0,
        "dns" : -1
      },
      "serverIPAddress" : "127.0.0.1",
      "comment" : "",
      "_katalonRequestInformation" : {
        "name" : "111",
        "testObjectId" : "Object Repository/VoPro/Account/api_admin_v1_users_userprofileid",
        "harId" : "72df4842-3851-4195-bf66-f5a51a831304"
      },
      "time" : 28
    } ],
    "comment" : ""
  }
}