{
  "log" : {
    "version" : "1.2",
    "creator" : {
      "name" : "BrowserMob Proxy",
      "version" : "2.1.5",
      "comment" : ""
    },
    "pages" : [ {
      "id" : "Page 0",
      "startedDateTime" : "2019-03-29T22:30:47.165Z",
      "title" : "Page 0",
      "pageTimings" : {
        "onLoad" : 1879,
        "comment" : ""
      },
      "comment" : ""
    } ],
    "entries" : [ {
      "pageref" : "Page 0",
      "startedDateTime" : "2019-03-29T22:30:47.167Z",
      "request" : {
        "method" : "PUT",
        "url" : "http://localhost:10520/WebAPI/api/admin/v1/users/19?",
        "httpVersion" : "HTTP/1.1",
        "cookies" : [ ],
        "headers" : [ {
          "name" : "User-Agent",
          "value" : "Katalon Studio"
        }, {
          "name" : "Content-Type",
          "value" : "application/x-www-form-urlencoded"
        }, {
          "name" : "Authorization",
          "value" : "Bearer eyJ0eXAiOiJKV1QiLCJhbGciOiJIUzI1NiJ9.eyJ1bmlxdWVfbmFtZSI6ImFkbWluIiwicm9sZSI6InVzZXIiLCJzdWIiOiJhZG1pbiIsImlzcyI6IkNyb3BNZXRyaWNzIiwiYXVkIjoiYWxsIiwiZXhwIjoxNTUzOTAyNTQ3LCJuYmYiOjE1NTM4OTg2NDd9.IJNi9Binst2GjAwpDERwNGXjNJD0w5km8OXcNCWdWFk"
        }, {
          "name" : "Host",
          "value" : "localhost:10520"
        }, {
          "name" : "Accept",
          "value" : "text/html, image/gif, image/jpeg, *; q=.2, */*; q=.2"
        }, {
          "name" : "Proxy-Connection",
          "value" : "keep-alive"
        }, {
          "name" : "Content-Length",
          "value" : "774"
        } ],
        "queryString" : [ ],
        "postData" : {
          "mimeType" : "application/x-www-form-urlencoded",
          "params" : [ {
            "name" : "password",
            "value" : "cropmetrics",
            "comment" : ""
          }, {
            "name" : "email",
            "value" : "cropmetricsvo.dealerlong@gmail.com",
            "comment" : ""
          }, {
            "name" : "fullname",
            "value" : "x",
            "comment" : ""
          }, {
            "name" : "phone",
            "value" : "1",
            "comment" : ""
          }, {
            "name" : "dealer",
            "value" : "12 API_ACNT_When_new_account_have_long_dealer_attribute_Expected_status_code_20012 API_ACNT_When_new_account_have_long_dealer_attribute_Expected_status_code_20012 API_ACNT_When_new_account_have_long_dealer_attribute_Expected_status_code_20012 API_ACNT_When_new_account_have_long_dealer_attribute_Expected_status_code_20012 API_ACNT_When_new_account_have_long_dealer_attribute_Expected_status_code_20012 API_ACNT_When_new_account_have_long_dealer_attribute_Expected_status_code_200",
            "comment" : ""
          }, {
            "name" : "addressLine1",
            "value" : "address line 1 test validation",
            "comment" : ""
          }, {
            "name" : "addressLine2",
            "value" : "address line 2 test validation",
            "comment" : ""
          }, {
            "name" : "town",
            "value" : "townValidation",
            "comment" : ""
          }, {
            "name" : "state",
            "value" : "stateValidation",
            "comment" : ""
          }, {
            "name" : "zip",
            "value" : "zipValidation",
            "comment" : ""
          }, {
            "name" : "country",
            "value" : "countryValidation",
            "comment" : ""
          }, {
            "name" : "roles",
            "value" : "Client",
            "comment" : ""
          }, {
            "name" : "userProfileId",
            "value" : "19",
            "comment" : ""
          } ],
          "comment" : ""
        },
        "headersSize" : 545,
        "bodySize" : 774,
        "comment" : ""
      },
      "response" : {
        "status" : 200,
        "statusText" : "OK",
        "httpVersion" : "HTTP/1.1",
        "cookies" : [ {
          "name" : ".ASPROLES",
          "value" : "7luegmRyKbtyAE6CVCeNNUMqLvurotSx624Qa_IozSeCQzNf-V44QP-p93-9gMJMFdHQv_slsReV9Qb-r-WIuv_yRc7NSmyz_EnZczRoOrwQ3H6EhvuLHoQmT81wtpg7R3w2Dh7ciB6zivYvI5eFnkYHM5GzIy2TfnyOpcsR1L1zYv4-XhlQD_BenZWov9OIax66iN6DxMiiMdFSK-gPVoHbV9ivZg2MwKscC7m8nnVdO3ay6u0mKprWZGPVsNW8dsdCABFpzBKDhs6lsr83ujVeWNpX5dKRmWKMcVcP6dvkMypPpofzKQ9V9DmcXZjtBvImVL9LBrr570COecFDED8IsHhj38XmE-yTNfsAFY9uj7h6KtR8iDwwJnYG1Biy9MH-bw-pqOknY1rclnkmEMJbEdGcsCbcBuLiFxKN-tNf7jicfTNYxidEj0edfmnv8RRcEiAc3gn2lRRanT02hv9h7wIMriOFtveDPGcUvA9Z7qFw0",
          "path" : "/",
          "httpOnly" : true,
          "secure" : false,
          "comment" : ""
        } ],
        "headers" : [ {
          "name" : "Cache-Control",
          "value" : "private"
        }, {
          "name" : "Server",
          "value" : "Microsoft-IIS/10.0"
        }, {
          "name" : "Set-Cookie",
          "value" : ".ASPROLES=7luegmRyKbtyAE6CVCeNNUMqLvurotSx624Qa_IozSeCQzNf-V44QP-p93-9gMJMFdHQv_slsReV9Qb-r-WIuv_yRc7NSmyz_EnZczRoOrwQ3H6EhvuLHoQmT81wtpg7R3w2Dh7ciB6zivYvI5eFnkYHM5GzIy2TfnyOpcsR1L1zYv4-XhlQD_BenZWov9OIax66iN6DxMiiMdFSK-gPVoHbV9ivZg2MwKscC7m8nnVdO3ay6u0mKprWZGPVsNW8dsdCABFpzBKDhs6lsr83ujVeWNpX5dKRmWKMcVcP6dvkMypPpofzKQ9V9DmcXZjtBvImVL9LBrr570COecFDED8IsHhj38XmE-yTNfsAFY9uj7h6KtR8iDwwJnYG1Biy9MH-bw-pqOknY1rclnkmEMJbEdGcsCbcBuLiFxKN-tNf7jicfTNYxidEj0edfmnv8RRcEiAc3gn2lRRanT02hv9h7wIMriOFtveDPGcUvA9Z7qFw0; path=/; HttpOnly"
        }, {
          "name" : "X-SourceFiles",
          "value" : "=?UTF-8?B?RDpcVmlydHVhbE9wdGltaXplci1SZWZhY3RvcmluZ1xDcm9wTWV0cmljcy5Wby5BcGlcQ3JvcE1ldHJpY3MuVm8uQXBpXGFwaVxhZG1pblx2MVx1c2Vyc1wxOQ==?="
        }, {
          "name" : "X-Powered-By",
          "value" : "ASP.NET"
        }, {
          "name" : "Date",
          "value" : "Fri, 29 Mar 2019 22:30:49 GMT"
        }, {
          "name" : "Content-Length",
          "value" : "0"
        } ],
        "content" : {
          "size" : 0,
          "mimeType" : "",
          "text" : "",
          "encoding" : "base64",
          "comment" : ""
        },
        "redirectURL" : "",
        "headersSize" : 844,
        "bodySize" : 0,
        "comment" : ""
      },
      "cache" : { },
      "timings" : {
        "comment" : "",
        "ssl" : -1,
        "send" : 0,
        "wait" : 1875,
        "receive" : 0,
        "connect" : -1,
        "dns" : -1,
        "blocked" : -1
      },
      "serverIPAddress" : "127.0.0.1",
      "comment" : "",
      "_katalonRequestInformation" : {
        "name" : "29",
        "testObjectId" : "Object Repository/VoPro/Account/api_admin_v1_users_userprofileid",
        "harId" : "2eadbc8c-ff18-463b-8f82-70c046b6cb4f"
      },
      "time" : 1876
    } ],
    "comment" : ""
  }
}