{
  "log" : {
    "version" : "1.2",
    "creator" : {
      "name" : "BrowserMob Proxy",
      "version" : "2.1.5",
      "comment" : ""
    },
    "pages" : [ {
      "id" : "Page 0",
      "startedDateTime" : "2019-03-29T22:13:20.831Z",
      "title" : "Page 0",
      "pageTimings" : {
        "onLoad" : 3752,
        "comment" : ""
      },
      "comment" : ""
    } ],
    "entries" : [ {
      "pageref" : "Page 0",
      "startedDateTime" : "2019-03-29T22:13:20.834Z",
      "request" : {
        "method" : "PUT",
        "url" : "http://localhost:10520/WebAPI/api/admin/v1/users/5?",
        "httpVersion" : "HTTP/1.1",
        "cookies" : [ ],
        "headers" : [ {
          "name" : "User-Agent",
          "value" : "Katalon Studio"
        }, {
          "name" : "Content-Type",
          "value" : "application/x-www-form-urlencoded"
        }, {
          "name" : "Authorization",
          "value" : "Bearer eyJ0eXAiOiJKV1QiLCJhbGciOiJIUzI1NiJ9.eyJ1bmlxdWVfbmFtZSI6ImFkbWluIiwicm9sZSI6InVzZXIiLCJzdWIiOiJhZG1pbiIsImlzcyI6IkNyb3BNZXRyaWNzIiwiYXVkIjoiYWxsIiwiZXhwIjoxNTUzOTAxNTAwLCJuYmYiOjE1NTM4OTc2MDB9.z3I46QIVw3dMUwVm7N91cjVzsPlurr7i4TNEa4RSMZE"
        }, {
          "name" : "Host",
          "value" : "localhost:10520"
        }, {
          "name" : "Accept",
          "value" : "text/html, image/gif, image/jpeg, *; q=.2, */*; q=.2"
        }, {
          "name" : "Proxy-Connection",
          "value" : "keep-alive"
        }, {
          "name" : "Content-Length",
          "value" : "346"
        } ],
        "queryString" : [ ],
        "postData" : {
          "mimeType" : "application/x-www-form-urlencoded",
          "params" : [ {
            "name" : "password",
            "value" : "15characterspas",
            "comment" : ""
          }, {
            "name" : "email",
            "value" : "cropmetricsvo.phone.space@gmail.com",
            "comment" : ""
          }, {
            "name" : "fullname",
            "value" : "test validation",
            "comment" : ""
          }, {
            "name" : "phone",
            "value" : "one five nine",
            "comment" : ""
          }, {
            "name" : "dealer",
            "value" : "dealer test validation",
            "comment" : ""
          }, {
            "name" : "addressLine1",
            "value" : "address line 1 test validation",
            "comment" : ""
          }, {
            "name" : "addressLine2",
            "value" : "address line 1 test validation",
            "comment" : ""
          }, {
            "name" : "town",
            "value" : "townValidation",
            "comment" : ""
          }, {
            "name" : "state",
            "value" : "stateValidation",
            "comment" : ""
          }, {
            "name" : "zip",
            "value" : "zipValidation",
            "comment" : ""
          }, {
            "name" : "country",
            "value" : "countryValidation",
            "comment" : ""
          }, {
            "name" : "roles",
            "value" : "Client",
            "comment" : ""
          }, {
            "name" : "userProfileId",
            "value" : "5",
            "comment" : ""
          } ],
          "comment" : ""
        },
        "headersSize" : 544,
        "bodySize" : 346,
        "comment" : ""
      },
      "response" : {
        "status" : 200,
        "statusText" : "OK",
        "httpVersion" : "HTTP/1.1",
        "cookies" : [ {
          "name" : ".ASPROLES",
          "value" : "dokeFnN-AgAgblyvP6jyu-G1tZMV_rOwqrDhLX-ZE2Dd9JvbbktTyG5XlvPPCXxQqGtlwt0TwsBCDBcHUlUbhA3GwZQHZ2ilxandYw2SNM80pU0-v715YqUGCGH4sMq_C0PW6O8U6HmmxFolOxIy4zvAx_-XZYHtvQB3gNkC9oUjCY4uE14Q3YVFeLm9wdpFq7xEAJ3dRvm8DYPgqqF4Dr_MOmIvboFjtW5C2nNCQYzvauRdbxjkQFT8lSgkvO9dbL80zBgDzTXhR0n_NPBQVUIf0NnWTWXX3mLQoadoGtNZegqwaQaTv2uZ7RZq1eYMHwwRzCojLR2LWdi8Hr-X44oso7rbI8JGed95dm-0rw2FK0WI19cIgUO1DA5BP4A0kCgizZ7AxX1oLOXcadzYq4iqjP9WoM2HwUvv0ThzQ2N_450vx8V-i5ZYttelpvDvMuHniEkMm-GZh7qx3QFaxu7ohddPR73Q2dPFugA7rFJjV6ks0",
          "path" : "/",
          "httpOnly" : true,
          "secure" : false,
          "comment" : ""
        } ],
        "headers" : [ {
          "name" : "Cache-Control",
          "value" : "private"
        }, {
          "name" : "Server",
          "value" : "Microsoft-IIS/10.0"
        }, {
          "name" : "Set-Cookie",
          "value" : ".ASPROLES=dokeFnN-AgAgblyvP6jyu-G1tZMV_rOwqrDhLX-ZE2Dd9JvbbktTyG5XlvPPCXxQqGtlwt0TwsBCDBcHUlUbhA3GwZQHZ2ilxandYw2SNM80pU0-v715YqUGCGH4sMq_C0PW6O8U6HmmxFolOxIy4zvAx_-XZYHtvQB3gNkC9oUjCY4uE14Q3YVFeLm9wdpFq7xEAJ3dRvm8DYPgqqF4Dr_MOmIvboFjtW5C2nNCQYzvauRdbxjkQFT8lSgkvO9dbL80zBgDzTXhR0n_NPBQVUIf0NnWTWXX3mLQoadoGtNZegqwaQaTv2uZ7RZq1eYMHwwRzCojLR2LWdi8Hr-X44oso7rbI8JGed95dm-0rw2FK0WI19cIgUO1DA5BP4A0kCgizZ7AxX1oLOXcadzYq4iqjP9WoM2HwUvv0ThzQ2N_450vx8V-i5ZYttelpvDvMuHniEkMm-GZh7qx3QFaxu7ohddPR73Q2dPFugA7rFJjV6ks0; path=/; HttpOnly"
        }, {
          "name" : "X-SourceFiles",
          "value" : "=?UTF-8?B?RDpcVmlydHVhbE9wdGltaXplci1SZWZhY3RvcmluZ1xDcm9wTWV0cmljcy5Wby5BcGlcQ3JvcE1ldHJpY3MuVm8uQXBpXGFwaVxhZG1pblx2MVx1c2Vyc1w1?="
        }, {
          "name" : "X-Powered-By",
          "value" : "ASP.NET"
        }, {
          "name" : "Date",
          "value" : "Fri, 29 Mar 2019 22:13:24 GMT"
        }, {
          "name" : "Content-Length",
          "value" : "0"
        } ],
        "content" : {
          "size" : 0,
          "mimeType" : "",
          "text" : "",
          "encoding" : "base64",
          "comment" : ""
        },
        "redirectURL" : "",
        "headersSize" : 840,
        "bodySize" : 0,
        "comment" : ""
      },
      "cache" : { },
      "timings" : {
        "comment" : "",
        "connect" : -1,
        "wait" : 3744,
        "receive" : 1,
        "dns" : -1,
        "send" : 0,
        "blocked" : -1,
        "ssl" : -1
      },
      "serverIPAddress" : "127.0.0.1",
      "comment" : "",
      "_katalonRequestInformation" : {
        "name" : "7",
        "testObjectId" : "Object Repository/VoPro/Account/api_admin_v1_users_userprofileid",
        "harId" : "4303133e-7317-4b32-a258-1789b45b588f"
      },
      "time" : 3745
    } ],
    "comment" : ""
  }
}