{
  "log" : {
    "version" : "1.2",
    "creator" : {
      "name" : "BrowserMob Proxy",
      "version" : "2.1.5",
      "comment" : ""
    },
    "pages" : [ {
      "id" : "Page 0",
      "startedDateTime" : "2019-03-28T18:58:34.284Z",
      "title" : "Page 0",
      "pageTimings" : {
        "onLoad" : 1276,
        "comment" : ""
      },
      "comment" : ""
    } ],
    "entries" : [ {
      "pageref" : "Page 0",
      "startedDateTime" : "2019-03-28T18:58:34.285Z",
      "request" : {
        "method" : "POST",
        "url" : "http://localhost:10520/WebAPI/api/admin/v1/users/?",
        "httpVersion" : "HTTP/1.1",
        "cookies" : [ ],
        "headers" : [ {
          "name" : "User-Agent",
          "value" : "Katalon Studio"
        }, {
          "name" : "Content-Type",
          "value" : "application/x-www-form-urlencoded"
        }, {
          "name" : "Authorization",
          "value" : "Bearer eyJ0eXAiOiJKV1QiLCJhbGciOiJIUzI1NiJ9.eyJ1bmlxdWVfbmFtZSI6ImFkbWluIiwicm9sZSI6InVzZXIiLCJzdWIiOiJhZG1pbiIsImlzcyI6IkNyb3BNZXRyaWNzIiwiYXVkIjoiYWxsIiwiZXhwIjoxNTUzODAzNDE0LCJuYmYiOjE1NTM3OTk1MTR9.Lm7-TR-IUdkkUMO4bOHknQZRHR3C-JF7tjTiYdfmLp0"
        }, {
          "name" : "Host",
          "value" : "localhost:10520"
        }, {
          "name" : "Accept",
          "value" : "text/html, image/gif, image/jpeg, *; q=.2, */*; q=.2"
        }, {
          "name" : "Proxy-Connection",
          "value" : "keep-alive"
        }, {
          "name" : "Content-Length",
          "value" : "353"
        } ],
        "queryString" : [ ],
        "postData" : {
          "mimeType" : "application/x-www-form-urlencoded",
          "params" : [ {
            "name" : "password",
            "value" : "cropmetrics",
            "comment" : ""
          }, {
            "name" : "email",
            "value" : "cropmetricsvo@gmail.com",
            "comment" : ""
          }, {
            "name" : "fullname",
            "value" : "test validation phone attribute as characters instead of numbers",
            "comment" : ""
          }, {
            "name" : "phone",
            "value" : "one",
            "comment" : ""
          }, {
            "name" : "dealer",
            "value" : "dealer test validation",
            "comment" : ""
          }, {
            "name" : "addressLine1",
            "value" : "address line 1 test validation",
            "comment" : ""
          }, {
            "name" : "addressLine2",
            "value" : "address line 1 test validation",
            "comment" : ""
          }, {
            "name" : "town",
            "value" : "townValidation",
            "comment" : ""
          }, {
            "name" : "state",
            "value" : "stateValidation",
            "comment" : ""
          }, {
            "name" : "zip",
            "value" : "zipValidation",
            "comment" : ""
          }, {
            "name" : "country",
            "value" : "countryValidation",
            "comment" : ""
          }, {
            "name" : "roles",
            "value" : "Client",
            "comment" : ""
          } ],
          "comment" : ""
        },
        "headersSize" : 544,
        "bodySize" : 353,
        "comment" : ""
      },
      "response" : {
        "status" : 200,
        "statusText" : "OK",
        "httpVersion" : "HTTP/1.1",
        "cookies" : [ {
          "name" : ".ASPROLES",
          "value" : "mXk6cAKhUJNdK7zfyyjDiKLBEdTpEFDqdRpPSt9Kg3LTaEvipmA2f3lhlmfezmnS0tZPYGXK8gccq-fFHSHVYjJivSkYgQky8MQpOdsxckoynbgqkfpDVZQpjW40QRwLi5mzd-e4kBzuuHLi6KSxnGv0Q8JnJ9QlWggAXFkL-Om7ZZaUMRCJOhanV4F_68JjvWzRxZPUFS16J828dAxm6coP0k4p-iW46RwIJe-h8EbGe3CKn-nGDeRufnd-Ksml7kSoJinJ4vvChaxfnVONPlB566WAb3Lc7S9H6T5Nw7pB073Tnq7K9SDaeBkCui5gyaDveunWxqoLf-cGFOJobDY1U8IMgnuCCjw18J6_OuaJBwDrOly7BVgC8oXQwBVqTDu9JYe08ISEnWBepQ_fiZkmfjlnszmMrWQHPrvnhPmv92dqYj0MTl4r8hd_7pybUMsWmssU1zlZHeYoaTw0H-GMBE0T7HFzFI_WreWBOTcY15rs0",
          "path" : "/",
          "httpOnly" : true,
          "secure" : false,
          "comment" : ""
        } ],
        "headers" : [ {
          "name" : "Cache-Control",
          "value" : "private"
        }, {
          "name" : "Content-Type",
          "value" : "application/json; charset=utf-8"
        }, {
          "name" : "Server",
          "value" : "Microsoft-IIS/10.0"
        }, {
          "name" : "Set-Cookie",
          "value" : ".ASPROLES=mXk6cAKhUJNdK7zfyyjDiKLBEdTpEFDqdRpPSt9Kg3LTaEvipmA2f3lhlmfezmnS0tZPYGXK8gccq-fFHSHVYjJivSkYgQky8MQpOdsxckoynbgqkfpDVZQpjW40QRwLi5mzd-e4kBzuuHLi6KSxnGv0Q8JnJ9QlWggAXFkL-Om7ZZaUMRCJOhanV4F_68JjvWzRxZPUFS16J828dAxm6coP0k4p-iW46RwIJe-h8EbGe3CKn-nGDeRufnd-Ksml7kSoJinJ4vvChaxfnVONPlB566WAb3Lc7S9H6T5Nw7pB073Tnq7K9SDaeBkCui5gyaDveunWxqoLf-cGFOJobDY1U8IMgnuCCjw18J6_OuaJBwDrOly7BVgC8oXQwBVqTDu9JYe08ISEnWBepQ_fiZkmfjlnszmMrWQHPrvnhPmv92dqYj0MTl4r8hd_7pybUMsWmssU1zlZHeYoaTw0H-GMBE0T7HFzFI_WreWBOTcY15rs0; path=/; HttpOnly"
        }, {
          "name" : "X-SourceFiles",
          "value" : "=?UTF-8?B?RDpcVmlydHVhbE9wdGltaXplci1SZWZhY3RvcmluZ1xDcm9wTWV0cmljcy5Wby5BcGlcQ3JvcE1ldHJpY3MuVm8uQXBpXGFwaVxhZG1pblx2MVx1c2Vyc1w=?="
        }, {
          "name" : "X-Powered-By",
          "value" : "ASP.NET"
        }, {
          "name" : "Date",
          "value" : "Thu, 28 Mar 2019 18:58:35 GMT"
        }, {
          "name" : "Content-Length",
          "value" : "8"
        } ],
        "content" : {
          "size" : 8,
          "mimeType" : "application/json; charset=utf-8",
          "text" : "{\"id\":5}",
          "comment" : ""
        },
        "redirectURL" : "",
        "headersSize" : 887,
        "bodySize" : 8,
        "comment" : ""
      },
      "cache" : { },
      "timings" : {
        "comment" : "",
        "ssl" : -1,
        "connect" : -1,
        "blocked" : -1,
        "receive" : 1,
        "dns" : -1,
        "wait" : 1274,
        "send" : 1
      },
      "serverIPAddress" : "127.0.0.1",
      "comment" : "",
      "_katalonRequestInformation" : {
        "name" : "13",
        "testObjectId" : "Object Repository/VoPro/Account/api_admin_v1_users",
        "harId" : "d3dd99b4-2ca9-445b-b57d-3e1725502157"
      },
      "time" : 1276
    } ],
    "comment" : ""
  }
}