{
  "log" : {
    "version" : "1.2",
    "creator" : {
      "name" : "BrowserMob Proxy",
      "version" : "2.1.5",
      "comment" : ""
    },
    "pages" : [ {
      "id" : "Page 0",
      "startedDateTime" : "2019-04-09T09:51:29.816Z",
      "title" : "Page 0",
      "pageTimings" : {
        "onLoad" : 3411,
        "comment" : ""
      },
      "comment" : ""
    } ],
    "entries" : [ {
      "pageref" : "Page 0",
      "startedDateTime" : "2019-04-09T09:51:29.818Z",
      "request" : {
        "method" : "POST",
        "url" : "http://localhost:10520/WebAPI/api/mobile/v1/fields?",
        "httpVersion" : "HTTP/1.1",
        "cookies" : [ ],
        "headers" : [ {
          "name" : "User-Agent",
          "value" : "Katalon Studio"
        }, {
          "name" : "Content-Type",
          "value" : "application/json"
        }, {
          "name" : "Authorization",
          "value" : "Bearer eyJ0eXAiOiJKV1QiLCJhbGciOiJIUzI1NiJ9.eyJ1bmlxdWVfbmFtZSI6Implbm55Lm1hbGRvbmFkby50eDFAZ21haWwuY29tIiwicm9sZSI6InVzZXIiLCJzdWIiOiJqZW5ueS5tYWxkb25hZG8udHgxQGdtYWlsLmNvbSIsImlzcyI6IkNyb3BNZXRyaWNzIiwiYXVkIjoiYWxsIiwiZXhwIjoxNTU0ODA3Mzg5LCJuYmYiOjE1NTQ4MDM0ODl9.ud14uz5IkbZVC9znR6mYjn4mcfZAqqu7azZDxiPjyMM"
        }, {
          "name" : "Host",
          "value" : "localhost:10520"
        }, {
          "name" : "Accept",
          "value" : "text/html, image/gif, image/jpeg, *; q=.2, */*; q=.2"
        }, {
          "name" : "Proxy-Connection",
          "value" : "keep-alive"
        }, {
          "name" : "Content-Length",
          "value" : "371"
        } ],
        "queryString" : [ ],
        "postData" : {
          "mimeType" : "application/json",
          "text" : "{\"field\":{\"farm_id\":7,\"name\":\"Field without x value in boundary\",\"boundary\":{\"boundaries\":[{\"boundary\":{\"coords\":[{\"x\":-101.49568751,\"y\":37.14976293},{\"x\":-101.50049403,\"y\":37.14647907},{\"x\":-101.50049403,\"y\":37.14264773},{\"x\":-101.49723246,\"y\":37.1411425},{\"x\":-101.49019435,\"y\":37.14223722},{\"x\":-101.48933604,\"y\":37.14620541},{\"x\":-101.49294093,\"y\":37.14866833}]}}]}}}",
          "comment" : ""
        },
        "headersSize" : 592,
        "bodySize" : 371,
        "comment" : ""
      },
      "response" : {
        "status" : 400,
        "statusText" : "Bad Request",
        "httpVersion" : "HTTP/1.1",
        "cookies" : [ {
          "name" : ".ASPROLES",
          "value" : "0i2HWdRco3zLIJBscV0fsu0MSZynbm3B20cVPAZjf7VVKycwepsiqGHL7e2O0xBhk_F-iJ6R8DGPWieCX6CpYr2iU4JZ33UlxPlp0R8--nv85dvmDV9ahhmMH1b_xh142D9Tk7PSeyZS0BTCvSST98B95M6PaM2E4fS7MaDxS1PCfKcPPWkyw2QH7XOaUPO2mjfllMDSKwC_d4nuNPUSACXV5yJfhejccxvmpSalc7Z8FInnm3zIZMXSUQITBRMchbyYXCkpEARoRh-Wpdynvf4_ajWF96Ym9Wye93pySsWvze9nNrRyOwGYKlolKTlZYiGqgjMs4goZZ4IkIdAhEh5jVZZmkbXiOEswS4Z-PLRD0bWkRWn7TuYCli6z8VafA6CDRRv8ENph6knr6pxnq87uTxaoCPD6MZE-8OnZF8_VSywSGvYdwNjqVBxERSJVVJ01D4JlG9uY3r1s9QuayP7xTYiZ-jbUiU_ZRHhwJFbsgXsK0FmygynAcp4cdWYs4qvYE8CiP04tKF9YgjVNit_KWxk1",
          "path" : "/",
          "httpOnly" : true,
          "secure" : false,
          "comment" : ""
        } ],
        "headers" : [ {
          "name" : "Cache-Control",
          "value" : "private"
        }, {
          "name" : "Content-Type",
          "value" : "application/json; charset=utf-8"
        }, {
          "name" : "Server",
          "value" : "Microsoft-IIS/10.0"
        }, {
          "name" : "Set-Cookie",
          "value" : ".ASPROLES=0i2HWdRco3zLIJBscV0fsu0MSZynbm3B20cVPAZjf7VVKycwepsiqGHL7e2O0xBhk_F-iJ6R8DGPWieCX6CpYr2iU4JZ33UlxPlp0R8--nv85dvmDV9ahhmMH1b_xh142D9Tk7PSeyZS0BTCvSST98B95M6PaM2E4fS7MaDxS1PCfKcPPWkyw2QH7XOaUPO2mjfllMDSKwC_d4nuNPUSACXV5yJfhejccxvmpSalc7Z8FInnm3zIZMXSUQITBRMchbyYXCkpEARoRh-Wpdynvf4_ajWF96Ym9Wye93pySsWvze9nNrRyOwGYKlolKTlZYiGqgjMs4goZZ4IkIdAhEh5jVZZmkbXiOEswS4Z-PLRD0bWkRWn7TuYCli6z8VafA6CDRRv8ENph6knr6pxnq87uTxaoCPD6MZE-8OnZF8_VSywSGvYdwNjqVBxERSJVVJ01D4JlG9uY3r1s9QuayP7xTYiZ-jbUiU_ZRHhwJFbsgXsK0FmygynAcp4cdWYs4qvYE8CiP04tKF9YgjVNit_KWxk1; path=/; HttpOnly"
        }, {
          "name" : "X-SourceFiles",
          "value" : "=?UTF-8?B?RDpcVmlydHVhbE9wdGltaXplci1SZWZhY3RvcmluZ1xDcm9wTWV0cmljcy5Wby5BcGlcQ3JvcE1ldHJpY3MuVm8uQXBpXGFwaVxtb2JpbGVcdjFcZmllbGRz?="
        }, {
          "name" : "X-Powered-By",
          "value" : "ASP.NET"
        }, {
          "name" : "Date",
          "value" : "Tue, 09 Apr 2019 09:51:33 GMT"
        }, {
          "name" : "Content-Length",
          "value" : "119"
        } ],
        "content" : {
          "size" : 119,
          "mimeType" : "application/json; charset=utf-8",
          "text" : "{\"message\":\"The Boundary is not valid. IllegalArgumentException: Points of LinearRing do not form a closed linestring\"}",
          "comment" : ""
        },
        "redirectURL" : "",
        "headersSize" : 941,
        "bodySize" : 119,
        "comment" : ""
      },
      "cache" : { },
      "timings" : {
        "comment" : "",
        "ssl" : -1,
        "connect" : -1,
        "blocked" : -1,
        "dns" : -1,
        "send" : 0,
        "receive" : 0,
        "wait" : 3403
      },
      "serverIPAddress" : "127.0.0.1",
      "comment" : "",
      "_katalonRequestInformation" : {
        "name" : "63",
        "testObjectId" : "Object Repository/VoGrow/Field/FieldPost",
        "harId" : "0c6852fc-0aed-4efb-9a0f-105551cd6416"
      },
      "time" : 3404
    } ],
    "comment" : ""
  }
}