{
  "log" : {
    "version" : "1.2",
    "creator" : {
      "name" : "BrowserMob Proxy",
      "version" : "2.1.5",
      "comment" : ""
    },
    "pages" : [ {
      "id" : "Page 0",
      "startedDateTime" : "2019-04-09T21:05:52.004Z",
      "title" : "Page 0",
      "pageTimings" : {
        "onLoad" : 28,
        "comment" : ""
      },
      "comment" : ""
    } ],
    "entries" : [ {
      "pageref" : "Page 0",
      "startedDateTime" : "2019-04-09T21:05:52.004Z",
      "request" : {
        "method" : "PUT",
        "url" : "http://localhost:10520/WebAPI/api/mobile/v1/fields/3?",
        "httpVersion" : "HTTP/1.1",
        "cookies" : [ ],
        "headers" : [ {
          "name" : "User-Agent",
          "value" : "Katalon Studio"
        }, {
          "name" : "Content-Type",
          "value" : "application/json"
        }, {
          "name" : "Authorization",
          "value" : "Bearer eyJ0eXAiOiJKV1QiLCJhbGciOiJIUzI1NiJ9.eyJ1bmlxdWVfbmFtZSI6Implbm55Lm1hbGRvbmFkby50eDFAZ21haWwuY29tIiwicm9sZSI6InVzZXIiLCJzdWIiOiJqZW5ueS5tYWxkb25hZG8udHgxQGdtYWlsLmNvbSIsImlzcyI6IkNyb3BNZXRyaWNzIiwiYXVkIjoiYWxsIiwiZXhwIjoxNTU0ODQ3ODUxLCJuYmYiOjE1NTQ4NDM5NTF9.2wJsciYfhKQtb79hZ_fJAH8F3YQpPVnxEHCiOJsemP0"
        }, {
          "name" : "Host",
          "value" : "localhost:10520"
        }, {
          "name" : "Accept",
          "value" : "text/html, image/gif, image/jpeg, *; q=.2, */*; q=.2"
        }, {
          "name" : "Proxy-Connection",
          "value" : "keep-alive"
        }, {
          "name" : "Content-Length",
          "value" : "388"
        } ],
        "queryString" : [ ],
        "postData" : {
          "mimeType" : "application/json",
          "text" : "{\"field\":{\"name\":\"Field whit invalid spaces values on boundary\",\"boundary\":{\"boundaries\":[{\"boundary\":{\"coords\":[{\"x\":\" \",\"y\":\" \"},{\"x\":-101.50049403,\"y\":37.14647907},{\"x\":-101.50049403,\"y\":37.14264773},{\"x\":-101.49723246,\"y\":37.1411425},{\"x\":-101.49019435,\"y\":37.14223722},{\"x\":-101.48933604,\"y\":37.14620541},{\"x\":-101.49294093,\"y\":37.14866833},{\"x\":-101.49568751,\"y\":37.14976293}]}}]}}}",
          "comment" : ""
        },
        "headersSize" : 593,
        "bodySize" : 388,
        "comment" : ""
      },
      "response" : {
        "status" : 400,
        "statusText" : "Bad Request",
        "httpVersion" : "HTTP/1.1",
        "cookies" : [ {
          "name" : ".ASPROLES",
          "value" : "RTwzTKRyG8cX-KuB6mEx2oI0GoTxtNta52Kmz46oUxU9UY_WR5JMGmMde_X4I3VA8qTSoRchgtgaapcWZeCI1SLNTwz6Fy3DOwEstzS5RY5YzxRJ3XlkSS6Hwxpdp4aF3n6uLJMliG3GYc_Kie72iJWp9IQ3XqyZQm1XPwoFA6dpepIjURi4mhob7ggeMjpKqISJbSRh6QFEkZ8RdMG6WmSdpF1UnJQgr8B357Pq4zBTOjxgECMUgq9NdJlfNst4TITKSKUmrwwzRVtX2Vy5MTqxAbAhyQXe4EGQ91JMuccDnfXHOtIR6wqeGpz-QTqA0N7wKrJCNE9jJS7AfCqfYBKJtaup6ZQsEd21LnAENhs91YyIRblYA-ShVkB_HHcOVjF6nOUD-MHaI_1ps95kdocbYYRb8ps90S5mF74wA7Xs3mluYfmjx656ouTcxa-TUvY5YpcK4PAGFJ0SVqaij-GOll9k_XpJiB-m-vJCBs2QMJarqHAbEiuw_prYXwOfnWAFhwltaBFjZEcWPgtYXXj47Mw1",
          "path" : "/",
          "httpOnly" : true,
          "secure" : false,
          "comment" : ""
        } ],
        "headers" : [ {
          "name" : "Cache-Control",
          "value" : "private"
        }, {
          "name" : "Content-Type",
          "value" : "application/json; charset=utf-8"
        }, {
          "name" : "Server",
          "value" : "Microsoft-IIS/10.0"
        }, {
          "name" : "Set-Cookie",
          "value" : ".ASPROLES=RTwzTKRyG8cX-KuB6mEx2oI0GoTxtNta52Kmz46oUxU9UY_WR5JMGmMde_X4I3VA8qTSoRchgtgaapcWZeCI1SLNTwz6Fy3DOwEstzS5RY5YzxRJ3XlkSS6Hwxpdp4aF3n6uLJMliG3GYc_Kie72iJWp9IQ3XqyZQm1XPwoFA6dpepIjURi4mhob7ggeMjpKqISJbSRh6QFEkZ8RdMG6WmSdpF1UnJQgr8B357Pq4zBTOjxgECMUgq9NdJlfNst4TITKSKUmrwwzRVtX2Vy5MTqxAbAhyQXe4EGQ91JMuccDnfXHOtIR6wqeGpz-QTqA0N7wKrJCNE9jJS7AfCqfYBKJtaup6ZQsEd21LnAENhs91YyIRblYA-ShVkB_HHcOVjF6nOUD-MHaI_1ps95kdocbYYRb8ps90S5mF74wA7Xs3mluYfmjx656ouTcxa-TUvY5YpcK4PAGFJ0SVqaij-GOll9k_XpJiB-m-vJCBs2QMJarqHAbEiuw_prYXwOfnWAFhwltaBFjZEcWPgtYXXj47Mw1; path=/; HttpOnly"
        }, {
          "name" : "X-SourceFiles",
          "value" : "=?UTF-8?B?RDpcVmlydHVhbE9wdGltaXplci1SZWZhY3RvcmluZ1xDcm9wTWV0cmljcy5Wby5BcGlcQ3JvcE1ldHJpY3MuVm8uQXBpXGFwaVxtb2JpbGVcdjFcZmllbGRzXDM=?="
        }, {
          "name" : "X-Powered-By",
          "value" : "ASP.NET"
        }, {
          "name" : "Date",
          "value" : "Tue, 09 Apr 2019 21:05:51 GMT"
        }, {
          "name" : "Content-Length",
          "value" : "37"
        } ],
        "content" : {
          "size" : 37,
          "mimeType" : "application/json; charset=utf-8",
          "text" : "{\"message\":\"The request is invalid.\"}",
          "comment" : ""
        },
        "redirectURL" : "",
        "headersSize" : 944,
        "bodySize" : 37,
        "comment" : ""
      },
      "cache" : { },
      "timings" : {
        "comment" : "",
        "send" : 0,
        "connect" : -1,
        "dns" : -1,
        "receive" : 0,
        "wait" : 28,
        "blocked" : -1,
        "ssl" : -1
      },
      "serverIPAddress" : "127.0.0.1",
      "comment" : "",
      "_katalonRequestInformation" : {
        "name" : "94",
        "testObjectId" : "Object Repository/VoGrow/Field/FieldPut",
        "harId" : "a670ab12-0177-409d-8137-196717b1bd45"
      },
      "time" : 28
    } ],
    "comment" : ""
  }
}