{
  "log" : {
    "version" : "1.2",
    "creator" : {
      "name" : "BrowserMob Proxy",
      "version" : "2.1.5",
      "comment" : ""
    },
    "pages" : [ {
      "id" : "Page 0",
      "startedDateTime" : "2019-04-09T21:06:46.244Z",
      "title" : "Page 0",
      "pageTimings" : {
        "onLoad" : 131,
        "comment" : ""
      },
      "comment" : ""
    } ],
    "entries" : [ {
      "pageref" : "Page 0",
      "startedDateTime" : "2019-04-09T21:06:46.246Z",
      "request" : {
        "method" : "GET",
        "url" : "http://localhost:10520/WebAPI/api/mobile/v1/user?",
        "httpVersion" : "HTTP/1.1",
        "cookies" : [ ],
        "headers" : [ {
          "name" : "User-Agent",
          "value" : "Katalon Studio"
        }, {
          "name" : "Content-Type",
          "value" : "application/json"
        }, {
          "name" : "Authorization",
          "value" : "Bearer eyJ0eXAiOiJKV1QiLCJhbGciOiJIUzI1NiJ9.eyJ1bmlxdWVfbmFtZSI6Implbm55Lm1hbGRvbmFkby50eDJAZ21haWwuY29tIiwicm9sZSI6InVzZXIiLCJzdWIiOiJqZW5ueS5tYWxkb25hZG8udHgyQGdtYWlsLmNvbSIsImlzcyI6IkNyb3BNZXRyaWNzIiwiYXVkIjoiYWxsIiwiZXhwIjoxNTU0ODQ3OTA2LCJuYmYiOjE1NTQ4NDQwMDZ9.N-EgCkY5IuvGD2DoCoZX6LERkue_KIVWpDRDogsmWBc"
        }, {
          "name" : "Host",
          "value" : "localhost:10520"
        }, {
          "name" : "Accept",
          "value" : "text/html, image/gif, image/jpeg, *; q=.2, */*; q=.2"
        }, {
          "name" : "Proxy-Connection",
          "value" : "keep-alive"
        } ],
        "queryString" : [ ],
        "headersSize" : 568,
        "bodySize" : 0,
        "comment" : ""
      },
      "response" : {
        "status" : 200,
        "statusText" : "OK",
        "httpVersion" : "HTTP/1.1",
        "cookies" : [ {
          "name" : ".ASPROLES",
          "value" : "wGpEqgOk24iFnkDeqzCT_95ake-RqWYB_lPjx8DWDH700dicqUVeNiA98dbRzKO5BWdzPC1sNSp2gXStMjh_wDCX2xdjoZufVOq7uWXTRFlS9mGkWgjr-b6Nx5zFz9iWCWjl-SQ_q97Yxfj3mJEdSiRpmOvf-1nDE_26_EkVssgqfFWwmo_5Y0CAYxzfgej33byDMbDRwOUlHMhd687EfQ6VpcDWDD8zncjTsZqWgwxFBi9dOiOqs5TDVYeD8xsBrx9vPveGVJ5HQCU0W52TNKcFUsCdhingV572o-CLR3LBa8i_drz03u0ZWBxOcHxmyD9mnIv-n03V7CX8uQr56oKCYFUxDQWONTjOdVfk3DL7HUKt4Qx1IDTW3awBMqIx0vkaZVt-LEJAZxhsv6e6y6xYPNvblO2pcZ5mKNPe3A5AMIQ-1vGMAS1rSZgPBGU5iQX34aq7skvA8lHo45MffdR7IiKz97gNyHLFBEj0uNBYzS7YvLMEvYLbFYceb15al6Yxnw2",
          "path" : "/",
          "httpOnly" : true,
          "secure" : false,
          "comment" : ""
        } ],
        "headers" : [ {
          "name" : "Cache-Control",
          "value" : "private"
        }, {
          "name" : "Content-Type",
          "value" : "application/json; charset=utf-8"
        }, {
          "name" : "Server",
          "value" : "Microsoft-IIS/10.0"
        }, {
          "name" : "Set-Cookie",
          "value" : ".ASPROLES=wGpEqgOk24iFnkDeqzCT_95ake-RqWYB_lPjx8DWDH700dicqUVeNiA98dbRzKO5BWdzPC1sNSp2gXStMjh_wDCX2xdjoZufVOq7uWXTRFlS9mGkWgjr-b6Nx5zFz9iWCWjl-SQ_q97Yxfj3mJEdSiRpmOvf-1nDE_26_EkVssgqfFWwmo_5Y0CAYxzfgej33byDMbDRwOUlHMhd687EfQ6VpcDWDD8zncjTsZqWgwxFBi9dOiOqs5TDVYeD8xsBrx9vPveGVJ5HQCU0W52TNKcFUsCdhingV572o-CLR3LBa8i_drz03u0ZWBxOcHxmyD9mnIv-n03V7CX8uQr56oKCYFUxDQWONTjOdVfk3DL7HUKt4Qx1IDTW3awBMqIx0vkaZVt-LEJAZxhsv6e6y6xYPNvblO2pcZ5mKNPe3A5AMIQ-1vGMAS1rSZgPBGU5iQX34aq7skvA8lHo45MffdR7IiKz97gNyHLFBEj0uNBYzS7YvLMEvYLbFYceb15al6Yxnw2; path=/; HttpOnly"
        }, {
          "name" : "X-SourceFiles",
          "value" : "=?UTF-8?B?RDpcVmlydHVhbE9wdGltaXplci1SZWZhY3RvcmluZ1xDcm9wTWV0cmljcy5Wby5BcGlcQ3JvcE1ldHJpY3MuVm8uQXBpXGFwaVxtb2JpbGVcdjFcdXNlcg==?="
        }, {
          "name" : "X-Powered-By",
          "value" : "ASP.NET"
        }, {
          "name" : "Date",
          "value" : "Tue, 09 Apr 2019 21:06:46 GMT"
        }, {
          "name" : "Content-Length",
          "value" : "211"
        } ],
        "content" : {
          "size" : 211,
          "mimeType" : "application/json; charset=utf-8",
          "text" : "{\"id\":4,\"name\":\"grower without agent\",\"email\":\"jenny.maldonado.tx2@gmail.com\",\"address_line1\":\"x\",\"address_line2\":\"\",\"town\":\"x\",\"state\":\"NE\",\"zip\":\"x\",\"country\":\"USA\",\"phone\":\"\",\"role\":\"Client\",\"roles\":\"Client\"}",
          "comment" : ""
        },
        "redirectURL" : "",
        "headersSize" : 911,
        "bodySize" : 211,
        "comment" : ""
      },
      "cache" : { },
      "timings" : {
        "comment" : "",
        "ssl" : -1,
        "receive" : 1,
        "blocked" : -1,
        "send" : 0,
        "wait" : 125,
        "dns" : -1,
        "connect" : -1
      },
      "serverIPAddress" : "127.0.0.1",
      "comment" : "",
      "_katalonRequestInformation" : {
        "name" : "3",
        "testObjectId" : "Object Repository/VoGrow/User/User",
        "harId" : "0f7a26b5-970a-414e-891f-d67c5031973a"
      },
      "time" : 126
    } ],
    "comment" : ""
  }
}