{
  "log" : {
    "version" : "1.2",
    "creator" : {
      "name" : "BrowserMob Proxy",
      "version" : "2.1.5",
      "comment" : ""
    },
    "pages" : [ {
      "id" : "Page 0",
      "startedDateTime" : "2019-04-09T21:05:41.879Z",
      "title" : "Page 0",
      "pageTimings" : {
        "onLoad" : 4855,
        "comment" : ""
      },
      "comment" : ""
    } ],
    "entries" : [ {
      "pageref" : "Page 0",
      "startedDateTime" : "2019-04-09T21:05:41.881Z",
      "request" : {
        "method" : "PUT",
        "url" : "http://localhost:10520/WebAPI/api/mobile/v1/fields/3?",
        "httpVersion" : "HTTP/1.1",
        "cookies" : [ ],
        "headers" : [ {
          "name" : "User-Agent",
          "value" : "Katalon Studio"
        }, {
          "name" : "Content-Type",
          "value" : "application/json"
        }, {
          "name" : "Authorization",
          "value" : "Bearer eyJ0eXAiOiJKV1QiLCJhbGciOiJIUzI1NiJ9.eyJ1bmlxdWVfbmFtZSI6Implbm55Lm1hbGRvbmFkby50eDFAZ21haWwuY29tIiwicm9sZSI6InVzZXIiLCJzdWIiOiJqZW5ueS5tYWxkb25hZG8udHgxQGdtYWlsLmNvbSIsImlzcyI6IkNyb3BNZXRyaWNzIiwiYXVkIjoiYWxsIiwiZXhwIjoxNTU0ODQ3ODQxLCJuYmYiOjE1NTQ4NDM5NDF9.kzCxpxtRm058gUBWf-aA_g3HiwA_wjUP-tcsDf407GM"
        }, {
          "name" : "Host",
          "value" : "localhost:10520"
        }, {
          "name" : "Accept",
          "value" : "text/html, image/gif, image/jpeg, *; q=.2, */*; q=.2"
        }, {
          "name" : "Proxy-Connection",
          "value" : "keep-alive"
        }, {
          "name" : "Content-Length",
          "value" : "401"
        } ],
        "queryString" : [ ],
        "postData" : {
          "mimeType" : "application/json",
          "text" : "{\"field\":{\"name\":\"Field whit invalid y value on boundary\",\"boundary\":{\"boundaries\":[{\"boundary\":{\"coords\":[{\"x\":-101.49568751,\"y\":137.14976293},{\"x\":-101.50049403,\"y\":37.14647907},{\"x\":-101.50049403,\"y\":37.14264773},{\"x\":-101.49723246,\"y\":37.1411425},{\"x\":-101.49019435,\"y\":37.14223722},{\"x\":-101.48933604,\"y\":37.14620541},{\"x\":-101.49294093,\"y\":37.14866833},{\"x\":-101.49568751,\"y\":37.14976293}]}}]}}}",
          "comment" : ""
        },
        "headersSize" : 593,
        "bodySize" : 401,
        "comment" : ""
      },
      "response" : {
        "status" : 400,
        "statusText" : "Bad Request",
        "httpVersion" : "HTTP/1.1",
        "cookies" : [ {
          "name" : ".ASPROLES",
          "value" : "eOjwCwPnAEa3z6gy6J6Oofry2XNEvpjvsHsZp8anTvvZB7sQMbWII4IevEDAL5KWEbfS1i3p31cMdWs_BsXpLDrWp4HJShY4KeYHZFRdGKQGC8xVKJM7ShJlcJrUp6Rp3GCQKKv46RhgWg6U4EfYthleNFlH-fROVh6-xRKxtVxybxwvGIwNqmAQuil3lA9zJxVCcJ_Fqe1Md7T4n-JddSJiBfsBglLmeD1xYB0hjAe2pmLitXLFAyDtJ7VQa4lJ7TyA1wfj7H2A6HO2sOkaOIEWuT2eWx_35dO_1zP1cuAwciOKicVS1KKR49OOKsk8DexDf2fSspWI-W5CqZUS9PZDEM5uFmdmixcK0UGVIajqwq3-zL_GYtvxQrgqIEIGahrMxJ3G6LLttGRuqDqnDK_uoPwVy_Ctq0tVrmPVwuDQ14ERdB2T7xAkpdff4isZIgRfocSu9a5xEUn0G-LupZ5Vym9fJnOYx-ylnc0ciFYpGmpMVZeLdHU_oD1ZXDlZmxk-cC07LqSadh88wZK4M2neOWQ1",
          "path" : "/",
          "httpOnly" : true,
          "secure" : false,
          "comment" : ""
        } ],
        "headers" : [ {
          "name" : "Cache-Control",
          "value" : "private"
        }, {
          "name" : "Content-Type",
          "value" : "application/json; charset=utf-8"
        }, {
          "name" : "Server",
          "value" : "Microsoft-IIS/10.0"
        }, {
          "name" : "Set-Cookie",
          "value" : ".ASPROLES=eOjwCwPnAEa3z6gy6J6Oofry2XNEvpjvsHsZp8anTvvZB7sQMbWII4IevEDAL5KWEbfS1i3p31cMdWs_BsXpLDrWp4HJShY4KeYHZFRdGKQGC8xVKJM7ShJlcJrUp6Rp3GCQKKv46RhgWg6U4EfYthleNFlH-fROVh6-xRKxtVxybxwvGIwNqmAQuil3lA9zJxVCcJ_Fqe1Md7T4n-JddSJiBfsBglLmeD1xYB0hjAe2pmLitXLFAyDtJ7VQa4lJ7TyA1wfj7H2A6HO2sOkaOIEWuT2eWx_35dO_1zP1cuAwciOKicVS1KKR49OOKsk8DexDf2fSspWI-W5CqZUS9PZDEM5uFmdmixcK0UGVIajqwq3-zL_GYtvxQrgqIEIGahrMxJ3G6LLttGRuqDqnDK_uoPwVy_Ctq0tVrmPVwuDQ14ERdB2T7xAkpdff4isZIgRfocSu9a5xEUn0G-LupZ5Vym9fJnOYx-ylnc0ciFYpGmpMVZeLdHU_oD1ZXDlZmxk-cC07LqSadh88wZK4M2neOWQ1; path=/; HttpOnly"
        }, {
          "name" : "X-SourceFiles",
          "value" : "=?UTF-8?B?RDpcVmlydHVhbE9wdGltaXplci1SZWZhY3RvcmluZ1xDcm9wTWV0cmljcy5Wby5BcGlcQ3JvcE1ldHJpY3MuVm8uQXBpXGFwaVxtb2JpbGVcdjFcZmllbGRzXDM=?="
        }, {
          "name" : "X-Powered-By",
          "value" : "ASP.NET"
        }, {
          "name" : "Date",
          "value" : "Tue, 09 Apr 2019 21:05:46 GMT"
        }, {
          "name" : "Content-Length",
          "value" : "119"
        } ],
        "content" : {
          "size" : 119,
          "mimeType" : "application/json; charset=utf-8",
          "text" : "{\"message\":\"The Boundary is not valid. IllegalArgumentException: Points of LinearRing do not form a closed linestring\"}",
          "comment" : ""
        },
        "redirectURL" : "",
        "headersSize" : 945,
        "bodySize" : 119,
        "comment" : ""
      },
      "cache" : { },
      "timings" : {
        "comment" : "",
        "send" : 0,
        "connect" : -1,
        "dns" : -1,
        "receive" : 0,
        "wait" : 4849,
        "blocked" : -1,
        "ssl" : -1
      },
      "serverIPAddress" : "127.0.0.1",
      "comment" : "",
      "_katalonRequestInformation" : {
        "name" : "90",
        "testObjectId" : "Object Repository/VoGrow/Field/FieldPut",
        "harId" : "f820e2d1-71bd-4e9c-bf88-e0f54f574777"
      },
      "time" : 4850
    } ],
    "comment" : ""
  }
}