{
  "log" : {
    "version" : "1.2",
    "creator" : {
      "name" : "BrowserMob Proxy",
      "version" : "2.1.5",
      "comment" : ""
    },
    "pages" : [ {
      "id" : "Page 0",
      "startedDateTime" : "2019-03-28T21:50:55.735Z",
      "title" : "Page 0",
      "pageTimings" : {
        "onLoad" : 1364,
        "comment" : ""
      },
      "comment" : ""
    } ],
    "entries" : [ {
      "pageref" : "Page 0",
      "startedDateTime" : "2019-03-28T21:50:55.736Z",
      "request" : {
        "method" : "POST",
        "url" : "http://localhost:10520/WebAPI/api/admin/v1/users/?",
        "httpVersion" : "HTTP/1.1",
        "cookies" : [ ],
        "headers" : [ {
          "name" : "User-Agent",
          "value" : "Katalon Studio"
        }, {
          "name" : "Content-Type",
          "value" : "application/x-www-form-urlencoded"
        }, {
          "name" : "Authorization",
          "value" : "Bearer eyJ0eXAiOiJKV1QiLCJhbGciOiJIUzI1NiJ9.eyJ1bmlxdWVfbmFtZSI6ImFkbWluIiwicm9sZSI6InVzZXIiLCJzdWIiOiJhZG1pbiIsImlzcyI6IkNyb3BNZXRyaWNzIiwiYXVkIjoiYWxsIiwiZXhwIjoxNTUzODEzNzU1LCJuYmYiOjE1NTM4MDk4NTV9.ifAUik4A0n8A6nRzi6tS1jiBbx3cBI0IYAS2gwD6nOo"
        }, {
          "name" : "Host",
          "value" : "localhost:10520"
        }, {
          "name" : "Accept",
          "value" : "text/html, image/gif, image/jpeg, *; q=.2, */*; q=.2"
        }, {
          "name" : "Proxy-Connection",
          "value" : "keep-alive"
        }, {
          "name" : "Content-Length",
          "value" : "295"
        } ],
        "queryString" : [ ],
        "postData" : {
          "mimeType" : "application/x-www-form-urlencoded",
          "params" : [ {
            "name" : "password",
            "value" : "15characterspas",
            "comment" : ""
          }, {
            "name" : "email",
            "value" : "cropmetricsvo.15.pass@gmail.com",
            "comment" : ""
          }, {
            "name" : "fullname",
            "value" : "test validation",
            "comment" : ""
          }, {
            "name" : "phone",
            "value" : "123",
            "comment" : ""
          }, {
            "name" : "dealer",
            "value" : "x",
            "comment" : ""
          }, {
            "name" : "addressLine1",
            "value" : "address line 1 test validation",
            "comment" : ""
          }, {
            "name" : "addressLine2",
            "value" : "address line 1 test validation",
            "comment" : ""
          }, {
            "name" : "town",
            "value" : "townValidation",
            "comment" : ""
          }, {
            "name" : "state",
            "value" : "stateValidation",
            "comment" : ""
          }, {
            "name" : "zip",
            "value" : "zipValidation",
            "comment" : ""
          }, {
            "name" : "country",
            "value" : "countryValidation",
            "comment" : ""
          }, {
            "name" : "roles",
            "value" : "Client",
            "comment" : ""
          } ],
          "comment" : ""
        },
        "headersSize" : 544,
        "bodySize" : 295,
        "comment" : ""
      },
      "response" : {
        "status" : 200,
        "statusText" : "OK",
        "httpVersion" : "HTTP/1.1",
        "cookies" : [ {
          "name" : ".ASPROLES",
          "value" : "UqNVCwgnaxAO2A01Dj1n5gaYLTQnBgs5VD6alKdIBHUOHFe9AlF0ZdY20uLVKcaH7CI35GHflem2sc9SCadXgwX7YCPimTLr1tkqirPs1pymHNukVAj3_yIwbxcxQXg_1tW-GiuLvob-96sbUeKOpPh_Z-W0Bq5paAMPvKSaTyhJytz1EHniqDYlbcYboXPuxgusPypJWsRuP-i2fjCAWvzZwfb6vlgxeqzbLB2GGFXN_GJI1chg0k985nt-4k2W5AokTw1iNsH5KyGotdIE2-2a_sUh--rgupUZdlreMZzDoziQRSPh5ajQffjIocmy7nkzcum_Ni-y3OkancOhfmzTBUShoHFHuSkgotf6e0n7QnUk94rJvtwDVC4cwe9lJ-e1X0OakE-00MIQL-nTpdQ_DTmLd5b-JaU-11YA_YHJ49eJIru8NpXWCStYhT3fiA6xQe4XToBBC42gqm9AMn0mfqIDeccj62u-VRk6cSYU8h3c0",
          "path" : "/",
          "httpOnly" : true,
          "secure" : false,
          "comment" : ""
        } ],
        "headers" : [ {
          "name" : "Cache-Control",
          "value" : "private"
        }, {
          "name" : "Content-Type",
          "value" : "application/json; charset=utf-8"
        }, {
          "name" : "Server",
          "value" : "Microsoft-IIS/10.0"
        }, {
          "name" : "Set-Cookie",
          "value" : ".ASPROLES=UqNVCwgnaxAO2A01Dj1n5gaYLTQnBgs5VD6alKdIBHUOHFe9AlF0ZdY20uLVKcaH7CI35GHflem2sc9SCadXgwX7YCPimTLr1tkqirPs1pymHNukVAj3_yIwbxcxQXg_1tW-GiuLvob-96sbUeKOpPh_Z-W0Bq5paAMPvKSaTyhJytz1EHniqDYlbcYboXPuxgusPypJWsRuP-i2fjCAWvzZwfb6vlgxeqzbLB2GGFXN_GJI1chg0k985nt-4k2W5AokTw1iNsH5KyGotdIE2-2a_sUh--rgupUZdlreMZzDoziQRSPh5ajQffjIocmy7nkzcum_Ni-y3OkancOhfmzTBUShoHFHuSkgotf6e0n7QnUk94rJvtwDVC4cwe9lJ-e1X0OakE-00MIQL-nTpdQ_DTmLd5b-JaU-11YA_YHJ49eJIru8NpXWCStYhT3fiA6xQe4XToBBC42gqm9AMn0mfqIDeccj62u-VRk6cSYU8h3c0; path=/; HttpOnly"
        }, {
          "name" : "X-SourceFiles",
          "value" : "=?UTF-8?B?RDpcVmlydHVhbE9wdGltaXplci1SZWZhY3RvcmluZ1xDcm9wTWV0cmljcy5Wby5BcGlcQ3JvcE1ldHJpY3MuVm8uQXBpXGFwaVxhZG1pblx2MVx1c2Vyc1w=?="
        }, {
          "name" : "X-Powered-By",
          "value" : "ASP.NET"
        }, {
          "name" : "Date",
          "value" : "Thu, 28 Mar 2019 21:50:57 GMT"
        }, {
          "name" : "Content-Length",
          "value" : "9"
        } ],
        "content" : {
          "size" : 9,
          "mimeType" : "application/json; charset=utf-8",
          "text" : "{\"id\":14}",
          "comment" : ""
        },
        "redirectURL" : "",
        "headersSize" : 887,
        "bodySize" : 9,
        "comment" : ""
      },
      "cache" : { },
      "timings" : {
        "comment" : "",
        "blocked" : -1,
        "wait" : 1359,
        "receive" : 0,
        "dns" : -1,
        "send" : 0,
        "connect" : -1,
        "ssl" : -1
      },
      "serverIPAddress" : "127.0.0.1",
      "comment" : "",
      "_katalonRequestInformation" : {
        "name" : "37",
        "testObjectId" : "Object Repository/VoPro/Account/api_admin_v1_users",
        "harId" : "94671ccc-2368-4dfd-b273-400865940977"
      },
      "time" : 1360
    } ],
    "comment" : ""
  }
}