{
  "log" : {
    "version" : "1.2",
    "creator" : {
      "name" : "BrowserMob Proxy",
      "version" : "2.1.5",
      "comment" : ""
    },
    "pages" : [ {
      "id" : "Page 0",
      "startedDateTime" : "2019-03-28T20:42:10.145Z",
      "title" : "Page 0",
      "pageTimings" : {
        "onLoad" : 1290,
        "comment" : ""
      },
      "comment" : ""
    } ],
    "entries" : [ {
      "pageref" : "Page 0",
      "startedDateTime" : "2019-03-28T20:42:10.146Z",
      "request" : {
        "method" : "POST",
        "url" : "http://localhost:10520/WebAPI/api/admin/v1/users/?",
        "httpVersion" : "HTTP/1.1",
        "cookies" : [ ],
        "headers" : [ {
          "name" : "User-Agent",
          "value" : "Katalon Studio"
        }, {
          "name" : "Content-Type",
          "value" : "application/x-www-form-urlencoded"
        }, {
          "name" : "Authorization",
          "value" : "Bearer eyJ0eXAiOiJKV1QiLCJhbGciOiJIUzI1NiJ9.eyJ1bmlxdWVfbmFtZSI6ImFkbWluIiwicm9sZSI6InVzZXIiLCJzdWIiOiJhZG1pbiIsImlzcyI6IkNyb3BNZXRyaWNzIiwiYXVkIjoiYWxsIiwiZXhwIjoxNTUzODA5NjMwLCJuYmYiOjE1NTM4MDU3MzB9.rj1FXpEe7TZSRKQELnniHotkRLwSq5ADDuqC8ph4OOQ"
        }, {
          "name" : "Host",
          "value" : "localhost:10520"
        }, {
          "name" : "Accept",
          "value" : "text/html, image/gif, image/jpeg, *; q=.2, */*; q=.2"
        }, {
          "name" : "Proxy-Connection",
          "value" : "keep-alive"
        }, {
          "name" : "Content-Length",
          "value" : "305"
        } ],
        "queryString" : [ ],
        "postData" : {
          "mimeType" : "application/x-www-form-urlencoded",
          "params" : [ {
            "name" : "password",
            "value" : "cropmetrics",
            "comment" : ""
          }, {
            "name" : "email",
            "value" : "cropmetricsvo.dealersymbols@gmail.com",
            "comment" : ""
          }, {
            "name" : "fullname",
            "value" : "x",
            "comment" : ""
          }, {
            "name" : "phone",
            "value" : "1",
            "comment" : ""
          }, {
            "name" : "dealer",
            "value" : "!@#$%^&*(",
            "comment" : ""
          }, {
            "name" : "addressLine1",
            "value" : "address line 1 test validation",
            "comment" : ""
          }, {
            "name" : "addressLine2",
            "value" : "address line 2 test validation",
            "comment" : ""
          }, {
            "name" : "town",
            "value" : "townValidation",
            "comment" : ""
          }, {
            "name" : "state",
            "value" : "stateValidation",
            "comment" : ""
          }, {
            "name" : "zip",
            "value" : "zipValidation",
            "comment" : ""
          }, {
            "name" : "country",
            "value" : "countryValidation",
            "comment" : ""
          }, {
            "name" : "roles",
            "value" : "Client",
            "comment" : ""
          } ],
          "comment" : ""
        },
        "headersSize" : 544,
        "bodySize" : 305,
        "comment" : ""
      },
      "response" : {
        "status" : 200,
        "statusText" : "OK",
        "httpVersion" : "HTTP/1.1",
        "cookies" : [ {
          "name" : ".ASPROLES",
          "value" : "DDLA5Tx8ZK7uxBOZT7Saau-fwDlBh5KdASO8WgqIvqGiEzUrzuDlBO9THeXTtZD-4COtC9qVFxfYXia9GC_MlTcVcR3Z_dbNBVYyN3gEqRUHRNQIuWQJxUQ0hoLh4gSvn_y3Z34pKDJluzgzeqMaQ1j1rxvDuLLvXV4VlAFdtErxzUGzyzV3bqdrYIwJk52cqYx4KON4lNUFktFw8B-tN6hotriftCWVyP7XC8la9-Wqyvcxu8kiv_Mf9u_mYrZm29-iG7WQsi17BDZRmAo1mRrqIF0B1j119BeNXfV6cU0aicHp65wykvIrJVdaHuY72mtp5LUWx2mK5-NbbottVeYlGFBWhvJsBgnTjjHZyFJ0F4X24uN37_T_2BHM7Q8H1dheLPg7rPvItC9OhB8ZTodJvsjBWIaHIEgVXtSaahjCCWPE7Je969t9nQ5cn2ADUeiVRbHA_d0P-CHZAqcW6uPudn_rFCjXrOH6Q3Xo4Yma_StM0",
          "path" : "/",
          "httpOnly" : true,
          "secure" : false,
          "comment" : ""
        } ],
        "headers" : [ {
          "name" : "Cache-Control",
          "value" : "private"
        }, {
          "name" : "Content-Type",
          "value" : "application/json; charset=utf-8"
        }, {
          "name" : "Server",
          "value" : "Microsoft-IIS/10.0"
        }, {
          "name" : "Set-Cookie",
          "value" : ".ASPROLES=DDLA5Tx8ZK7uxBOZT7Saau-fwDlBh5KdASO8WgqIvqGiEzUrzuDlBO9THeXTtZD-4COtC9qVFxfYXia9GC_MlTcVcR3Z_dbNBVYyN3gEqRUHRNQIuWQJxUQ0hoLh4gSvn_y3Z34pKDJluzgzeqMaQ1j1rxvDuLLvXV4VlAFdtErxzUGzyzV3bqdrYIwJk52cqYx4KON4lNUFktFw8B-tN6hotriftCWVyP7XC8la9-Wqyvcxu8kiv_Mf9u_mYrZm29-iG7WQsi17BDZRmAo1mRrqIF0B1j119BeNXfV6cU0aicHp65wykvIrJVdaHuY72mtp5LUWx2mK5-NbbottVeYlGFBWhvJsBgnTjjHZyFJ0F4X24uN37_T_2BHM7Q8H1dheLPg7rPvItC9OhB8ZTodJvsjBWIaHIEgVXtSaahjCCWPE7Je969t9nQ5cn2ADUeiVRbHA_d0P-CHZAqcW6uPudn_rFCjXrOH6Q3Xo4Yma_StM0; path=/; HttpOnly"
        }, {
          "name" : "X-SourceFiles",
          "value" : "=?UTF-8?B?RDpcVmlydHVhbE9wdGltaXplci1SZWZhY3RvcmluZ1xDcm9wTWV0cmljcy5Wby5BcGlcQ3JvcE1ldHJpY3MuVm8uQXBpXGFwaVxhZG1pblx2MVx1c2Vyc1w=?="
        }, {
          "name" : "X-Powered-By",
          "value" : "ASP.NET"
        }, {
          "name" : "Date",
          "value" : "Thu, 28 Mar 2019 20:42:11 GMT"
        }, {
          "name" : "Content-Length",
          "value" : "9"
        } ],
        "content" : {
          "size" : 9,
          "mimeType" : "application/json; charset=utf-8",
          "text" : "{\"id\":21}",
          "comment" : ""
        },
        "redirectURL" : "",
        "headersSize" : 887,
        "bodySize" : 9,
        "comment" : ""
      },
      "cache" : { },
      "timings" : {
        "comment" : "",
        "ssl" : -1,
        "send" : 0,
        "receive" : 0,
        "wait" : 1285,
        "connect" : -1,
        "blocked" : -1,
        "dns" : -1
      },
      "serverIPAddress" : "127.0.0.1",
      "comment" : "",
      "_katalonRequestInformation" : {
        "name" : "61",
        "testObjectId" : "Object Repository/VoPro/Account/api_admin_v1_users",
        "harId" : "64a5eaec-76cc-4acf-b721-6a0f3e2719d5"
      },
      "time" : 1286
    } ],
    "comment" : ""
  }
}