{
  "log" : {
    "version" : "1.2",
    "creator" : {
      "name" : "BrowserMob Proxy",
      "version" : "2.1.5",
      "comment" : ""
    },
    "pages" : [ {
      "id" : "Page 0",
      "startedDateTime" : "2019-03-29T18:59:11.403Z",
      "title" : "Page 0",
      "pageTimings" : {
        "onLoad" : 86,
        "comment" : ""
      },
      "comment" : ""
    } ],
    "entries" : [ {
      "pageref" : "Page 0",
      "startedDateTime" : "2019-03-29T18:59:11.404Z",
      "request" : {
        "method" : "PUT",
        "url" : "http://localhost:10520/WebAPI/api/admin/v1/users/14?",
        "httpVersion" : "HTTP/1.1",
        "cookies" : [ ],
        "headers" : [ {
          "name" : "User-Agent",
          "value" : "Katalon Studio"
        }, {
          "name" : "Content-Type",
          "value" : "application/x-www-form-urlencoded"
        }, {
          "name" : "Authorization",
          "value" : "Bearer eyJ0eXAiOiJKV1QiLCJhbGciOiJIUzI1NiJ9.eyJ1bmlxdWVfbmFtZSI6ImFkbWluIiwicm9sZSI6InVzZXIiLCJzdWIiOiJhZG1pbiIsImlzcyI6IkNyb3BNZXRyaWNzIiwiYXVkIjoiYWxsIiwiZXhwIjoxNTUzODg5ODUxLCJuYmYiOjE1NTM4ODU5NTF9.wz1a89HN9afl0VjeEg4eQE3D-O8xfC4IyM4RgWOeqds"
        }, {
          "name" : "Host",
          "value" : "localhost:10520"
        }, {
          "name" : "Accept",
          "value" : "text/html, image/gif, image/jpeg, *; q=.2, */*; q=.2"
        }, {
          "name" : "Proxy-Connection",
          "value" : "keep-alive"
        }, {
          "name" : "Content-Length",
          "value" : "302"
        } ],
        "queryString" : [ ],
        "postData" : {
          "mimeType" : "application/x-www-form-urlencoded",
          "params" : [ {
            "name" : "password",
            "value" : "lessp",
            "comment" : ""
          }, {
            "name" : "email",
            "value" : "cropmetricsvo.15.pass@gmail.com",
            "comment" : ""
          }, {
            "name" : "fullname",
            "value" : "test validation",
            "comment" : ""
          }, {
            "name" : "phone",
            "value" : "123",
            "comment" : ""
          }, {
            "name" : "dealer",
            "value" : "x",
            "comment" : ""
          }, {
            "name" : "addressLine1",
            "value" : "address line 1 test validation",
            "comment" : ""
          }, {
            "name" : "addressLine2",
            "value" : "address line 2 test validation",
            "comment" : ""
          }, {
            "name" : "town",
            "value" : "townValidation",
            "comment" : ""
          }, {
            "name" : "state",
            "value" : "stateValidation",
            "comment" : ""
          }, {
            "name" : "zip",
            "value" : "zipValidation",
            "comment" : ""
          }, {
            "name" : "country",
            "value" : "countryValidation",
            "comment" : ""
          }, {
            "name" : "roles",
            "value" : "Client",
            "comment" : ""
          }, {
            "name" : "userProfileId",
            "value" : "14",
            "comment" : ""
          } ],
          "comment" : ""
        },
        "headersSize" : 545,
        "bodySize" : 302,
        "comment" : ""
      },
      "response" : {
        "status" : 400,
        "statusText" : "Bad Request",
        "httpVersion" : "HTTP/1.1",
        "cookies" : [ {
          "name" : ".ASPROLES",
          "value" : "CFYHgrR7J5YJyHNBzMjN4-ZOOCxII8VyRKx5TxeBDygpB7a2zt0QNoa9aeWUBL71PUWGs_ILyM6mfH0tXn2f6Y3CuxK-7_SY1z7ANtgtRFLJ2Kujn-HfbvrGxpnUrf7DTzE8VtsGqaow7ShTbL1hMjA0kwWXb4xgzxMJ6fZhZQb6XNnvbnHfeXvCbV__jGHhZP6tQOWp8g6cSAHuQv2vfNvecH-SnCqzjEkzp4PdaAcRe2GkafxGkcSpne-craq04AlwGP4H3hth6YQfxAsshuHlok0z-T7R-B8zzVOHa2iG0pO6BjeQnCk2xO7DL6JADJaZI_PnbfzvPEYpSKmYbY0YrzFzhsH2qC1cmVWSMJs4qwRdnAb9yn9NH8ejHSh8NWQn_T_mbzg83DTqNVVR5-aiL8b0ZUMu1F_2jjjCNdkhxpjcHaS4PmoUxjgb8iWuQlFY_xhdz4cbmODha9Dq38Iqizwh5cdXCo6mZ_g-5PI_xsh90",
          "path" : "/",
          "httpOnly" : true,
          "secure" : false,
          "comment" : ""
        } ],
        "headers" : [ {
          "name" : "Cache-Control",
          "value" : "private"
        }, {
          "name" : "Content-Type",
          "value" : "application/json; charset=utf-8"
        }, {
          "name" : "Server",
          "value" : "Microsoft-IIS/10.0"
        }, {
          "name" : "Set-Cookie",
          "value" : ".ASPROLES=CFYHgrR7J5YJyHNBzMjN4-ZOOCxII8VyRKx5TxeBDygpB7a2zt0QNoa9aeWUBL71PUWGs_ILyM6mfH0tXn2f6Y3CuxK-7_SY1z7ANtgtRFLJ2Kujn-HfbvrGxpnUrf7DTzE8VtsGqaow7ShTbL1hMjA0kwWXb4xgzxMJ6fZhZQb6XNnvbnHfeXvCbV__jGHhZP6tQOWp8g6cSAHuQv2vfNvecH-SnCqzjEkzp4PdaAcRe2GkafxGkcSpne-craq04AlwGP4H3hth6YQfxAsshuHlok0z-T7R-B8zzVOHa2iG0pO6BjeQnCk2xO7DL6JADJaZI_PnbfzvPEYpSKmYbY0YrzFzhsH2qC1cmVWSMJs4qwRdnAb9yn9NH8ejHSh8NWQn_T_mbzg83DTqNVVR5-aiL8b0ZUMu1F_2jjjCNdkhxpjcHaS4PmoUxjgb8iWuQlFY_xhdz4cbmODha9Dq38Iqizwh5cdXCo6mZ_g-5PI_xsh90; path=/; HttpOnly"
        }, {
          "name" : "X-SourceFiles",
          "value" : "=?UTF-8?B?RDpcVmlydHVhbE9wdGltaXplci1SZWZhY3RvcmluZ1xDcm9wTWV0cmljcy5Wby5BcGlcQ3JvcE1ldHJpY3MuVm8uQXBpXGFwaVxhZG1pblx2MVx1c2Vyc1wxNA==?="
        }, {
          "name" : "X-Powered-By",
          "value" : "ASP.NET"
        }, {
          "name" : "Date",
          "value" : "Fri, 29 Mar 2019 18:59:10 GMT"
        }, {
          "name" : "Content-Length",
          "value" : "83"
        } ],
        "content" : {
          "size" : 83,
          "mimeType" : "application/json; charset=utf-8",
          "text" : "{\"message\":\"The request is invalid. The password must have at least 6 characters.\"}",
          "comment" : ""
        },
        "redirectURL" : "",
        "headersSize" : 901,
        "bodySize" : 83,
        "comment" : ""
      },
      "cache" : { },
      "timings" : {
        "comment" : "",
        "ssl" : -1,
        "wait" : 80,
        "send" : 0,
        "receive" : 1,
        "dns" : -1,
        "blocked" : -1,
        "connect" : -1
      },
      "serverIPAddress" : "127.0.0.1",
      "comment" : "",
      "_katalonRequestInformation" : {
        "name" : "3",
        "testObjectId" : "Object Repository/VoPro/Account/api_admin_v1_users_userprofileid",
        "harId" : "ca155770-4b55-4e6e-aa18-901ef60507e7"
      },
      "time" : 82
    } ],
    "comment" : ""
  }
}