{
  "log" : {
    "version" : "1.2",
    "creator" : {
      "name" : "BrowserMob Proxy",
      "version" : "2.1.5",
      "comment" : ""
    },
    "pages" : [ {
      "id" : "Page 0",
      "startedDateTime" : "2019-03-28T19:47:13.124Z",
      "title" : "Page 0",
      "pageTimings" : {
        "onLoad" : 2379,
        "comment" : ""
      },
      "comment" : ""
    } ],
    "entries" : [ {
      "pageref" : "Page 0",
      "startedDateTime" : "2019-03-28T19:47:13.125Z",
      "request" : {
        "method" : "POST",
        "url" : "http://localhost:10520/WebAPI/api/admin/v1/users/?",
        "httpVersion" : "HTTP/1.1",
        "cookies" : [ ],
        "headers" : [ {
          "name" : "User-Agent",
          "value" : "Katalon Studio"
        }, {
          "name" : "Content-Type",
          "value" : "application/x-www-form-urlencoded"
        }, {
          "name" : "Authorization",
          "value" : "Bearer eyJ0eXAiOiJKV1QiLCJhbGciOiJIUzI1NiJ9.eyJ1bmlxdWVfbmFtZSI6ImFkbWluIiwicm9sZSI6InVzZXIiLCJzdWIiOiJhZG1pbiIsImlzcyI6IkNyb3BNZXRyaWNzIiwiYXVkIjoiYWxsIiwiZXhwIjoxNTUzODA2MzMzLCJuYmYiOjE1NTM4MDI0MzN9.qOq4DZCSUp7dP0L3S8DE9rR96lTO4GorN5B0wc6qCig"
        }, {
          "name" : "Host",
          "value" : "localhost:10520"
        }, {
          "name" : "Accept",
          "value" : "text/html, image/gif, image/jpeg, *; q=.2, */*; q=.2"
        }, {
          "name" : "Proxy-Connection",
          "value" : "keep-alive"
        }, {
          "name" : "Content-Length",
          "value" : "287"
        } ],
        "queryString" : [ ],
        "postData" : {
          "mimeType" : "application/x-www-form-urlencoded",
          "params" : [ {
            "name" : "password",
            "value" : "cropmetrics",
            "comment" : ""
          }, {
            "name" : "email",
            "value" : "cropmetricsvo.no.country@gmail.com",
            "comment" : ""
          }, {
            "name" : "fullname",
            "value" : "test validation",
            "comment" : ""
          }, {
            "name" : "phone",
            "value" : "123",
            "comment" : ""
          }, {
            "name" : "dealer",
            "value" : "dealet test",
            "comment" : ""
          }, {
            "name" : "addressLine1",
            "value" : "address line 1 test validation",
            "comment" : ""
          }, {
            "name" : "addressLine2",
            "value" : "address line 2 test validation",
            "comment" : ""
          }, {
            "name" : "town",
            "value" : "townValidation",
            "comment" : ""
          }, {
            "name" : "state",
            "value" : "stateValidation",
            "comment" : ""
          }, {
            "name" : "zip",
            "value" : "zipValidation",
            "comment" : ""
          }, {
            "name" : "country",
            "value" : "",
            "comment" : ""
          }, {
            "name" : "roles",
            "value" : "Client",
            "comment" : ""
          } ],
          "comment" : ""
        },
        "headersSize" : 544,
        "bodySize" : 287,
        "comment" : ""
      },
      "response" : {
        "status" : 500,
        "statusText" : "Internal Server Error",
        "httpVersion" : "HTTP/1.1",
        "cookies" : [ {
          "name" : ".ASPROLES",
          "value" : "mzDRkh2kyH4ItZeLgDivVaeEyw7w9Cj4n0h76LetGlZBm3iIz4IEymK_8HrW9OPp2eoVY1eF4giBzjtA7HgHAPw9y1eLs9IeNBUaJGBo28DSALJMHMgXPwokuJ5iupCzHQ-I9mCANF9AuYzhvTJGCiq6sc394bROpkq53wEABNsAFgkG2jgySMuzWL-mHI-g3ByBX9N8qSNYf-bqVNag9Rjli3gN4Ot6RYiT6MjwVKHQUjwzrQJSlhq1VwgCELXBk0oSRZSQB4xriWOO8zJr668udLuJc9_WhqomUAMS5HxLTQ9SJcSrWHuT2vJI2KrwYP9mTa57Aroni22EgnP2fYD2-DaJ9zg3LkLwfaQQoTXTiyAHjSwD-jsIjaK2UoPaT4GBddFJfUX-osrX-zvQa8wPvLL-pmeWPQtySA8PoANlkvHSNICjEs21MLN6KDFvQUVfroKfJqkEHW60ZAEi-ZZzwlvB5wk-AM0bnqwaEmTGuqLk0",
          "path" : "/",
          "httpOnly" : true,
          "secure" : false,
          "comment" : ""
        } ],
        "headers" : [ {
          "name" : "Cache-Control",
          "value" : "private"
        }, {
          "name" : "Content-Type",
          "value" : "application/json; charset=utf-8"
        }, {
          "name" : "Server",
          "value" : "Microsoft-IIS/10.0"
        }, {
          "name" : "Set-Cookie",
          "value" : ".ASPROLES=mzDRkh2kyH4ItZeLgDivVaeEyw7w9Cj4n0h76LetGlZBm3iIz4IEymK_8HrW9OPp2eoVY1eF4giBzjtA7HgHAPw9y1eLs9IeNBUaJGBo28DSALJMHMgXPwokuJ5iupCzHQ-I9mCANF9AuYzhvTJGCiq6sc394bROpkq53wEABNsAFgkG2jgySMuzWL-mHI-g3ByBX9N8qSNYf-bqVNag9Rjli3gN4Ot6RYiT6MjwVKHQUjwzrQJSlhq1VwgCELXBk0oSRZSQB4xriWOO8zJr668udLuJc9_WhqomUAMS5HxLTQ9SJcSrWHuT2vJI2KrwYP9mTa57Aroni22EgnP2fYD2-DaJ9zg3LkLwfaQQoTXTiyAHjSwD-jsIjaK2UoPaT4GBddFJfUX-osrX-zvQa8wPvLL-pmeWPQtySA8PoANlkvHSNICjEs21MLN6KDFvQUVfroKfJqkEHW60ZAEi-ZZzwlvB5wk-AM0bnqwaEmTGuqLk0; path=/; HttpOnly"
        }, {
          "name" : "X-SourceFiles",
          "value" : "=?UTF-8?B?RDpcVmlydHVhbE9wdGltaXplci1SZWZhY3RvcmluZ1xDcm9wTWV0cmljcy5Wby5BcGlcQ3JvcE1ldHJpY3MuVm8uQXBpXGFwaVxhZG1pblx2MVx1c2Vyc1w=?="
        }, {
          "name" : "X-Powered-By",
          "value" : "ASP.NET"
        }, {
          "name" : "Date",
          "value" : "Thu, 28 Mar 2019 19:47:15 GMT"
        }, {
          "name" : "Content-Length",
          "value" : "53"
        } ],
        "content" : {
          "size" : 53,
          "mimeType" : "application/json; charset=utf-8",
          "text" : "{\"message\":\"Internal server error in the processing\"}",
          "comment" : ""
        },
        "redirectURL" : "",
        "headersSize" : 907,
        "bodySize" : 53,
        "comment" : ""
      },
      "cache" : { },
      "timings" : {
        "comment" : "",
        "ssl" : -1,
        "send" : 0,
        "wait" : 2374,
        "receive" : 0,
        "dns" : -1,
        "blocked" : -1,
        "connect" : -1
      },
      "serverIPAddress" : "127.0.0.1",
      "comment" : "",
      "_katalonRequestInformation" : {
        "name" : "29",
        "testObjectId" : "Object Repository/VoPro/Account/api_admin_v1_users",
        "harId" : "3830d76d-3cfb-4e99-8556-e320288d6d92"
      },
      "time" : 2375
    } ],
    "comment" : ""
  }
}