{
  "log" : {
    "version" : "1.2",
    "creator" : {
      "name" : "BrowserMob Proxy",
      "version" : "2.1.5",
      "comment" : ""
    },
    "pages" : [ {
      "id" : "Page 0",
      "startedDateTime" : "2019-04-01T13:35:10.248Z",
      "title" : "Page 0",
      "pageTimings" : {
        "onLoad" : 1844,
        "comment" : ""
      },
      "comment" : ""
    } ],
    "entries" : [ {
      "pageref" : "Page 0",
      "startedDateTime" : "2019-04-01T13:35:10.249Z",
      "request" : {
        "method" : "POST",
        "url" : "http://localhost:10520/WebAPI/api/admin/v1/users/?",
        "httpVersion" : "HTTP/1.1",
        "cookies" : [ ],
        "headers" : [ {
          "name" : "User-Agent",
          "value" : "Katalon Studio"
        }, {
          "name" : "Content-Type",
          "value" : "application/x-www-form-urlencoded"
        }, {
          "name" : "Authorization",
          "value" : "Bearer eyJ0eXAiOiJKV1QiLCJhbGciOiJIUzI1NiJ9.eyJ1bmlxdWVfbmFtZSI6ImFkbWluIiwicm9sZSI6InVzZXIiLCJzdWIiOiJhZG1pbiIsImlzcyI6IkNyb3BNZXRyaWNzIiwiYXVkIjoiYWxsIiwiZXhwIjoxNTU0MTI5NjEwLCJuYmYiOjE1NTQxMjU3MTB9.ogVfEhY069N5HjKdzCiFE3YIQMQ_PZn_FZjlNdwpwAs"
        }, {
          "name" : "Host",
          "value" : "localhost:10520"
        }, {
          "name" : "Accept",
          "value" : "text/html, image/gif, image/jpeg, *; q=.2, */*; q=.2"
        }, {
          "name" : "Proxy-Connection",
          "value" : "keep-alive"
        }, {
          "name" : "Content-Length",
          "value" : "685"
        } ],
        "queryString" : [ ],
        "postData" : {
          "mimeType" : "application/x-www-form-urlencoded",
          "params" : [ {
            "name" : "password",
            "value" : "cropmetrics",
            "comment" : ""
          }, {
            "name" : "email",
            "value" : "cropmetricsvo.addressline1long@gmail.com",
            "comment" : ""
          }, {
            "name" : "fullname",
            "value" : "x",
            "comment" : ""
          }, {
            "name" : "phone",
            "value" : "1",
            "comment" : ""
          }, {
            "name" : "dealer",
            "value" : "xx",
            "comment" : ""
          }, {
            "name" : "addressLine1",
            "value" : "14 API_ACNT_When_new_account_have_long_addressline1_attribute_Expected_status_code_20014 API_ACNT_When_new_account_have_long_addressline1_attribute_Expected_status_code_20014 API_ACNT_When_new_account_have_long_addressline1_attribute_Expected_status_code_20014 API_ACNT_When_new_account_have_long_addressline1_attribute_Expected_status_code_20014 API_ACNT_When_new_account_have_long_addressline1_attribute_Expected_status_code_200",
            "comment" : ""
          }, {
            "name" : "addressLine2",
            "value" : "address line 2 test validation",
            "comment" : ""
          }, {
            "name" : "town",
            "value" : "townValidation",
            "comment" : ""
          }, {
            "name" : "state",
            "value" : "stateValidation",
            "comment" : ""
          }, {
            "name" : "zip",
            "value" : "zipValidation",
            "comment" : ""
          }, {
            "name" : "country",
            "value" : "countryValidation",
            "comment" : ""
          }, {
            "name" : "roles",
            "value" : "Client",
            "comment" : ""
          } ],
          "comment" : ""
        },
        "headersSize" : 544,
        "bodySize" : 685,
        "comment" : ""
      },
      "response" : {
        "status" : 200,
        "statusText" : "OK",
        "httpVersion" : "HTTP/1.1",
        "cookies" : [ {
          "name" : ".ASPROLES",
          "value" : "pQ39w6UnYPPZumJlnCvz-i0pWk9XXXAn89GkmnBDBS0rxuv3r2NibMALhIcIVUCS9Q_t8v_bACw8CL568ejSqNd2yPThQpC0GdVg1U4GlL3tXv5KiDPQoVQWU13QozQhynlr3xl_LWQXUqECOdgmnNycRr_Th5Z9uMgpem4r9PdoNnEPRMTZ0cyqBGzL7lAJNHODJ-7d6GqLzR-l1oRWt4QeQcX1BkGFq1K-M2MYnJ2zPWFJFFTNFcsDDyRcCLOAbPJD7hWa9Io1jK8pzK7dMQHk4l-9mOw37YaQTAkhF8xcZFJKlRr2jIjCu3-9bccr_mrwnvX_elixGorwzFIskD5cHizUaD0e53BFd9hjKcjbY-D5hJMBn1p35YW0DG7RnPAaXWBYRv5v6tlggSIveNkALYFznR6WVkvr7z2Iutwuz_ONDZdFINvzDUidk8DUIQd3H0_XjiRuUV9w4m5rm8AmmMSJGn1ItoikPXb7PmD_-oIS0",
          "path" : "/",
          "httpOnly" : true,
          "secure" : false,
          "comment" : ""
        } ],
        "headers" : [ {
          "name" : "Cache-Control",
          "value" : "private"
        }, {
          "name" : "Content-Type",
          "value" : "application/json; charset=utf-8"
        }, {
          "name" : "Server",
          "value" : "Microsoft-IIS/10.0"
        }, {
          "name" : "Set-Cookie",
          "value" : ".ASPROLES=pQ39w6UnYPPZumJlnCvz-i0pWk9XXXAn89GkmnBDBS0rxuv3r2NibMALhIcIVUCS9Q_t8v_bACw8CL568ejSqNd2yPThQpC0GdVg1U4GlL3tXv5KiDPQoVQWU13QozQhynlr3xl_LWQXUqECOdgmnNycRr_Th5Z9uMgpem4r9PdoNnEPRMTZ0cyqBGzL7lAJNHODJ-7d6GqLzR-l1oRWt4QeQcX1BkGFq1K-M2MYnJ2zPWFJFFTNFcsDDyRcCLOAbPJD7hWa9Io1jK8pzK7dMQHk4l-9mOw37YaQTAkhF8xcZFJKlRr2jIjCu3-9bccr_mrwnvX_elixGorwzFIskD5cHizUaD0e53BFd9hjKcjbY-D5hJMBn1p35YW0DG7RnPAaXWBYRv5v6tlggSIveNkALYFznR6WVkvr7z2Iutwuz_ONDZdFINvzDUidk8DUIQd3H0_XjiRuUV9w4m5rm8AmmMSJGn1ItoikPXb7PmD_-oIS0; path=/; HttpOnly"
        }, {
          "name" : "X-SourceFiles",
          "value" : "=?UTF-8?B?RDpcVmlydHVhbE9wdGltaXplci1SZWZhY3RvcmluZ1xDcm9wTWV0cmljcy5Wby5BcGlcQ3JvcE1ldHJpY3MuVm8uQXBpXGFwaVxhZG1pblx2MVx1c2Vyc1w=?="
        }, {
          "name" : "X-Powered-By",
          "value" : "ASP.NET"
        }, {
          "name" : "Date",
          "value" : "Mon, 01 Apr 2019 13:35:12 GMT"
        }, {
          "name" : "Content-Length",
          "value" : "9"
        } ],
        "content" : {
          "size" : 9,
          "mimeType" : "application/json; charset=utf-8",
          "text" : "{\"id\":21}",
          "comment" : ""
        },
        "redirectURL" : "",
        "headersSize" : 887,
        "bodySize" : 9,
        "comment" : ""
      },
      "cache" : { },
      "timings" : {
        "comment" : "",
        "ssl" : -1,
        "wait" : 1838,
        "receive" : 0,
        "send" : 0,
        "dns" : -1,
        "blocked" : -1,
        "connect" : -1
      },
      "serverIPAddress" : "127.0.0.1",
      "comment" : "",
      "_katalonRequestInformation" : {
        "name" : "63",
        "testObjectId" : "Object Repository/VoPro/Account/api_admin_v1_users",
        "harId" : "86652bf1-07ca-47a2-a3cb-8e99c3031568"
      },
      "time" : 1839
    } ],
    "comment" : ""
  }
}