{
  "log" : {
    "version" : "1.2",
    "creator" : {
      "name" : "BrowserMob Proxy",
      "version" : "2.1.5",
      "comment" : ""
    },
    "pages" : [ {
      "id" : "Page 0",
      "startedDateTime" : "2019-03-29T21:46:06.518Z",
      "title" : "Page 0",
      "pageTimings" : {
        "onLoad" : 1856,
        "comment" : ""
      },
      "comment" : ""
    } ],
    "entries" : [ {
      "pageref" : "Page 0",
      "startedDateTime" : "2019-03-29T21:46:06.519Z",
      "request" : {
        "method" : "POST",
        "url" : "http://localhost:10520/WebAPI/api/admin/v1/users/?",
        "httpVersion" : "HTTP/1.1",
        "cookies" : [ ],
        "headers" : [ {
          "name" : "User-Agent",
          "value" : "Katalon Studio"
        }, {
          "name" : "Content-Type",
          "value" : "application/x-www-form-urlencoded"
        }, {
          "name" : "Authorization",
          "value" : "Bearer eyJ0eXAiOiJKV1QiLCJhbGciOiJIUzI1NiJ9.eyJ1bmlxdWVfbmFtZSI6ImFkbWluIiwicm9sZSI6InVzZXIiLCJzdWIiOiJhZG1pbiIsImlzcyI6IkNyb3BNZXRyaWNzIiwiYXVkIjoiYWxsIiwiZXhwIjoxNTUzODk5ODY2LCJuYmYiOjE1NTM4OTU5NjZ9.ZydKTdgBCKnDH6R_xe2TsYsozcJoBHcRLZ-PmuLw4FE"
        }, {
          "name" : "Host",
          "value" : "localhost:10520"
        }, {
          "name" : "Accept",
          "value" : "text/html, image/gif, image/jpeg, *; q=.2, */*; q=.2"
        }, {
          "name" : "Proxy-Connection",
          "value" : "keep-alive"
        }, {
          "name" : "Content-Length",
          "value" : "266"
        } ],
        "queryString" : [ ],
        "postData" : {
          "mimeType" : "application/x-www-form-urlencoded",
          "params" : [ {
            "name" : "password",
            "value" : "cropmetrics",
            "comment" : ""
          }, {
            "name" : "email",
            "value" : "cropmetricsvo.roleagent@gmail.com",
            "comment" : ""
          }, {
            "name" : "fullname",
            "value" : "test validation",
            "comment" : ""
          }, {
            "name" : "phone",
            "value" : "123",
            "comment" : ""
          }, {
            "name" : "dealer",
            "value" : "x",
            "comment" : ""
          }, {
            "name" : "addressLine1",
            "value" : "address line 1 test validation",
            "comment" : ""
          }, {
            "name" : "addressLine2",
            "value" : "address line 2 test validation",
            "comment" : ""
          }, {
            "name" : "town",
            "value" : "townValidation",
            "comment" : ""
          }, {
            "name" : "state",
            "value" : "stateValidation",
            "comment" : ""
          }, {
            "name" : "zip",
            "value" : "xx",
            "comment" : ""
          }, {
            "name" : "country",
            "value" : "xx",
            "comment" : ""
          }, {
            "name" : "roles",
            "value" : "Agent",
            "comment" : ""
          } ],
          "comment" : ""
        },
        "headersSize" : 544,
        "bodySize" : 266,
        "comment" : ""
      },
      "response" : {
        "status" : 200,
        "statusText" : "OK",
        "httpVersion" : "HTTP/1.1",
        "cookies" : [ {
          "name" : ".ASPROLES",
          "value" : "XUofDDF9_lDCt7m531MnGNllVy1IIvyfFNocWc9kfN5EQkIPANEng6r5W6Fq1FZ16iWEd6LTRjzL4bflYkTf2F3T5dvAXHX4ECG-SbeWfOBgwmgnlS6OAkuox9Zt3feclXPiL-7JaxA5iAfPE1TT6KDWEYkO6z88m-mes6GKuRN1ljRmlgafNTJoPBcGqi-BRMp4OaE1XeLaHH0efn4rOcI4hVakwS1u8xMen0Zt1vdLcJjYbade4EtDLZOlmkNsUfDjJQpRXDB3NY5Auq_rLMtsfJEiuWGaMIWHfpvVJ-6aXJKhpr_s5HLWiUo2Wj7yxxhlFC-gH-tOobIKONiOn18wa_qDsb1GtAEIPBx3cAo1rRwmK5EwuGfGdInvK4KxINW9pqPOkX9Po--0PctMWOusLCsT5INHc_9EZ_BYIiPB5--FtxhaAJu6Qs-a3AlxOCnKweL25-Dn0Ek48Dyd5S3MbQt02c3d66XP0IVMZCwtiUhP0",
          "path" : "/",
          "httpOnly" : true,
          "secure" : false,
          "comment" : ""
        } ],
        "headers" : [ {
          "name" : "Cache-Control",
          "value" : "private"
        }, {
          "name" : "Content-Type",
          "value" : "application/json; charset=utf-8"
        }, {
          "name" : "Server",
          "value" : "Microsoft-IIS/10.0"
        }, {
          "name" : "Set-Cookie",
          "value" : ".ASPROLES=XUofDDF9_lDCt7m531MnGNllVy1IIvyfFNocWc9kfN5EQkIPANEng6r5W6Fq1FZ16iWEd6LTRjzL4bflYkTf2F3T5dvAXHX4ECG-SbeWfOBgwmgnlS6OAkuox9Zt3feclXPiL-7JaxA5iAfPE1TT6KDWEYkO6z88m-mes6GKuRN1ljRmlgafNTJoPBcGqi-BRMp4OaE1XeLaHH0efn4rOcI4hVakwS1u8xMen0Zt1vdLcJjYbade4EtDLZOlmkNsUfDjJQpRXDB3NY5Auq_rLMtsfJEiuWGaMIWHfpvVJ-6aXJKhpr_s5HLWiUo2Wj7yxxhlFC-gH-tOobIKONiOn18wa_qDsb1GtAEIPBx3cAo1rRwmK5EwuGfGdInvK4KxINW9pqPOkX9Po--0PctMWOusLCsT5INHc_9EZ_BYIiPB5--FtxhaAJu6Qs-a3AlxOCnKweL25-Dn0Ek48Dyd5S3MbQt02c3d66XP0IVMZCwtiUhP0; path=/; HttpOnly"
        }, {
          "name" : "X-SourceFiles",
          "value" : "=?UTF-8?B?RDpcVmlydHVhbE9wdGltaXplci1SZWZhY3RvcmluZ1xDcm9wTWV0cmljcy5Wby5BcGlcQ3JvcE1ldHJpY3MuVm8uQXBpXGFwaVxhZG1pblx2MVx1c2Vyc1w=?="
        }, {
          "name" : "X-Powered-By",
          "value" : "ASP.NET"
        }, {
          "name" : "Date",
          "value" : "Fri, 29 Mar 2019 21:46:08 GMT"
        }, {
          "name" : "Content-Length",
          "value" : "9"
        } ],
        "content" : {
          "size" : 9,
          "mimeType" : "application/json; charset=utf-8",
          "text" : "{\"id\":42}",
          "comment" : ""
        },
        "redirectURL" : "",
        "headersSize" : 887,
        "bodySize" : 9,
        "comment" : ""
      },
      "cache" : { },
      "timings" : {
        "comment" : "",
        "send" : 0,
        "wait" : 1851,
        "receive" : 0,
        "blocked" : -1,
        "dns" : -1,
        "connect" : -1,
        "ssl" : -1
      },
      "serverIPAddress" : "127.0.0.1",
      "comment" : "",
      "_katalonRequestInformation" : {
        "name" : "111",
        "testObjectId" : "Object Repository/VoPro/Account/api_admin_v1_users",
        "harId" : "fc192884-5b18-4908-b6d7-376d2d0d5f35"
      },
      "time" : 1852
    } ],
    "comment" : ""
  }
}