{
  "log" : {
    "version" : "1.2",
    "creator" : {
      "name" : "BrowserMob Proxy",
      "version" : "2.1.5",
      "comment" : ""
    },
    "pages" : [ {
      "id" : "Page 0",
      "startedDateTime" : "2019-04-09T09:49:58.373Z",
      "title" : "Page 0",
      "pageTimings" : {
        "onLoad" : 2371,
        "comment" : ""
      },
      "comment" : ""
    } ],
    "entries" : [ {
      "pageref" : "Page 0",
      "startedDateTime" : "2019-04-09T09:49:58.376Z",
      "request" : {
        "method" : "PUT",
        "url" : "http://localhost:10520/WebAPI/api/mobile/v1/fields/1?",
        "httpVersion" : "HTTP/1.1",
        "cookies" : [ ],
        "headers" : [ {
          "name" : "User-Agent",
          "value" : "Katalon Studio"
        }, {
          "name" : "Content-Type",
          "value" : "application/json"
        }, {
          "name" : "Authorization",
          "value" : "Bearer eyJ0eXAiOiJKV1QiLCJhbGciOiJIUzI1NiJ9.eyJ1bmlxdWVfbmFtZSI6Implbm55Lm1hbGRvbmFkby50eDJAZ21haWwuY29tIiwicm9sZSI6InVzZXIiLCJzdWIiOiJqZW5ueS5tYWxkb25hZG8udHgyQGdtYWlsLmNvbSIsImlzcyI6IkNyb3BNZXRyaWNzIiwiYXVkIjoiYWxsIiwiZXhwIjoxNTU0ODA3Mjk3LCJuYmYiOjE1NTQ4MDMzOTd9.Zj9YE_3HGSJPxeJNH7FU7zH9NDp2x8E80bUO42318H4"
        }, {
          "name" : "Host",
          "value" : "localhost:10520"
        }, {
          "name" : "Accept",
          "value" : "text/html, image/gif, image/jpeg, *; q=.2, */*; q=.2"
        }, {
          "name" : "Proxy-Connection",
          "value" : "keep-alive"
        }, {
          "name" : "Content-Length",
          "value" : "387"
        } ],
        "queryString" : [ ],
        "postData" : {
          "mimeType" : "application/json",
          "text" : "{\"field\":{\"name\":\"Field only grower Updated\",\"boundary\":{\"boundaries\":[{\"boundary\":{\"coords\":[{\"x\":-101.49568751,\"y\":37.14976293},{\"x\":-101.50049403,\"y\":37.14647907},{\"x\":-101.50049403,\"y\":37.14264773},{\"x\":-101.49723246,\"y\":37.1411425},{\"x\":-101.49019435,\"y\":37.14223722},{\"x\":-101.48933604,\"y\":37.14620541},{\"x\":-101.49294093,\"y\":37.14866833},{\"x\":-101.49568751,\"y\":37.14976293}]}}]}}}",
          "comment" : ""
        },
        "headersSize" : 593,
        "bodySize" : 387,
        "comment" : ""
      },
      "response" : {
        "status" : 200,
        "statusText" : "OK",
        "httpVersion" : "HTTP/1.1",
        "cookies" : [ {
          "name" : ".ASPROLES",
          "value" : "RAWdYcdmpkkAwXDY7NFwKRNYqsvwkbGWHyR-HLDfAnEhXLUECzGyn1q5YLhBOo8CDsFkSe3NKMn5iOOKOnP8Hmjw0Uzw_vrGircTQbn8DaTmvsBX4h0m_M4dHYIPshcNOVjiQPSnCvT9CVtEtAKc35W3XTM4kh2bhgtSS-ib4ttoNHd5wi7WW_6pjO86xg17TTkUNzy9RMINSpT6Y-S5KQ4_yb6lBiKiWo77_vUj7F_3nJBnUJTIwVYDTxzF_C_6OHcA03-2HC5jShBEkmdbj8r1WoERAYPQwb2LUfycY5GvHfoFhfXpl3EJ5ezK04EgQQF0i0Krql0wSlFUro0Etp233vLKF3_oYbK_PP5gfvU77HWZC6qnvhUR-yDgmGFeSX3YFOsprwCXxvsSDbd78fg2ecCBJWpdfTO5Bd_jjq7hZQ_gBQ70mWXY4D1HLzDfE_ry4l8Lonq7W83LO2w24GnWJrhr5_bgiuDNM73q08yB_kkOVFnAnUpyGrGRBUANefZVaA2",
          "path" : "/",
          "httpOnly" : true,
          "secure" : false,
          "comment" : ""
        } ],
        "headers" : [ {
          "name" : "Cache-Control",
          "value" : "private"
        }, {
          "name" : "Content-Type",
          "value" : "application/json; charset=utf-8"
        }, {
          "name" : "Server",
          "value" : "Microsoft-IIS/10.0"
        }, {
          "name" : "Set-Cookie",
          "value" : ".ASPROLES=RAWdYcdmpkkAwXDY7NFwKRNYqsvwkbGWHyR-HLDfAnEhXLUECzGyn1q5YLhBOo8CDsFkSe3NKMn5iOOKOnP8Hmjw0Uzw_vrGircTQbn8DaTmvsBX4h0m_M4dHYIPshcNOVjiQPSnCvT9CVtEtAKc35W3XTM4kh2bhgtSS-ib4ttoNHd5wi7WW_6pjO86xg17TTkUNzy9RMINSpT6Y-S5KQ4_yb6lBiKiWo77_vUj7F_3nJBnUJTIwVYDTxzF_C_6OHcA03-2HC5jShBEkmdbj8r1WoERAYPQwb2LUfycY5GvHfoFhfXpl3EJ5ezK04EgQQF0i0Krql0wSlFUro0Etp233vLKF3_oYbK_PP5gfvU77HWZC6qnvhUR-yDgmGFeSX3YFOsprwCXxvsSDbd78fg2ecCBJWpdfTO5Bd_jjq7hZQ_gBQ70mWXY4D1HLzDfE_ry4l8Lonq7W83LO2w24GnWJrhr5_bgiuDNM73q08yB_kkOVFnAnUpyGrGRBUANefZVaA2; path=/; HttpOnly"
        }, {
          "name" : "X-SourceFiles",
          "value" : "=?UTF-8?B?RDpcVmlydHVhbE9wdGltaXplci1SZWZhY3RvcmluZ1xDcm9wTWV0cmljcy5Wby5BcGlcQ3JvcE1ldHJpY3MuVm8uQXBpXGFwaVxtb2JpbGVcdjFcZmllbGRzXDE=?="
        }, {
          "name" : "X-Powered-By",
          "value" : "ASP.NET"
        }, {
          "name" : "Date",
          "value" : "Tue, 09 Apr 2019 09:50:00 GMT"
        }, {
          "name" : "Content-Length",
          "value" : "419"
        } ],
        "content" : {
          "size" : 419,
          "mimeType" : "application/json; charset=utf-8",
          "text" : "{\"field\":{\"id\":1,\"farm_id\":1,\"name\":\"Field only grower Updated\",\"boundary\":{\"boundaries\":[{\"boundary\":{\"coords\":[{\"x\":-101.49568751,\"y\":37.14976293},{\"x\":-101.49294093,\"y\":37.14866833},{\"x\":-101.48933604,\"y\":37.14620541},{\"x\":-101.49019435,\"y\":37.14223722},{\"x\":-101.49723246,\"y\":37.1411425},{\"x\":-101.50049403,\"y\":37.14264773},{\"x\":-101.50049403,\"y\":37.14647907},{\"x\":-101.49568751,\"y\":37.14976293}]},\"holes\":null}]}}}",
          "comment" : ""
        },
        "redirectURL" : "",
        "headersSize" : 915,
        "bodySize" : 419,
        "comment" : ""
      },
      "cache" : { },
      "timings" : {
        "comment" : "",
        "ssl" : -1,
        "connect" : -1,
        "blocked" : -1,
        "dns" : -1,
        "send" : 1,
        "receive" : 10,
        "wait" : 2353
      },
      "serverIPAddress" : "127.0.0.1",
      "comment" : "",
      "_katalonRequestInformation" : {
        "name" : "1",
        "testObjectId" : "Object Repository/VoGrow/Field/FieldPut",
        "harId" : "90ec5096-db29-46af-bc07-116c8a546230"
      },
      "time" : 2365
    } ],
    "comment" : ""
  }
}