{
  "log" : {
    "version" : "1.2",
    "creator" : {
      "name" : "BrowserMob Proxy",
      "version" : "2.1.5",
      "comment" : ""
    },
    "pages" : [ {
      "id" : "Page 0",
      "startedDateTime" : "2019-03-29T20:30:15.855Z",
      "title" : "Page 0",
      "pageTimings" : {
        "onLoad" : 98,
        "comment" : ""
      },
      "comment" : ""
    } ],
    "entries" : [ {
      "pageref" : "Page 0",
      "startedDateTime" : "2019-03-29T20:30:15.857Z",
      "request" : {
        "method" : "PUT",
        "url" : "http://localhost:10520/WebAPI/api/admin/v1/users/14?",
        "httpVersion" : "HTTP/1.1",
        "cookies" : [ ],
        "headers" : [ {
          "name" : "User-Agent",
          "value" : "Katalon Studio"
        }, {
          "name" : "Content-Type",
          "value" : "application/x-www-form-urlencoded"
        }, {
          "name" : "Authorization",
          "value" : "Bearer eyJ0eXAiOiJKV1QiLCJhbGciOiJIUzI1NiJ9.eyJ1bmlxdWVfbmFtZSI6ImFkbWluIiwicm9sZSI6InVzZXIiLCJzdWIiOiJhZG1pbiIsImlzcyI6IkNyb3BNZXRyaWNzIiwiYXVkIjoiYWxsIiwiZXhwIjoxNTUzODk1MzE1LCJuYmYiOjE1NTM4OTE0MTV9.rliVEWpssCnLy-1RB3cjormDXUp3lu8Oqp_LwzRBLWA"
        }, {
          "name" : "Host",
          "value" : "localhost:10520"
        }, {
          "name" : "Accept",
          "value" : "text/html, image/gif, image/jpeg, *; q=.2, */*; q=.2"
        }, {
          "name" : "Proxy-Connection",
          "value" : "keep-alive"
        }, {
          "name" : "Content-Length",
          "value" : "302"
        } ],
        "queryString" : [ ],
        "postData" : {
          "mimeType" : "application/x-www-form-urlencoded",
          "params" : [ {
            "name" : "password",
            "value" : "lessp",
            "comment" : ""
          }, {
            "name" : "email",
            "value" : "cropmetricsvo.15.pass@gmail.com",
            "comment" : ""
          }, {
            "name" : "fullname",
            "value" : "test validation",
            "comment" : ""
          }, {
            "name" : "phone",
            "value" : "123",
            "comment" : ""
          }, {
            "name" : "dealer",
            "value" : "x",
            "comment" : ""
          }, {
            "name" : "addressLine1",
            "value" : "address line 1 test validation",
            "comment" : ""
          }, {
            "name" : "addressLine2",
            "value" : "address line 2 test validation",
            "comment" : ""
          }, {
            "name" : "town",
            "value" : "townValidation",
            "comment" : ""
          }, {
            "name" : "state",
            "value" : "stateValidation",
            "comment" : ""
          }, {
            "name" : "zip",
            "value" : "zipValidation",
            "comment" : ""
          }, {
            "name" : "country",
            "value" : "countryValidation",
            "comment" : ""
          }, {
            "name" : "roles",
            "value" : "Client",
            "comment" : ""
          }, {
            "name" : "userProfileId",
            "value" : "14",
            "comment" : ""
          } ],
          "comment" : ""
        },
        "headersSize" : 545,
        "bodySize" : 302,
        "comment" : ""
      },
      "response" : {
        "status" : 400,
        "statusText" : "Bad Request",
        "httpVersion" : "HTTP/1.1",
        "cookies" : [ {
          "name" : ".ASPROLES",
          "value" : "kknMNhlf0qXSBD2Cb_AoGtg1aLvLepNwF7O1sgVUwe3he1R097nkVRa1hx9e5f8FXBM-GEW7r6wWl_7LOaKhw0f3LgwTe_N9pvPIlikPiloACmzsf3PfRZ-5FDq-jNSTLeWwIEscl55guf4Mjh9fRyts1l4jE4Dt7KYD3Lv3r_pk49xCpjmCL9cKBljMrRFjDD_iH-2U5aUvH2fa1Ru6JCzSLFMJX8NbcNPqrrEpSGxfkvAzSJgnd7RI8tDYCgKKT5pU7OBL6hojQNpB7cS6A4l3k5Dv_LorXhqUdSg_nLU01Lt-5Ytf2gERLPbdDFPcds2NyZqqnhUKNw910hbyeCjuw5UcJuUBBQKeI1fgUBokOvxw1WsE7-gWO3cJPa_loQxeE2n1cZrkKv1HFMuN6etvZDJlTm25TteS9eUyfQ0z6gU9ul1sX11h_C6svCalvIoDBFBcqy7ivd15n2S-7ivrsPhh4XQbbuSL4Ut750w3LvXB0",
          "path" : "/",
          "httpOnly" : true,
          "secure" : false,
          "comment" : ""
        } ],
        "headers" : [ {
          "name" : "Cache-Control",
          "value" : "private"
        }, {
          "name" : "Content-Type",
          "value" : "application/json; charset=utf-8"
        }, {
          "name" : "Server",
          "value" : "Microsoft-IIS/10.0"
        }, {
          "name" : "Set-Cookie",
          "value" : ".ASPROLES=kknMNhlf0qXSBD2Cb_AoGtg1aLvLepNwF7O1sgVUwe3he1R097nkVRa1hx9e5f8FXBM-GEW7r6wWl_7LOaKhw0f3LgwTe_N9pvPIlikPiloACmzsf3PfRZ-5FDq-jNSTLeWwIEscl55guf4Mjh9fRyts1l4jE4Dt7KYD3Lv3r_pk49xCpjmCL9cKBljMrRFjDD_iH-2U5aUvH2fa1Ru6JCzSLFMJX8NbcNPqrrEpSGxfkvAzSJgnd7RI8tDYCgKKT5pU7OBL6hojQNpB7cS6A4l3k5Dv_LorXhqUdSg_nLU01Lt-5Ytf2gERLPbdDFPcds2NyZqqnhUKNw910hbyeCjuw5UcJuUBBQKeI1fgUBokOvxw1WsE7-gWO3cJPa_loQxeE2n1cZrkKv1HFMuN6etvZDJlTm25TteS9eUyfQ0z6gU9ul1sX11h_C6svCalvIoDBFBcqy7ivd15n2S-7ivrsPhh4XQbbuSL4Ut750w3LvXB0; path=/; HttpOnly"
        }, {
          "name" : "X-SourceFiles",
          "value" : "=?UTF-8?B?RDpcVmlydHVhbE9wdGltaXplci1SZWZhY3RvcmluZ1xDcm9wTWV0cmljcy5Wby5BcGlcQ3JvcE1ldHJpY3MuVm8uQXBpXGFwaVxhZG1pblx2MVx1c2Vyc1wxNA==?="
        }, {
          "name" : "X-Powered-By",
          "value" : "ASP.NET"
        }, {
          "name" : "Date",
          "value" : "Fri, 29 Mar 2019 20:30:15 GMT"
        }, {
          "name" : "Content-Length",
          "value" : "83"
        } ],
        "content" : {
          "size" : 83,
          "mimeType" : "application/json; charset=utf-8",
          "text" : "{\"message\":\"The request is invalid. The password must have at least 6 characters.\"}",
          "comment" : ""
        },
        "redirectURL" : "",
        "headersSize" : 901,
        "bodySize" : 83,
        "comment" : ""
      },
      "cache" : { },
      "timings" : {
        "comment" : "",
        "ssl" : -1,
        "send" : 0,
        "wait" : 94,
        "connect" : -1,
        "blocked" : -1,
        "receive" : 1,
        "dns" : -1
      },
      "serverIPAddress" : "127.0.0.1",
      "comment" : "",
      "_katalonRequestInformation" : {
        "name" : "3",
        "testObjectId" : "Object Repository/VoPro/Account/api_admin_v1_users_userprofileid",
        "harId" : "11f5326e-38bb-4876-a288-897d7fd9918c"
      },
      "time" : 96
    } ],
    "comment" : ""
  }
}