{
  "log" : {
    "version" : "1.2",
    "creator" : {
      "name" : "BrowserMob Proxy",
      "version" : "2.1.5",
      "comment" : ""
    },
    "pages" : [ {
      "id" : "Page 0",
      "startedDateTime" : "2019-04-11T16:42:03.863Z",
      "title" : "Page 0",
      "pageTimings" : {
        "onLoad" : 3942,
        "comment" : ""
      },
      "comment" : ""
    } ],
    "entries" : [ {
      "pageref" : "Page 0",
      "startedDateTime" : "2019-04-11T16:42:03.864Z",
      "request" : {
        "method" : "POST",
        "url" : "http://localhost:10520/WebAPI/api/mobile/v1/fields?",
        "httpVersion" : "HTTP/1.1",
        "cookies" : [ ],
        "headers" : [ {
          "name" : "User-Agent",
          "value" : "Katalon Studio"
        }, {
          "name" : "Content-Type",
          "value" : "application/json"
        }, {
          "name" : "Authorization",
          "value" : "Bearer eyJ0eXAiOiJKV1QiLCJhbGciOiJIUzI1NiJ9.eyJ1bmlxdWVfbmFtZSI6Implbm55Lm1hbGRvbmFkby50eDFAZ21haWwuY29tIiwicm9sZSI6InVzZXIiLCJzdWIiOiJqZW5ueS5tYWxkb25hZG8udHgxQGdtYWlsLmNvbSIsImlzcyI6IkNyb3BNZXRyaWNzIiwiYXVkIjoiYWxsIiwiZXhwIjoxNTU1MDA0ODIzLCJuYmYiOjE1NTUwMDA5MjN9.WSCQLwZ_k_-VBmyFph0uhBRTbdFT5A70flDpF2vLsos"
        }, {
          "name" : "Host",
          "value" : "localhost:10520"
        }, {
          "name" : "Accept",
          "value" : "text/html, image/gif, image/jpeg, *; q=.2, */*; q=.2"
        }, {
          "name" : "Proxy-Connection",
          "value" : "keep-alive"
        }, {
          "name" : "Content-Length",
          "value" : "655"
        } ],
        "queryString" : [ ],
        "postData" : {
          "mimeType" : "application/json",
          "text" : "{\"field\":{\"farm_id\":3,\"name\":\"API_FIELD_When_new_field_has_name_attribute_with_more_than_128_chars_Expected_status_code_400 API_FIELD_When_new_field_has_name_attribute_with_more_than_128_chars_Expected_status_code_400 API_FIELD_When_new_field_has_name_attribute_with_more_than_128_chars_Expected_status_code_400\",\"boundary\":{\"boundaries\":[{\"boundary\":{\"coords\":[{\"x\":-101.49568751,\"y\":37.14976293},{\"x\":-101.50049403,\"y\":37.14647907},{\"x\":-101.50049403,\"y\":37.14264773},{\"x\":-101.49723246,\"y\":37.1411425},{\"x\":-101.49019435,\"y\":37.14223722},{\"x\":-101.48933604,\"y\":37.14620541},{\"x\":-101.49294093,\"y\":37.14866833},{\"x\":-101.49568751,\"y\":37.14976293}]}}]}}}",
          "comment" : ""
        },
        "headersSize" : 592,
        "bodySize" : 655,
        "comment" : ""
      },
      "response" : {
        "status" : 400,
        "statusText" : "Bad Request",
        "httpVersion" : "HTTP/1.1",
        "cookies" : [ {
          "name" : ".ASPROLES",
          "value" : "nr4V0bqjii7v5qd90eA1JtsuBnOE-psFlLWF_S75oXG50k2PkJ7pNEDWX2jCUmMjXez3F_sTzNUnHjAnO3Imb7SXZvNFHBx8tgHKBEWzw1apAX0tRIRwpmGoYNdU7Za5vztELxYuAWtezwarNnUO_DNg9vkjy2F-ZKW3imrc4B2jj67wkdBiiqAQewAgp6UHKozL5bYYG-HZnLPrUPt4Y0ROD6v1B1QadMCJA1YbHDUWWA9UXGuqcs-3gkz35zuU3F4xKOMGUcJAmpSwlaIwhf3VcwigEofd2KYD2S7OKCKpUyoKkcXX9j6k_Ihd9JbCr7gz1KKapnzec33Xp2Ti0_kMjYwCt9biprXB74RMVsGes22LvXKgfYvuUpuqpegJBuM3HX0Q5bGC9k7mPWqqKtvb4bAy29El1DNZyQoHteDY8VWz3nJirikljKt7R-pBu5a26862vKf1xihuk227lKANN84zaKRq9Ugxs_uPgbgUYekMoAFH4DuyA2T82QaYC_Yme1cvd9FbMUmPE-dnyIWcwhU1",
          "path" : "/",
          "httpOnly" : true,
          "secure" : false,
          "comment" : ""
        } ],
        "headers" : [ {
          "name" : "Cache-Control",
          "value" : "private"
        }, {
          "name" : "Content-Type",
          "value" : "application/json; charset=utf-8"
        }, {
          "name" : "Server",
          "value" : "Microsoft-IIS/10.0"
        }, {
          "name" : "Set-Cookie",
          "value" : ".ASPROLES=nr4V0bqjii7v5qd90eA1JtsuBnOE-psFlLWF_S75oXG50k2PkJ7pNEDWX2jCUmMjXez3F_sTzNUnHjAnO3Imb7SXZvNFHBx8tgHKBEWzw1apAX0tRIRwpmGoYNdU7Za5vztELxYuAWtezwarNnUO_DNg9vkjy2F-ZKW3imrc4B2jj67wkdBiiqAQewAgp6UHKozL5bYYG-HZnLPrUPt4Y0ROD6v1B1QadMCJA1YbHDUWWA9UXGuqcs-3gkz35zuU3F4xKOMGUcJAmpSwlaIwhf3VcwigEofd2KYD2S7OKCKpUyoKkcXX9j6k_Ihd9JbCr7gz1KKapnzec33Xp2Ti0_kMjYwCt9biprXB74RMVsGes22LvXKgfYvuUpuqpegJBuM3HX0Q5bGC9k7mPWqqKtvb4bAy29El1DNZyQoHteDY8VWz3nJirikljKt7R-pBu5a26862vKf1xihuk227lKANN84zaKRq9Ugxs_uPgbgUYekMoAFH4DuyA2T82QaYC_Yme1cvd9FbMUmPE-dnyIWcwhU1; path=/; HttpOnly"
        }, {
          "name" : "X-SourceFiles",
          "value" : "=?UTF-8?B?RDpcVmlydHVhbE9wdGltaXplci1SZWZhY3RvcmluZ1xDcm9wTWV0cmljcy5Wby5BcGlcQ3JvcE1ldHJpY3MuVm8uQXBpXGFwaVxtb2JpbGVcdjFcZmllbGRz?="
        }, {
          "name" : "X-Powered-By",
          "value" : "ASP.NET"
        }, {
          "name" : "Date",
          "value" : "Thu, 11 Apr 2019 16:42:07 GMT"
        }, {
          "name" : "Content-Length",
          "value" : "65"
        } ],
        "content" : {
          "size" : 65,
          "mimeType" : "application/json; charset=utf-8",
          "text" : "{\"message\":\"The field name must contains as max 128 characters.\"}",
          "comment" : ""
        },
        "redirectURL" : "",
        "headersSize" : 940,
        "bodySize" : 65,
        "comment" : ""
      },
      "cache" : { },
      "timings" : {
        "comment" : "",
        "send" : 0,
        "wait" : 3934,
        "receive" : 2,
        "connect" : -1,
        "blocked" : -1,
        "dns" : -1,
        "ssl" : -1
      },
      "serverIPAddress" : "127.0.0.1",
      "comment" : "",
      "_katalonRequestInformation" : {
        "name" : "37",
        "testObjectId" : "Object Repository/VoGrow/Field/FieldPost",
        "harId" : "fb989265-dc0a-429e-9e37-d23fec5c303c"
      },
      "time" : 3937
    } ],
    "comment" : ""
  }
}