{
  "log" : {
    "version" : "1.2",
    "creator" : {
      "name" : "BrowserMob Proxy",
      "version" : "2.1.5",
      "comment" : ""
    },
    "pages" : [ {
      "id" : "Page 0",
      "startedDateTime" : "2019-04-11T16:06:16.911Z",
      "title" : "Page 0",
      "pageTimings" : {
        "onLoad" : 1477,
        "comment" : ""
      },
      "comment" : ""
    } ],
    "entries" : [ {
      "pageref" : "Page 0",
      "startedDateTime" : "2019-04-11T16:06:16.913Z",
      "request" : {
        "method" : "POST",
        "url" : "http://localhost:10520/WebAPI/api/mobile/v1/fields?",
        "httpVersion" : "HTTP/1.1",
        "cookies" : [ ],
        "headers" : [ {
          "name" : "User-Agent",
          "value" : "Katalon Studio"
        }, {
          "name" : "Content-Type",
          "value" : "application/json"
        }, {
          "name" : "Authorization",
          "value" : "Bearer eyJ0eXAiOiJKV1QiLCJhbGciOiJIUzI1NiJ9.eyJ1bmlxdWVfbmFtZSI6Implbm55Lm1hbGRvbmFkby50eDFAZ21haWwuY29tIiwicm9sZSI6InVzZXIiLCJzdWIiOiJqZW5ueS5tYWxkb25hZG8udHgxQGdtYWlsLmNvbSIsImlzcyI6IkNyb3BNZXRyaWNzIiwiYXVkIjoiYWxsIiwiZXhwIjoxNTU1MDAyNjc2LCJuYmYiOjE1NTQ5OTg3NzZ9.SShNgDFCo3GTE8sS96oi9Ghujdb_7Wbxm8oZQauiHy8"
        }, {
          "name" : "Host",
          "value" : "localhost:10520"
        }, {
          "name" : "Accept",
          "value" : "text/html, image/gif, image/jpeg, *; q=.2, */*; q=.2"
        }, {
          "name" : "Proxy-Connection",
          "value" : "keep-alive"
        }, {
          "name" : "Content-Length",
          "value" : "396"
        } ],
        "queryString" : [ ],
        "postData" : {
          "mimeType" : "application/json",
          "text" : "{\"field\":{\"farm_id\":3,\"name\":\"Field created by agent\",\"boundary\":{\"boundaries\":[{\"boundary\":{\"coords\":[{\"x\":-101.49568751,\"y\":37.14976293},{\"x\":-101.50049403,\"y\":37.14647907},{\"x\":-101.50049403,\"y\":37.14264773},{\"x\":-101.49723246,\"y\":37.1411425},{\"x\":-101.49019435,\"y\":37.14223722},{\"x\":-101.48933604,\"y\":37.14620541},{\"x\":-101.49294093,\"y\":37.14866833},{\"x\":-101.49568751,\"y\":37.14976293}]}}]}}}",
          "comment" : ""
        },
        "headersSize" : 592,
        "bodySize" : 396,
        "comment" : ""
      },
      "response" : {
        "status" : 201,
        "statusText" : "Created",
        "httpVersion" : "HTTP/1.1",
        "cookies" : [ {
          "name" : ".ASPROLES",
          "value" : "LXXw00OIbuZiiGM5eJhGwq2xmWNA42IYs43y01UhZYcxp88VwQghrVQPsgJNvhok-VLpYd_Dsqpv6cUkB_nX_pk_L4Q7fLbViDVQOzQlwbC6OL82vtlDp5-p1Ua4xw07MXvuTShS3fDwmYnLC67NidqdDX8-nOR_4r8T3WRoOspSONRaBCK6SreSEjEUMjudJYWgySQTPfZNR8LK8f4x3mCmxGXc39Shtn15xb5H1fGrgcmc3lCRC2FPRUPWjONgTcKFYKKz9IUYwBVrNFJ9IWHx3n07oWtLx7mZnpMmeUJR_NKnH9EZZywpmHA25nPgRbbbXlfmXo-2SYQOpAHtyC4CSelsiY0-GCm4vtpGYqGpUMUtClUtA4NPM6WrPfB3JAdHD6ZJuUYnIG1zSQTl_YG5z3PnhxvDiWDpYDixBxApCHHyxmIbk2yrS-ECwkFHMP_j0qtR4ffaeTMLRLbFPnhv30EJAGGQKGaqY40dtHhxDq3krps9tr44yPmzrfCK8Mdu8Z1GKOpi2LauX_nJkho7ri01",
          "path" : "/",
          "httpOnly" : true,
          "secure" : false,
          "comment" : ""
        } ],
        "headers" : [ {
          "name" : "Cache-Control",
          "value" : "private"
        }, {
          "name" : "Content-Type",
          "value" : "application/json; charset=utf-8"
        }, {
          "name" : "Location",
          "value" : "api/mobile/v1/fields/2"
        }, {
          "name" : "Server",
          "value" : "Microsoft-IIS/10.0"
        }, {
          "name" : "Set-Cookie",
          "value" : ".ASPROLES=LXXw00OIbuZiiGM5eJhGwq2xmWNA42IYs43y01UhZYcxp88VwQghrVQPsgJNvhok-VLpYd_Dsqpv6cUkB_nX_pk_L4Q7fLbViDVQOzQlwbC6OL82vtlDp5-p1Ua4xw07MXvuTShS3fDwmYnLC67NidqdDX8-nOR_4r8T3WRoOspSONRaBCK6SreSEjEUMjudJYWgySQTPfZNR8LK8f4x3mCmxGXc39Shtn15xb5H1fGrgcmc3lCRC2FPRUPWjONgTcKFYKKz9IUYwBVrNFJ9IWHx3n07oWtLx7mZnpMmeUJR_NKnH9EZZywpmHA25nPgRbbbXlfmXo-2SYQOpAHtyC4CSelsiY0-GCm4vtpGYqGpUMUtClUtA4NPM6WrPfB3JAdHD6ZJuUYnIG1zSQTl_YG5z3PnhxvDiWDpYDixBxApCHHyxmIbk2yrS-ECwkFHMP_j0qtR4ffaeTMLRLbFPnhv30EJAGGQKGaqY40dtHhxDq3krps9tr44yPmzrfCK8Mdu8Z1GKOpi2LauX_nJkho7ri01; path=/; HttpOnly"
        }, {
          "name" : "X-SourceFiles",
          "value" : "=?UTF-8?B?RDpcVmlydHVhbE9wdGltaXplci1SZWZhY3RvcmluZ1xDcm9wTWV0cmljcy5Wby5BcGlcQ3JvcE1ldHJpY3MuVm8uQXBpXGFwaVxtb2JpbGVcdjFcZmllbGRz?="
        }, {
          "name" : "X-Powered-By",
          "value" : "ASP.NET"
        }, {
          "name" : "Date",
          "value" : "Thu, 11 Apr 2019 16:06:18 GMT"
        }, {
          "name" : "Content-Length",
          "value" : "416"
        } ],
        "content" : {
          "size" : 416,
          "mimeType" : "application/json; charset=utf-8",
          "text" : "{\"field\":{\"id\":2,\"farm_id\":3,\"name\":\"Field created by agent\",\"boundary\":{\"boundaries\":[{\"boundary\":{\"coords\":[{\"x\":-101.49568751,\"y\":37.14976293},{\"x\":-101.49294093,\"y\":37.14866833},{\"x\":-101.48933604,\"y\":37.14620541},{\"x\":-101.49019435,\"y\":37.14223722},{\"x\":-101.49723246,\"y\":37.1411425},{\"x\":-101.50049403,\"y\":37.14264773},{\"x\":-101.50049403,\"y\":37.14647907},{\"x\":-101.49568751,\"y\":37.14976293}]},\"holes\":null}]}}}",
          "comment" : ""
        },
        "redirectURL" : "",
        "headersSize" : 971,
        "bodySize" : 416,
        "comment" : ""
      },
      "cache" : { },
      "timings" : {
        "comment" : "",
        "ssl" : -1,
        "dns" : -1,
        "receive" : 1,
        "blocked" : -1,
        "connect" : -1,
        "wait" : 1470,
        "send" : 0
      },
      "serverIPAddress" : "127.0.0.1",
      "comment" : "",
      "_katalonRequestInformation" : {
        "name" : "3",
        "testObjectId" : "Object Repository/VoGrow/Field/FieldPost",
        "harId" : "d99a70de-2d41-4083-bc8c-8780d09e8aaa"
      },
      "time" : 1471
    } ],
    "comment" : ""
  }
}