{
  "log" : {
    "version" : "1.2",
    "creator" : {
      "name" : "BrowserMob Proxy",
      "version" : "2.1.5",
      "comment" : ""
    },
    "pages" : [ {
      "id" : "Page 0",
      "startedDateTime" : "2019-03-29T16:39:59.787Z",
      "title" : "Page 0",
      "pageTimings" : {
        "onLoad" : 1906,
        "comment" : ""
      },
      "comment" : ""
    } ],
    "entries" : [ {
      "pageref" : "Page 0",
      "startedDateTime" : "2019-03-29T16:39:59.787Z",
      "request" : {
        "method" : "POST",
        "url" : "http://localhost:10520/WebAPI/api/admin/v1/users/?",
        "httpVersion" : "HTTP/1.1",
        "cookies" : [ ],
        "headers" : [ {
          "name" : "User-Agent",
          "value" : "Katalon Studio"
        }, {
          "name" : "Content-Type",
          "value" : "application/x-www-form-urlencoded"
        }, {
          "name" : "Authorization",
          "value" : "Bearer eyJ0eXAiOiJKV1QiLCJhbGciOiJIUzI1NiJ9.eyJ1bmlxdWVfbmFtZSI6ImFkbWluIiwicm9sZSI6InVzZXIiLCJzdWIiOiJhZG1pbiIsImlzcyI6IkNyb3BNZXRyaWNzIiwiYXVkIjoiYWxsIiwiZXhwIjoxNTUzODgxNDk5LCJuYmYiOjE1NTM4Nzc1OTl9.EM0bWrCnnngJ1k5t1ZpOuxgQlkVqED_KnWJOnlRZtuU"
        }, {
          "name" : "Host",
          "value" : "localhost:10520"
        }, {
          "name" : "Accept",
          "value" : "text/html, image/gif, image/jpeg, *; q=.2, */*; q=.2"
        }, {
          "name" : "Proxy-Connection",
          "value" : "keep-alive"
        }, {
          "name" : "Content-Length",
          "value" : "300"
        } ],
        "queryString" : [ ],
        "postData" : {
          "mimeType" : "application/x-www-form-urlencoded",
          "params" : [ {
            "name" : "password",
            "value" : "cropmetrics",
            "comment" : ""
          }, {
            "name" : "email",
            "value" : "cropmetricsvo.phonesymbols@gmail.com",
            "comment" : ""
          }, {
            "name" : "fullname",
            "value" : "x",
            "comment" : ""
          }, {
            "name" : "phone",
            "value" : "!@#$%^&",
            "comment" : ""
          }, {
            "name" : "dealer",
            "value" : "x",
            "comment" : ""
          }, {
            "name" : "addressLine1",
            "value" : "address line 1 test validation",
            "comment" : ""
          }, {
            "name" : "addressLine2",
            "value" : "address line 2 test validation",
            "comment" : ""
          }, {
            "name" : "town",
            "value" : "townValidation",
            "comment" : ""
          }, {
            "name" : "state",
            "value" : "stateValidation",
            "comment" : ""
          }, {
            "name" : "zip",
            "value" : "zipValidation",
            "comment" : ""
          }, {
            "name" : "country",
            "value" : "countryValidation",
            "comment" : ""
          }, {
            "name" : "roles",
            "value" : "Client",
            "comment" : ""
          } ],
          "comment" : ""
        },
        "headersSize" : 544,
        "bodySize" : 300,
        "comment" : ""
      },
      "response" : {
        "status" : 200,
        "statusText" : "OK",
        "httpVersion" : "HTTP/1.1",
        "cookies" : [ {
          "name" : ".ASPROLES",
          "value" : "8jQ68143WKAIjDR0ScDmHX9737rmjEp1VJCjTasTmLmquw3HRAe8zFiVeKpj14N5Gc8LnQqSAJeSRuwZhdMYb8uLWsh4rB9EheykKmaeDvTZmTHOeCj7lsZUU-rJy4yFWnsRYr7pL-HJVa93V4VkfWxGTbZqrj-W_41ed3F6wSmErfK4QVCf4hEz8p1bmt4rm3FUkfdRBc7cMSdfTGFDfaRqPQLZfZqwW8cVZeFmRLHWECV2NjQ6Zr3MJpg1fWnXal3HU_mxhoJX-JLip-yZ4-HNZ9jxMynQ5feX7lzR3HDIrIRNwrqXHsWmpTBj9gFTHHbR9f3wull3BGT3tP7AYBWM0Fzgmh8Hh_P_mTOqt1TWWXMLwlcG3nnoPG066FAxr5_ndi1I4eYvItFIB-cv6xAFDQEcl1BLBeH3FAR580H_CRMVll8Sx1AWJuq5miYhwK0ZL9tQBAjKqFrNTor8CxNFeGb4CMIIXEB3gqaPFJB9vzUx0",
          "path" : "/",
          "httpOnly" : true,
          "secure" : false,
          "comment" : ""
        } ],
        "headers" : [ {
          "name" : "Cache-Control",
          "value" : "private"
        }, {
          "name" : "Content-Type",
          "value" : "application/json; charset=utf-8"
        }, {
          "name" : "Server",
          "value" : "Microsoft-IIS/10.0"
        }, {
          "name" : "Set-Cookie",
          "value" : ".ASPROLES=8jQ68143WKAIjDR0ScDmHX9737rmjEp1VJCjTasTmLmquw3HRAe8zFiVeKpj14N5Gc8LnQqSAJeSRuwZhdMYb8uLWsh4rB9EheykKmaeDvTZmTHOeCj7lsZUU-rJy4yFWnsRYr7pL-HJVa93V4VkfWxGTbZqrj-W_41ed3F6wSmErfK4QVCf4hEz8p1bmt4rm3FUkfdRBc7cMSdfTGFDfaRqPQLZfZqwW8cVZeFmRLHWECV2NjQ6Zr3MJpg1fWnXal3HU_mxhoJX-JLip-yZ4-HNZ9jxMynQ5feX7lzR3HDIrIRNwrqXHsWmpTBj9gFTHHbR9f3wull3BGT3tP7AYBWM0Fzgmh8Hh_P_mTOqt1TWWXMLwlcG3nnoPG066FAxr5_ndi1I4eYvItFIB-cv6xAFDQEcl1BLBeH3FAR580H_CRMVll8Sx1AWJuq5miYhwK0ZL9tQBAjKqFrNTor8CxNFeGb4CMIIXEB3gqaPFJB9vzUx0; path=/; HttpOnly"
        }, {
          "name" : "X-SourceFiles",
          "value" : "=?UTF-8?B?RDpcVmlydHVhbE9wdGltaXplci1SZWZhY3RvcmluZ1xDcm9wTWV0cmljcy5Wby5BcGlcQ3JvcE1ldHJpY3MuVm8uQXBpXGFwaVxhZG1pblx2MVx1c2Vyc1w=?="
        }, {
          "name" : "X-Powered-By",
          "value" : "ASP.NET"
        }, {
          "name" : "Date",
          "value" : "Fri, 29 Mar 2019 16:40:01 GMT"
        }, {
          "name" : "Content-Length",
          "value" : "9"
        } ],
        "content" : {
          "size" : 9,
          "mimeType" : "application/json; charset=utf-8",
          "text" : "{\"id\":19}",
          "comment" : ""
        },
        "redirectURL" : "",
        "headersSize" : 887,
        "bodySize" : 9,
        "comment" : ""
      },
      "cache" : { },
      "timings" : {
        "comment" : "",
        "ssl" : -1,
        "wait" : 1902,
        "connect" : -1,
        "send" : 0,
        "blocked" : -1,
        "receive" : 0,
        "dns" : -1
      },
      "serverIPAddress" : "127.0.0.1",
      "comment" : "",
      "_katalonRequestInformation" : {
        "name" : "57",
        "testObjectId" : "Object Repository/VoPro/Account/api_admin_v1_users",
        "harId" : "bb642be0-a003-403d-8bf4-07419bcbcb3a"
      },
      "time" : 1903
    } ],
    "comment" : ""
  }
}