{
  "log" : {
    "version" : "1.2",
    "creator" : {
      "name" : "BrowserMob Proxy",
      "version" : "2.1.5",
      "comment" : ""
    },
    "pages" : [ {
      "id" : "Page 0",
      "startedDateTime" : "2019-04-24T20:30:42.692Z",
      "title" : "Page 0",
      "pageTimings" : {
        "onLoad" : 3324,
        "comment" : ""
      },
      "comment" : ""
    } ],
    "entries" : [ {
      "pageref" : "Page 0",
      "startedDateTime" : "2019-04-24T20:30:42.694Z",
      "request" : {
        "method" : "POST",
        "url" : "http://localhost:10520/WebAPI/api/mobile/v1/fields?",
        "httpVersion" : "HTTP/1.1",
        "cookies" : [ ],
        "headers" : [ {
          "name" : "User-Agent",
          "value" : "Katalon Studio"
        }, {
          "name" : "Content-Type",
          "value" : "application/json"
        }, {
          "name" : "Authorization",
          "value" : "Bearer eyJ0eXAiOiJKV1QiLCJhbGciOiJIUzI1NiJ9.eyJ1bmlxdWVfbmFtZSI6Implbm55Lm1hbGRvbmFkby50eDFAZ21haWwuY29tIiwicm9sZSI6InVzZXIiLCJzdWIiOiJqZW5ueS5tYWxkb25hZG8udHgxQGdtYWlsLmNvbSIsImlzcyI6IkNyb3BNZXRyaWNzIiwiYXVkIjoiYWxsIiwiZXhwIjoxNTU2MTQxNzQyLCJuYmYiOjE1NTYxMzc4NDJ9.Y_IG_YJkM1vFpMovPN_aLrZp8BfqV87Rclp4dKFnLWU"
        }, {
          "name" : "Host",
          "value" : "localhost:10520"
        }, {
          "name" : "Accept",
          "value" : "text/html, image/gif, image/jpeg, *; q=.2, */*; q=.2"
        }, {
          "name" : "Proxy-Connection",
          "value" : "keep-alive"
        }, {
          "name" : "Content-Length",
          "value" : "389"
        } ],
        "queryString" : [ ],
        "postData" : {
          "mimeType" : "application/json",
          "text" : "{\"field\":{\"farm_id\":7,\"name\":\"Field without x value in boundary\",\"boundary\":{\"boundaries\":[{\"boundary\":{\"coords\":[{\"y\":37.14976293},{\"x\":-101.50049403,\"y\":37.14647907},{\"x\":-101.50049403,\"y\":37.14264773},{\"x\":-101.49723246,\"y\":37.1411425},{\"x\":-101.49019435,\"y\":37.14223722},{\"x\":-101.48933604,\"y\":37.14620541},{\"x\":-101.49294093,\"y\":37.14866833},{\"x\":-101.49568751,\"y\":37.14976293}]}}]}}}",
          "comment" : ""
        },
        "headersSize" : 592,
        "bodySize" : 389,
        "comment" : ""
      },
      "response" : {
        "status" : 400,
        "statusText" : "Bad Request",
        "httpVersion" : "HTTP/1.1",
        "cookies" : [ {
          "name" : ".ASPROLES",
          "value" : "DacSbKYA2TH5IZlu2Yg3MKiCqseGgNrMaMe5GdfgpzM0MMpFZUmXIrD4FMlErKQMuhPe6O-kgzRkwbKkiHLzEoaPR63mdUcyQrBoQN0bMU19BsRKQwstWr2iSfImlNyvbpcG2k356ANx_2lxb8MByG28c01AM21LSrzyFWojZAgtNRV7OmVuuSRPrPidGA5XhIx0YgyhQyveBmJEB138D_DQCjqGhHg31Nln2J8IQ9wDQAjkXvAwJEtqMZREff--ki9Cb3WmKnycjzYGDWmutnwsvrHDHIPeQa6yzxbuhuPZpgmDC0eUlWCYCUHbDf9mPDtesfpaFniGIZf8BJbuslsSJGTOkMMoaRBbugbiM7Hpm_5nIT3J_QBEc7pAOMf2qWF-xebkH42i_DFT-Kx83eQ8IJLBEmfMsObS4ikLefvvDEzqLV4isO06oaeWxyJeYN60yVq4N6gVLaCePAO75aIPOAIGC8ZQkWD2fe_-WiwC81kVJBaesaCqsfZ1IJDEMYU2Tl22nDXXtadgEFLQL279QVg1",
          "path" : "/",
          "httpOnly" : true,
          "secure" : false,
          "comment" : ""
        } ],
        "headers" : [ {
          "name" : "Cache-Control",
          "value" : "private"
        }, {
          "name" : "Content-Type",
          "value" : "application/json; charset=utf-8"
        }, {
          "name" : "Server",
          "value" : "Microsoft-IIS/10.0"
        }, {
          "name" : "Set-Cookie",
          "value" : ".ASPROLES=DacSbKYA2TH5IZlu2Yg3MKiCqseGgNrMaMe5GdfgpzM0MMpFZUmXIrD4FMlErKQMuhPe6O-kgzRkwbKkiHLzEoaPR63mdUcyQrBoQN0bMU19BsRKQwstWr2iSfImlNyvbpcG2k356ANx_2lxb8MByG28c01AM21LSrzyFWojZAgtNRV7OmVuuSRPrPidGA5XhIx0YgyhQyveBmJEB138D_DQCjqGhHg31Nln2J8IQ9wDQAjkXvAwJEtqMZREff--ki9Cb3WmKnycjzYGDWmutnwsvrHDHIPeQa6yzxbuhuPZpgmDC0eUlWCYCUHbDf9mPDtesfpaFniGIZf8BJbuslsSJGTOkMMoaRBbugbiM7Hpm_5nIT3J_QBEc7pAOMf2qWF-xebkH42i_DFT-Kx83eQ8IJLBEmfMsObS4ikLefvvDEzqLV4isO06oaeWxyJeYN60yVq4N6gVLaCePAO75aIPOAIGC8ZQkWD2fe_-WiwC81kVJBaesaCqsfZ1IJDEMYU2Tl22nDXXtadgEFLQL279QVg1; path=/; HttpOnly"
        }, {
          "name" : "X-SourceFiles",
          "value" : "=?UTF-8?B?RDpcVmlydHVhbE9wdGltaXplci1SZWZhY3RvcmluZ1xDcm9wTWV0cmljcy5Wby5BcGlcQ3JvcE1ldHJpY3MuVm8uQXBpXGFwaVxtb2JpbGVcdjFcZmllbGRz?="
        }, {
          "name" : "X-Powered-By",
          "value" : "ASP.NET"
        }, {
          "name" : "Date",
          "value" : "Wed, 24 Apr 2019 20:30:46 GMT"
        }, {
          "name" : "Content-Length",
          "value" : "119"
        } ],
        "content" : {
          "size" : 119,
          "mimeType" : "application/json; charset=utf-8",
          "text" : "{\"message\":\"The Boundary is not valid. IllegalArgumentException: Points of LinearRing do not form a closed linestring\"}",
          "comment" : ""
        },
        "redirectURL" : "",
        "headersSize" : 941,
        "bodySize" : 119,
        "comment" : ""
      },
      "cache" : { },
      "timings" : {
        "comment" : "",
        "ssl" : -1,
        "receive" : 0,
        "send" : 0,
        "wait" : 3320,
        "connect" : -1,
        "blocked" : -1,
        "dns" : -1
      },
      "serverIPAddress" : "127.0.0.1",
      "comment" : "",
      "_katalonRequestInformation" : {
        "name" : "104",
        "testObjectId" : "Object Repository/VoGrow/Field/FieldPost",
        "harId" : "fca2d651-d849-48c9-976b-ac187ade7a45"
      },
      "time" : 3321
    } ],
    "comment" : ""
  }
}