{
  "log" : {
    "version" : "1.2",
    "creator" : {
      "name" : "BrowserMob Proxy",
      "version" : "2.1.5",
      "comment" : ""
    },
    "pages" : [ {
      "id" : "Page 0",
      "startedDateTime" : "2019-04-01T13:39:32.816Z",
      "title" : "Page 0",
      "pageTimings" : {
        "onLoad" : 26,
        "comment" : ""
      },
      "comment" : ""
    } ],
    "entries" : [ {
      "pageref" : "Page 0",
      "startedDateTime" : "2019-04-01T13:39:32.817Z",
      "request" : {
        "method" : "PUT",
        "url" : "http://localhost:10520/WebAPI/api/admin/v1/users/14?",
        "httpVersion" : "HTTP/1.1",
        "cookies" : [ ],
        "headers" : [ {
          "name" : "User-Agent",
          "value" : "Katalon Studio"
        }, {
          "name" : "Content-Type",
          "value" : "application/x-www-form-urlencoded"
        }, {
          "name" : "Authorization",
          "value" : "Bearer eyJ0eXAiOiJKV1QiLCJhbGciOiJIUzI1NiJ9.eyJ1bmlxdWVfbmFtZSI6ImFkbWluIiwicm9sZSI6InVzZXIiLCJzdWIiOiJhZG1pbiIsImlzcyI6IkNyb3BNZXRyaWNzIiwiYXVkIjoiYWxsIiwiZXhwIjoxNTU0MTI5ODcyLCJuYmYiOjE1NTQxMjU5NzJ9.wMWJWBNQUJkfGLLD2_hp44NxJsEc4qUm2hrTXh2_1Bg"
        }, {
          "name" : "Host",
          "value" : "localhost:10520"
        }, {
          "name" : "Accept",
          "value" : "text/html, image/gif, image/jpeg, *; q=.2, */*; q=.2"
        }, {
          "name" : "Proxy-Connection",
          "value" : "keep-alive"
        }, {
          "name" : "Content-Length",
          "value" : "275"
        } ],
        "queryString" : [ ],
        "postData" : {
          "mimeType" : "application/x-www-form-urlencoded",
          "params" : [ {
            "name" : "password",
            "value" : "cropmetrics",
            "comment" : ""
          }, {
            "name" : "email",
            "value" : "",
            "comment" : ""
          }, {
            "name" : "fullname",
            "value" : "test validation",
            "comment" : ""
          }, {
            "name" : "phone",
            "value" : "123",
            "comment" : ""
          }, {
            "name" : "dealer",
            "value" : "x",
            "comment" : ""
          }, {
            "name" : "addressLine1",
            "value" : "address line 1 test validation",
            "comment" : ""
          }, {
            "name" : "addressLine2",
            "value" : "address line 2 test validation",
            "comment" : ""
          }, {
            "name" : "town",
            "value" : "townValidation",
            "comment" : ""
          }, {
            "name" : "state",
            "value" : "stateValidation",
            "comment" : ""
          }, {
            "name" : "zip",
            "value" : "zipValidation",
            "comment" : ""
          }, {
            "name" : "country",
            "value" : "countryValidation",
            "comment" : ""
          }, {
            "name" : "roles",
            "value" : "Client",
            "comment" : ""
          }, {
            "name" : "userProfileId",
            "value" : "14",
            "comment" : ""
          } ],
          "comment" : ""
        },
        "headersSize" : 545,
        "bodySize" : 275,
        "comment" : ""
      },
      "response" : {
        "status" : 400,
        "statusText" : "Bad Request",
        "httpVersion" : "HTTP/1.1",
        "cookies" : [ {
          "name" : ".ASPROLES",
          "value" : "RtExjaFbY9BpRJFPDkfnNlJiURIkDrBCRyg7WJeKzNXkLGr0r8dJaq-XJmm7WP_TaP5FPGzIX0N_ThVkFArdLXzn382NiCdtxs9jQtIvuLnB4mMb_aRXfyMkwVqwdQgMdYQjcF1yaGL9h1hVl5jX6guzaD2BFs2ah9Ta1N1ygOPJWJ2N9FY1Eu98R5Og7IleDoV7ixo_Bm3QiaKPF1j4xpWXj6TxRs4mdu-kkPuP3s4Jwa1A9qsyI9-bvDfc85d0PjxWxNLouYljaTBJAHbLwzQ4moEiwYRO6KazDuky4SW2Y5uZc0_nkmonFhGIGEvyTq4nUBywLD3Kem-WNeRjT0upMen-ss2xdH2z9pfopKl1vPRk5kSMdOcU6xEBQNz5qpKCf3JjTtfWDJQy6qTEXMhtS_9IhIMOLGUQ9GBYVujjwkkarirVLizxZYRXP90Eeeh2B5tu8uBkss7E4ucMM1xvQxfWqmq4oXUXFUsd4K6FqyS90",
          "path" : "/",
          "httpOnly" : true,
          "secure" : false,
          "comment" : ""
        } ],
        "headers" : [ {
          "name" : "Cache-Control",
          "value" : "private"
        }, {
          "name" : "Content-Type",
          "value" : "application/json; charset=utf-8"
        }, {
          "name" : "Server",
          "value" : "Microsoft-IIS/10.0"
        }, {
          "name" : "Set-Cookie",
          "value" : ".ASPROLES=RtExjaFbY9BpRJFPDkfnNlJiURIkDrBCRyg7WJeKzNXkLGr0r8dJaq-XJmm7WP_TaP5FPGzIX0N_ThVkFArdLXzn382NiCdtxs9jQtIvuLnB4mMb_aRXfyMkwVqwdQgMdYQjcF1yaGL9h1hVl5jX6guzaD2BFs2ah9Ta1N1ygOPJWJ2N9FY1Eu98R5Og7IleDoV7ixo_Bm3QiaKPF1j4xpWXj6TxRs4mdu-kkPuP3s4Jwa1A9qsyI9-bvDfc85d0PjxWxNLouYljaTBJAHbLwzQ4moEiwYRO6KazDuky4SW2Y5uZc0_nkmonFhGIGEvyTq4nUBywLD3Kem-WNeRjT0upMen-ss2xdH2z9pfopKl1vPRk5kSMdOcU6xEBQNz5qpKCf3JjTtfWDJQy6qTEXMhtS_9IhIMOLGUQ9GBYVujjwkkarirVLizxZYRXP90Eeeh2B5tu8uBkss7E4ucMM1xvQxfWqmq4oXUXFUsd4K6FqyS90; path=/; HttpOnly"
        }, {
          "name" : "X-SourceFiles",
          "value" : "=?UTF-8?B?RDpcVmlydHVhbE9wdGltaXplci1SZWZhY3RvcmluZ1xDcm9wTWV0cmljcy5Wby5BcGlcQ3JvcE1ldHJpY3MuVm8uQXBpXGFwaVxhZG1pblx2MVx1c2Vyc1wxNA==?="
        }, {
          "name" : "X-Powered-By",
          "value" : "ASP.NET"
        }, {
          "name" : "Date",
          "value" : "Mon, 01 Apr 2019 13:39:32 GMT"
        }, {
          "name" : "Content-Length",
          "value" : "97"
        } ],
        "content" : {
          "size" : 97,
          "mimeType" : "application/json; charset=utf-8",
          "text" : "{\"message\":\"The request is invalid. The email cannot be blank or the value provided is invalid.\"}",
          "comment" : ""
        },
        "redirectURL" : "",
        "headersSize" : 901,
        "bodySize" : 97,
        "comment" : ""
      },
      "cache" : { },
      "timings" : {
        "comment" : "",
        "blocked" : -1,
        "connect" : -1,
        "dns" : -1,
        "ssl" : -1,
        "send" : 0,
        "wait" : 21,
        "receive" : 0
      },
      "serverIPAddress" : "127.0.0.1",
      "comment" : "",
      "_katalonRequestInformation" : {
        "name" : "107",
        "testObjectId" : "Object Repository/VoPro/Account/api_admin_v1_users_userprofileid",
        "harId" : "3bbcf849-2637-45df-baf6-5cfc27973032"
      },
      "time" : 22
    } ],
    "comment" : ""
  }
}