{
  "log" : {
    "version" : "1.2",
    "creator" : {
      "name" : "BrowserMob Proxy",
      "version" : "2.1.5",
      "comment" : ""
    },
    "pages" : [ {
      "id" : "Page 0",
      "startedDateTime" : "2019-04-11T16:08:11.103Z",
      "title" : "Page 0",
      "pageTimings" : {
        "onLoad" : 3119,
        "comment" : ""
      },
      "comment" : ""
    } ],
    "entries" : [ {
      "pageref" : "Page 0",
      "startedDateTime" : "2019-04-11T16:08:11.104Z",
      "request" : {
        "method" : "POST",
        "url" : "http://localhost:10520/WebAPI/api/mobile/v1/fields?",
        "httpVersion" : "HTTP/1.1",
        "cookies" : [ ],
        "headers" : [ {
          "name" : "User-Agent",
          "value" : "Katalon Studio"
        }, {
          "name" : "Content-Type",
          "value" : "application/json"
        }, {
          "name" : "Authorization",
          "value" : "Bearer eyJ0eXAiOiJKV1QiLCJhbGciOiJIUzI1NiJ9.eyJ1bmlxdWVfbmFtZSI6Implbm55Lm1hbGRvbmFkby50eDFAZ21haWwuY29tIiwicm9sZSI6InVzZXIiLCJzdWIiOiJqZW5ueS5tYWxkb25hZG8udHgxQGdtYWlsLmNvbSIsImlzcyI6IkNyb3BNZXRyaWNzIiwiYXVkIjoiYWxsIiwiZXhwIjoxNTU1MDAyNzkxLCJuYmYiOjE1NTQ5OTg4OTF9.nFDP2xgQB6j4Lgun5GVgxBBSVC97-QxV4AxfTR9fWU0"
        }, {
          "name" : "Host",
          "value" : "localhost:10520"
        }, {
          "name" : "Accept",
          "value" : "text/html, image/gif, image/jpeg, *; q=.2, */*; q=.2"
        }, {
          "name" : "Proxy-Connection",
          "value" : "keep-alive"
        }, {
          "name" : "Content-Length",
          "value" : "413"
        } ],
        "queryString" : [ ],
        "postData" : {
          "mimeType" : "application/json",
          "text" : "{\"field\":{\"farm_id\":7,\"name\":\"Field whit invalid xy value on boundary\",\"boundary\":{\"boundaries\":[{\"boundary\":{\"coords\":[{\"x\":-301.49568751,\"y\":37.14976293},{\"x\":-101.50049403,\"y\":37.14647907},{\"x\":-101.50049403,\"y\":37.14264773},{\"x\":-101.49723246,\"y\":37.1411425},{\"x\":-101.49019435,\"y\":37.14223722},{\"x\":-101.48933604,\"y\":37.14620541},{\"x\":-101.49294093,\"y\":37.14866833},{\"x\":-101.49568751,\"y\":37.14976293}]}}]}}}",
          "comment" : ""
        },
        "headersSize" : 592,
        "bodySize" : 413,
        "comment" : ""
      },
      "response" : {
        "status" : 400,
        "statusText" : "Bad Request",
        "httpVersion" : "HTTP/1.1",
        "cookies" : [ {
          "name" : ".ASPROLES",
          "value" : "5vfwc9AwX8T3VuBUnvwX1WmR4j8ItyyNN4qwuqyVkp0_2eRUhgvnjIJAf2OXOt-14rtx33IJ6NEkp1l_Seqwm0A_nvznLeM0KWfN6Kq7phYVu4XqoVisao9PgSEeyLPin_oA82BDynoq-uQMTAlBgTIaddBbu2xpo8OTsNFczzBkoIIgJ24mZAm4ksJK3WLA49N8KWxloS_pRn9b-ZRm-9hxWk36hVTmfIB7gKU8twDkqXkeGNJpYEUylirWRZZUbzvD5_cvM0T9np-iDKkeyCRE7HH2czUPnx6WaecqU9bOv0BRKSYYfLJpOBhClPjYT7hq-wy8YMXN0DJEBUZAud59ex9mRqlO5pyAgB25rcst1a3vuY4I-i4cgmxpnPwkiUdl6WF_mbRQb_xelK00vS1qvhCUSeWyhFILlZaGP7BLu6MWplzRokXYtasxu3UhsGKGPcEtIR4HG6kWkLWFxEQaXUA4eO76Ix_WV_gy2xk8WnE-k58RgBXttZZC2l45xvB4o-7T76eVoIYvpQ_3SIqz1UQ1",
          "path" : "/",
          "httpOnly" : true,
          "secure" : false,
          "comment" : ""
        } ],
        "headers" : [ {
          "name" : "Cache-Control",
          "value" : "private"
        }, {
          "name" : "Content-Type",
          "value" : "application/json; charset=utf-8"
        }, {
          "name" : "Server",
          "value" : "Microsoft-IIS/10.0"
        }, {
          "name" : "Set-Cookie",
          "value" : ".ASPROLES=5vfwc9AwX8T3VuBUnvwX1WmR4j8ItyyNN4qwuqyVkp0_2eRUhgvnjIJAf2OXOt-14rtx33IJ6NEkp1l_Seqwm0A_nvznLeM0KWfN6Kq7phYVu4XqoVisao9PgSEeyLPin_oA82BDynoq-uQMTAlBgTIaddBbu2xpo8OTsNFczzBkoIIgJ24mZAm4ksJK3WLA49N8KWxloS_pRn9b-ZRm-9hxWk36hVTmfIB7gKU8twDkqXkeGNJpYEUylirWRZZUbzvD5_cvM0T9np-iDKkeyCRE7HH2czUPnx6WaecqU9bOv0BRKSYYfLJpOBhClPjYT7hq-wy8YMXN0DJEBUZAud59ex9mRqlO5pyAgB25rcst1a3vuY4I-i4cgmxpnPwkiUdl6WF_mbRQb_xelK00vS1qvhCUSeWyhFILlZaGP7BLu6MWplzRokXYtasxu3UhsGKGPcEtIR4HG6kWkLWFxEQaXUA4eO76Ix_WV_gy2xk8WnE-k58RgBXttZZC2l45xvB4o-7T76eVoIYvpQ_3SIqz1UQ1; path=/; HttpOnly"
        }, {
          "name" : "X-SourceFiles",
          "value" : "=?UTF-8?B?RDpcVmlydHVhbE9wdGltaXplci1SZWZhY3RvcmluZ1xDcm9wTWV0cmljcy5Wby5BcGlcQ3JvcE1ldHJpY3MuVm8uQXBpXGFwaVxtb2JpbGVcdjFcZmllbGRz?="
        }, {
          "name" : "X-Powered-By",
          "value" : "ASP.NET"
        }, {
          "name" : "Date",
          "value" : "Thu, 11 Apr 2019 16:08:14 GMT"
        }, {
          "name" : "Content-Length",
          "value" : "119"
        } ],
        "content" : {
          "size" : 119,
          "mimeType" : "application/json; charset=utf-8",
          "text" : "{\"message\":\"The Boundary is not valid. IllegalArgumentException: Points of LinearRing do not form a closed linestring\"}",
          "comment" : ""
        },
        "redirectURL" : "",
        "headersSize" : 941,
        "bodySize" : 119,
        "comment" : ""
      },
      "cache" : { },
      "timings" : {
        "comment" : "",
        "ssl" : -1,
        "dns" : -1,
        "receive" : 1,
        "blocked" : -1,
        "connect" : -1,
        "wait" : 3114,
        "send" : 0
      },
      "serverIPAddress" : "127.0.0.1",
      "comment" : "",
      "_katalonRequestInformation" : {
        "name" : "92",
        "testObjectId" : "Object Repository/VoGrow/Field/FieldPost",
        "harId" : "758c5582-5955-466c-843b-4d3b8465b1c7"
      },
      "time" : 3116
    } ],
    "comment" : ""
  }
}