{
  "log" : {
    "version" : "1.2",
    "creator" : {
      "name" : "BrowserMob Proxy",
      "version" : "2.1.5",
      "comment" : ""
    },
    "pages" : [ {
      "id" : "Page 0",
      "startedDateTime" : "2019-04-09T20:48:57.823Z",
      "title" : "Page 0",
      "pageTimings" : {
        "onLoad" : 14,
        "comment" : ""
      },
      "comment" : ""
    } ],
    "entries" : [ {
      "pageref" : "Page 0",
      "startedDateTime" : "2019-04-09T20:48:57.824Z",
      "request" : {
        "method" : "PUT",
        "url" : "http://localhost:10520/WebAPI/api/mobile/v1/fields/one?",
        "httpVersion" : "HTTP/1.1",
        "cookies" : [ ],
        "headers" : [ {
          "name" : "User-Agent",
          "value" : "Katalon Studio"
        }, {
          "name" : "Content-Type",
          "value" : "application/json"
        }, {
          "name" : "Authorization",
          "value" : "Bearer eyJ0eXAiOiJKV1QiLCJhbGciOiJIUzI1NiJ9.eyJ1bmlxdWVfbmFtZSI6Implbm55Lm1hbGRvbmFkby50eDFAZ21haWwuY29tIiwicm9sZSI6InVzZXIiLCJzdWIiOiJqZW5ueS5tYWxkb25hZG8udHgxQGdtYWlsLmNvbSIsImlzcyI6IkNyb3BNZXRyaWNzIiwiYXVkIjoiYWxsIiwiZXhwIjoxNTU0ODQ2ODM3LCJuYmYiOjE1NTQ4NDI5Mzd9.TkWc_DbznRYmkkx0qAEhlUp4kAf4tIHMUCJly1VWzSY"
        }, {
          "name" : "Host",
          "value" : "localhost:10520"
        }, {
          "name" : "Accept",
          "value" : "text/html, image/gif, image/jpeg, *; q=.2, */*; q=.2"
        }, {
          "name" : "Proxy-Connection",
          "value" : "keep-alive"
        }, {
          "name" : "Content-Length",
          "value" : "389"
        } ],
        "queryString" : [ ],
        "postData" : {
          "mimeType" : "application/json",
          "text" : "{\"field\":{\"name\":\"Field by agent not assigned\",\"boundary\":{\"boundaries\":[{\"boundary\":{\"coords\":[{\"x\":-101.49568751,\"y\":37.14976293},{\"x\":-101.50049403,\"y\":37.14647907},{\"x\":-101.50049403,\"y\":37.14264773},{\"x\":-101.49723246,\"y\":37.1411425},{\"x\":-101.49019435,\"y\":37.14223722},{\"x\":-101.48933604,\"y\":37.14620541},{\"x\":-101.49294093,\"y\":37.14866833},{\"x\":-101.49568751,\"y\":37.14976293}]}}]}}}",
          "comment" : ""
        },
        "headersSize" : 595,
        "bodySize" : 389,
        "comment" : ""
      },
      "response" : {
        "status" : 400,
        "statusText" : "Bad Request",
        "httpVersion" : "HTTP/1.1",
        "cookies" : [ {
          "name" : ".ASPROLES",
          "value" : "sPCHgUA3DTnFX1RwwyUy_A9fuOFWzEeokzYYgkd7GRXSDtlWGAadg1_kEhsFkuQSmll1W0aG38VD2s2xnm-20CuPL00qo6XRPpZxltVIYq60rgS1L9Lcyhj1vkkU8xZXL---AxBM6Ecz9GGu7gjCN7U4ErnGG1k81xGoMVYqCG75JNyM79xTp3Sib-HseMw2ahCRDLpkfYoj6che7E7sSqwVYFDWzSDcUHbNr3QVqvz5S2KL-boMHduBj46IBv6zT-4QoDKG4prWWmfHh9yOm4fVQEM4qhwLEAX42qOo8g-DHX40pQp6C_Bsg8tgldNBBMOhvjk7xlaYeiBfKceSrLVoJxFLmyMy6dwqceHwRSPpuw6GS9bErpTvks4iCO8pvJp2zbbieUGyxACpFRP_qj11LcytcNOYGowOAG-8cio_sr396ZXjgi41GoeC57jJ0ZMr9BvbKNi0RIS2j-r4jZ0ShmUaTrcIbCL7mGtAiERnAU4izYi1tSlgFvJcxQtZ_TP1tZzeYqT1vf-fHibh9Sr5Tbw1",
          "path" : "/",
          "httpOnly" : true,
          "secure" : false,
          "comment" : ""
        } ],
        "headers" : [ {
          "name" : "Cache-Control",
          "value" : "private"
        }, {
          "name" : "Content-Type",
          "value" : "application/json; charset=utf-8"
        }, {
          "name" : "Server",
          "value" : "Microsoft-IIS/10.0"
        }, {
          "name" : "Set-Cookie",
          "value" : ".ASPROLES=sPCHgUA3DTnFX1RwwyUy_A9fuOFWzEeokzYYgkd7GRXSDtlWGAadg1_kEhsFkuQSmll1W0aG38VD2s2xnm-20CuPL00qo6XRPpZxltVIYq60rgS1L9Lcyhj1vkkU8xZXL---AxBM6Ecz9GGu7gjCN7U4ErnGG1k81xGoMVYqCG75JNyM79xTp3Sib-HseMw2ahCRDLpkfYoj6che7E7sSqwVYFDWzSDcUHbNr3QVqvz5S2KL-boMHduBj46IBv6zT-4QoDKG4prWWmfHh9yOm4fVQEM4qhwLEAX42qOo8g-DHX40pQp6C_Bsg8tgldNBBMOhvjk7xlaYeiBfKceSrLVoJxFLmyMy6dwqceHwRSPpuw6GS9bErpTvks4iCO8pvJp2zbbieUGyxACpFRP_qj11LcytcNOYGowOAG-8cio_sr396ZXjgi41GoeC57jJ0ZMr9BvbKNi0RIS2j-r4jZ0ShmUaTrcIbCL7mGtAiERnAU4izYi1tSlgFvJcxQtZ_TP1tZzeYqT1vf-fHibh9Sr5Tbw1; path=/; HttpOnly"
        }, {
          "name" : "X-SourceFiles",
          "value" : "=?UTF-8?B?RDpcVmlydHVhbE9wdGltaXplci1SZWZhY3RvcmluZ1xDcm9wTWV0cmljcy5Wby5BcGlcQ3JvcE1ldHJpY3MuVm8uQXBpXGFwaVxtb2JpbGVcdjFcZmllbGRzXG9uZQ==?="
        }, {
          "name" : "X-Powered-By",
          "value" : "ASP.NET"
        }, {
          "name" : "Date",
          "value" : "Tue, 09 Apr 2019 20:48:56 GMT"
        }, {
          "name" : "Content-Length",
          "value" : "77"
        } ],
        "content" : {
          "size" : 77,
          "mimeType" : "application/json; charset=utf-8",
          "text" : "{\"message\":\"The request is invalid. The value 'one' is not valid for Int32.\"}",
          "comment" : ""
        },
        "redirectURL" : "",
        "headersSize" : 948,
        "bodySize" : 77,
        "comment" : ""
      },
      "cache" : { },
      "timings" : {
        "comment" : "",
        "send" : 0,
        "wait" : 10,
        "receive" : 0,
        "connect" : -1,
        "blocked" : -1,
        "dns" : -1,
        "ssl" : -1
      },
      "serverIPAddress" : "127.0.0.1",
      "comment" : "",
      "_katalonRequestInformation" : {
        "name" : "17",
        "testObjectId" : "Object Repository/VoGrow/Field/FieldPut",
        "harId" : "7ec33910-85e1-4e53-b953-6f04d0ad02a1"
      },
      "time" : 11
    } ],
    "comment" : ""
  }
}