{
  "log" : {
    "version" : "1.2",
    "creator" : {
      "name" : "BrowserMob Proxy",
      "version" : "2.1.5",
      "comment" : ""
    },
    "pages" : [ {
      "id" : "Page 0",
      "startedDateTime" : "2019-03-29T22:26:20.642Z",
      "title" : "Page 0",
      "pageTimings" : {
        "onLoad" : 23,
        "comment" : ""
      },
      "comment" : ""
    } ],
    "entries" : [ {
      "pageref" : "Page 0",
      "startedDateTime" : "2019-03-29T22:26:20.643Z",
      "request" : {
        "method" : "POST",
        "url" : "http://localhost:10520/WebAPI/api/admin/v1/users/?",
        "httpVersion" : "HTTP/1.1",
        "cookies" : [ ],
        "headers" : [ {
          "name" : "User-Agent",
          "value" : "Katalon Studio"
        }, {
          "name" : "Content-Type",
          "value" : "application/x-www-form-urlencoded"
        }, {
          "name" : "Authorization",
          "value" : "Bearer eyJ0eXAiOiJKV1QiLCJhbGciOiJIUzI1NiJ9.eyJ1bmlxdWVfbmFtZSI6ImFkbWluIiwicm9sZSI6InVzZXIiLCJzdWIiOiJhZG1pbiIsImlzcyI6IkNyb3BNZXRyaWNzIiwiYXVkIjoiYWxsIiwiZXhwIjoxNTUzOTAyMjgwLCJuYmYiOjE1NTM4OTgzODB9.L1RLn_3y6lAPTeuWAj9rWrSKX2J_2nkSEATx1_tGKbo"
        }, {
          "name" : "Host",
          "value" : "localhost:10520"
        }, {
          "name" : "Accept",
          "value" : "text/html, image/gif, image/jpeg, *; q=.2, */*; q=.2"
        }, {
          "name" : "Proxy-Connection",
          "value" : "keep-alive"
        }, {
          "name" : "Content-Length",
          "value" : "296"
        } ],
        "queryString" : [ ],
        "postData" : {
          "mimeType" : "application/x-www-form-urlencoded",
          "params" : [ {
            "name" : "password",
            "value" : "cropmetrics",
            "comment" : ""
          }, {
            "name" : "email",
            "value" : "cropmetricsvo.no.roles@gmail.com",
            "comment" : ""
          }, {
            "name" : "fullname",
            "value" : "test validation",
            "comment" : ""
          }, {
            "name" : "phone",
            "value" : "123",
            "comment" : ""
          }, {
            "name" : "dealer",
            "value" : "dealet test",
            "comment" : ""
          }, {
            "name" : "addressLine1",
            "value" : "address line 1 test validation",
            "comment" : ""
          }, {
            "name" : "addressLine2",
            "value" : "address line 2 test validation",
            "comment" : ""
          }, {
            "name" : "town",
            "value" : "townValidation",
            "comment" : ""
          }, {
            "name" : "state",
            "value" : "stateValidation",
            "comment" : ""
          }, {
            "name" : "zip",
            "value" : "zipValidation",
            "comment" : ""
          }, {
            "name" : "country",
            "value" : "countryValidation",
            "comment" : ""
          }, {
            "name" : "roles",
            "value" : "",
            "comment" : ""
          } ],
          "comment" : ""
        },
        "headersSize" : 544,
        "bodySize" : 296,
        "comment" : ""
      },
      "response" : {
        "status" : 400,
        "statusText" : "Bad Request",
        "httpVersion" : "HTTP/1.1",
        "cookies" : [ {
          "name" : ".ASPROLES",
          "value" : "pO0v6oiiIABn1tBAExgBznuLTL_098VlgDcBRsdNcH50mSn4EIJ9fBJVFk73oxIAshsCDOoKtDzIoZLt7gQo8AdbA3U4Zxe7Kh0_ZnYXXMyOm7PGayn2TeAECSKVRML2qFwjZim339K7ej2KjbLCfyTsAskXhrgmUb2V8rFvkWqT00gM58nfxRzN_hTygBJWVCUgnr3aS42ofXplw35aU4loPTeSOnQmh-2wIrOgtQcBA4ZvYKBTuRfttQ2FW5BAMvuSIcF3nHHjQE7CvY_kkv9XCJHSjzpp8Iul_ftvgxzLVgW_FpHbpGOaB225LUtACZQmo-apJfP_02MPErG1_MgB08c6MI81Uoe5_mlzNhrfQMF881k8dWbMfQmv4BTtKA7hOx5tXh-xfqNI2RsFyMwrlf4lYp-rMzNjNNj2eVXoS8YC9je52xuJWblRz4QnW1DXOPSCDM7bg2dnG4oawww46mW5ie3FSnWWdkjd1igU9qPN0",
          "path" : "/",
          "httpOnly" : true,
          "secure" : false,
          "comment" : ""
        } ],
        "headers" : [ {
          "name" : "Cache-Control",
          "value" : "private"
        }, {
          "name" : "Content-Type",
          "value" : "application/json; charset=utf-8"
        }, {
          "name" : "Server",
          "value" : "Microsoft-IIS/10.0"
        }, {
          "name" : "Set-Cookie",
          "value" : ".ASPROLES=pO0v6oiiIABn1tBAExgBznuLTL_098VlgDcBRsdNcH50mSn4EIJ9fBJVFk73oxIAshsCDOoKtDzIoZLt7gQo8AdbA3U4Zxe7Kh0_ZnYXXMyOm7PGayn2TeAECSKVRML2qFwjZim339K7ej2KjbLCfyTsAskXhrgmUb2V8rFvkWqT00gM58nfxRzN_hTygBJWVCUgnr3aS42ofXplw35aU4loPTeSOnQmh-2wIrOgtQcBA4ZvYKBTuRfttQ2FW5BAMvuSIcF3nHHjQE7CvY_kkv9XCJHSjzpp8Iul_ftvgxzLVgW_FpHbpGOaB225LUtACZQmo-apJfP_02MPErG1_MgB08c6MI81Uoe5_mlzNhrfQMF881k8dWbMfQmv4BTtKA7hOx5tXh-xfqNI2RsFyMwrlf4lYp-rMzNjNNj2eVXoS8YC9je52xuJWblRz4QnW1DXOPSCDM7bg2dnG4oawww46mW5ie3FSnWWdkjd1igU9qPN0; path=/; HttpOnly"
        }, {
          "name" : "X-SourceFiles",
          "value" : "=?UTF-8?B?RDpcVmlydHVhbE9wdGltaXplci1SZWZhY3RvcmluZ1xDcm9wTWV0cmljcy5Wby5BcGlcQ3JvcE1ldHJpY3MuVm8uQXBpXGFwaVxhZG1pblx2MVx1c2Vyc1w=?="
        }, {
          "name" : "X-Powered-By",
          "value" : "ASP.NET"
        }, {
          "name" : "Date",
          "value" : "Fri, 29 Mar 2019 22:26:20 GMT"
        }, {
          "name" : "Content-Length",
          "value" : "97"
        } ],
        "content" : {
          "size" : 97,
          "mimeType" : "application/json; charset=utf-8",
          "text" : "{\"message\":\"The request is invalid. The Roles cannot be blank or the value provided is invalid.\"}",
          "comment" : ""
        },
        "redirectURL" : "",
        "headersSize" : 897,
        "bodySize" : 97,
        "comment" : ""
      },
      "cache" : { },
      "timings" : {
        "comment" : "",
        "ssl" : -1,
        "wait" : 19,
        "send" : 0,
        "receive" : 0,
        "dns" : -1,
        "connect" : -1,
        "blocked" : -1
      },
      "serverIPAddress" : "127.0.0.1",
      "comment" : "",
      "_katalonRequestInformation" : {
        "name" : "31",
        "testObjectId" : "Object Repository/VoPro/Account/api_admin_v1_users",
        "harId" : "830b4a9d-6667-474f-a48a-7901f3ad7def"
      },
      "time" : 20
    } ],
    "comment" : ""
  }
}