Suite/Test/Step Name,Browser,Description,Start time,End time,Duration,Status
Auto_Put_Field,,,2019-04-09 05:49:53,2019-04-09 05:51:33,1m - 40.019s,FAILED
,,,,,,
Test Cases/VoGrow/API/Field/Put/1 API_FIELD_When_field_is_updated_as_grower_Expected_status_code_200,,,2019-04-09 05:49:53,2019-04-09 05:50:02,8.440s,PASSED
"fieldId = ""1""",,,2019-04-09 05:49:54,2019-04-09 05:49:54,0.002s,PASSED
"nameField = ""Field only grower Updated""",,,2019-04-09 05:49:54,2019-04-09 05:49:54,0.002s,PASSED
"boundaryField = ""{""boundaries"":[{""boundary"":{""coords"":[{""x"":-101.49568751,""y"":37.14976293},{""x"":-101.50049403,""y"":37.14647907},{""x"":-101.50049403,""y"":37.14264773},{""x"":-101.49723246,""y"":37.1411425},{""x"":-101.49019435,""y"":37.14223722},{""x"":-101.48933604,""y"":37.14620541},{""x"":-101.49294093,""y"":37.14866833},{""x"":-101.49568751,""y"":37.14976293}]}}]}""",,,2019-04-09 05:49:54,2019-04-09 05:49:54,0.003s,PASSED
"tokenUserName = ""jenny.maldonado.tx2@gmail.com""",,,2019-04-09 05:49:54,2019-04-09 05:49:54,0.005s,PASSED
"tokenPassword = ""cropmetrics""",,,2019-04-09 05:49:54,2019-04-09 05:49:54,0.002s,PASSED
"responseToken = sendRequest(findTestObject(""VoPro/Token"", [""usernameToken"":tokenUserName, ""passwordToken"":tokenPassword]))",,,2019-04-09 05:49:54,2019-04-09 05:49:58,3.903s,PASSED
slurper = new groovy.json.JsonSlurper(),,,2019-04-09 05:49:58,2019-04-09 05:49:58,0.012s,PASSED
tokenResult = slurper.parseText(responseToken.getResponseBodyContent()),,,2019-04-09 05:49:58,2019-04-09 05:49:58,0.019s,PASSED
accessToken = access_token,,,2019-04-09 05:49:58,2019-04-09 05:49:58,0.006s,PASSED
"println("".. Current access token generated for admin user : "" + accessToken)",,,2019-04-09 05:49:58,2019-04-09 05:49:58,0.005s,PASSED
"requestFieldPut = findTestObject(""VoGrow/Field/FieldPut"", [""access_token"":accessToken, ""fieldId"":fieldId])",,,2019-04-09 05:49:58,2019-04-09 05:49:58,0.024s,PASSED
"bodyRequest = ""{""field"":{""name"":"""" + nameField + """",""boundary"":"" + boundaryField + ""}}""",,,2019-04-09 05:49:58,2019-04-09 05:49:58,0.001s,PASSED
try,,,2019-04-09 05:49:58,2019-04-09 05:49:58,0.008s,PASSED
responseField = sendRequest(requestFieldPut),,,2019-04-09 05:49:58,2019-04-09 05:50:00,2.391s,PASSED
"verifyResponseStatusCode(responseField, 200)",,,2019-04-09 05:50:00,2019-04-09 05:50:00,0.021s,PASSED
slurper1 = new groovy.json.JsonSlurper(),,,2019-04-09 05:50:00,2019-04-09 05:50:00,0.003s,PASSED
responseBodyField = slurper1.parseText(responseField.getResponseBodyContent()),,,2019-04-09 05:50:00,2019-04-09 05:50:00,0.003s,PASSED
fieldId = id,,,2019-04-09 05:50:00,2019-04-09 05:50:01,0.445s,PASSED
"println(""The field updated has the next id:  "" + id)",,,2019-04-09 05:50:01,2019-04-09 05:50:01,0.002s,PASSED
"println(""The field updated has the next farm id:  "" + farm_id)",,,2019-04-09 05:50:01,2019-04-09 05:50:01,0.002s,PASSED
"println(""The field updated has the next name:  "" + name)",,,2019-04-09 05:50:01,2019-04-09 05:50:01,0.002s,PASSED
"println(""The field updated has the next boundary :  "" + boundary)",,,2019-04-09 05:50:01,2019-04-09 05:50:01,0.007s,PASSED
"verifyElementPropertyValue(responseField, ""field.id"", fieldId)",,,2019-04-09 05:50:01,2019-04-09 05:50:01,0.046s,PASSED
"connectionCmDatabase.CmConnection.connectDB(""localhost"", ""virtualoptimizer"", ""5432"", ""postgres"", ""admin"")",,,2019-04-09 05:50:01,2019-04-09 05:50:01,0.697s,PASSED
"famId = ""3""",,,2019-04-09 05:50:01,2019-04-09 05:50:02,0.004s,PASSED
"queryUpdate = ""UPDATE cropmetrics.farm SET isvalid=true WHERE id = "" + famId",,,2019-04-09 05:50:02,2019-04-09 05:50:02,0.000s,PASSED
queryResult1 = connectionCmDatabase.CmConnection.execute(queryUpdate),,,2019-04-09 05:50:02,2019-04-09 05:50:02,0.099s,PASSED
"query = ""select isvalid from cropmetrics.farm WHERE id = "" + famId",,,2019-04-09 05:50:02,2019-04-09 05:50:02,0.001s,PASSED
queryResult = connectionCmDatabase.CmConnection.executeQuery(query),,,2019-04-09 05:50:02,2019-04-09 05:50:02,0.016s,PASSED
,,,,,,
Test Cases/VoGrow/API/Field/Put/2 API_FIELD_When_field_is_updated_as_grower_Expected_field_is_updated_in_database,,,2019-04-09 05:50:02,2019-04-09 05:50:02,0.471s,PASSED
"connectionCmDatabase.CmConnection.connectDB(""localhost"", ""virtualoptimizer"", ""5432"", ""postgres"", ""admin"")",,,2019-04-09 05:50:02,2019-04-09 05:50:02,0.056s,PASSED
"println(""The field id updated is : "" + fieldId)",,,2019-04-09 05:50:02,2019-04-09 05:50:02,0.001s,PASSED
"query = ""select id, name, farm_id from cropmetrics.field where id ="" + fieldId",,,2019-04-09 05:50:02,2019-04-09 05:50:02,0.001s,PASSED
queryResult = connectionCmDatabase.CmConnection.executeQuery(query),,,2019-04-09 05:50:02,2019-04-09 05:50:02,0.005s,PASSED
while (queryResult.next()),,,2019-04-09 05:50:02,2019-04-09 05:50:02,0.028s,PASSED
,,,,,,
Test Cases/VoGrow/API/Field/Put/3 API_FIELD_When_field_is_updated_as_grower_Expected_only_one_field_is_updated_in_the_database,,,2019-04-09 05:50:02,2019-04-09 05:50:02,0.271s,PASSED
"connectionCmDatabase.CmConnection.connectDB(""localhost"", ""virtualoptimizer"", ""5432"", ""postgres"", ""admin"")",,,2019-04-09 05:50:02,2019-04-09 05:50:02,0.048s,PASSED
"println(""New field id is : "" + fieldId)",,,2019-04-09 05:50:02,2019-04-09 05:50:02,0.001s,PASSED
"query = ""select id, name, farm_id from cropmetrics.field where id ="" + fieldId",,,2019-04-09 05:50:02,2019-04-09 05:50:02,0.000s,PASSED
queryResult = connectionCmDatabase.CmConnection.executeQuery(query),,,2019-04-09 05:50:02,2019-04-09 05:50:02,0.004s,PASSED
count = 0,,,2019-04-09 05:50:02,2019-04-09 05:50:02,0.001s,PASSED
while (queryResult.next()),,,2019-04-09 05:50:02,2019-04-09 05:50:02,0.008s,PASSED
,,,,,,
Test Cases/VoGrow/API/Field/Put/4 API_FIELD_When_field_is_updated_as_dealer_for_one_of_the_grower_assigned_Expected_status_code_200,,,2019-04-09 05:50:02,2019-04-09 05:50:04,1.423s,PASSED
"fieldId = ""5""",,,2019-04-09 05:50:03,2019-04-09 05:50:03,0.001s,PASSED
"nameField = ""Field Updated by dealer full access""",,,2019-04-09 05:50:03,2019-04-09 05:50:03,0.001s,PASSED
"boundaryField = ""{""boundaries"":[{""boundary"":{""coords"":[{""x"":-101.49568751,""y"":37.14976293},{""x"":-101.50049403,""y"":37.14647907},{""x"":-101.50049403,""y"":37.14264773},{""x"":-101.49723246,""y"":37.1411425},{""x"":-101.49019435,""y"":37.14223722},{""x"":-101.48933604,""y"":37.14620541},{""x"":-101.49294093,""y"":37.14866833},{""x"":-101.49568751,""y"":37.14976293}]}}]}""",,,2019-04-09 05:50:03,2019-04-09 05:50:03,0.001s,PASSED
"tokenUserName = ""jenny.maldonado.tx1@gmail.com""",,,2019-04-09 05:50:03,2019-04-09 05:50:03,0.000s,PASSED
"tokenPassword = ""cropmetrics""",,,2019-04-09 05:50:03,2019-04-09 05:50:03,0.000s,PASSED
"responseToken = sendRequest(findTestObject(""VoPro/Token"", [""usernameToken"":tokenUserName, ""passwordToken"":tokenPassword]))",,,2019-04-09 05:50:03,2019-04-09 05:50:03,0.091s,PASSED
slurper = new groovy.json.JsonSlurper(),,,2019-04-09 05:50:03,2019-04-09 05:50:03,0.001s,PASSED
tokenResult = slurper.parseText(responseToken.getResponseBodyContent()),,,2019-04-09 05:50:03,2019-04-09 05:50:03,0.001s,PASSED
accessToken = access_token,,,2019-04-09 05:50:03,2019-04-09 05:50:03,0.001s,PASSED
"println("".. Current access token generated for admin user : "" + accessToken)",,,2019-04-09 05:50:03,2019-04-09 05:50:03,0.001s,PASSED
"requestFieldPut = findTestObject(""VoGrow/Field/FieldPut"", [""access_token"":accessToken, ""fieldId"":fieldId])",,,2019-04-09 05:50:03,2019-04-09 05:50:03,0.005s,PASSED
"bodyRequest = ""{""field"":{""name"":"""" + nameField + """",""boundary"":"" + boundaryField + ""}}""",,,2019-04-09 05:50:03,2019-04-09 05:50:03,0.000s,PASSED
try,,,2019-04-09 05:50:03,2019-04-09 05:50:03,0.001s,PASSED
responseField = sendRequest(requestFieldPut),,,2019-04-09 05:50:03,2019-04-09 05:50:04,1.037s,PASSED
"verifyResponseStatusCode(responseField, 200)",,,2019-04-09 05:50:04,2019-04-09 05:50:04,0.004s,PASSED
slurper1 = new groovy.json.JsonSlurper(),,,2019-04-09 05:50:04,2019-04-09 05:50:04,0.001s,PASSED
responseBodyField = slurper1.parseText(responseField.getResponseBodyContent()),,,2019-04-09 05:50:04,2019-04-09 05:50:04,0.001s,PASSED
fieldId = id,,,2019-04-09 05:50:04,2019-04-09 05:50:04,0.001s,PASSED
"println(""The field updated has the next id:  "" + id)",,,2019-04-09 05:50:04,2019-04-09 05:50:04,0.001s,PASSED
"println(""The field updated has the next farm id:  "" + farm_id)",,,2019-04-09 05:50:04,2019-04-09 05:50:04,0.002s,PASSED
"println(""The field updated has the next name:  "" + name)",,,2019-04-09 05:50:04,2019-04-09 05:50:04,0.001s,PASSED
"println(""The field updated has the next boundary :  "" + boundary)",,,2019-04-09 05:50:04,2019-04-09 05:50:04,0.002s,PASSED
"verifyElementPropertyValue(responseField, ""field.id"", fieldId)",,,2019-04-09 05:50:04,2019-04-09 05:50:04,0.020s,PASSED
,,,,,,
Test Cases/VoGrow/API/Field/Put/5 API_FIELD_When_field_is_updated_as_dealer_for_grower_not_assigned_Expected_status_code_400,,,2019-04-09 05:50:04,2019-04-09 05:50:08,4.173s,PASSED
"fieldId = ""1""",,,2019-04-09 05:50:04,2019-04-09 05:50:04,0.001s,PASSED
"nameField = ""Field updated by agent not assigned""",,,2019-04-09 05:50:04,2019-04-09 05:50:04,0.003s,PASSED
"boundaryField = ""{""boundaries"":[{""boundary"":{""coords"":[{""x"":-101.49568751,""y"":37.14976293},{""x"":-101.50049403,""y"":37.14647907},{""x"":-101.50049403,""y"":37.14264773},{""x"":-101.49723246,""y"":37.1411425},{""x"":-101.49019435,""y"":37.14223722},{""x"":-101.48933604,""y"":37.14620541},{""x"":-101.49294093,""y"":37.14866833},{""x"":-101.49568751,""y"":37.14976293}]}}]}""",,,2019-04-09 05:50:04,2019-04-09 05:50:04,0.001s,PASSED
"tokenUserName = ""jenny.maldonado.tx1@gmail.com""",,,2019-04-09 05:50:04,2019-04-09 05:50:04,0.001s,PASSED
"tokenPassword = ""cropmetrics""",,,2019-04-09 05:50:04,2019-04-09 05:50:04,0.003s,PASSED
"responseToken = sendRequest(findTestObject(""VoPro/Token"", [""usernameToken"":tokenUserName, ""passwordToken"":tokenPassword]))",,,2019-04-09 05:50:04,2019-04-09 05:50:04,0.089s,PASSED
slurper = new groovy.json.JsonSlurper(),,,2019-04-09 05:50:04,2019-04-09 05:50:04,0.001s,PASSED
tokenResult = slurper.parseText(responseToken.getResponseBodyContent()),,,2019-04-09 05:50:04,2019-04-09 05:50:04,0.001s,PASSED
accessToken = access_token,,,2019-04-09 05:50:04,2019-04-09 05:50:04,0.001s,PASSED
"println("".. Current access token generated for admin user : "" + accessToken)",,,2019-04-09 05:50:04,2019-04-09 05:50:04,0.001s,PASSED
"requestFieldPut = findTestObject(""VoGrow/Field/FieldPut"", [""access_token"":accessToken, ""fieldId"":fieldId])",,,2019-04-09 05:50:04,2019-04-09 05:50:04,0.006s,PASSED
"bodyRequest = ""{""field"":{""name"":"""" + nameField + """",""boundary"":"" + boundaryField + ""}}""",,,2019-04-09 05:50:04,2019-04-09 05:50:04,0.001s,PASSED
try,,,2019-04-09 05:50:04,2019-04-09 05:50:04,0.002s,PASSED
responseField = sendRequest(requestFieldPut),,,2019-04-09 05:50:04,2019-04-09 05:50:08,3.750s,PASSED
"verifyResponseStatusCode(responseField, 400)",,,2019-04-09 05:50:08,2019-04-09 05:50:08,0.002s,PASSED
,,,,,,
Test Cases/VoGrow/API/Field/Put/6 API_FIELD_When_field_is_updated_as_dealer_for_grower_not_assigned_Expected_properly_error_message_is_displayed,,,2019-04-09 05:50:08,2019-04-09 05:50:12,3.728s,PASSED
"fieldId = ""1""",,,2019-04-09 05:50:08,2019-04-09 05:50:08,0.001s,PASSED
"nameField = ""Field updated by agent not assigned""",,,2019-04-09 05:50:08,2019-04-09 05:50:08,0.000s,PASSED
"boundaryField = ""{""boundaries"":[{""boundary"":{""coords"":[{""x"":-101.49568751,""y"":37.14976293},{""x"":-101.50049403,""y"":37.14647907},{""x"":-101.50049403,""y"":37.14264773},{""x"":-101.49723246,""y"":37.1411425},{""x"":-101.49019435,""y"":37.14223722},{""x"":-101.48933604,""y"":37.14620541},{""x"":-101.49294093,""y"":37.14866833},{""x"":-101.49568751,""y"":37.14976293}]}}]}""",,,2019-04-09 05:50:08,2019-04-09 05:50:08,0.000s,PASSED
"tokenUserName = ""jenny.maldonado.tx1@gmail.com""",,,2019-04-09 05:50:08,2019-04-09 05:50:08,0.001s,PASSED
"tokenPassword = ""cropmetrics""",,,2019-04-09 05:50:08,2019-04-09 05:50:08,0.000s,PASSED
"responseToken = sendRequest(findTestObject(""VoPro/Token"", [""usernameToken"":tokenUserName, ""passwordToken"":tokenPassword]))",,,2019-04-09 05:50:08,2019-04-09 05:50:08,0.072s,PASSED
slurper = new groovy.json.JsonSlurper(),,,2019-04-09 05:50:08,2019-04-09 05:50:08,0.001s,PASSED
tokenResult = slurper.parseText(responseToken.getResponseBodyContent()),,,2019-04-09 05:50:08,2019-04-09 05:50:08,0.001s,PASSED
accessToken = access_token,,,2019-04-09 05:50:08,2019-04-09 05:50:08,0.000s,PASSED
"println("".. Current access token generated for admin user : "" + accessToken)",,,2019-04-09 05:50:08,2019-04-09 05:50:08,0.001s,PASSED
"requestFieldPut = findTestObject(""VoGrow/Field/FieldPut"", [""access_token"":accessToken, ""fieldId"":fieldId])",,,2019-04-09 05:50:08,2019-04-09 05:50:08,0.006s,PASSED
"bodyRequest = ""{""field"":{""name"":"""" + nameField + """",""boundary"":"" + boundaryField + ""}}""",,,2019-04-09 05:50:08,2019-04-09 05:50:08,0.001s,PASSED
try,,,2019-04-09 05:50:08,2019-04-09 05:50:08,0.003s,PASSED
responseField = sendRequest(requestFieldPut),,,2019-04-09 05:50:08,2019-04-09 05:50:12,3.363s,PASSED
slurper1 = new groovy.json.JsonSlurper(),,,2019-04-09 05:50:12,2019-04-09 05:50:12,0.001s,PASSED
FieldPostResult = slurper1.parseText(responseField.getResponseBodyContent()),,,2019-04-09 05:50:12,2019-04-09 05:50:12,0.001s,PASSED
messageResponse = message,,,2019-04-09 05:50:12,2019-04-09 05:50:12,0.000s,PASSED
"messageExpected = ""The modifier doesn't have permissions to modify the field requested.""",,,2019-04-09 05:50:12,2019-04-09 05:50:12,0.000s,PASSED
"println(""Error message response: "" + messageResponse)",,,2019-04-09 05:50:12,2019-04-09 05:50:12,0.002s,PASSED
"println(""Error message expected: "" + messageExpected)",,,2019-04-09 05:50:12,2019-04-09 05:50:12,0.000s,PASSED
"verifyElementPropertyValue(responseField, ""message"", messageExpected)",,,2019-04-09 05:50:12,2019-04-09 05:50:12,0.021s,PASSED
,,,,,,
Test Cases/VoGrow/API/Field/Put/6.1 API_FIELD_When_field_is_updated_as_dealer_for_one_grower_assigned_Expected_status_code_200,,,2019-04-09 05:50:12,2019-04-09 05:50:13,1.507s,PASSED
"fieldId = ""5""",,,2019-04-09 05:50:12,2019-04-09 05:50:12,0.000s,PASSED
"nameField = ""Field name UPDATED by dealer account full""",,,2019-04-09 05:50:12,2019-04-09 05:50:12,0.002s,PASSED
"boundaryField = ""{""boundaries"":[{""boundary"":{""coords"":[{""x"":-101.49568751,""y"":37.14976293},{""x"":-101.50049403,""y"":37.14647907},{""x"":-101.50049403,""y"":37.14264773},{""x"":-101.49723246,""y"":37.1411425},{""x"":-101.49019435,""y"":37.14223722},{""x"":-101.48933604,""y"":37.14620541},{""x"":-101.49294093,""y"":37.14866833},{""x"":-101.49568751,""y"":37.14976293}]}}]}""",,,2019-04-09 05:50:12,2019-04-09 05:50:12,0.001s,PASSED
"tokenUserName = ""jenny.maldonado.tx1@gmail.com""",,,2019-04-09 05:50:12,2019-04-09 05:50:12,0.001s,PASSED
"tokenPassword = ""cropmetrics""",,,2019-04-09 05:50:12,2019-04-09 05:50:12,0.001s,PASSED
"responseToken = sendRequest(findTestObject(""VoPro/Token"", [""usernameToken"":tokenUserName, ""passwordToken"":tokenPassword]))",,,2019-04-09 05:50:12,2019-04-09 05:50:12,0.085s,PASSED
slurper = new groovy.json.JsonSlurper(),,,2019-04-09 05:50:12,2019-04-09 05:50:12,0.001s,PASSED
tokenResult = slurper.parseText(responseToken.getResponseBodyContent()),,,2019-04-09 05:50:12,2019-04-09 05:50:12,0.001s,PASSED
accessToken = access_token,,,2019-04-09 05:50:12,2019-04-09 05:50:12,0.001s,PASSED
"println("".. Current access token generated for admin user : "" + accessToken)",,,2019-04-09 05:50:12,2019-04-09 05:50:12,0.001s,PASSED
"requestFieldPut = findTestObject(""VoGrow/Field/FieldPut"", [""access_token"":accessToken, ""fieldId"":fieldId])",,,2019-04-09 05:50:12,2019-04-09 05:50:12,0.004s,PASSED
"bodyRequest = ""{""field"":{""name"":"""" + nameField + """",""boundary"":"" + boundaryField + ""}}""",,,2019-04-09 05:50:12,2019-04-09 05:50:12,0.001s,PASSED
try,,,2019-04-09 05:50:12,2019-04-09 05:50:12,0.002s,PASSED
responseField = sendRequest(requestFieldPut),,,2019-04-09 05:50:12,2019-04-09 05:50:13,1.126s,PASSED
"verifyResponseStatusCode(responseField, 200)",,,2019-04-09 05:50:13,2019-04-09 05:50:13,0.003s,PASSED
slurper1 = new groovy.json.JsonSlurper(),,,2019-04-09 05:50:13,2019-04-09 05:50:13,0.002s,PASSED
responseBodyField = slurper1.parseText(responseField.getResponseBodyContent()),,,2019-04-09 05:50:13,2019-04-09 05:50:13,0.002s,PASSED
fieldId = id,,,2019-04-09 05:50:13,2019-04-09 05:50:13,0.001s,PASSED
"println(""New field created has the next id:  "" + id)",,,2019-04-09 05:50:13,2019-04-09 05:50:13,0.001s,PASSED
"println(""New field created has the next name:  "" + name)",,,2019-04-09 05:50:13,2019-04-09 05:50:13,0.001s,PASSED
"println(""New field created has the farm id:  "" + farm_id)",,,2019-04-09 05:50:13,2019-04-09 05:50:13,0.002s,PASSED
"verifyElementPropertyValue(responseField, ""field.id"", fieldId)",,,2019-04-09 05:50:13,2019-04-09 05:50:13,0.022s,PASSED
,,,,,,
Test Cases/VoGrow/API/Field/Put/7 API_FIELD_When_field_is_updated_as_dealer_for_one_grower_assigned_Expected_field_is_updated_in_database,,,2019-04-09 05:50:13,2019-04-09 05:50:14,0.299s,PASSED
"connectionCmDatabase.CmConnection.connectDB(""localhost"", ""virtualoptimizer"", ""5432"", ""postgres"", ""admin"")",,,2019-04-09 05:50:13,2019-04-09 05:50:14,0.064s,PASSED
"println(""The field id updated is : "" + fieldId)",,,2019-04-09 05:50:14,2019-04-09 05:50:14,0.002s,PASSED
"query = ""select id, name, farm_id from cropmetrics.field where id ="" + fieldId",,,2019-04-09 05:50:14,2019-04-09 05:50:14,0.001s,PASSED
queryResult = connectionCmDatabase.CmConnection.executeQuery(query),,,2019-04-09 05:50:14,2019-04-09 05:50:14,0.003s,PASSED
while (queryResult.next()),,,2019-04-09 05:50:14,2019-04-09 05:50:14,0.007s,PASSED
,,,,,,
Test Cases/VoGrow/API/Field/Put/9 API_FIELD_When_field_updated_has_the_fieldid_parameter_as_empty_Expected_status_code_405,,,2019-04-09 05:50:14,2019-04-09 05:50:14,0.510s,PASSED
"fieldId = """"",,,2019-04-09 05:50:14,2019-04-09 05:50:14,0.001s,PASSED
"nameField = ""Field by agent not assigned""",,,2019-04-09 05:50:14,2019-04-09 05:50:14,0.000s,PASSED
"boundaryField = ""{""boundaries"":[{""boundary"":{""coords"":[{""x"":-101.49568751,""y"":37.14976293},{""x"":-101.50049403,""y"":37.14647907},{""x"":-101.50049403,""y"":37.14264773},{""x"":-101.49723246,""y"":37.1411425},{""x"":-101.49019435,""y"":37.14223722},{""x"":-101.48933604,""y"":37.14620541},{""x"":-101.49294093,""y"":37.14866833},{""x"":-101.49568751,""y"":37.14976293}]}}]}""",,,2019-04-09 05:50:14,2019-04-09 05:50:14,0.000s,PASSED
"tokenUserName = ""jenny.maldonado.tx1@gmail.com""",,,2019-04-09 05:50:14,2019-04-09 05:50:14,0.000s,PASSED
"tokenPassword = ""cropmetrics""",,,2019-04-09 05:50:14,2019-04-09 05:50:14,0.000s,PASSED
"responseToken = sendRequest(findTestObject(""VoPro/Token"", [""usernameToken"":tokenUserName, ""passwordToken"":tokenPassword]))",,,2019-04-09 05:50:14,2019-04-09 05:50:14,0.111s,PASSED
slurper = new groovy.json.JsonSlurper(),,,2019-04-09 05:50:14,2019-04-09 05:50:14,0.001s,PASSED
tokenResult = slurper.parseText(responseToken.getResponseBodyContent()),,,2019-04-09 05:50:14,2019-04-09 05:50:14,0.001s,PASSED
accessToken = access_token,,,2019-04-09 05:50:14,2019-04-09 05:50:14,0.000s,PASSED
"println("".. Current access token generated for admin user : "" + accessToken)",,,2019-04-09 05:50:14,2019-04-09 05:50:14,0.000s,PASSED
"requestFieldPut = findTestObject(""VoGrow/Field/FieldPut"", [""access_token"":accessToken, ""fieldId"":fieldId])",,,2019-04-09 05:50:14,2019-04-09 05:50:14,0.005s,PASSED
"bodyRequest = ""{""field"":{""name"":"""" + nameField + """",""boundary"":"" + boundaryField + ""}}""",,,2019-04-09 05:50:14,2019-04-09 05:50:14,0.000s,PASSED
try,,,2019-04-09 05:50:14,2019-04-09 05:50:14,0.001s,PASSED
responseField = sendRequest(requestFieldPut),,,2019-04-09 05:50:14,2019-04-09 05:50:14,0.079s,PASSED
"verifyResponseStatusCode(responseField, 405)",,,2019-04-09 05:50:14,2019-04-09 05:50:14,0.002s,PASSED
,,,,,,
Test Cases/VoGrow/API/Field/Put/9.1 API_FIELD_When_field_updated_has_the_fieldid_parameter_as_empty_Expected_properly_error_message_is_displayed,,,2019-04-09 05:50:14,2019-04-09 05:50:14,0.394s,PASSED
"fieldId = """"",,,2019-04-09 05:50:14,2019-04-09 05:50:14,0.001s,PASSED
"nameField = ""Field by agent not assigned""",,,2019-04-09 05:50:14,2019-04-09 05:50:14,0.002s,PASSED
"boundaryField = ""{""boundaries"":[{""boundary"":{""coords"":[{""x"":-101.49568751,""y"":37.14976293},{""x"":-101.50049403,""y"":37.14647907},{""x"":-101.50049403,""y"":37.14264773},{""x"":-101.49723246,""y"":37.1411425},{""x"":-101.49019435,""y"":37.14223722},{""x"":-101.48933604,""y"":37.14620541},{""x"":-101.49294093,""y"":37.14866833},{""x"":-101.49568751,""y"":37.14976293}]}}]}""",,,2019-04-09 05:50:14,2019-04-09 05:50:14,0.001s,PASSED
"tokenUserName = ""jenny.maldonado.tx1@gmail.com""",,,2019-04-09 05:50:14,2019-04-09 05:50:14,0.001s,PASSED
"tokenPassword = ""cropmetrics""",,,2019-04-09 05:50:14,2019-04-09 05:50:14,0.000s,PASSED
"responseToken = sendRequest(findTestObject(""VoPro/Token"", [""usernameToken"":tokenUserName, ""passwordToken"":tokenPassword]))",,,2019-04-09 05:50:14,2019-04-09 05:50:14,0.077s,PASSED
slurper = new groovy.json.JsonSlurper(),,,2019-04-09 05:50:14,2019-04-09 05:50:14,0.001s,PASSED
tokenResult = slurper.parseText(responseToken.getResponseBodyContent()),,,2019-04-09 05:50:14,2019-04-09 05:50:14,0.001s,PASSED
accessToken = access_token,,,2019-04-09 05:50:14,2019-04-09 05:50:14,0.000s,PASSED
"println("".. Current access token generated for admin user : "" + accessToken)",,,2019-04-09 05:50:14,2019-04-09 05:50:14,0.000s,PASSED
"requestFieldPut = findTestObject(""VoGrow/Field/FieldPut"", [""access_token"":accessToken, ""fieldId"":fieldId])",,,2019-04-09 05:50:14,2019-04-09 05:50:14,0.004s,PASSED
"bodyRequest = ""{""field"":{""name"":"""" + nameField + """",""boundary"":"" + boundaryField + ""}}""",,,2019-04-09 05:50:14,2019-04-09 05:50:14,0.000s,PASSED
try,,,2019-04-09 05:50:14,2019-04-09 05:50:14,0.001s,PASSED
responseField = sendRequest(requestFieldPut),,,2019-04-09 05:50:14,2019-04-09 05:50:14,0.056s,PASSED
slurper1 = new groovy.json.JsonSlurper(),,,2019-04-09 05:50:14,2019-04-09 05:50:14,0.000s,PASSED
FieldPostResult = slurper1.parseText(responseField.getResponseBodyContent()),,,2019-04-09 05:50:14,2019-04-09 05:50:14,0.001s,PASSED
messageResponse = message,,,2019-04-09 05:50:14,2019-04-09 05:50:14,0.000s,PASSED
"messageExpected = ""The requested resource does not support http method 'PUT'.""",,,2019-04-09 05:50:14,2019-04-09 05:50:14,0.001s,PASSED
"println(""Error message response: "" + messageResponse)",,,2019-04-09 05:50:14,2019-04-09 05:50:14,0.001s,PASSED
"println(""Error message expected: "" + messageExpected)",,,2019-04-09 05:50:14,2019-04-09 05:50:14,0.001s,PASSED
"verifyElementPropertyValue(responseField, ""message"", messageExpected)",,,2019-04-09 05:50:14,2019-04-09 05:50:14,0.014s,PASSED
,,,,,,
Test Cases/VoGrow/API/Field/Put/9.2 API_FIELD_When_field_updated_has_the_fieldid_parameter_with_chars_Expected_status_code_400,,,2019-04-09 05:50:14,2019-04-09 05:50:15,0.408s,PASSED
"fieldId = ""one""",,,2019-04-09 05:50:15,2019-04-09 05:50:15,0.002s,PASSED
"nameField = ""Field by agent not assigned""",,,2019-04-09 05:50:15,2019-04-09 05:50:15,0.000s,PASSED
"boundaryField = ""{""boundaries"":[{""boundary"":{""coords"":[{""x"":-101.49568751,""y"":37.14976293},{""x"":-101.50049403,""y"":37.14647907},{""x"":-101.50049403,""y"":37.14264773},{""x"":-101.49723246,""y"":37.1411425},{""x"":-101.49019435,""y"":37.14223722},{""x"":-101.48933604,""y"":37.14620541},{""x"":-101.49294093,""y"":37.14866833},{""x"":-101.49568751,""y"":37.14976293}]}}]}""",,,2019-04-09 05:50:15,2019-04-09 05:50:15,0.000s,PASSED
"tokenUserName = ""jenny.maldonado.tx1@gmail.com""",,,2019-04-09 05:50:15,2019-04-09 05:50:15,0.001s,PASSED
"tokenPassword = ""cropmetrics""",,,2019-04-09 05:50:15,2019-04-09 05:50:15,0.001s,PASSED
"responseToken = sendRequest(findTestObject(""VoPro/Token"", [""usernameToken"":tokenUserName, ""passwordToken"":tokenPassword]))",,,2019-04-09 05:50:15,2019-04-09 05:50:15,0.103s,PASSED
slurper = new groovy.json.JsonSlurper(),,,2019-04-09 05:50:15,2019-04-09 05:50:15,0.001s,PASSED
tokenResult = slurper.parseText(responseToken.getResponseBodyContent()),,,2019-04-09 05:50:15,2019-04-09 05:50:15,0.001s,PASSED
accessToken = access_token,,,2019-04-09 05:50:15,2019-04-09 05:50:15,0.001s,PASSED
"println("".. Current access token generated for admin user : "" + accessToken)",,,2019-04-09 05:50:15,2019-04-09 05:50:15,0.001s,PASSED
"requestFieldPut = findTestObject(""VoGrow/Field/FieldPut"", [""access_token"":accessToken, ""fieldId"":fieldId])",,,2019-04-09 05:50:15,2019-04-09 05:50:15,0.003s,PASSED
"bodyRequest = ""{""field"":{""name"":"""" + nameField + """",""boundary"":"" + boundaryField + ""}}""",,,2019-04-09 05:50:15,2019-04-09 05:50:15,0.000s,PASSED
try,,,2019-04-09 05:50:15,2019-04-09 05:50:15,0.001s,PASSED
responseField = sendRequest(requestFieldPut),,,2019-04-09 05:50:15,2019-04-09 05:50:15,0.097s,PASSED
"verifyResponseStatusCode(responseField, 400)",,,2019-04-09 05:50:15,2019-04-09 05:50:15,0.002s,PASSED
,,,,,,
Test Cases/VoGrow/API/Field/Put/9.3 API_FIELD_When_field_updated_has_the_fieldid_parameter_with_chars_Expected_properly_error_message_is_displayed,,,2019-04-09 05:50:15,2019-04-09 05:50:15,0.332s,PASSED
"fieldId = ""one""",,,2019-04-09 05:50:15,2019-04-09 05:50:15,0.000s,PASSED
"nameField = ""Field by agent not assigned""",,,2019-04-09 05:50:15,2019-04-09 05:50:15,0.001s,PASSED
"boundaryField = ""{""boundaries"":[{""boundary"":{""coords"":[{""x"":-101.49568751,""y"":37.14976293},{""x"":-101.50049403,""y"":37.14647907},{""x"":-101.50049403,""y"":37.14264773},{""x"":-101.49723246,""y"":37.1411425},{""x"":-101.49019435,""y"":37.14223722},{""x"":-101.48933604,""y"":37.14620541},{""x"":-101.49294093,""y"":37.14866833},{""x"":-101.49568751,""y"":37.14976293}]}}]}""",,,2019-04-09 05:50:15,2019-04-09 05:50:15,0.000s,PASSED
"tokenUserName = ""jenny.maldonado.tx1@gmail.com""",,,2019-04-09 05:50:15,2019-04-09 05:50:15,0.000s,PASSED
"tokenPassword = ""cropmetrics""",,,2019-04-09 05:50:15,2019-04-09 05:50:15,0.001s,PASSED
"responseToken = sendRequest(findTestObject(""VoPro/Token"", [""usernameToken"":tokenUserName, ""passwordToken"":tokenPassword]))",,,2019-04-09 05:50:15,2019-04-09 05:50:15,0.069s,PASSED
slurper = new groovy.json.JsonSlurper(),,,2019-04-09 05:50:15,2019-04-09 05:50:15,0.000s,PASSED
tokenResult = slurper.parseText(responseToken.getResponseBodyContent()),,,2019-04-09 05:50:15,2019-04-09 05:50:15,0.001s,PASSED
accessToken = access_token,,,2019-04-09 05:50:15,2019-04-09 05:50:15,0.001s,PASSED
"println("".. Current access token generated for admin user : "" + accessToken)",,,2019-04-09 05:50:15,2019-04-09 05:50:15,0.001s,PASSED
"requestFieldPut = findTestObject(""VoGrow/Field/FieldPut"", [""access_token"":accessToken, ""fieldId"":fieldId])",,,2019-04-09 05:50:15,2019-04-09 05:50:15,0.004s,PASSED
"bodyRequest = ""{""field"":{""name"":"""" + nameField + """",""boundary"":"" + boundaryField + ""}}""",,,2019-04-09 05:50:15,2019-04-09 05:50:15,0.001s,PASSED
try,,,2019-04-09 05:50:15,2019-04-09 05:50:15,0.002s,PASSED
responseField = sendRequest(requestFieldPut),,,2019-04-09 05:50:15,2019-04-09 05:50:15,0.068s,PASSED
slurper1 = new groovy.json.JsonSlurper(),,,2019-04-09 05:50:15,2019-04-09 05:50:15,0.001s,PASSED
FieldPostResult = slurper1.parseText(responseField.getResponseBodyContent()),,,2019-04-09 05:50:15,2019-04-09 05:50:15,0.000s,PASSED
messageResponse = message,,,2019-04-09 05:50:15,2019-04-09 05:50:15,0.000s,PASSED
"messageExpected = ""The request is invalid. The value 'one' is not valid for Int32.""",,,2019-04-09 05:50:15,2019-04-09 05:50:15,0.001s,PASSED
"println(""Error message response: "" + messageResponse)",,,2019-04-09 05:50:15,2019-04-09 05:50:15,0.000s,PASSED
"println(""Error message expected: "" + messageExpected)",,,2019-04-09 05:50:15,2019-04-09 05:50:15,0.000s,PASSED
"verifyElementPropertyValue(responseField, ""message"", messageExpected)",,,2019-04-09 05:50:15,2019-04-09 05:50:15,0.014s,PASSED
,,,,,,
Test Cases/VoGrow/API/Field/Put/9.4 API_FIELD_When_field_updated_has_the_fieldid_paramert_with_spaces_Expected_status_code_405,,,2019-04-09 05:50:15,2019-04-09 05:50:15,0.264s,PASSED
"fieldId = ""    """,,,2019-04-09 05:50:15,2019-04-09 05:50:15,0.001s,PASSED
"nameField = ""Field by agent not assigned""",,,2019-04-09 05:50:15,2019-04-09 05:50:15,0.000s,PASSED
"boundaryField = ""{""boundaries"":[{""boundary"":{""coords"":[{""x"":-101.49568751,""y"":37.14976293},{""x"":-101.50049403,""y"":37.14647907},{""x"":-101.50049403,""y"":37.14264773},{""x"":-101.49723246,""y"":37.1411425},{""x"":-101.49019435,""y"":37.14223722},{""x"":-101.48933604,""y"":37.14620541},{""x"":-101.49294093,""y"":37.14866833},{""x"":-101.49568751,""y"":37.14976293}]}}]}""",,,2019-04-09 05:50:15,2019-04-09 05:50:15,0.001s,PASSED
"tokenUserName = ""jenny.maldonado.tx1@gmail.com""",,,2019-04-09 05:50:15,2019-04-09 05:50:15,0.000s,PASSED
"tokenPassword = ""cropmetrics""",,,2019-04-09 05:50:15,2019-04-09 05:50:15,0.001s,PASSED
"responseToken = sendRequest(findTestObject(""VoPro/Token"", [""usernameToken"":tokenUserName, ""passwordToken"":tokenPassword]))",,,2019-04-09 05:50:15,2019-04-09 05:50:15,0.070s,PASSED
slurper = new groovy.json.JsonSlurper(),,,2019-04-09 05:50:15,2019-04-09 05:50:15,0.000s,PASSED
tokenResult = slurper.parseText(responseToken.getResponseBodyContent()),,,2019-04-09 05:50:15,2019-04-09 05:50:15,0.001s,PASSED
accessToken = access_token,,,2019-04-09 05:50:15,2019-04-09 05:50:15,0.000s,PASSED
"println("".. Current access token generated for admin user : "" + accessToken)",,,2019-04-09 05:50:15,2019-04-09 05:50:15,0.000s,PASSED
"requestFieldPut = findTestObject(""VoGrow/Field/FieldPut"", [""access_token"":accessToken, ""fieldId"":fieldId])",,,2019-04-09 05:50:15,2019-04-09 05:50:15,0.003s,PASSED
"bodyRequest = ""{""field"":{""name"":"""" + nameField + """",""boundary"":"" + boundaryField + ""}}""",,,2019-04-09 05:50:15,2019-04-09 05:50:15,0.000s,PASSED
try,,,2019-04-09 05:50:15,2019-04-09 05:50:15,0.001s,PASSED
responseField = sendRequest(requestFieldPut),,,2019-04-09 05:50:15,2019-04-09 05:50:15,0.012s,PASSED
"verifyResponseStatusCode(responseField, 400)",,,2019-04-09 05:50:15,2019-04-09 05:50:15,0.002s,PASSED
,,,,,,
Test Cases/VoGrow/API/Field/Put/9.6 API_FIELD_When_field_updated_has_the_valid_fieldid_parameter_but_different_of_the_user_token_Expected_status_code_400,,,2019-04-09 05:50:15,2019-04-09 05:50:19,3.711s,PASSED
"fieldId = ""1""",,,2019-04-09 05:50:16,2019-04-09 05:50:16,0.001s,PASSED
"nameField = ""Field by agent not assigned""",,,2019-04-09 05:50:16,2019-04-09 05:50:16,0.000s,PASSED
"boundaryField = ""{""boundaries"":[{""boundary"":{""coords"":[{""x"":-101.49568751,""y"":37.14976293},{""x"":-101.50049403,""y"":37.14647907},{""x"":-101.50049403,""y"":37.14264773},{""x"":-101.49723246,""y"":37.1411425},{""x"":-101.49019435,""y"":37.14223722},{""x"":-101.48933604,""y"":37.14620541},{""x"":-101.49294093,""y"":37.14866833},{""x"":-101.49568751,""y"":37.14976293}]}}]}""",,,2019-04-09 05:50:16,2019-04-09 05:50:16,0.000s,PASSED
"tokenUserName = ""jenny.maldonado.tx@gmail.com""",,,2019-04-09 05:50:16,2019-04-09 05:50:16,0.001s,PASSED
"tokenPassword = ""cropmetrics""",,,2019-04-09 05:50:16,2019-04-09 05:50:16,0.001s,PASSED
"responseToken = sendRequest(findTestObject(""VoPro/Token"", [""usernameToken"":tokenUserName, ""passwordToken"":tokenPassword]))",,,2019-04-09 05:50:16,2019-04-09 05:50:16,0.150s,PASSED
slurper = new groovy.json.JsonSlurper(),,,2019-04-09 05:50:16,2019-04-09 05:50:16,0.000s,PASSED
tokenResult = slurper.parseText(responseToken.getResponseBodyContent()),,,2019-04-09 05:50:16,2019-04-09 05:50:16,0.000s,PASSED
accessToken = access_token,,,2019-04-09 05:50:16,2019-04-09 05:50:16,0.000s,PASSED
"println("".. Current access token generated for admin user : "" + accessToken)",,,2019-04-09 05:50:16,2019-04-09 05:50:16,0.001s,PASSED
"requestFieldPut = findTestObject(""VoGrow/Field/FieldPut"", [""access_token"":accessToken, ""fieldId"":fieldId])",,,2019-04-09 05:50:16,2019-04-09 05:50:16,0.004s,PASSED
"bodyRequest = ""{""field"":{""name"":"""" + nameField + """",""boundary"":"" + boundaryField + ""}}""",,,2019-04-09 05:50:16,2019-04-09 05:50:16,0.001s,PASSED
try,,,2019-04-09 05:50:16,2019-04-09 05:50:16,0.001s,PASSED
responseField = sendRequest(requestFieldPut),,,2019-04-09 05:50:16,2019-04-09 05:50:19,3.386s,PASSED
"verifyResponseStatusCode(responseField, 400)",,,2019-04-09 05:50:19,2019-04-09 05:50:19,0.002s,PASSED
,,,,,,
Test Cases/VoGrow/API/Field/Put/9.7 API_FIELD_When_field_updated_has_valid_fieldid_parameter_but_different_of_user_token_Expected_properly_error_message_is_displayed,,,2019-04-09 05:50:19,2019-04-09 05:50:23,3.843s,PASSED
"fieldId = ""1""",,,2019-04-09 05:50:19,2019-04-09 05:50:19,0.000s,PASSED
"nameField = ""Field by agent not assigned""",,,2019-04-09 05:50:19,2019-04-09 05:50:19,0.000s,PASSED
"boundaryField = ""{""boundaries"":[{""boundary"":{""coords"":[{""x"":-101.49568751,""y"":37.14976293},{""x"":-101.50049403,""y"":37.14647907},{""x"":-101.50049403,""y"":37.14264773},{""x"":-101.49723246,""y"":37.1411425},{""x"":-101.49019435,""y"":37.14223722},{""x"":-101.48933604,""y"":37.14620541},{""x"":-101.49294093,""y"":37.14866833},{""x"":-101.49568751,""y"":37.14976293}]}}]}""",,,2019-04-09 05:50:19,2019-04-09 05:50:19,0.001s,PASSED
"tokenUserName = ""jenny.maldonado.tx@gmail.com""",,,2019-04-09 05:50:19,2019-04-09 05:50:19,0.001s,PASSED
"tokenPassword = ""cropmetrics""",,,2019-04-09 05:50:19,2019-04-09 05:50:19,0.001s,PASSED
"responseToken = sendRequest(findTestObject(""VoPro/Token"", [""usernameToken"":tokenUserName, ""passwordToken"":tokenPassword]))",,,2019-04-09 05:50:19,2019-04-09 05:50:20,0.120s,PASSED
slurper = new groovy.json.JsonSlurper(),,,2019-04-09 05:50:20,2019-04-09 05:50:20,0.000s,PASSED
tokenResult = slurper.parseText(responseToken.getResponseBodyContent()),,,2019-04-09 05:50:20,2019-04-09 05:50:20,0.000s,PASSED
accessToken = access_token,,,2019-04-09 05:50:20,2019-04-09 05:50:20,0.001s,PASSED
"println("".. Current access token generated for admin user : "" + accessToken)",,,2019-04-09 05:50:20,2019-04-09 05:50:20,0.001s,PASSED
"requestFieldPut = findTestObject(""VoGrow/Field/FieldPut"", [""access_token"":accessToken, ""fieldId"":fieldId])",,,2019-04-09 05:50:20,2019-04-09 05:50:20,0.004s,PASSED
"bodyRequest = ""{""field"":{""name"":"""" + nameField + """",""boundary"":"" + boundaryField + ""}}""",,,2019-04-09 05:50:20,2019-04-09 05:50:20,0.001s,PASSED
try,,,2019-04-09 05:50:20,2019-04-09 05:50:20,0.002s,PASSED
responseField = sendRequest(requestFieldPut),,,2019-04-09 05:50:20,2019-04-09 05:50:23,3.432s,PASSED
slurper1 = new groovy.json.JsonSlurper(),,,2019-04-09 05:50:23,2019-04-09 05:50:23,0.001s,PASSED
FieldPostResult = slurper1.parseText(responseField.getResponseBodyContent()),,,2019-04-09 05:50:23,2019-04-09 05:50:23,0.001s,PASSED
messageResponse = message,,,2019-04-09 05:50:23,2019-04-09 05:50:23,0.001s,PASSED
"messageExpected = ""The modifier doesn't have permissions to modify the field requested.""",,,2019-04-09 05:50:23,2019-04-09 05:50:23,0.000s,PASSED
"println(""Error message response: "" + messageResponse)",,,2019-04-09 05:50:23,2019-04-09 05:50:23,0.003s,PASSED
"println(""Error message expected: "" + messageExpected)",,,2019-04-09 05:50:23,2019-04-09 05:50:23,0.000s,PASSED
"verifyElementPropertyValue(responseField, ""message"", messageExpected)",,,2019-04-09 05:50:23,2019-04-09 05:50:23,0.015s,PASSED
,,,,,,
Test Cases/VoGrow/API/Field/Put/9.8 API_FIELD_When_field_updated_has_an_invalid_fieldid_parameter_Expected_status_code_400,,,2019-04-09 05:50:23,2019-04-09 05:50:27,3.790s,PASSED
"fieldId = ""11111111""",,,2019-04-09 05:50:23,2019-04-09 05:50:23,0.001s,PASSED
"nameField = ""Field by agent not assigned""",,,2019-04-09 05:50:23,2019-04-09 05:50:23,0.001s,PASSED
"boundaryField = ""{""boundaries"":[{""boundary"":{""coords"":[{""x"":-101.49568751,""y"":37.14976293},{""x"":-101.50049403,""y"":37.14647907},{""x"":-101.50049403,""y"":37.14264773},{""x"":-101.49723246,""y"":37.1411425},{""x"":-101.49019435,""y"":37.14223722},{""x"":-101.48933604,""y"":37.14620541},{""x"":-101.49294093,""y"":37.14866833},{""x"":-101.49568751,""y"":37.14976293}]}}]}""",,,2019-04-09 05:50:23,2019-04-09 05:50:23,0.000s,PASSED
"tokenUserName = ""jenny.maldonado.tx1@gmail.com""",,,2019-04-09 05:50:23,2019-04-09 05:50:23,0.001s,PASSED
"tokenPassword = ""cropmetrics""",,,2019-04-09 05:50:23,2019-04-09 05:50:23,0.001s,PASSED
"responseToken = sendRequest(findTestObject(""VoPro/Token"", [""usernameToken"":tokenUserName, ""passwordToken"":tokenPassword]))",,,2019-04-09 05:50:23,2019-04-09 05:50:23,0.103s,PASSED
slurper = new groovy.json.JsonSlurper(),,,2019-04-09 05:50:23,2019-04-09 05:50:23,0.000s,PASSED
tokenResult = slurper.parseText(responseToken.getResponseBodyContent()),,,2019-04-09 05:50:23,2019-04-09 05:50:23,0.001s,PASSED
accessToken = access_token,,,2019-04-09 05:50:23,2019-04-09 05:50:23,0.000s,PASSED
"println("".. Current access token generated for admin user : "" + accessToken)",,,2019-04-09 05:50:23,2019-04-09 05:50:23,0.001s,PASSED
"requestFieldPut = findTestObject(""VoGrow/Field/FieldPut"", [""access_token"":accessToken, ""fieldId"":fieldId])",,,2019-04-09 05:50:23,2019-04-09 05:50:23,0.004s,PASSED
"bodyRequest = ""{""field"":{""name"":"""" + nameField + """",""boundary"":"" + boundaryField + ""}}""",,,2019-04-09 05:50:23,2019-04-09 05:50:23,0.001s,PASSED
try,,,2019-04-09 05:50:23,2019-04-09 05:50:23,0.001s,PASSED
responseField = sendRequest(requestFieldPut),,,2019-04-09 05:50:23,2019-04-09 05:50:27,3.419s,PASSED
"verifyResponseStatusCode(responseField, 400)",,,2019-04-09 05:50:27,2019-04-09 05:50:27,0.002s,PASSED
,,,,,,
Test Cases/VoGrow/API/Field/Put/9.9 API_FIELD_When_field_updated_has_an_invalid_fieldid_parameter_Expected_properly_error_message_is_displayed,,,2019-04-09 05:50:27,2019-04-09 05:50:31,3.791s,PASSED
"fieldId = ""11111111""",,,2019-04-09 05:50:27,2019-04-09 05:50:27,0.000s,PASSED
"nameField = ""Field by agent not assigned""",,,2019-04-09 05:50:27,2019-04-09 05:50:27,0.000s,PASSED
"boundaryField = ""{""boundaries"":[{""boundary"":{""coords"":[{""x"":-101.49568751,""y"":37.14976293},{""x"":-101.50049403,""y"":37.14647907},{""x"":-101.50049403,""y"":37.14264773},{""x"":-101.49723246,""y"":37.1411425},{""x"":-101.49019435,""y"":37.14223722},{""x"":-101.48933604,""y"":37.14620541},{""x"":-101.49294093,""y"":37.14866833},{""x"":-101.49568751,""y"":37.14976293}]}}]}""",,,2019-04-09 05:50:27,2019-04-09 05:50:27,0.000s,PASSED
"tokenUserName = ""jenny.maldonado.tx1@gmail.com""",,,2019-04-09 05:50:27,2019-04-09 05:50:27,0.001s,PASSED
"tokenPassword = ""cropmetrics""",,,2019-04-09 05:50:27,2019-04-09 05:50:27,0.000s,PASSED
"responseToken = sendRequest(findTestObject(""VoPro/Token"", [""usernameToken"":tokenUserName, ""passwordToken"":tokenPassword]))",,,2019-04-09 05:50:27,2019-04-09 05:50:27,0.103s,PASSED
slurper = new groovy.json.JsonSlurper(),,,2019-04-09 05:50:27,2019-04-09 05:50:27,0.001s,PASSED
tokenResult = slurper.parseText(responseToken.getResponseBodyContent()),,,2019-04-09 05:50:27,2019-04-09 05:50:27,0.000s,PASSED
accessToken = access_token,,,2019-04-09 05:50:27,2019-04-09 05:50:27,0.001s,PASSED
"println("".. Current access token generated for admin user : "" + accessToken)",,,2019-04-09 05:50:27,2019-04-09 05:50:27,0.000s,PASSED
"requestFieldPut = findTestObject(""VoGrow/Field/FieldPut"", [""access_token"":accessToken, ""fieldId"":fieldId])",,,2019-04-09 05:50:27,2019-04-09 05:50:27,0.006s,PASSED
"bodyRequest = ""{""field"":{""name"":"""" + nameField + """",""boundary"":"" + boundaryField + ""}}""",,,2019-04-09 05:50:27,2019-04-09 05:50:27,0.001s,PASSED
try,,,2019-04-09 05:50:27,2019-04-09 05:50:27,0.002s,PASSED
responseField = sendRequest(requestFieldPut),,,2019-04-09 05:50:27,2019-04-09 05:50:31,3.469s,PASSED
slurper1 = new groovy.json.JsonSlurper(),,,2019-04-09 05:50:31,2019-04-09 05:50:31,0.001s,PASSED
FieldPostResult = slurper1.parseText(responseField.getResponseBodyContent()),,,2019-04-09 05:50:31,2019-04-09 05:50:31,0.001s,PASSED
messageResponse = message,,,2019-04-09 05:50:31,2019-04-09 05:50:31,0.001s,PASSED
"messageExpected = ""The field id is not valid.""",,,2019-04-09 05:50:31,2019-04-09 05:50:31,0.001s,PASSED
"println(""Error message response: "" + messageResponse)",,,2019-04-09 05:50:31,2019-04-09 05:50:31,0.001s,PASSED
"println(""Error message expected: "" + messageExpected)",,,2019-04-09 05:50:31,2019-04-09 05:50:31,0.001s,PASSED
"verifyElementPropertyValue(responseField, ""message"", messageExpected)",,,2019-04-09 05:50:31,2019-04-09 05:50:31,0.016s,PASSED
,,,,,,
Test Cases/VoGrow/API/Field/Put/15 API_FIELD_When_field_updated_has_the_fieldid_attribute_with_symbols_Expected_status_code_400,,,2019-04-09 05:50:31,2019-04-09 05:50:31,0.353s,PASSED
"fieldId = ""!!!!!""",,,2019-04-09 05:50:31,2019-04-09 05:50:31,0.001s,PASSED
"nameField = ""Field by agent not assigned""",,,2019-04-09 05:50:31,2019-04-09 05:50:31,0.000s,PASSED
"boundaryField = ""{""boundaries"":[{""boundary"":{""coords"":[{""x"":-101.49568751,""y"":37.14976293},{""x"":-101.50049403,""y"":37.14647907},{""x"":-101.50049403,""y"":37.14264773},{""x"":-101.49723246,""y"":37.1411425},{""x"":-101.49019435,""y"":37.14223722},{""x"":-101.48933604,""y"":37.14620541},{""x"":-101.49294093,""y"":37.14866833},{""x"":-101.49568751,""y"":37.14976293}]}}]}""",,,2019-04-09 05:50:31,2019-04-09 05:50:31,0.001s,PASSED
"tokenUserName = ""jenny.maldonado.tx1@gmail.com""",,,2019-04-09 05:50:31,2019-04-09 05:50:31,0.000s,PASSED
"tokenPassword = ""cropmetrics""",,,2019-04-09 05:50:31,2019-04-09 05:50:31,0.000s,PASSED
"responseToken = sendRequest(findTestObject(""VoPro/Token"", [""usernameToken"":tokenUserName, ""passwordToken"":tokenPassword]))",,,2019-04-09 05:50:31,2019-04-09 05:50:31,0.084s,PASSED
slurper = new groovy.json.JsonSlurper(),,,2019-04-09 05:50:31,2019-04-09 05:50:31,0.000s,PASSED
tokenResult = slurper.parseText(responseToken.getResponseBodyContent()),,,2019-04-09 05:50:31,2019-04-09 05:50:31,0.001s,PASSED
accessToken = access_token,,,2019-04-09 05:50:31,2019-04-09 05:50:31,0.000s,PASSED
"println("".. Current access token generated for admin user : "" + accessToken)",,,2019-04-09 05:50:31,2019-04-09 05:50:31,0.000s,PASSED
"requestFieldPut = findTestObject(""VoGrow/Field/FieldPut"", [""access_token"":accessToken, ""fieldId"":fieldId])",,,2019-04-09 05:50:31,2019-04-09 05:50:31,0.005s,PASSED
"bodyRequest = ""{""field"":{""name"":"""" + nameField + """",""boundary"":"" + boundaryField + ""}}""",,,2019-04-09 05:50:31,2019-04-09 05:50:31,0.001s,PASSED
try,,,2019-04-09 05:50:31,2019-04-09 05:50:31,0.002s,PASSED
responseField = sendRequest(requestFieldPut),,,2019-04-09 05:50:31,2019-04-09 05:50:31,0.070s,PASSED
"verifyResponseStatusCode(responseField, 400)",,,2019-04-09 05:50:31,2019-04-09 05:50:31,0.002s,PASSED
,,,,,,
Test Cases/VoGrow/API/Field/Put/16 API_FIELD_When_field_updated_has_the_fieldid_attribute_with_symbols_Expected_properly_error_message_is_displayed,,,2019-04-09 05:50:31,2019-04-09 05:50:31,0.389s,PASSED
"fieldId = ""!!!!!""",,,2019-04-09 05:50:31,2019-04-09 05:50:31,0.001s,PASSED
"nameField = ""Field by agent not assigned""",,,2019-04-09 05:50:31,2019-04-09 05:50:31,0.000s,PASSED
"boundaryField = ""{""boundaries"":[{""boundary"":{""coords"":[{""x"":-101.49568751,""y"":37.14976293},{""x"":-101.50049403,""y"":37.14647907},{""x"":-101.50049403,""y"":37.14264773},{""x"":-101.49723246,""y"":37.1411425},{""x"":-101.49019435,""y"":37.14223722},{""x"":-101.48933604,""y"":37.14620541},{""x"":-101.49294093,""y"":37.14866833},{""x"":-101.49568751,""y"":37.14976293}]}}]}""",,,2019-04-09 05:50:31,2019-04-09 05:50:31,0.000s,PASSED
"tokenUserName = ""jenny.maldonado.tx1@gmail.com""",,,2019-04-09 05:50:31,2019-04-09 05:50:31,0.000s,PASSED
"tokenPassword = ""cropmetrics""",,,2019-04-09 05:50:31,2019-04-09 05:50:31,0.000s,PASSED
"responseToken = sendRequest(findTestObject(""VoPro/Token"", [""usernameToken"":tokenUserName, ""passwordToken"":tokenPassword]))",,,2019-04-09 05:50:31,2019-04-09 05:50:31,0.081s,PASSED
slurper = new groovy.json.JsonSlurper(),,,2019-04-09 05:50:31,2019-04-09 05:50:31,0.000s,PASSED
tokenResult = slurper.parseText(responseToken.getResponseBodyContent()),,,2019-04-09 05:50:31,2019-04-09 05:50:31,0.001s,PASSED
accessToken = access_token,,,2019-04-09 05:50:31,2019-04-09 05:50:31,0.001s,PASSED
"println("".. Current access token generated for admin user : "" + accessToken)",,,2019-04-09 05:50:31,2019-04-09 05:50:31,0.001s,PASSED
"requestFieldPut = findTestObject(""VoGrow/Field/FieldPut"", [""access_token"":accessToken, ""fieldId"":fieldId])",,,2019-04-09 05:50:31,2019-04-09 05:50:31,0.003s,PASSED
"bodyRequest = ""{""field"":{""name"":"""" + nameField + """",""boundary"":"" + boundaryField + ""}}""",,,2019-04-09 05:50:31,2019-04-09 05:50:31,0.001s,PASSED
try,,,2019-04-09 05:50:31,2019-04-09 05:50:31,0.002s,PASSED
responseField = sendRequest(requestFieldPut),,,2019-04-09 05:50:31,2019-04-09 05:50:31,0.107s,PASSED
slurper1 = new groovy.json.JsonSlurper(),,,2019-04-09 05:50:31,2019-04-09 05:50:31,0.001s,PASSED
FieldPostResult = slurper1.parseText(responseField.getResponseBodyContent()),,,2019-04-09 05:50:31,2019-04-09 05:50:31,0.001s,PASSED
messageResponse = message,,,2019-04-09 05:50:31,2019-04-09 05:50:31,0.000s,PASSED
"messageExpected = ""The request is invalid. The value '!!!!!' is not valid for Int32.""",,,2019-04-09 05:50:31,2019-04-09 05:50:31,0.001s,PASSED
"println(""Error message response: "" + messageResponse)",,,2019-04-09 05:50:31,2019-04-09 05:50:31,0.000s,PASSED
"println(""Error message expected: "" + messageExpected)",,,2019-04-09 05:50:31,2019-04-09 05:50:31,0.000s,PASSED
"verifyElementPropertyValue(responseField, ""message"", messageExpected)",,,2019-04-09 05:50:31,2019-04-09 05:50:31,0.017s,PASSED
,,,,,,
Test Cases/VoGrow/API/Field/Put/21 API_FIELD_When_field_updated_has_name_attribute_with_more_than_128_chars_Expected_status_code_400,,,2019-04-09 05:50:31,2019-04-09 05:50:35,3.636s,PASSED
"fieldId = ""5""",,,2019-04-09 05:50:32,2019-04-09 05:50:32,0.001s,PASSED
"nameField = ""API_FIELD_When_new_field_has_name_attribute_with_more_than_128_chars_Expected_status_code_400 API_FIELD_When_new_field_has_name_attribute_with_more_than_128_chars_Expected_status_code_400 API_FIELD_When_new_field_has_name_attribute_with_more_than_128_chars_Expected_status_code_400""",,,2019-04-09 05:50:32,2019-04-09 05:50:32,0.001s,PASSED
"boundaryField = ""{""boundaries"":[{""boundary"":{""coords"":[{""x"":-101.49568751,""y"":37.14976293},{""x"":-101.50049403,""y"":37.14647907},{""x"":-101.50049403,""y"":37.14264773},{""x"":-101.49723246,""y"":37.1411425},{""x"":-101.49019435,""y"":37.14223722},{""x"":-101.48933604,""y"":37.14620541},{""x"":-101.49294093,""y"":37.14866833},{""x"":-101.49568751,""y"":37.14976293}]}}]}""",,,2019-04-09 05:50:32,2019-04-09 05:50:32,0.000s,PASSED
"tokenUserName = ""jenny.maldonado.tx1@gmail.com""",,,2019-04-09 05:50:32,2019-04-09 05:50:32,0.001s,PASSED
"tokenPassword = ""cropmetrics""",,,2019-04-09 05:50:32,2019-04-09 05:50:32,0.000s,PASSED
"responseToken = sendRequest(findTestObject(""VoPro/Token"", [""usernameToken"":tokenUserName, ""passwordToken"":tokenPassword]))",,,2019-04-09 05:50:32,2019-04-09 05:50:32,0.075s,PASSED
slurper = new groovy.json.JsonSlurper(),,,2019-04-09 05:50:32,2019-04-09 05:50:32,0.000s,PASSED
tokenResult = slurper.parseText(responseToken.getResponseBodyContent()),,,2019-04-09 05:50:32,2019-04-09 05:50:32,0.001s,PASSED
accessToken = access_token,,,2019-04-09 05:50:32,2019-04-09 05:50:32,0.001s,PASSED
"println("".. Current access token generated for admin user : "" + accessToken)",,,2019-04-09 05:50:32,2019-04-09 05:50:32,0.000s,PASSED
"requestFieldPut = findTestObject(""VoGrow/Field/FieldPut"", [""access_token"":accessToken, ""fieldId"":fieldId])",,,2019-04-09 05:50:32,2019-04-09 05:50:32,0.004s,PASSED
"bodyRequest = ""{""field"":{""name"":"""" + nameField + """",""boundary"":"" + boundaryField + ""}}""",,,2019-04-09 05:50:32,2019-04-09 05:50:32,0.003s,PASSED
try,,,2019-04-09 05:50:32,2019-04-09 05:50:32,0.001s,PASSED
responseField = sendRequest(requestFieldPut),,,2019-04-09 05:50:32,2019-04-09 05:50:35,3.381s,PASSED
"verifyResponseStatusCode(responseField, 400)",,,2019-04-09 05:50:35,2019-04-09 05:50:35,0.002s,PASSED
,,,,,,
Test Cases/VoGrow/API/Field/Put/22 API_FIELD_When_field_updated_has_name_attribute_with_more_than_128_chars_Expected_properly_error_message_is_displayed,,,2019-04-09 05:50:35,2019-04-09 05:50:39,3.874s,PASSED
"fieldId = ""5""",,,2019-04-09 05:50:35,2019-04-09 05:50:35,0.000s,PASSED
"nameField = ""API_FIELD_When_new_field_has_name_attribute_with_more_than_128_chars_Expected_status_code_400 API_FIELD_When_new_field_has_name_attribute_with_more_than_128_chars_Expected_status_code_400 API_FIELD_When_new_field_has_name_attribute_with_more_than_128_chars_Expected_status_code_400""",,,2019-04-09 05:50:35,2019-04-09 05:50:35,0.000s,PASSED
"boundaryField = ""{""boundaries"":[{""boundary"":{""coords"":[{""x"":-101.49568751,""y"":37.14976293},{""x"":-101.50049403,""y"":37.14647907},{""x"":-101.50049403,""y"":37.14264773},{""x"":-101.49723246,""y"":37.1411425},{""x"":-101.49019435,""y"":37.14223722},{""x"":-101.48933604,""y"":37.14620541},{""x"":-101.49294093,""y"":37.14866833},{""x"":-101.49568751,""y"":37.14976293}]}}]}""",,,2019-04-09 05:50:35,2019-04-09 05:50:35,0.001s,PASSED
"tokenUserName = ""jenny.maldonado.tx1@gmail.com""",,,2019-04-09 05:50:35,2019-04-09 05:50:35,0.001s,PASSED
"tokenPassword = ""cropmetrics""",,,2019-04-09 05:50:35,2019-04-09 05:50:35,0.000s,PASSED
"responseToken = sendRequest(findTestObject(""VoPro/Token"", [""usernameToken"":tokenUserName, ""passwordToken"":tokenPassword]))",,,2019-04-09 05:50:35,2019-04-09 05:50:35,0.081s,PASSED
slurper = new groovy.json.JsonSlurper(),,,2019-04-09 05:50:35,2019-04-09 05:50:35,0.000s,PASSED
tokenResult = slurper.parseText(responseToken.getResponseBodyContent()),,,2019-04-09 05:50:35,2019-04-09 05:50:35,0.001s,PASSED
accessToken = access_token,,,2019-04-09 05:50:35,2019-04-09 05:50:35,0.001s,PASSED
"println("".. Current access token generated for admin user : "" + accessToken)",,,2019-04-09 05:50:35,2019-04-09 05:50:35,0.001s,PASSED
"requestFieldPut = findTestObject(""VoGrow/Field/FieldPut"", [""access_token"":accessToken, ""fieldId"":fieldId])",,,2019-04-09 05:50:35,2019-04-09 05:50:35,0.006s,PASSED
"bodyRequest = ""{""field"":{""name"":"""" + nameField + """",""boundary"":"" + boundaryField + ""}}""",,,2019-04-09 05:50:35,2019-04-09 05:50:35,0.000s,PASSED
try,,,2019-04-09 05:50:35,2019-04-09 05:50:35,0.002s,PASSED
responseField = sendRequest(requestFieldPut),,,2019-04-09 05:50:35,2019-04-09 05:50:39,3.533s,PASSED
"verifyResponseStatusCode(responseField, 400)",,,2019-04-09 05:50:39,2019-04-09 05:50:39,0.003s,PASSED
slurper1 = new groovy.json.JsonSlurper(),,,2019-04-09 05:50:39,2019-04-09 05:50:39,0.000s,PASSED
FieldPostResult = slurper1.parseText(responseField.getResponseBodyContent()),,,2019-04-09 05:50:39,2019-04-09 05:50:39,0.001s,PASSED
messageResponse = message,,,2019-04-09 05:50:39,2019-04-09 05:50:39,0.000s,PASSED
"messageExpected = ""The field name must contains as max 128 characters.""",,,2019-04-09 05:50:39,2019-04-09 05:50:39,0.000s,PASSED
"println(""Error message response: "" + messageResponse)",,,2019-04-09 05:50:39,2019-04-09 05:50:39,0.001s,PASSED
"println(""Error message expected: "" + messageExpected)",,,2019-04-09 05:50:39,2019-04-09 05:50:39,0.001s,PASSED
"verifyElementPropertyValue(responseField, ""message"", messageExpected)",,,2019-04-09 05:50:39,2019-04-09 05:50:39,0.017s,PASSED
,,,,,,
Test Cases/VoGrow/API/Field/Put/23 API_FIELD_When_field_updated_has_name_attribute_with_128_chars_Expected_status_code_201,,,2019-04-09 05:50:39,2019-04-09 05:50:44,4.657s,FAILED
"fieldId = ""14""",,,2019-04-09 05:50:39,2019-04-09 05:50:39,0.001s,PASSED
"nameField = ""128 chars as field name API FIELD When new field has name attribute with 128 chars Expected status code 201 API FIELD When new f""",,,2019-04-09 05:50:39,2019-04-09 05:50:39,0.001s,PASSED
"boundaryField = ""{""boundaries"":[{""boundary"":{""coords"":[{""x"":-101.49568751,""y"":37.14976293},{""x"":-101.50049403,""y"":37.14647907},{""x"":-101.50049403,""y"":37.14264773},{""x"":-101.49723246,""y"":37.1411425},{""x"":-101.49019435,""y"":37.14223722},{""x"":-101.48933604,""y"":37.14620541},{""x"":-101.49294093,""y"":37.14866833},{""x"":-101.49568751,""y"":37.14976293}]}}]}""",,,2019-04-09 05:50:39,2019-04-09 05:50:39,0.001s,PASSED
"tokenUserName = ""jenny.maldonado.tx1@gmail.com""",,,2019-04-09 05:50:39,2019-04-09 05:50:39,0.001s,PASSED
"tokenPassword = ""cropmetrics""",,,2019-04-09 05:50:39,2019-04-09 05:50:39,0.001s,PASSED
"responseToken = sendRequest(findTestObject(""VoPro/Token"", [""usernameToken"":tokenUserName, ""passwordToken"":tokenPassword]))",,,2019-04-09 05:50:39,2019-04-09 05:50:39,0.100s,PASSED
slurper = new groovy.json.JsonSlurper(),,,2019-04-09 05:50:39,2019-04-09 05:50:39,0.001s,PASSED
tokenResult = slurper.parseText(responseToken.getResponseBodyContent()),,,2019-04-09 05:50:39,2019-04-09 05:50:39,0.000s,PASSED
accessToken = access_token,,,2019-04-09 05:50:39,2019-04-09 05:50:39,0.000s,PASSED
"println("".. Current access token generated for admin user : "" + accessToken)",,,2019-04-09 05:50:39,2019-04-09 05:50:39,0.001s,PASSED
"requestFieldPut = findTestObject(""VoGrow/Field/FieldPut"", [""access_token"":accessToken, ""fieldId"":fieldId])",,,2019-04-09 05:50:39,2019-04-09 05:50:39,0.004s,PASSED
"bodyRequest = ""{""field"":{""name"":"""" + nameField + """",""boundary"":"" + boundaryField + ""}}""",,,2019-04-09 05:50:39,2019-04-09 05:50:39,0.001s,PASSED
try,,,2019-04-09 05:50:39,2019-04-09 05:50:39,0.001s,PASSED
responseField = sendRequest(requestFieldPut),,,2019-04-09 05:50:39,2019-04-09 05:50:44,4.317s,PASSED
"verifyResponseStatusCode(responseField, 200)",,,2019-04-09 05:50:44,2019-04-09 05:50:44,0.015s,FAILED
,,,,,,
Test Cases/VoGrow/API/Field/Put/24 API_FIELD_When_field_updated_has_name_attribute_with_128_chars_Expected_new_field_is_added_in_database,,,2019-04-09 05:50:44,2019-04-09 05:50:44,0.197s,PASSED
"connectionCmDatabase.CmConnection.connectDB(""localhost"", ""virtualoptimizer"", ""5432"", ""postgres"", ""admin"")",,,2019-04-09 05:50:44,2019-04-09 05:50:44,0.047s,PASSED
"println(""New field id is : "" + fieldId)",,,2019-04-09 05:50:44,2019-04-09 05:50:44,0.001s,PASSED
"query = ""select id, name, farm_id from cropmetrics.field where id ="" + fieldId",,,2019-04-09 05:50:44,2019-04-09 05:50:44,0.000s,PASSED
queryResult = connectionCmDatabase.CmConnection.executeQuery(query),,,2019-04-09 05:50:44,2019-04-09 05:50:44,0.003s,PASSED
while (queryResult.next()),,,2019-04-09 05:50:44,2019-04-09 05:50:44,0.002s,PASSED
,,,,,,
Test Cases/VoGrow/API/Field/Put/25 API_FIELD_When_field_updated_has_name_attribute_with_only_spaces_Expected_status_code_400,,,2019-04-09 05:50:44,2019-04-09 05:50:47,3.661s,PASSED
"fieldId = ""14""",,,2019-04-09 05:50:44,2019-04-09 05:50:44,0.000s,PASSED
"nameField = ""    """,,,2019-04-09 05:50:44,2019-04-09 05:50:44,0.000s,PASSED
"boundaryField = ""{""boundaries"":[{""boundary"":{""coords"":[{""x"":-101.49568751,""y"":37.14976293},{""x"":-101.50049403,""y"":37.14647907},{""x"":-101.50049403,""y"":37.14264773},{""x"":-101.49723246,""y"":37.1411425},{""x"":-101.49019435,""y"":37.14223722},{""x"":-101.48933604,""y"":37.14620541},{""x"":-101.49294093,""y"":37.14866833},{""x"":-101.49568751,""y"":37.14976293}]}}]}""",,,2019-04-09 05:50:44,2019-04-09 05:50:44,0.001s,PASSED
"tokenUserName = ""jenny.maldonado.tx1@gmail.com""",,,2019-04-09 05:50:44,2019-04-09 05:50:44,0.000s,PASSED
"tokenPassword = ""cropmetrics""",,,2019-04-09 05:50:44,2019-04-09 05:50:44,0.001s,PASSED
"responseToken = sendRequest(findTestObject(""VoPro/Token"", [""usernameToken"":tokenUserName, ""passwordToken"":tokenPassword]))",,,2019-04-09 05:50:44,2019-04-09 05:50:44,0.071s,PASSED
slurper = new groovy.json.JsonSlurper(),,,2019-04-09 05:50:44,2019-04-09 05:50:44,0.000s,PASSED
tokenResult = slurper.parseText(responseToken.getResponseBodyContent()),,,2019-04-09 05:50:44,2019-04-09 05:50:44,0.000s,PASSED
accessToken = access_token,,,2019-04-09 05:50:44,2019-04-09 05:50:44,0.001s,PASSED
"println("".. Current access token generated for admin user : "" + accessToken)",,,2019-04-09 05:50:44,2019-04-09 05:50:44,0.001s,PASSED
"requestFieldPut = findTestObject(""VoGrow/Field/FieldPut"", [""access_token"":accessToken, ""fieldId"":fieldId])",,,2019-04-09 05:50:44,2019-04-09 05:50:44,0.004s,PASSED
"bodyRequest = ""{""field"":{""name"":"""" + nameField + """",""boundary"":"" + boundaryField + ""}}""",,,2019-04-09 05:50:44,2019-04-09 05:50:44,0.001s,PASSED
try,,,2019-04-09 05:50:44,2019-04-09 05:50:44,0.001s,PASSED
responseField = sendRequest(requestFieldPut),,,2019-04-09 05:50:44,2019-04-09 05:50:47,3.430s,PASSED
"verifyResponseStatusCode(responseField, 400)",,,2019-04-09 05:50:47,2019-04-09 05:50:47,0.002s,PASSED
,,,,,,
Test Cases/VoGrow/API/Field/Put/26 API_FIELD_When_field_updated_has_name_attribute_with_only_spaces_Expected_properly_error_message_is_displayed,,,2019-04-09 05:50:47,2019-04-09 05:50:51,3.923s,FAILED
"fieldId = ""14""",,,2019-04-09 05:50:48,2019-04-09 05:50:48,0.000s,PASSED
"nameField = ""    """,,,2019-04-09 05:50:48,2019-04-09 05:50:48,0.001s,PASSED
"boundaryField = ""{""boundaries"":[{""boundary"":{""coords"":[{""x"":-101.49568751,""y"":37.14976293},{""x"":-101.50049403,""y"":37.14647907},{""x"":-101.50049403,""y"":37.14264773},{""x"":-101.49723246,""y"":37.1411425},{""x"":-101.49019435,""y"":37.14223722},{""x"":-101.48933604,""y"":37.14620541},{""x"":-101.49294093,""y"":37.14866833},{""x"":-101.49568751,""y"":37.14976293}]}}]}""",,,2019-04-09 05:50:48,2019-04-09 05:50:48,0.001s,PASSED
"tokenUserName = ""jenny.maldonado.tx1@gmail.com""",,,2019-04-09 05:50:48,2019-04-09 05:50:48,0.001s,PASSED
"tokenPassword = ""cropmetrics""",,,2019-04-09 05:50:48,2019-04-09 05:50:48,0.000s,PASSED
"responseToken = sendRequest(findTestObject(""VoPro/Token"", [""usernameToken"":tokenUserName, ""passwordToken"":tokenPassword]))",,,2019-04-09 05:50:48,2019-04-09 05:50:48,0.080s,PASSED
slurper = new groovy.json.JsonSlurper(),,,2019-04-09 05:50:48,2019-04-09 05:50:48,0.000s,PASSED
tokenResult = slurper.parseText(responseToken.getResponseBodyContent()),,,2019-04-09 05:50:48,2019-04-09 05:50:48,0.000s,PASSED
accessToken = access_token,,,2019-04-09 05:50:48,2019-04-09 05:50:48,0.001s,PASSED
"println("".. Current access token generated for admin user : "" + accessToken)",,,2019-04-09 05:50:48,2019-04-09 05:50:48,0.001s,PASSED
"requestFieldPut = findTestObject(""VoGrow/Field/FieldPut"", [""access_token"":accessToken, ""fieldId"":fieldId])",,,2019-04-09 05:50:48,2019-04-09 05:50:48,0.004s,PASSED
"bodyRequest = ""{""field"":{""name"":"""" + nameField + """",""boundary"":"" + boundaryField + ""}}""",,,2019-04-09 05:50:48,2019-04-09 05:50:48,0.001s,PASSED
try,,,2019-04-09 05:50:48,2019-04-09 05:50:48,0.001s,PASSED
responseField = sendRequest(requestFieldPut),,,2019-04-09 05:50:48,2019-04-09 05:50:51,3.539s,PASSED
slurper1 = new groovy.json.JsonSlurper(),,,2019-04-09 05:50:51,2019-04-09 05:50:51,0.000s,PASSED
FieldPostResult = slurper1.parseText(responseField.getResponseBodyContent()),,,2019-04-09 05:50:51,2019-04-09 05:50:51,0.000s,PASSED
messageResponse = message,,,2019-04-09 05:50:51,2019-04-09 05:50:51,0.001s,PASSED
"messageExpected = ""The Name must be provided.""",,,2019-04-09 05:50:51,2019-04-09 05:50:51,0.001s,PASSED
"println(""Error message response: "" + messageResponse)",,,2019-04-09 05:50:51,2019-04-09 05:50:51,0.001s,PASSED
"println(""Error message expected: "" + messageExpected)",,,2019-04-09 05:50:51,2019-04-09 05:50:51,0.001s,PASSED
"verifyElementPropertyValue(responseField, ""message"", messageExpected)",,,2019-04-09 05:50:51,2019-04-09 05:50:51,0.031s,FAILED
,,,,,,
Test Cases/VoGrow/API/Field/Put/27 API_FIELD_When_field_updated_has_name_attribute_as_empty_Expected_status_code_400,,,2019-04-09 05:50:51,2019-04-09 05:50:55,3.719s,PASSED
"fieldId = ""14""",,,2019-04-09 05:50:51,2019-04-09 05:50:51,0.000s,PASSED
"nameField = """"",,,2019-04-09 05:50:51,2019-04-09 05:50:51,0.000s,PASSED
"boundaryField = ""{""boundaries"":[{""boundary"":{""coords"":[{""x"":-101.49568751,""y"":37.14976293},{""x"":-101.50049403,""y"":37.14647907},{""x"":-101.50049403,""y"":37.14264773},{""x"":-101.49723246,""y"":37.1411425},{""x"":-101.49019435,""y"":37.14223722},{""x"":-101.48933604,""y"":37.14620541},{""x"":-101.49294093,""y"":37.14866833},{""x"":-101.49568751,""y"":37.14976293}]}}]}""",,,2019-04-09 05:50:51,2019-04-09 05:50:51,0.000s,PASSED
"tokenUserName = ""jenny.maldonado.tx1@gmail.com""",,,2019-04-09 05:50:51,2019-04-09 05:50:51,0.000s,PASSED
"tokenPassword = ""cropmetrics""",,,2019-04-09 05:50:51,2019-04-09 05:50:51,0.001s,PASSED
"responseToken = sendRequest(findTestObject(""VoPro/Token"", [""usernameToken"":tokenUserName, ""passwordToken"":tokenPassword]))",,,2019-04-09 05:50:51,2019-04-09 05:50:52,0.071s,PASSED
slurper = new groovy.json.JsonSlurper(),,,2019-04-09 05:50:52,2019-04-09 05:50:52,0.000s,PASSED
tokenResult = slurper.parseText(responseToken.getResponseBodyContent()),,,2019-04-09 05:50:52,2019-04-09 05:50:52,0.000s,PASSED
accessToken = access_token,,,2019-04-09 05:50:52,2019-04-09 05:50:52,0.001s,PASSED
"println("".. Current access token generated for admin user : "" + accessToken)",,,2019-04-09 05:50:52,2019-04-09 05:50:52,0.000s,PASSED
"requestFieldPut = findTestObject(""VoGrow/Field/FieldPut"", [""access_token"":accessToken, ""fieldId"":fieldId])",,,2019-04-09 05:50:52,2019-04-09 05:50:52,0.004s,PASSED
"bodyRequest = ""{""field"":{""name"":"""" + nameField + """",""boundary"":"" + boundaryField + ""}}""",,,2019-04-09 05:50:52,2019-04-09 05:50:52,0.000s,PASSED
try,,,2019-04-09 05:50:52,2019-04-09 05:50:52,0.002s,PASSED
responseField = sendRequest(requestFieldPut),,,2019-04-09 05:50:52,2019-04-09 05:50:55,3.471s,PASSED
"verifyResponseStatusCode(responseField, 400)",,,2019-04-09 05:50:55,2019-04-09 05:50:55,0.002s,PASSED
,,,,,,
Test Cases/VoGrow/API/Field/Put/28 API_FIELD_When_field_updated_has_name_attribute_as_empty_Expected_properly_error_message_is_displayed,,,2019-04-09 05:50:55,2019-04-09 05:50:59,3.683s,FAILED
"fieldId = ""14""",,,2019-04-09 05:50:55,2019-04-09 05:50:55,0.000s,PASSED
"nameField = """"",,,2019-04-09 05:50:55,2019-04-09 05:50:55,0.000s,PASSED
"boundaryField = ""{""boundaries"":[{""boundary"":{""coords"":[{""x"":-101.49568751,""y"":37.14976293},{""x"":-101.50049403,""y"":37.14647907},{""x"":-101.50049403,""y"":37.14264773},{""x"":-101.49723246,""y"":37.1411425},{""x"":-101.49019435,""y"":37.14223722},{""x"":-101.48933604,""y"":37.14620541},{""x"":-101.49294093,""y"":37.14866833},{""x"":-101.49568751,""y"":37.14976293}]}}]}""",,,2019-04-09 05:50:55,2019-04-09 05:50:55,0.000s,PASSED
"tokenUserName = ""jenny.maldonado.tx1@gmail.com""",,,2019-04-09 05:50:55,2019-04-09 05:50:55,0.001s,PASSED
"tokenPassword = ""cropmetrics""",,,2019-04-09 05:50:55,2019-04-09 05:50:55,0.000s,PASSED
"responseToken = sendRequest(findTestObject(""VoPro/Token"", [""usernameToken"":tokenUserName, ""passwordToken"":tokenPassword]))",,,2019-04-09 05:50:55,2019-04-09 05:50:55,0.089s,PASSED
slurper = new groovy.json.JsonSlurper(),,,2019-04-09 05:50:55,2019-04-09 05:50:55,0.000s,PASSED
tokenResult = slurper.parseText(responseToken.getResponseBodyContent()),,,2019-04-09 05:50:55,2019-04-09 05:50:55,0.001s,PASSED
accessToken = access_token,,,2019-04-09 05:50:55,2019-04-09 05:50:55,0.001s,PASSED
"println("".. Current access token generated for admin user : "" + accessToken)",,,2019-04-09 05:50:55,2019-04-09 05:50:55,0.003s,PASSED
"requestFieldPut = findTestObject(""VoGrow/Field/FieldPut"", [""access_token"":accessToken, ""fieldId"":fieldId])",,,2019-04-09 05:50:55,2019-04-09 05:50:55,0.004s,PASSED
"bodyRequest = ""{""field"":{""name"":"""" + nameField + """",""boundary"":"" + boundaryField + ""}}""",,,2019-04-09 05:50:55,2019-04-09 05:50:55,0.000s,PASSED
try,,,2019-04-09 05:50:55,2019-04-09 05:50:55,0.002s,PASSED
responseField = sendRequest(requestFieldPut),,,2019-04-09 05:50:55,2019-04-09 05:50:59,3.398s,PASSED
slurper1 = new groovy.json.JsonSlurper(),,,2019-04-09 05:50:59,2019-04-09 05:50:59,0.000s,PASSED
FieldPostResult = slurper1.parseText(responseField.getResponseBodyContent()),,,2019-04-09 05:50:59,2019-04-09 05:50:59,0.001s,PASSED
messageResponse = message,,,2019-04-09 05:50:59,2019-04-09 05:50:59,0.001s,PASSED
"messageExpected = ""The Name must be provided.""",,,2019-04-09 05:50:59,2019-04-09 05:50:59,0.001s,PASSED
"println(""Error message response: "" + messageResponse)",,,2019-04-09 05:50:59,2019-04-09 05:50:59,0.000s,PASSED
"println(""Error message expected: "" + messageExpected)",,,2019-04-09 05:50:59,2019-04-09 05:50:59,0.000s,PASSED
"verifyElementPropertyValue(responseField, ""message"", messageExpected)",,,2019-04-09 05:50:59,2019-04-09 05:50:59,0.016s,FAILED
,,,,,,
Test Cases/VoGrow/API/Field/Put/29 API_FIELD_When_field_updated_has_name_attribute_as_symbols_Expected_status_code_400,,,2019-04-09 05:50:59,2019-04-09 05:51:02,3.654s,PASSED
"fieldId = ""14""",,,2019-04-09 05:50:59,2019-04-09 05:50:59,0.000s,PASSED
"nameField = ""!@#$%^""",,,2019-04-09 05:50:59,2019-04-09 05:50:59,0.000s,PASSED
"boundaryField = ""{""boundaries"":[{""boundary"":{""coords"":[{""x"":-101.49568751,""y"":37.14976293},{""x"":-101.50049403,""y"":37.14647907},{""x"":-101.50049403,""y"":37.14264773},{""x"":-101.49723246,""y"":37.1411425},{""x"":-101.49019435,""y"":37.14223722},{""x"":-101.48933604,""y"":37.14620541},{""x"":-101.49294093,""y"":37.14866833},{""x"":-101.49568751,""y"":37.14976293}]}}]}""",,,2019-04-09 05:50:59,2019-04-09 05:50:59,0.000s,PASSED
"tokenUserName = ""jenny.maldonado.tx1@gmail.com""",,,2019-04-09 05:50:59,2019-04-09 05:50:59,0.001s,PASSED
"tokenPassword = ""cropmetrics""",,,2019-04-09 05:50:59,2019-04-09 05:50:59,0.000s,PASSED
"responseToken = sendRequest(findTestObject(""VoPro/Token"", [""usernameToken"":tokenUserName, ""passwordToken"":tokenPassword]))",,,2019-04-09 05:50:59,2019-04-09 05:50:59,0.073s,PASSED
slurper = new groovy.json.JsonSlurper(),,,2019-04-09 05:50:59,2019-04-09 05:50:59,0.000s,PASSED
tokenResult = slurper.parseText(responseToken.getResponseBodyContent()),,,2019-04-09 05:50:59,2019-04-09 05:50:59,0.001s,PASSED
accessToken = access_token,,,2019-04-09 05:50:59,2019-04-09 05:50:59,0.001s,PASSED
"println("".. Current access token generated for admin user : "" + accessToken)",,,2019-04-09 05:50:59,2019-04-09 05:50:59,0.000s,PASSED
"requestFieldPut = findTestObject(""VoGrow/Field/FieldPut"", [""access_token"":accessToken, ""fieldId"":fieldId])",,,2019-04-09 05:50:59,2019-04-09 05:50:59,0.003s,PASSED
"bodyRequest = ""{""field"":{""name"":"""" + nameField + """",""boundary"":"" + boundaryField + ""}}""",,,2019-04-09 05:50:59,2019-04-09 05:50:59,0.001s,PASSED
try,,,2019-04-09 05:50:59,2019-04-09 05:50:59,0.001s,PASSED
responseField = sendRequest(requestFieldPut),,,2019-04-09 05:50:59,2019-04-09 05:51:02,3.414s,PASSED
"verifyResponseStatusCode(responseField, 400)",,,2019-04-09 05:51:02,2019-04-09 05:51:02,0.003s,PASSED
,,,,,,
Test Cases/VoGrow/API/Field/Put/30 API_FIELD_When_field_updated_has_name_attribute_as_symbols_Expected_properly_error_message_is_displayed,,,2019-04-09 05:51:02,2019-04-09 05:51:06,3.856s,FAILED
"fieldId = ""14""",,,2019-04-09 05:51:03,2019-04-09 05:51:03,0.001s,PASSED
"nameField = ""!@#$%^""",,,2019-04-09 05:51:03,2019-04-09 05:51:03,0.000s,PASSED
"boundaryField = ""{""boundaries"":[{""boundary"":{""coords"":[{""x"":-101.49568751,""y"":37.14976293},{""x"":-101.50049403,""y"":37.14647907},{""x"":-101.50049403,""y"":37.14264773},{""x"":-101.49723246,""y"":37.1411425},{""x"":-101.49019435,""y"":37.14223722},{""x"":-101.48933604,""y"":37.14620541},{""x"":-101.49294093,""y"":37.14866833},{""x"":-101.49568751,""y"":37.14976293}]}}]}""",,,2019-04-09 05:51:03,2019-04-09 05:51:03,0.000s,PASSED
"tokenUserName = ""jenny.maldonado.tx1@gmail.com""",,,2019-04-09 05:51:03,2019-04-09 05:51:03,0.000s,PASSED
"tokenPassword = ""cropmetrics""",,,2019-04-09 05:51:03,2019-04-09 05:51:03,0.000s,PASSED
"responseToken = sendRequest(findTestObject(""VoPro/Token"", [""usernameToken"":tokenUserName, ""passwordToken"":tokenPassword]))",,,2019-04-09 05:51:03,2019-04-09 05:51:03,0.056s,PASSED
slurper = new groovy.json.JsonSlurper(),,,2019-04-09 05:51:03,2019-04-09 05:51:03,0.000s,PASSED
tokenResult = slurper.parseText(responseToken.getResponseBodyContent()),,,2019-04-09 05:51:03,2019-04-09 05:51:03,0.000s,PASSED
accessToken = access_token,,,2019-04-09 05:51:03,2019-04-09 05:51:03,0.000s,PASSED
"println("".. Current access token generated for admin user : "" + accessToken)",,,2019-04-09 05:51:03,2019-04-09 05:51:03,0.001s,PASSED
"requestFieldPut = findTestObject(""VoGrow/Field/FieldPut"", [""access_token"":accessToken, ""fieldId"":fieldId])",,,2019-04-09 05:51:03,2019-04-09 05:51:03,0.004s,PASSED
"bodyRequest = ""{""field"":{""name"":"""" + nameField + """",""boundary"":"" + boundaryField + ""}}""",,,2019-04-09 05:51:03,2019-04-09 05:51:03,0.001s,PASSED
try,,,2019-04-09 05:51:03,2019-04-09 05:51:03,0.002s,PASSED
responseField = sendRequest(requestFieldPut),,,2019-04-09 05:51:03,2019-04-09 05:51:06,3.575s,PASSED
slurper1 = new groovy.json.JsonSlurper(),,,2019-04-09 05:51:06,2019-04-09 05:51:06,0.000s,PASSED
FieldPostResult = slurper1.parseText(responseField.getResponseBodyContent()),,,2019-04-09 05:51:06,2019-04-09 05:51:06,0.000s,PASSED
messageResponse = message,,,2019-04-09 05:51:06,2019-04-09 05:51:06,0.000s,PASSED
"messageExpected = ""The field name must contain only alphanumeric characters, apostrophes and/or spaces.""",,,2019-04-09 05:51:06,2019-04-09 05:51:06,0.001s,PASSED
"println(""Error message response: "" + messageResponse)",,,2019-04-09 05:51:06,2019-04-09 05:51:06,0.001s,PASSED
"println(""Error message expected: "" + messageExpected)",,,2019-04-09 05:51:06,2019-04-09 05:51:06,0.001s,PASSED
"verifyElementPropertyValue(responseField, ""message"", messageExpected)",,,2019-04-09 05:51:06,2019-04-09 05:51:06,0.023s,FAILED
,,,,,,
Test Cases/VoGrow/API/Field/Put/31 API_FIELD_When_field_updated_has_name_attribute_with_spaces_and_chars_Expected_status_code_201,,,2019-04-09 05:51:06,2019-04-09 05:51:10,3.976s,FAILED
"fieldId = ""14""",,,2019-04-09 05:51:06,2019-04-09 05:51:06,0.000s,PASSED
"nameField = ""Field name with spaces updated""",,,2019-04-09 05:51:06,2019-04-09 05:51:06,0.001s,PASSED
"boundaryField = ""{""boundaries"":[{""boundary"":{""coords"":[{""x"":-101.49568751,""y"":37.14976293},{""x"":-101.50049403,""y"":37.14647907},{""x"":-101.50049403,""y"":37.14264773},{""x"":-101.49723246,""y"":37.1411425},{""x"":-101.49019435,""y"":37.14223722},{""x"":-101.48933604,""y"":37.14620541},{""x"":-101.49294093,""y"":37.14866833},{""x"":-101.49568751,""y"":37.14976293}]}}]}""",,,2019-04-09 05:51:06,2019-04-09 05:51:06,0.000s,PASSED
"tokenUserName = ""jenny.maldonado.tx1@gmail.com""",,,2019-04-09 05:51:06,2019-04-09 05:51:06,0.000s,PASSED
"tokenPassword = ""cropmetrics""",,,2019-04-09 05:51:06,2019-04-09 05:51:06,0.000s,PASSED
"responseToken = sendRequest(findTestObject(""VoPro/Token"", [""usernameToken"":tokenUserName, ""passwordToken"":tokenPassword]))",,,2019-04-09 05:51:06,2019-04-09 05:51:07,0.078s,PASSED
slurper = new groovy.json.JsonSlurper(),,,2019-04-09 05:51:07,2019-04-09 05:51:07,0.001s,PASSED
tokenResult = slurper.parseText(responseToken.getResponseBodyContent()),,,2019-04-09 05:51:07,2019-04-09 05:51:07,0.000s,PASSED
accessToken = access_token,,,2019-04-09 05:51:07,2019-04-09 05:51:07,0.001s,PASSED
"println("".. Current access token generated for admin user : "" + accessToken)",,,2019-04-09 05:51:07,2019-04-09 05:51:07,0.000s,PASSED
"requestFieldPut = findTestObject(""VoGrow/Field/FieldPut"", [""access_token"":accessToken, ""fieldId"":fieldId])",,,2019-04-09 05:51:07,2019-04-09 05:51:07,0.003s,PASSED
"bodyRequest = ""{""field"":{""name"":"""" + nameField + """",""boundary"":"" + boundaryField + ""}}""",,,2019-04-09 05:51:07,2019-04-09 05:51:07,0.000s,PASSED
try,,,2019-04-09 05:51:07,2019-04-09 05:51:07,0.002s,PASSED
responseField = sendRequest(requestFieldPut),,,2019-04-09 05:51:07,2019-04-09 05:51:10,3.631s,PASSED
"verifyResponseStatusCode(responseField, 200)",,,2019-04-09 05:51:10,2019-04-09 05:51:10,0.005s,FAILED
,,,,,,
Test Cases/VoGrow/API/Field/Put/32 API_FIELD_When_field_updated_has_name_attribute_with_apostrophes_and_chars_Expected_status_code_201,,,2019-04-09 05:51:10,2019-04-09 05:51:14,3.877s,FAILED
"fieldId = ""14""",,,2019-04-09 05:51:10,2019-04-09 05:51:10,0.001s,PASSED
"nameField = ""Field chars and 'values 'updated""",,,2019-04-09 05:51:10,2019-04-09 05:51:10,0.001s,PASSED
"boundaryField = ""{""boundaries"":[{""boundary"":{""coords"":[{""x"":-101.49568751,""y"":37.14976293},{""x"":-101.50049403,""y"":37.14647907},{""x"":-101.50049403,""y"":37.14264773},{""x"":-101.49723246,""y"":37.1411425},{""x"":-101.49019435,""y"":37.14223722},{""x"":-101.48933604,""y"":37.14620541},{""x"":-101.49294093,""y"":37.14866833},{""x"":-101.49568751,""y"":37.14976293}]}}]}""",,,2019-04-09 05:51:10,2019-04-09 05:51:10,0.001s,PASSED
"tokenUserName = ""jenny.maldonado.tx1@gmail.com""",,,2019-04-09 05:51:10,2019-04-09 05:51:10,0.001s,PASSED
"tokenPassword = ""cropmetrics""",,,2019-04-09 05:51:10,2019-04-09 05:51:10,0.001s,PASSED
"responseToken = sendRequest(findTestObject(""VoPro/Token"", [""usernameToken"":tokenUserName, ""passwordToken"":tokenPassword]))",,,2019-04-09 05:51:10,2019-04-09 05:51:11,0.102s,PASSED
slurper = new groovy.json.JsonSlurper(),,,2019-04-09 05:51:11,2019-04-09 05:51:11,0.000s,PASSED
tokenResult = slurper.parseText(responseToken.getResponseBodyContent()),,,2019-04-09 05:51:11,2019-04-09 05:51:11,0.000s,PASSED
accessToken = access_token,,,2019-04-09 05:51:11,2019-04-09 05:51:11,0.000s,PASSED
"println("".. Current access token generated for admin user : "" + accessToken)",,,2019-04-09 05:51:11,2019-04-09 05:51:11,0.001s,PASSED
"requestFieldPut = findTestObject(""VoGrow/Field/FieldPut"", [""access_token"":accessToken, ""fieldId"":fieldId])",,,2019-04-09 05:51:11,2019-04-09 05:51:11,0.003s,PASSED
"bodyRequest = ""{""field"":{""name"":"""" + nameField + """",""boundary"":"" + boundaryField + ""}}""",,,2019-04-09 05:51:11,2019-04-09 05:51:11,0.000s,PASSED
try,,,2019-04-09 05:51:11,2019-04-09 05:51:11,0.002s,PASSED
responseField = sendRequest(requestFieldPut),,,2019-04-09 05:51:11,2019-04-09 05:51:14,3.497s,PASSED
"verifyResponseStatusCode(responseField, 200)",,,2019-04-09 05:51:14,2019-04-09 05:51:14,0.004s,FAILED
,,,,,,
Test Cases/VoGrow/API/Field/Put/33 API_FIELD_When_field_updated_has_name_attribute_with_only_numbers_Expected_status_code_201,,,2019-04-09 05:51:14,2019-04-09 05:51:18,3.770s,FAILED
"fieldId = ""14""",,,2019-04-09 05:51:14,2019-04-09 05:51:14,0.000s,PASSED
"nameField = ""5555555""",,,2019-04-09 05:51:14,2019-04-09 05:51:14,0.001s,PASSED
"boundaryField = ""{""boundaries"":[{""boundary"":{""coords"":[{""x"":-101.49568751,""y"":37.14976293},{""x"":-101.50049403,""y"":37.14647907},{""x"":-101.50049403,""y"":37.14264773},{""x"":-101.49723246,""y"":37.1411425},{""x"":-101.49019435,""y"":37.14223722},{""x"":-101.48933604,""y"":37.14620541},{""x"":-101.49294093,""y"":37.14866833},{""x"":-101.49568751,""y"":37.14976293}]}}]}""",,,2019-04-09 05:51:14,2019-04-09 05:51:14,0.000s,PASSED
"tokenUserName = ""jenny.maldonado.tx1@gmail.com""",,,2019-04-09 05:51:14,2019-04-09 05:51:14,0.000s,PASSED
"tokenPassword = ""cropmetrics""",,,2019-04-09 05:51:14,2019-04-09 05:51:14,0.000s,PASSED
"responseToken = sendRequest(findTestObject(""VoPro/Token"", [""usernameToken"":tokenUserName, ""passwordToken"":tokenPassword]))",,,2019-04-09 05:51:14,2019-04-09 05:51:14,0.099s,PASSED
slurper = new groovy.json.JsonSlurper(),,,2019-04-09 05:51:14,2019-04-09 05:51:14,0.001s,PASSED
tokenResult = slurper.parseText(responseToken.getResponseBodyContent()),,,2019-04-09 05:51:14,2019-04-09 05:51:14,0.000s,PASSED
accessToken = access_token,,,2019-04-09 05:51:14,2019-04-09 05:51:14,0.000s,PASSED
"println("".. Current access token generated for admin user : "" + accessToken)",,,2019-04-09 05:51:14,2019-04-09 05:51:14,0.001s,PASSED
"requestFieldPut = findTestObject(""VoGrow/Field/FieldPut"", [""access_token"":accessToken, ""fieldId"":fieldId])",,,2019-04-09 05:51:14,2019-04-09 05:51:14,0.004s,PASSED
"bodyRequest = ""{""field"":{""name"":"""" + nameField + """",""boundary"":"" + boundaryField + ""}}""",,,2019-04-09 05:51:14,2019-04-09 05:51:14,0.000s,PASSED
try,,,2019-04-09 05:51:14,2019-04-09 05:51:14,0.001s,PASSED
responseField = sendRequest(requestFieldPut),,,2019-04-09 05:51:14,2019-04-09 05:51:18,3.495s,PASSED
"verifyResponseStatusCode(responseField, 200)",,,2019-04-09 05:51:18,2019-04-09 05:51:18,0.005s,FAILED
,,,,,,
Test Cases/VoGrow/API/Field/Put/34 API_FIELD_When_field_updated_has_name_attribute_with_only_chars_Expected_status_code_201,,,2019-04-09 05:51:18,2019-04-09 05:51:22,3.672s,FAILED
"fieldId = ""14""",,,2019-04-09 05:51:18,2019-04-09 05:51:18,0.000s,PASSED
"nameField = ""FieldNameWithOnlyCharsUpdated""",,,2019-04-09 05:51:18,2019-04-09 05:51:18,0.000s,PASSED
"boundaryField = ""{""boundaries"":[{""boundary"":{""coords"":[{""x"":-101.49568751,""y"":37.14976293},{""x"":-101.50049403,""y"":37.14647907},{""x"":-101.50049403,""y"":37.14264773},{""x"":-101.49723246,""y"":37.1411425},{""x"":-101.49019435,""y"":37.14223722},{""x"":-101.48933604,""y"":37.14620541},{""x"":-101.49294093,""y"":37.14866833},{""x"":-101.49568751,""y"":37.14976293}]}}]}""",,,2019-04-09 05:51:18,2019-04-09 05:51:18,0.001s,PASSED
"tokenUserName = ""jenny.maldonado.tx1@gmail.com""",,,2019-04-09 05:51:18,2019-04-09 05:51:18,0.000s,PASSED
"tokenPassword = ""cropmetrics""",,,2019-04-09 05:51:18,2019-04-09 05:51:18,0.000s,PASSED
"responseToken = sendRequest(findTestObject(""VoPro/Token"", [""usernameToken"":tokenUserName, ""passwordToken"":tokenPassword]))",,,2019-04-09 05:51:18,2019-04-09 05:51:18,0.089s,PASSED
slurper = new groovy.json.JsonSlurper(),,,2019-04-09 05:51:18,2019-04-09 05:51:18,0.001s,PASSED
tokenResult = slurper.parseText(responseToken.getResponseBodyContent()),,,2019-04-09 05:51:18,2019-04-09 05:51:18,0.000s,PASSED
accessToken = access_token,,,2019-04-09 05:51:18,2019-04-09 05:51:18,0.000s,PASSED
"println("".. Current access token generated for admin user : "" + accessToken)",,,2019-04-09 05:51:18,2019-04-09 05:51:18,0.001s,PASSED
"requestFieldPut = findTestObject(""VoGrow/Field/FieldPut"", [""access_token"":accessToken, ""fieldId"":fieldId])",,,2019-04-09 05:51:18,2019-04-09 05:51:18,0.002s,PASSED
"bodyRequest = ""{""field"":{""name"":"""" + nameField + """",""boundary"":"" + boundaryField + ""}}""",,,2019-04-09 05:51:18,2019-04-09 05:51:18,0.000s,PASSED
try,,,2019-04-09 05:51:18,2019-04-09 05:51:18,0.001s,PASSED
responseField = sendRequest(requestFieldPut),,,2019-04-09 05:51:18,2019-04-09 05:51:22,3.406s,PASSED
"verifyResponseStatusCode(responseField, 200)",,,2019-04-09 05:51:22,2019-04-09 05:51:22,0.005s,FAILED
,,,,,,
Test Cases/VoGrow/API/Field/Put/35 API_FIELD_When_field_updated_has_an_existing_name_in_farm_id_Expected_status_code_400,,,2019-04-09 05:51:22,2019-04-09 05:51:25,3.696s,FAILED
"fieldId = ""13""",,,2019-04-09 05:51:22,2019-04-09 05:51:22,0.001s,PASSED
"nameField = ""FieldNameWithOnlyCharsUpdated""",,,2019-04-09 05:51:22,2019-04-09 05:51:22,0.000s,PASSED
"boundaryField = ""{""boundaries"":[{""boundary"":{""coords"":[{""x"":-101.49568751,""y"":37.14976293},{""x"":-101.50049403,""y"":37.14647907},{""x"":-101.50049403,""y"":37.14264773},{""x"":-101.49723246,""y"":37.1411425},{""x"":-101.49019435,""y"":37.14223722},{""x"":-101.48933604,""y"":37.14620541},{""x"":-101.49294093,""y"":37.14866833},{""x"":-101.49568751,""y"":37.14976293}]}}]}""",,,2019-04-09 05:51:22,2019-04-09 05:51:22,0.001s,PASSED
"tokenUserName = ""jenny.maldonado.tx1@gmail.com""",,,2019-04-09 05:51:22,2019-04-09 05:51:22,0.000s,PASSED
"tokenPassword = ""cropmetrics""",,,2019-04-09 05:51:22,2019-04-09 05:51:22,0.000s,PASSED
"responseToken = sendRequest(findTestObject(""VoPro/Token"", [""usernameToken"":tokenUserName, ""passwordToken"":tokenPassword]))",,,2019-04-09 05:51:22,2019-04-09 05:51:22,0.060s,PASSED
slurper = new groovy.json.JsonSlurper(),,,2019-04-09 05:51:22,2019-04-09 05:51:22,0.000s,PASSED
tokenResult = slurper.parseText(responseToken.getResponseBodyContent()),,,2019-04-09 05:51:22,2019-04-09 05:51:22,0.001s,PASSED
accessToken = access_token,,,2019-04-09 05:51:22,2019-04-09 05:51:22,0.001s,PASSED
"println("".. Current access token generated for admin user : "" + accessToken)",,,2019-04-09 05:51:22,2019-04-09 05:51:22,0.000s,PASSED
"requestFieldPut = findTestObject(""VoGrow/Field/FieldPut"", [""access_token"":accessToken, ""fieldId"":fieldId])",,,2019-04-09 05:51:22,2019-04-09 05:51:22,0.003s,PASSED
"bodyRequest = ""{""field"":{""name"":"""" + nameField + """",""boundary"":"" + boundaryField + ""}}""",,,2019-04-09 05:51:22,2019-04-09 05:51:22,0.000s,PASSED
try,,,2019-04-09 05:51:22,2019-04-09 05:51:22,0.001s,PASSED
responseField = sendRequest(requestFieldPut),,,2019-04-09 05:51:22,2019-04-09 05:51:25,3.446s,PASSED
"verifyResponseStatusCode(responseField, 400)",,,2019-04-09 05:51:25,2019-04-09 05:51:25,0.002s,PASSED
slurper1 = new groovy.json.JsonSlurper(),,,2019-04-09 05:51:25,2019-04-09 05:51:25,0.000s,PASSED
FieldPostResult = slurper1.parseText(responseField.getResponseBodyContent()),,,2019-04-09 05:51:25,2019-04-09 05:51:25,0.001s,PASSED
messageResponse = message,,,2019-04-09 05:51:25,2019-04-09 05:51:25,0.000s,PASSED
"messageExpected = ""The field name already exists in the farm.""",,,2019-04-09 05:51:25,2019-04-09 05:51:25,0.001s,PASSED
"println(""Error message response: "" + messageResponse)",,,2019-04-09 05:51:25,2019-04-09 05:51:25,0.000s,PASSED
"println(""Error message expected: "" + messageExpected)",,,2019-04-09 05:51:25,2019-04-09 05:51:25,0.000s,PASSED
"verifyElementPropertyValue(responseField, ""message"", messageExpected)",,,2019-04-09 05:51:25,2019-04-09 05:51:25,0.018s,FAILED
,,,,,,
Test Cases/VoGrow/API/Field/Put/36 API_FIELD_When_field_updated_has_an_existing_name_in_farm_id_Expected_properly_error_message_is_displayed,,,2019-04-09 05:51:25,2019-04-09 05:51:29,3.797s,FAILED
"fieldId = ""13""",,,2019-04-09 05:51:25,2019-04-09 05:51:25,0.000s,PASSED
"nameField = ""FieldNameWithOnlyCharsUpdated""",,,2019-04-09 05:51:25,2019-04-09 05:51:25,0.001s,PASSED
"boundaryField = ""{""boundaries"":[{""boundary"":{""coords"":[{""x"":-101.49568751,""y"":37.14976293},{""x"":-101.50049403,""y"":37.14647907},{""x"":-101.50049403,""y"":37.14264773},{""x"":-101.49723246,""y"":37.1411425},{""x"":-101.49019435,""y"":37.14223722},{""x"":-101.48933604,""y"":37.14620541},{""x"":-101.49294093,""y"":37.14866833},{""x"":-101.49568751,""y"":37.14976293}]}}]}""",,,2019-04-09 05:51:25,2019-04-09 05:51:25,0.000s,PASSED
"tokenUserName = ""jenny.maldonado.tx1@gmail.com""",,,2019-04-09 05:51:25,2019-04-09 05:51:25,0.000s,PASSED
"tokenPassword = ""cropmetrics""",,,2019-04-09 05:51:25,2019-04-09 05:51:25,0.001s,PASSED
"responseToken = sendRequest(findTestObject(""VoPro/Token"", [""usernameToken"":tokenUserName, ""passwordToken"":tokenPassword]))",,,2019-04-09 05:51:25,2019-04-09 05:51:25,0.072s,PASSED
slurper = new groovy.json.JsonSlurper(),,,2019-04-09 05:51:25,2019-04-09 05:51:25,0.001s,PASSED
tokenResult = slurper.parseText(responseToken.getResponseBodyContent()),,,2019-04-09 05:51:25,2019-04-09 05:51:25,0.000s,PASSED
accessToken = access_token,,,2019-04-09 05:51:25,2019-04-09 05:51:25,0.001s,PASSED
"println("".. Current access token generated for admin user : "" + accessToken)",,,2019-04-09 05:51:25,2019-04-09 05:51:25,0.000s,PASSED
"requestFieldPut = findTestObject(""VoGrow/Field/FieldPut"", [""access_token"":accessToken, ""fieldId"":fieldId])",,,2019-04-09 05:51:25,2019-04-09 05:51:25,0.004s,PASSED
"bodyRequest = ""{""field"":{""name"":"""" + nameField + """",""boundary"":"" + boundaryField + ""}}""",,,2019-04-09 05:51:25,2019-04-09 05:51:25,0.000s,PASSED
try,,,2019-04-09 05:51:25,2019-04-09 05:51:25,0.001s,PASSED
responseField = sendRequest(requestFieldPut),,,2019-04-09 05:51:25,2019-04-09 05:51:29,3.521s,PASSED
slurper1 = new groovy.json.JsonSlurper(),,,2019-04-09 05:51:29,2019-04-09 05:51:29,0.000s,PASSED
FieldPostResult = slurper1.parseText(responseField.getResponseBodyContent()),,,2019-04-09 05:51:29,2019-04-09 05:51:29,0.001s,PASSED
messageResponse = message,,,2019-04-09 05:51:29,2019-04-09 05:51:29,0.001s,PASSED
"messageExpected = ""The field name already exists in the farm.""",,,2019-04-09 05:51:29,2019-04-09 05:51:29,0.000s,PASSED
"println(""Error message response: "" + messageResponse)",,,2019-04-09 05:51:29,2019-04-09 05:51:29,0.001s,PASSED
"println(""Error message expected: "" + messageExpected)",,,2019-04-09 05:51:29,2019-04-09 05:51:29,0.001s,PASSED
"verifyElementPropertyValue(responseField, ""message"", messageExpected)",,,2019-04-09 05:51:29,2019-04-09 05:51:29,0.017s,FAILED
,,,,,,
Test Cases/VoGrow/API/Field/Put/60 API_FIELD_When_new_fiel_is_created_with_boundary_attribute_without_one_point_Expected_properly_error_message_is_displayed,,,2019-04-09 05:51:29,2019-04-09 05:51:33,3.714s,PASSED
"famId = ""7""",,,2019-04-09 05:51:29,2019-04-09 05:51:29,0.000s,PASSED
"nameField = ""Field without x value in boundary""",,,2019-04-09 05:51:29,2019-04-09 05:51:29,0.000s,PASSED
"boundaryField = ""{""boundaries"":[{""boundary"":{""coords"":[{""x"":-101.49568751,""y"":37.14976293},{""x"":-101.50049403,""y"":37.14647907},{""x"":-101.50049403,""y"":37.14264773},{""x"":-101.49723246,""y"":37.1411425},{""x"":-101.49019435,""y"":37.14223722},{""x"":-101.48933604,""y"":37.14620541},{""x"":-101.49294093,""y"":37.14866833}]}}]}""",,,2019-04-09 05:51:29,2019-04-09 05:51:29,0.001s,PASSED
"tokenUserName = ""jenny.maldonado.tx1@gmail.com""",,,2019-04-09 05:51:29,2019-04-09 05:51:29,0.000s,PASSED
"tokenPassword = ""cropmetrics""",,,2019-04-09 05:51:29,2019-04-09 05:51:29,0.001s,PASSED
"responseToken = sendRequest(findTestObject(""VoPro/Token"", [""usernameToken"":tokenUserName, ""passwordToken"":tokenPassword]))",,,2019-04-09 05:51:29,2019-04-09 05:51:29,0.086s,PASSED
slurper = new groovy.json.JsonSlurper(),,,2019-04-09 05:51:29,2019-04-09 05:51:29,0.000s,PASSED
tokenResult = slurper.parseText(responseToken.getResponseBodyContent()),,,2019-04-09 05:51:29,2019-04-09 05:51:29,0.001s,PASSED
accessToken = access_token,,,2019-04-09 05:51:29,2019-04-09 05:51:29,0.001s,PASSED
"println("".. Current access token generated for admin user : "" + accessToken)",,,2019-04-09 05:51:29,2019-04-09 05:51:29,0.000s,PASSED
"requestFieldPost = findTestObject(""VoGrow/Field/FieldPost"", [""access_token"":accessToken])",,,2019-04-09 05:51:29,2019-04-09 05:51:29,0.004s,PASSED
"bodyRequest = ""{""field"":{""farm_id"":"" + famId + "",""name"":"""" + nameField + """",""boundary"":"" + boundaryField + ""}}""",,,2019-04-09 05:51:29,2019-04-09 05:51:29,0.001s,PASSED
try,,,2019-04-09 05:51:29,2019-04-09 05:51:29,0.001s,PASSED
responseField = sendRequest(requestFieldPost),,,2019-04-09 05:51:29,2019-04-09 05:51:33,3.414s,PASSED
slurper1 = new groovy.json.JsonSlurper(),,,2019-04-09 05:51:33,2019-04-09 05:51:33,0.001s,PASSED
FieldPostResult = slurper1.parseText(responseField.getResponseBodyContent()),,,2019-04-09 05:51:33,2019-04-09 05:51:33,0.000s,PASSED
messageResponse = message,,,2019-04-09 05:51:33,2019-04-09 05:51:33,0.001s,PASSED
"messageExpected = ""The Boundary is not valid. IllegalArgumentException: Points of LinearRing do not form a closed linestring""",,,2019-04-09 05:51:33,2019-04-09 05:51:33,0.000s,PASSED
"println(""Error message response: "" + messageResponse)",,,2019-04-09 05:51:33,2019-04-09 05:51:33,0.001s,PASSED
"println(""Error message expected: "" + messageExpected)",,,2019-04-09 05:51:33,2019-04-09 05:51:33,0.000s,PASSED
"verifyElementPropertyValue(responseField, ""message"", messageExpected)",,,2019-04-09 05:51:33,2019-04-09 05:51:33,0.017s,PASSED
