{
  "log" : {
    "version" : "1.2",
    "creator" : {
      "name" : "BrowserMob Proxy",
      "version" : "2.1.5",
      "comment" : ""
    },
    "pages" : [ {
      "id" : "Page 0",
      "startedDateTime" : "2019-04-09T09:32:54.193Z",
      "title" : "Page 0",
      "pageTimings" : {
        "onLoad" : 35261,
        "comment" : ""
      },
      "comment" : ""
    } ],
    "entries" : [ {
      "pageref" : "Page 0",
      "startedDateTime" : "2019-04-09T09:32:54.195Z",
      "request" : {
        "method" : "POST",
        "url" : "http://localhost:10520/WebAPI/api/mobile/v1/fields?",
        "httpVersion" : "HTTP/1.1",
        "cookies" : [ ],
        "headers" : [ {
          "name" : "User-Agent",
          "value" : "Katalon Studio"
        }, {
          "name" : "Content-Type",
          "value" : "application/json"
        }, {
          "name" : "Authorization",
          "value" : "Bearer eyJ0eXAiOiJKV1QiLCJhbGciOiJIUzI1NiJ9.eyJ1bmlxdWVfbmFtZSI6Implbm55Lm1hbGRvbmFkby50eDJAZ21haWwuY29tIiwicm9sZSI6InVzZXIiLCJzdWIiOiJqZW5ueS5tYWxkb25hZG8udHgyQGdtYWlsLmNvbSIsImlzcyI6IkNyb3BNZXRyaWNzIiwiYXVkIjoiYWxsIiwiZXhwIjoxNTU0ODA2MjczLCJuYmYiOjE1NTQ4MDIzNzN9.zUtsjmdz1tKc6ZTnnQduoPPGCQLAvMvvz5ZzIH8G6PI"
        }, {
          "name" : "Host",
          "value" : "localhost:10520"
        }, {
          "name" : "Accept",
          "value" : "text/html, image/gif, image/jpeg, *; q=.2, */*; q=.2"
        }, {
          "name" : "Proxy-Connection",
          "value" : "keep-alive"
        }, {
          "name" : "Content-Length",
          "value" : "392"
        } ],
        "queryString" : [ ],
        "postData" : {
          "mimeType" : "application/json",
          "text" : "{\"field\":{\"farm_id\":1,\"name\":\"Field by katakon 1\",\"boundary\":{\"boundaries\":[{\"boundary\":{\"coords\":[{\"x\":-101.49568751,\"y\":37.14976293},{\"x\":-101.50049403,\"y\":37.14647907},{\"x\":-101.50049403,\"y\":37.14264773},{\"x\":-101.49723246,\"y\":37.1411425},{\"x\":-101.49019435,\"y\":37.14223722},{\"x\":-101.48933604,\"y\":37.14620541},{\"x\":-101.49294093,\"y\":37.14866833},{\"x\":-101.49568751,\"y\":37.14976293}]}}]}}}",
          "comment" : ""
        },
        "headersSize" : 592,
        "bodySize" : 392,
        "comment" : ""
      },
      "response" : {
        "status" : 201,
        "statusText" : "Created",
        "httpVersion" : "HTTP/1.1",
        "cookies" : [ {
          "name" : ".ASPROLES",
          "value" : "9p_tO8FzMp0OeIIgaPXDLSOdtPd3ungDLAt3d642x2xX0rcXCVtEm3vjtaBCUzBAM8isgHqnbBhK3-jSYerx5Kob1_Z94F_bTr7pZDYRJS9g3jUE61zbFQLcjQ4CLemHQRvopPWA_wWFjtCVjOcVGkGIsSOC-eFdVeMfaoRryaf192kIWV5OEqGuSZ7rU50pGo_yeGqyI3W6rhhCpB3tPsGhQ1kXXjRVGuoRlRsBV3zty7Tn_-jOajuV53saydiKT18UwGlGSGE9a1XjpGD8AJMkDIJUDpBH5yl1sytjjkHl0F9b6WZ7XwPKzEzOA7rJyh6SBJkrt4UUxb2eo8f9fUBWJARADKiWTi56nFGdvoc__5UmxzXV7abopIjSnp-RvEsjhHdyl9xs6rTPDoGld6pV0l8bGFBLRBNLCXa_YbS9LD69Sf4lv0lKvWMlZ4-xETyK0eNfQ8DfqrWuAWBIGa0-psdqUZ9bLYUMtClU7jJlE_O_owA23XAHci2c87OR-ICyOA2",
          "path" : "/",
          "httpOnly" : true,
          "secure" : false,
          "comment" : ""
        } ],
        "headers" : [ {
          "name" : "Cache-Control",
          "value" : "private"
        }, {
          "name" : "Content-Type",
          "value" : "application/json; charset=utf-8"
        }, {
          "name" : "Location",
          "value" : "api/mobile/v1/fields/1"
        }, {
          "name" : "Server",
          "value" : "Microsoft-IIS/10.0"
        }, {
          "name" : "Set-Cookie",
          "value" : ".ASPROLES=9p_tO8FzMp0OeIIgaPXDLSOdtPd3ungDLAt3d642x2xX0rcXCVtEm3vjtaBCUzBAM8isgHqnbBhK3-jSYerx5Kob1_Z94F_bTr7pZDYRJS9g3jUE61zbFQLcjQ4CLemHQRvopPWA_wWFjtCVjOcVGkGIsSOC-eFdVeMfaoRryaf192kIWV5OEqGuSZ7rU50pGo_yeGqyI3W6rhhCpB3tPsGhQ1kXXjRVGuoRlRsBV3zty7Tn_-jOajuV53saydiKT18UwGlGSGE9a1XjpGD8AJMkDIJUDpBH5yl1sytjjkHl0F9b6WZ7XwPKzEzOA7rJyh6SBJkrt4UUxb2eo8f9fUBWJARADKiWTi56nFGdvoc__5UmxzXV7abopIjSnp-RvEsjhHdyl9xs6rTPDoGld6pV0l8bGFBLRBNLCXa_YbS9LD69Sf4lv0lKvWMlZ4-xETyK0eNfQ8DfqrWuAWBIGa0-psdqUZ9bLYUMtClU7jJlE_O_owA23XAHci2c87OR-ICyOA2; path=/; HttpOnly"
        }, {
          "name" : "X-SourceFiles",
          "value" : "=?UTF-8?B?RDpcVmlydHVhbE9wdGltaXplci1SZWZhY3RvcmluZ1xDcm9wTWV0cmljcy5Wby5BcGlcQ3JvcE1ldHJpY3MuVm8uQXBpXGFwaVxtb2JpbGVcdjFcZmllbGRz?="
        }, {
          "name" : "X-Powered-By",
          "value" : "ASP.NET"
        }, {
          "name" : "Date",
          "value" : "Tue, 09 Apr 2019 09:33:29 GMT"
        }, {
          "name" : "Content-Length",
          "value" : "412"
        } ],
        "content" : {
          "size" : 412,
          "mimeType" : "application/json; charset=utf-8",
          "text" : "{\"field\":{\"id\":1,\"farm_id\":1,\"name\":\"Field by katakon 1\",\"boundary\":{\"boundaries\":[{\"boundary\":{\"coords\":[{\"x\":-101.49568751,\"y\":37.14976293},{\"x\":-101.49294093,\"y\":37.14866833},{\"x\":-101.48933604,\"y\":37.14620541},{\"x\":-101.49019435,\"y\":37.14223722},{\"x\":-101.49723246,\"y\":37.1411425},{\"x\":-101.50049403,\"y\":37.14264773},{\"x\":-101.50049403,\"y\":37.14647907},{\"x\":-101.49568751,\"y\":37.14976293}]},\"holes\":null}]}}}",
          "comment" : ""
        },
        "redirectURL" : "",
        "headersSize" : 950,
        "bodySize" : 412,
        "comment" : ""
      },
      "cache" : { },
      "timings" : {
        "comment" : "",
        "ssl" : -1,
        "receive" : 6,
        "wait" : 35247,
        "connect" : -1,
        "blocked" : -1,
        "dns" : -1,
        "send" : 2
      },
      "serverIPAddress" : "127.0.0.1",
      "comment" : "",
      "_katalonRequestInformation" : {
        "name" : "1",
        "testObjectId" : "Object Repository/VoGrow/Field/FieldPost",
        "harId" : "598eb935-bed4-4212-98ed-7b3116630984"
      },
      "time" : 35256
    } ],
    "comment" : ""
  }
}