Suite/Test/Step Name,Browser,Description,Start time,End time,Duration,Status
Auto_User,,,2019-04-09 15:50:03,2019-04-09 15:50:18,15.791s,PASSED
,,,,,,
Test Cases/VoGrow/API/User/Info/1 API_USER_When_user_is_client_only_Expected_status_code_200,,,2019-04-09 15:50:03,2019-04-09 15:50:08,5.396s,PASSED
"tokenUserName = ""jenny.maldonado.tx2@gmail.com""",,,2019-04-09 15:50:04,2019-04-09 15:50:04,0.002s,PASSED
"tokenPassword = ""cropmetrics""",,,2019-04-09 15:50:04,2019-04-09 15:50:04,0.003s,PASSED
"responseToken = sendRequest(findTestObject(""VoPro/Token"", [""usernameToken"":tokenUserName, ""passwordToken"":tokenPassword]))",,,2019-04-09 15:50:04,2019-04-09 15:50:08,4.210s,PASSED
slurper = new groovy.json.JsonSlurper(),,,2019-04-09 15:50:08,2019-04-09 15:50:08,0.039s,PASSED
tokenResult = slurper.parseText(responseToken.getResponseBodyContent()),,,2019-04-09 15:50:08,2019-04-09 15:50:08,0.021s,PASSED
accessToken = access_token,,,2019-04-09 15:50:08,2019-04-09 15:50:08,0.008s,PASSED
"println("".. Current access token generated for admin user : "" + accessToken)",,,2019-04-09 15:50:08,2019-04-09 15:50:08,0.012s,PASSED
"responseUser = sendRequest(findTestObject(""VoGrow/User/User"", [""access_token"":accessToken]))",,,2019-04-09 15:50:08,2019-04-09 15:50:08,0.232s,PASSED
"verifyResponseStatusCode(responseUser, 200)",,,2019-04-09 15:50:08,2019-04-09 15:50:08,0.010s,PASSED
,,,,,,
Test Cases/VoGrow/API/User/Info/2 API_USER_When_user_is_client_only_Expected_response_body_content_with_the_conresponding_grower_data,,,2019-04-09 15:50:08,2019-04-09 15:50:10,1.159s,PASSED
"tokenUserName = ""jenny.maldonado.tx2@gmail.com""",,,2019-04-09 15:50:09,2019-04-09 15:50:09,0.000s,PASSED
"tokenPassword = ""cropmetrics""",,,2019-04-09 15:50:09,2019-04-09 15:50:09,0.000s,PASSED
"responseToken = sendRequest(findTestObject(""VoPro/Token"", [""usernameToken"":tokenUserName, ""passwordToken"":tokenPassword]))",,,2019-04-09 15:50:09,2019-04-09 15:50:09,0.244s,PASSED
slurper = new groovy.json.JsonSlurper(),,,2019-04-09 15:50:09,2019-04-09 15:50:09,0.000s,PASSED
tokenResult = slurper.parseText(responseToken.getResponseBodyContent()),,,2019-04-09 15:50:09,2019-04-09 15:50:09,0.000s,PASSED
accessToken = access_token,,,2019-04-09 15:50:09,2019-04-09 15:50:09,0.000s,PASSED
"println("".. Current access token generated for admin user : "" + accessToken)",,,2019-04-09 15:50:09,2019-04-09 15:50:09,0.000s,PASSED
"responseUser = sendRequest(findTestObject(""VoGrow/User/User"", [""access_token"":accessToken]))",,,2019-04-09 15:50:09,2019-04-09 15:50:09,0.051s,PASSED
slurper1 = new groovy.json.JsonSlurper(),,,2019-04-09 15:50:09,2019-04-09 15:50:09,0.000s,PASSED
responseBodyUser = slurper1.parseText(responseUser.getResponseBodyContent()),,,2019-04-09 15:50:09,2019-04-09 15:50:09,0.005s,PASSED
id = id,,,2019-04-09 15:50:09,2019-04-09 15:50:09,0.000s,PASSED
name = name,,,2019-04-09 15:50:09,2019-04-09 15:50:09,0.002s,PASSED
email = email,,,2019-04-09 15:50:09,2019-04-09 15:50:09,0.003s,PASSED
addressLine1 = address_line1,,,2019-04-09 15:50:09,2019-04-09 15:50:09,0.000s,PASSED
addressLine2 = address_line2,,,2019-04-09 15:50:09,2019-04-09 15:50:09,0.000s,PASSED
town = town,,,2019-04-09 15:50:09,2019-04-09 15:50:09,0.004s,PASSED
state = state,,,2019-04-09 15:50:09,2019-04-09 15:50:09,0.000s,PASSED
zip = zip,,,2019-04-09 15:50:09,2019-04-09 15:50:09,0.000s,PASSED
country = country,,,2019-04-09 15:50:09,2019-04-09 15:50:09,0.001s,PASSED
phone = phone,,,2019-04-09 15:50:09,2019-04-09 15:50:09,0.003s,PASSED
role = role,,,2019-04-09 15:50:09,2019-04-09 15:50:09,0.002s,PASSED
roles = roles,,,2019-04-09 15:50:09,2019-04-09 15:50:09,0.000s,PASSED
"println(""The user id is :  "" + id)",,,2019-04-09 15:50:09,2019-04-09 15:50:09,0.000s,PASSED
"println(""The user name is :  "" + name)",,,2019-04-09 15:50:09,2019-04-09 15:50:09,0.001s,PASSED
"println(""The user email is :  "" + email)",,,2019-04-09 15:50:09,2019-04-09 15:50:09,0.000s,PASSED
"println(""The user address line 1 is :  "" + addressLine1)",,,2019-04-09 15:50:09,2019-04-09 15:50:09,0.005s,PASSED
"println(""The user address line 2 is :  "" + addressLine2)",,,2019-04-09 15:50:09,2019-04-09 15:50:09,0.000s,PASSED
"println(""The user town is :  "" + town)",,,2019-04-09 15:50:09,2019-04-09 15:50:09,0.000s,PASSED
"println(""The user state is :  "" + state)",,,2019-04-09 15:50:09,2019-04-09 15:50:09,0.013s,PASSED
"println(""The user zip is :  "" + zip)",,,2019-04-09 15:50:09,2019-04-09 15:50:09,0.000s,PASSED
"println(""The user country is :  "" + country)",,,2019-04-09 15:50:09,2019-04-09 15:50:09,0.005s,PASSED
"println(""The user phone is :  "" + phone)",,,2019-04-09 15:50:09,2019-04-09 15:50:09,0.005s,PASSED
"println(""The user role is :  "" + role)",,,2019-04-09 15:50:09,2019-04-09 15:50:09,0.000s,PASSED
"println(""The user roles is :  "" + roles)",,,2019-04-09 15:50:09,2019-04-09 15:50:09,0.001s,PASSED
"idDB = ""4""",,,2019-04-09 15:50:09,2019-04-09 15:50:09,0.000s,PASSED
"nameDB = ""grower without agent""",,,2019-04-09 15:50:09,2019-04-09 15:50:09,0.005s,PASSED
"emailDB = ""jenny.maldonado.tx2@gmail.com""",,,2019-04-09 15:50:09,2019-04-09 15:50:09,0.003s,PASSED
"addressLine1DB = ""x""",,,2019-04-09 15:50:09,2019-04-09 15:50:09,0.000s,PASSED
"addressLine2DB = """"",,,2019-04-09 15:50:09,2019-04-09 15:50:09,0.002s,PASSED
"townDB = ""x""",,,2019-04-09 15:50:09,2019-04-09 15:50:09,0.000s,PASSED
"stateDB = ""NE""",,,2019-04-09 15:50:09,2019-04-09 15:50:09,0.000s,PASSED
"zipDB = ""x""",,,2019-04-09 15:50:09,2019-04-09 15:50:09,0.000s,PASSED
"countryDB = ""USA""",,,2019-04-09 15:50:09,2019-04-09 15:50:09,0.005s,PASSED
"phoneDB = """"",,,2019-04-09 15:50:09,2019-04-09 15:50:09,0.000s,PASSED
"roleDB = ""Client""",,,2019-04-09 15:50:09,2019-04-09 15:50:09,0.000s,PASSED
"rolesDB = ""Client""",,,2019-04-09 15:50:09,2019-04-09 15:50:09,0.003s,PASSED
"verifyElementPropertyValue(responseUser, ""id"", idDB)",,,2019-04-09 15:50:09,2019-04-09 15:50:09,0.050s,PASSED
"verifyElementPropertyValue(responseUser, ""name"", nameDB)",,,2019-04-09 15:50:09,2019-04-09 15:50:09,0.035s,PASSED
"verifyElementPropertyValue(responseUser, ""email"", emailDB)",,,2019-04-09 15:50:09,2019-04-09 15:50:09,0.016s,PASSED
"verifyElementPropertyValue(responseUser, ""address_line1"", addressLine1DB)",,,2019-04-09 15:50:09,2019-04-09 15:50:09,0.015s,PASSED
"verifyElementPropertyValue(responseUser, ""address_line2"", addressLine2DB)",,,2019-04-09 15:50:09,2019-04-09 15:50:09,0.024s,PASSED
"verifyElementPropertyValue(responseUser, ""town"", townDB)",,,2019-04-09 15:50:09,2019-04-09 15:50:09,0.020s,PASSED
"verifyElementPropertyValue(responseUser, ""state"", stateDB)",,,2019-04-09 15:50:09,2019-04-09 15:50:09,0.028s,PASSED
"verifyElementPropertyValue(responseUser, ""zip"", zipDB)",,,2019-04-09 15:50:09,2019-04-09 15:50:09,0.027s,PASSED
"verifyElementPropertyValue(responseUser, ""country"", countryDB)",,,2019-04-09 15:50:09,2019-04-09 15:50:10,0.047s,PASSED
"verifyElementPropertyValue(responseUser, ""phone"", phoneDB)",,,2019-04-09 15:50:10,2019-04-09 15:50:10,0.016s,PASSED
"verifyElementPropertyValue(responseUser, ""role"", roleDB)",,,2019-04-09 15:50:10,2019-04-09 15:50:10,0.018s,PASSED
"verifyElementPropertyValue(responseUser, ""roles"", rolesDB)",,,2019-04-09 15:50:10,2019-04-09 15:50:10,0.040s,PASSED
,,,,,,
Test Cases/VoGrow/API/User/Info/3 API_USER_When_user_is_agent_only_Expected_status_code_200,,,2019-04-09 15:50:10,2019-04-09 15:50:10,0.406s,PASSED
"tokenUserName = ""jenny.maldonado.tx1@gmail.com""",,,2019-04-09 15:50:10,2019-04-09 15:50:10,0.002s,PASSED
"tokenPassword = ""cropmetrics""",,,2019-04-09 15:50:10,2019-04-09 15:50:10,0.004s,PASSED
"responseToken = sendRequest(findTestObject(""VoPro/Token"", [""usernameToken"":tokenUserName, ""passwordToken"":tokenPassword]))",,,2019-04-09 15:50:10,2019-04-09 15:50:10,0.100s,PASSED
slurper = new groovy.json.JsonSlurper(),,,2019-04-09 15:50:10,2019-04-09 15:50:10,0.000s,PASSED
tokenResult = slurper.parseText(responseToken.getResponseBodyContent()),,,2019-04-09 15:50:10,2019-04-09 15:50:10,0.000s,PASSED
accessToken = access_token,,,2019-04-09 15:50:10,2019-04-09 15:50:10,0.005s,PASSED
"println("".. Current access token generated for admin user : "" + accessToken)",,,2019-04-09 15:50:10,2019-04-09 15:50:10,0.000s,PASSED
"responseUser = sendRequest(findTestObject(""VoGrow/User/User"", [""access_token"":accessToken]))",,,2019-04-09 15:50:10,2019-04-09 15:50:10,0.036s,PASSED
"verifyResponseStatusCode(responseUser, 200)",,,2019-04-09 15:50:10,2019-04-09 15:50:10,0.004s,PASSED
,,,,,,
Test Cases/VoGrow/API/User/Info/4 API_USER_When_user_is_agent_only_Expected_response_body_content_with_the_conresponding_agent_data,,,2019-04-09 15:50:10,2019-04-09 15:50:11,0.744s,PASSED
"tokenUserName = ""jenny.maldonado.tx1@gmail.com""",,,2019-04-09 15:50:10,2019-04-09 15:50:10,0.001s,PASSED
"tokenPassword = ""cropmetrics""",,,2019-04-09 15:50:10,2019-04-09 15:50:10,0.001s,PASSED
"responseToken = sendRequest(findTestObject(""VoPro/Token"", [""usernameToken"":tokenUserName, ""passwordToken"":tokenPassword]))",,,2019-04-09 15:50:10,2019-04-09 15:50:10,0.085s,PASSED
slurper = new groovy.json.JsonSlurper(),,,2019-04-09 15:50:10,2019-04-09 15:50:10,0.000s,PASSED
tokenResult = slurper.parseText(responseToken.getResponseBodyContent()),,,2019-04-09 15:50:10,2019-04-09 15:50:10,0.000s,PASSED
accessToken = access_token,,,2019-04-09 15:50:10,2019-04-09 15:50:10,0.000s,PASSED
"println("".. Current access token generated for admin user : "" + accessToken)",,,2019-04-09 15:50:10,2019-04-09 15:50:10,0.002s,PASSED
"responseUser = sendRequest(findTestObject(""VoGrow/User/User"", [""access_token"":accessToken]))",,,2019-04-09 15:50:10,2019-04-09 15:50:10,0.031s,PASSED
"verifyResponseStatusCode(responseUser, 200)",,,2019-04-09 15:50:10,2019-04-09 15:50:10,0.008s,PASSED
slurper1 = new groovy.json.JsonSlurper(),,,2019-04-09 15:50:10,2019-04-09 15:50:10,0.000s,PASSED
responseBodyUser = slurper1.parseText(responseUser.getResponseBodyContent()),,,2019-04-09 15:50:10,2019-04-09 15:50:10,0.002s,PASSED
id = id,,,2019-04-09 15:50:10,2019-04-09 15:50:10,0.000s,PASSED
name = name,,,2019-04-09 15:50:10,2019-04-09 15:50:10,0.002s,PASSED
email = email,,,2019-04-09 15:50:10,2019-04-09 15:50:10,0.000s,PASSED
addressLine1 = address_line1,,,2019-04-09 15:50:10,2019-04-09 15:50:10,0.000s,PASSED
addressLine2 = address_line2,,,2019-04-09 15:50:10,2019-04-09 15:50:10,0.000s,PASSED
town = town,,,2019-04-09 15:50:10,2019-04-09 15:50:10,0.000s,PASSED
state = state,,,2019-04-09 15:50:10,2019-04-09 15:50:10,0.000s,PASSED
zip = zip,,,2019-04-09 15:50:10,2019-04-09 15:50:10,0.000s,PASSED
country = country,,,2019-04-09 15:50:10,2019-04-09 15:50:10,0.000s,PASSED
phone = phone,,,2019-04-09 15:50:10,2019-04-09 15:50:10,0.000s,PASSED
role = role,,,2019-04-09 15:50:10,2019-04-09 15:50:10,0.002s,PASSED
roles = roles,,,2019-04-09 15:50:10,2019-04-09 15:50:10,0.000s,PASSED
"println(""The user id is :  "" + id)",,,2019-04-09 15:50:10,2019-04-09 15:50:10,0.002s,PASSED
"println(""The user name is :  "" + name)",,,2019-04-09 15:50:10,2019-04-09 15:50:10,0.000s,PASSED
"println(""The user email is :  "" + email)",,,2019-04-09 15:50:10,2019-04-09 15:50:10,0.000s,PASSED
"println(""The user address line 1 is :  "" + addressLine1)",,,2019-04-09 15:50:10,2019-04-09 15:50:10,0.000s,PASSED
"println(""The user address line 2 is :  "" + addressLine2)",,,2019-04-09 15:50:10,2019-04-09 15:50:10,0.000s,PASSED
"println(""The user town is :  "" + town)",,,2019-04-09 15:50:10,2019-04-09 15:50:10,0.001s,PASSED
"println(""The user state is :  "" + state)",,,2019-04-09 15:50:10,2019-04-09 15:50:10,0.000s,PASSED
"println(""The user zip is :  "" + zip)",,,2019-04-09 15:50:10,2019-04-09 15:50:10,0.000s,PASSED
"println(""The user country is :  "" + country)",,,2019-04-09 15:50:10,2019-04-09 15:50:10,0.000s,PASSED
"println(""The user phone is :  "" + phone)",,,2019-04-09 15:50:10,2019-04-09 15:50:10,0.000s,PASSED
"println(""The user role is :  "" + role)",,,2019-04-09 15:50:11,2019-04-09 15:50:11,0.000s,PASSED
"println(""The user roles is :  "" + roles)",,,2019-04-09 15:50:11,2019-04-09 15:50:11,0.000s,PASSED
"idDB = ""2""",,,2019-04-09 15:50:11,2019-04-09 15:50:11,0.000s,PASSED
"nameDB = ""Agent account""",,,2019-04-09 15:50:11,2019-04-09 15:50:11,0.005s,PASSED
"emailDB = ""jenny.maldonado.tx1@gmail.com""",,,2019-04-09 15:50:11,2019-04-09 15:50:11,0.001s,PASSED
"addressLine1DB = ""x""",,,2019-04-09 15:50:11,2019-04-09 15:50:11,0.000s,PASSED
"addressLine2DB = """"",,,2019-04-09 15:50:11,2019-04-09 15:50:11,0.000s,PASSED
"townDB = ""x""",,,2019-04-09 15:50:11,2019-04-09 15:50:11,0.002s,PASSED
"stateDB = ""NE""",,,2019-04-09 15:50:11,2019-04-09 15:50:11,0.000s,PASSED
"zipDB = ""x""",,,2019-04-09 15:50:11,2019-04-09 15:50:11,0.000s,PASSED
"countryDB = ""USA""",,,2019-04-09 15:50:11,2019-04-09 15:50:11,0.000s,PASSED
"phoneDB = """"",,,2019-04-09 15:50:11,2019-04-09 15:50:11,0.000s,PASSED
"roleDB = ""Agent""",,,2019-04-09 15:50:11,2019-04-09 15:50:11,0.000s,PASSED
"rolesDB = ""Client,Agent""",,,2019-04-09 15:50:11,2019-04-09 15:50:11,0.000s,PASSED
"verifyElementPropertyValue(responseUser, ""id"", idDB)",,,2019-04-09 15:50:11,2019-04-09 15:50:11,0.027s,PASSED
"verifyElementPropertyValue(responseUser, ""name"", nameDB)",,,2019-04-09 15:50:11,2019-04-09 15:50:11,0.021s,PASSED
"verifyElementPropertyValue(responseUser, ""email"", emailDB)",,,2019-04-09 15:50:11,2019-04-09 15:50:11,0.020s,PASSED
"verifyElementPropertyValue(responseUser, ""address_line1"", addressLine1DB)",,,2019-04-09 15:50:11,2019-04-09 15:50:11,0.028s,PASSED
"verifyElementPropertyValue(responseUser, ""address_line2"", addressLine2DB)",,,2019-04-09 15:50:11,2019-04-09 15:50:11,0.012s,PASSED
"verifyElementPropertyValue(responseUser, ""town"", townDB)",,,2019-04-09 15:50:11,2019-04-09 15:50:11,0.041s,PASSED
"verifyElementPropertyValue(responseUser, ""state"", stateDB)",,,2019-04-09 15:50:11,2019-04-09 15:50:11,0.019s,PASSED
"verifyElementPropertyValue(responseUser, ""zip"", zipDB)",,,2019-04-09 15:50:11,2019-04-09 15:50:11,0.019s,PASSED
"verifyElementPropertyValue(responseUser, ""country"", countryDB)",,,2019-04-09 15:50:11,2019-04-09 15:50:11,0.027s,PASSED
"verifyElementPropertyValue(responseUser, ""phone"", phoneDB)",,,2019-04-09 15:50:11,2019-04-09 15:50:11,0.024s,PASSED
"verifyElementPropertyValue(responseUser, ""role"", roleDB)",,,2019-04-09 15:50:11,2019-04-09 15:50:11,0.014s,PASSED
"verifyElementPropertyValue(responseUser, ""roles"", rolesDB)",,,2019-04-09 15:50:11,2019-04-09 15:50:11,0.016s,PASSED
,,,,,,
Test Cases/VoGrow/API/User/Info/5 API_USER_When_user_token_is_wrong_Expected_status_code_401,,,2019-04-09 15:50:11,2019-04-09 15:50:15,4.024s,PASSED
"accessToken = ""testInvalidToken""",,,2019-04-09 15:50:11,2019-04-09 15:50:11,0.003s,PASSED
"responseUser = sendRequest(findTestObject(""VoGrow/User/User"", [""access_token"":accessToken]))",,,2019-04-09 15:50:11,2019-04-09 15:50:15,3.803s,PASSED
"verifyResponseStatusCode(responseUser, 401)",,,2019-04-09 15:50:15,2019-04-09 15:50:15,0.000s,PASSED
,,,,,,
Test Cases/VoGrow/API/User/Info/6 API_USER_When_user_token_is_wrong_Expected_properly_error_message_is_displayed,,,2019-04-09 15:50:15,2019-04-09 15:50:17,2.490s,PASSED
"accessToken = ""testInvalidToken""",,,2019-04-09 15:50:15,2019-04-09 15:50:15,0.006s,PASSED
"responseUser = sendRequest(findTestObject(""VoGrow/User/User"", [""access_token"":accessToken]))",,,2019-04-09 15:50:15,2019-04-09 15:50:17,2.195s,PASSED
"verifyResponseStatusCode(responseUser, 401)",,,2019-04-09 15:50:17,2019-04-09 15:50:17,0.002s,PASSED
slurper1 = new groovy.json.JsonSlurper(),,,2019-04-09 15:50:17,2019-04-09 15:50:17,0.000s,PASSED
UserResult = slurper1.parseText(responseUser.getResponseBodyContent()),,,2019-04-09 15:50:17,2019-04-09 15:50:17,0.000s,PASSED
messageResponse = message,,,2019-04-09 15:50:17,2019-04-09 15:50:17,0.001s,PASSED
"messageExpected = ""Authorization has been denied for this request.""",,,2019-04-09 15:50:17,2019-04-09 15:50:17,0.000s,PASSED
"println(""Error message response: "" + messageResponse)",,,2019-04-09 15:50:17,2019-04-09 15:50:17,0.000s,PASSED
"println(""Error message expected: "" + messageExpected)",,,2019-04-09 15:50:17,2019-04-09 15:50:17,0.000s,PASSED
"verifyElementPropertyValue(responseUser, ""message"", messageExpected)",,,2019-04-09 15:50:17,2019-04-09 15:50:17,0.022s,PASSED
,,,,,,
Test Cases/VoGrow/API/User/Info/7 API_USER_When_user_has_admin_role_Expected_status_code_401,,,2019-04-09 15:50:17,2019-04-09 15:50:18,0.473s,PASSED
"tokenUserName = ""admin""",,,2019-04-09 15:50:18,2019-04-09 15:50:18,0.000s,PASSED
"tokenPassword = ""cropmetricsvo""",,,2019-04-09 15:50:18,2019-04-09 15:50:18,0.000s,PASSED
"responseToken = sendRequest(findTestObject(""VoPro/Token"", [""usernameToken"":tokenUserName, ""passwordToken"":tokenPassword]))",,,2019-04-09 15:50:18,2019-04-09 15:50:18,0.170s,PASSED
slurper = new groovy.json.JsonSlurper(),,,2019-04-09 15:50:18,2019-04-09 15:50:18,0.000s,PASSED
tokenResult = slurper.parseText(responseToken.getResponseBodyContent()),,,2019-04-09 15:50:18,2019-04-09 15:50:18,0.000s,PASSED
accessToken = access_token,,,2019-04-09 15:50:18,2019-04-09 15:50:18,0.000s,PASSED
"println("".. Current access token generated for admin user : "" + accessToken)",,,2019-04-09 15:50:18,2019-04-09 15:50:18,0.000s,PASSED
"responseUser = sendRequest(findTestObject(""VoGrow/User/User"", [""access_token"":accessToken]))",,,2019-04-09 15:50:18,2019-04-09 15:50:18,0.068s,PASSED
"verifyResponseStatusCode(responseUser, 401)",,,2019-04-09 15:50:18,2019-04-09 15:50:18,0.002s,PASSED
,,,,,,
Test Cases/VoGrow/API/User/Info/8 API_USER_When_user_has_admin_role_Expected_properly_error_message_is_displayed,,,2019-04-09 15:50:18,2019-04-09 15:50:18,0.385s,PASSED
"tokenUserName = ""admin""",,,2019-04-09 15:50:18,2019-04-09 15:50:18,0.000s,PASSED
"tokenPassword = ""cropmetricsvo""",,,2019-04-09 15:50:18,2019-04-09 15:50:18,0.000s,PASSED
"responseToken = sendRequest(findTestObject(""VoPro/Token"", [""usernameToken"":tokenUserName, ""passwordToken"":tokenPassword]))",,,2019-04-09 15:50:18,2019-04-09 15:50:18,0.112s,PASSED
slurper = new groovy.json.JsonSlurper(),,,2019-04-09 15:50:18,2019-04-09 15:50:18,0.000s,PASSED
tokenResult = slurper.parseText(responseToken.getResponseBodyContent()),,,2019-04-09 15:50:18,2019-04-09 15:50:18,0.000s,PASSED
accessToken = access_token,,,2019-04-09 15:50:18,2019-04-09 15:50:18,0.000s,PASSED
"println("".. Current access token generated for admin user : "" + accessToken)",,,2019-04-09 15:50:18,2019-04-09 15:50:18,0.000s,PASSED
"responseUser = sendRequest(findTestObject(""VoGrow/User/User"", [""access_token"":accessToken]))",,,2019-04-09 15:50:18,2019-04-09 15:50:18,0.058s,PASSED
"verifyResponseStatusCode(responseUser, 401)",,,2019-04-09 15:50:18,2019-04-09 15:50:18,0.002s,PASSED
slurper1 = new groovy.json.JsonSlurper(),,,2019-04-09 15:50:18,2019-04-09 15:50:18,0.004s,PASSED
UserResult = slurper1.parseText(responseUser.getResponseBodyContent()),,,2019-04-09 15:50:18,2019-04-09 15:50:18,0.000s,PASSED
messageResponse = message,,,2019-04-09 15:50:18,2019-04-09 15:50:18,0.000s,PASSED
"messageExpected = ""Authorization has been denied for this request.""",,,2019-04-09 15:50:18,2019-04-09 15:50:18,0.000s,PASSED
"println(""Error message response: "" + messageResponse)",,,2019-04-09 15:50:18,2019-04-09 15:50:18,0.000s,PASSED
"println(""Error message expected: "" + messageExpected)",,,2019-04-09 15:50:18,2019-04-09 15:50:18,0.000s,PASSED
"verifyElementPropertyValue(responseUser, ""message"", messageExpected)",,,2019-04-09 15:50:18,2019-04-09 15:50:18,0.016s,PASSED
