{
  "log" : {
    "version" : "1.2",
    "creator" : {
      "name" : "BrowserMob Proxy",
      "version" : "2.1.5",
      "comment" : ""
    },
    "pages" : [ {
      "id" : "Page 0",
      "startedDateTime" : "2019-03-29T22:13:24.955Z",
      "title" : "Page 0",
      "pageTimings" : {
        "onLoad" : 69,
        "comment" : ""
      },
      "comment" : ""
    } ],
    "entries" : [ {
      "pageref" : "Page 0",
      "startedDateTime" : "2019-03-29T22:13:24.957Z",
      "request" : {
        "method" : "PUT",
        "url" : "http://localhost:10520/WebAPI/api/admin/v1/users/22?",
        "httpVersion" : "HTTP/1.1",
        "cookies" : [ ],
        "headers" : [ {
          "name" : "User-Agent",
          "value" : "Katalon Studio"
        }, {
          "name" : "Content-Type",
          "value" : "application/x-www-form-urlencoded"
        }, {
          "name" : "Authorization",
          "value" : "Bearer eyJ0eXAiOiJKV1QiLCJhbGciOiJIUzI1NiJ9.eyJ1bmlxdWVfbmFtZSI6ImFkbWluIiwicm9sZSI6InVzZXIiLCJzdWIiOiJhZG1pbiIsImlzcyI6IkNyb3BNZXRyaWNzIiwiYXVkIjoiYWxsIiwiZXhwIjoxNTUzOTAxNTA0LCJuYmYiOjE1NTM4OTc2MDR9.Op4QtYzi1VNlDi22qwn6kXzGLsPH7eXK6KLDntRt-y8"
        }, {
          "name" : "Host",
          "value" : "localhost:10520"
        }, {
          "name" : "Accept",
          "value" : "text/html, image/gif, image/jpeg, *; q=.2, */*; q=.2"
        }, {
          "name" : "Proxy-Connection",
          "value" : "keep-alive"
        }, {
          "name" : "Content-Length",
          "value" : "367"
        } ],
        "queryString" : [ ],
        "postData" : {
          "mimeType" : "application/x-www-form-urlencoded",
          "params" : [ {
            "name" : "password",
            "value" : "     1",
            "comment" : ""
          }, {
            "name" : "email",
            "value" : "cropmetricsvo.passwithspaces.testsss@gmail.com",
            "comment" : ""
          }, {
            "name" : "fullname",
            "value" : "test validation phone attribute as characters instead of numbers",
            "comment" : ""
          }, {
            "name" : "phone",
            "value" : "123",
            "comment" : ""
          }, {
            "name" : "dealer",
            "value" : "x",
            "comment" : ""
          }, {
            "name" : "addressLine1",
            "value" : "address line 1 test validation",
            "comment" : ""
          }, {
            "name" : "addressLine2",
            "value" : "address line 1 test validation",
            "comment" : ""
          }, {
            "name" : "town",
            "value" : "townValidation",
            "comment" : ""
          }, {
            "name" : "state",
            "value" : "stateValidation",
            "comment" : ""
          }, {
            "name" : "zip",
            "value" : "zipValidation",
            "comment" : ""
          }, {
            "name" : "country",
            "value" : "countryValidation",
            "comment" : ""
          }, {
            "name" : "roles",
            "value" : "Client",
            "comment" : ""
          }, {
            "name" : "userProfileId",
            "value" : "22",
            "comment" : ""
          } ],
          "comment" : ""
        },
        "headersSize" : 545,
        "bodySize" : 367,
        "comment" : ""
      },
      "response" : {
        "status" : 400,
        "statusText" : "Bad Request",
        "httpVersion" : "HTTP/1.1",
        "cookies" : [ {
          "name" : ".ASPROLES",
          "value" : "Rx7NJWgqZMY-eI_ZiyWvUKVz9IR67j3ownljcCaOe67K65E5XG969tRbUshVGoTMEW6FSM8ZCEsH-OoqsTIj7J9VvxOyc9f-D3DcUPONINAFgIolNPTMXMS_ODNYA2yPv9K3-5PE5rWdjdRAW17zCfNh_xdngYuhdQP_OuTeTxNY3730Qd3ldEUUePK9T4R7wtMiEaFgMTCptcW6Pgzr_mNJ1jlh5kVWAYEAx6KSmkV5RBtaCQCvbuodNnL-O6sHEOv8d3JCAa-rgnTjJcAzyjQJY08hD-r7d6cBW9rVShTNBPoMvc47enXmgvFjmMz-_7U09c4A4QGWBXhQZXcBqgBsJEM7d_aIS-aamB7WxUXp9nx9_6QvpBXnGsixAlYUq2pP9hhccnU_BviUxs-91i2c6VfQR-Z5yB7S1ZsZU3cgtQsi40wVco4c9n7Ry34xywmQX9ERTcT9ZuvQom5hTh8cxZmQwSSBxw4yIAoaaPtBAp7V0",
          "path" : "/",
          "httpOnly" : true,
          "secure" : false,
          "comment" : ""
        } ],
        "headers" : [ {
          "name" : "Cache-Control",
          "value" : "private"
        }, {
          "name" : "Content-Type",
          "value" : "application/json; charset=utf-8"
        }, {
          "name" : "Server",
          "value" : "Microsoft-IIS/10.0"
        }, {
          "name" : "Set-Cookie",
          "value" : ".ASPROLES=Rx7NJWgqZMY-eI_ZiyWvUKVz9IR67j3ownljcCaOe67K65E5XG969tRbUshVGoTMEW6FSM8ZCEsH-OoqsTIj7J9VvxOyc9f-D3DcUPONINAFgIolNPTMXMS_ODNYA2yPv9K3-5PE5rWdjdRAW17zCfNh_xdngYuhdQP_OuTeTxNY3730Qd3ldEUUePK9T4R7wtMiEaFgMTCptcW6Pgzr_mNJ1jlh5kVWAYEAx6KSmkV5RBtaCQCvbuodNnL-O6sHEOv8d3JCAa-rgnTjJcAzyjQJY08hD-r7d6cBW9rVShTNBPoMvc47enXmgvFjmMz-_7U09c4A4QGWBXhQZXcBqgBsJEM7d_aIS-aamB7WxUXp9nx9_6QvpBXnGsixAlYUq2pP9hhccnU_BviUxs-91i2c6VfQR-Z5yB7S1ZsZU3cgtQsi40wVco4c9n7Ry34xywmQX9ERTcT9ZuvQom5hTh8cxZmQwSSBxw4yIAoaaPtBAp7V0; path=/; HttpOnly"
        }, {
          "name" : "X-SourceFiles",
          "value" : "=?UTF-8?B?RDpcVmlydHVhbE9wdGltaXplci1SZWZhY3RvcmluZ1xDcm9wTWV0cmljcy5Wby5BcGlcQ3JvcE1ldHJpY3MuVm8uQXBpXGFwaVxhZG1pblx2MVx1c2Vyc1wyMg==?="
        }, {
          "name" : "X-Powered-By",
          "value" : "ASP.NET"
        }, {
          "name" : "Date",
          "value" : "Fri, 29 Mar 2019 22:13:24 GMT"
        }, {
          "name" : "Content-Length",
          "value" : "85"
        } ],
        "content" : {
          "size" : 85,
          "mimeType" : "application/json; charset=utf-8",
          "text" : "{\"message\":\"The request is invalid. The password can't contain the space character.\"}",
          "comment" : ""
        },
        "redirectURL" : "",
        "headersSize" : 901,
        "bodySize" : 85,
        "comment" : ""
      },
      "cache" : { },
      "timings" : {
        "comment" : "",
        "connect" : -1,
        "wait" : 62,
        "receive" : 1,
        "dns" : -1,
        "send" : 0,
        "blocked" : -1,
        "ssl" : -1
      },
      "serverIPAddress" : "127.0.0.1",
      "comment" : "",
      "_katalonRequestInformation" : {
        "name" : "9",
        "testObjectId" : "Object Repository/VoPro/Account/api_admin_v1_users_userprofileid",
        "harId" : "65ee1165-899b-4d13-801e-8c56f312b2c8"
      },
      "time" : 64
    } ],
    "comment" : ""
  }
}