{
  "log" : {
    "version" : "1.2",
    "creator" : {
      "name" : "BrowserMob Proxy",
      "version" : "2.1.5",
      "comment" : ""
    },
    "pages" : [ {
      "id" : "Page 0",
      "startedDateTime" : "2019-04-11T16:03:31.027Z",
      "title" : "Page 0",
      "pageTimings" : {
        "onLoad" : 3736,
        "comment" : ""
      },
      "comment" : ""
    } ],
    "entries" : [ {
      "pageref" : "Page 0",
      "startedDateTime" : "2019-04-11T16:03:31.028Z",
      "request" : {
        "method" : "POST",
        "url" : "http://localhost:10520/WebAPI/api/mobile/v1/farms/?",
        "httpVersion" : "HTTP/1.1",
        "cookies" : [ ],
        "headers" : [ {
          "name" : "User-Agent",
          "value" : "Katalon Studio"
        }, {
          "name" : "Content-Type",
          "value" : "application/json"
        }, {
          "name" : "Authorization",
          "value" : "Bearer eyJ0eXAiOiJKV1QiLCJhbGciOiJIUzI1NiJ9.eyJ1bmlxdWVfbmFtZSI6Implbm55Lm1hbGRvbmFkby50eDFAZ21haWwuY29tIiwicm9sZSI6InVzZXIiLCJzdWIiOiJqZW5ueS5tYWxkb25hZG8udHgxQGdtYWlsLmNvbSIsImlzcyI6IkNyb3BNZXRyaWNzIiwiYXVkIjoiYWxsIiwiZXhwIjoxNTU1MDAyNTEwLCJuYmYiOjE1NTQ5OTg2MTB9.hV7WYpRJWZ-5p2b9s4u5EjKGa-xYVJ5Y0aQXKy5cTDc"
        }, {
          "name" : "Host",
          "value" : "localhost:10520"
        }, {
          "name" : "Accept",
          "value" : "text/html, image/gif, image/jpeg, *; q=.2, */*; q=.2"
        }, {
          "name" : "Proxy-Connection",
          "value" : "keep-alive"
        }, {
          "name" : "Content-Length",
          "value" : "209"
        } ],
        "queryString" : [ ],
        "postData" : {
          "mimeType" : "application/json",
          "text" : "{\"name\": \"API_FARM_When_new_farm_has_name_attribute_with_more_than_128_chars_Expected_status_code_400 API_FARM_When_new_farm_has_name_attribute_with_more_than_128_chars_Expected_status_code_400\", \"user_id\": 2}",
          "comment" : ""
        },
        "headersSize" : 592,
        "bodySize" : 209,
        "comment" : ""
      },
      "response" : {
        "status" : 400,
        "statusText" : "Bad Request",
        "httpVersion" : "HTTP/1.1",
        "cookies" : [ {
          "name" : ".ASPROLES",
          "value" : "_TtMlb7Q4NM_Wbv3He1JKjLTZ0Nn9zpfpF_M6nkvn8KaRJYXF6nOoW1sNJY7YdiReNnuCmq-4c395wIHFbbhglqz5yGxi4XcY_K7UZ_1SzxTIWebcsp2RalNvmmHUzZdcvCzn1gSHZpzPNK-HWn1gSwwVi_1jVTvjCXeGTB0tnkffqrxSIohq5AtDd085s5ALw4MDpM0RS_8Vs2KJ3a7k9VmWqWDl_muuH_GIisNgtVcvA_iut-Q3tZ3gfgUkSv6R97-IG2eKO1exj-_5sTs_oxmX1VUv4aBJgVcKKmvMztipNYVeasZGWEAEFRjUe-j7Vp5vrLuAJY1yN8oH9vRC7BqNVhTWTuzdlM-SovP2yfrfE8i96kVW-UM54f7tIT2yMB6pCKO0Xma_x7EbhAVLIQnicQYelNHZ7olWxLhiw--_Nom1qZs1fflJbUal0DXJogciz-1f-BbNyxH8FPiO9hL1UTXRpRVH5bL5pRAZHi33_LQHihQ-JiY8yjhAQED-AZzmgolf-lC023ajvanVYHDXVY1",
          "path" : "/",
          "httpOnly" : true,
          "secure" : false,
          "comment" : ""
        } ],
        "headers" : [ {
          "name" : "Cache-Control",
          "value" : "private"
        }, {
          "name" : "Content-Type",
          "value" : "application/json; charset=utf-8"
        }, {
          "name" : "Server",
          "value" : "Microsoft-IIS/10.0"
        }, {
          "name" : "Set-Cookie",
          "value" : ".ASPROLES=_TtMlb7Q4NM_Wbv3He1JKjLTZ0Nn9zpfpF_M6nkvn8KaRJYXF6nOoW1sNJY7YdiReNnuCmq-4c395wIHFbbhglqz5yGxi4XcY_K7UZ_1SzxTIWebcsp2RalNvmmHUzZdcvCzn1gSHZpzPNK-HWn1gSwwVi_1jVTvjCXeGTB0tnkffqrxSIohq5AtDd085s5ALw4MDpM0RS_8Vs2KJ3a7k9VmWqWDl_muuH_GIisNgtVcvA_iut-Q3tZ3gfgUkSv6R97-IG2eKO1exj-_5sTs_oxmX1VUv4aBJgVcKKmvMztipNYVeasZGWEAEFRjUe-j7Vp5vrLuAJY1yN8oH9vRC7BqNVhTWTuzdlM-SovP2yfrfE8i96kVW-UM54f7tIT2yMB6pCKO0Xma_x7EbhAVLIQnicQYelNHZ7olWxLhiw--_Nom1qZs1fflJbUal0DXJogciz-1f-BbNyxH8FPiO9hL1UTXRpRVH5bL5pRAZHi33_LQHihQ-JiY8yjhAQED-AZzmgolf-lC023ajvanVYHDXVY1; path=/; HttpOnly"
        }, {
          "name" : "X-SourceFiles",
          "value" : "=?UTF-8?B?RDpcVmlydHVhbE9wdGltaXplci1SZWZhY3RvcmluZ1xDcm9wTWV0cmljcy5Wby5BcGlcQ3JvcE1ldHJpY3MuVm8uQXBpXGFwaVxtb2JpbGVcdjFcZmFybXNc?="
        }, {
          "name" : "X-Powered-By",
          "value" : "ASP.NET"
        }, {
          "name" : "Date",
          "value" : "Thu, 11 Apr 2019 16:03:34 GMT"
        }, {
          "name" : "Content-Length",
          "value" : "64"
        } ],
        "content" : {
          "size" : 64,
          "mimeType" : "application/json; charset=utf-8",
          "text" : "{\"message\":\"The farm name must contains as max 128 characters.\"}",
          "comment" : ""
        },
        "redirectURL" : "",
        "headersSize" : 940,
        "bodySize" : 64,
        "comment" : ""
      },
      "cache" : { },
      "timings" : {
        "comment" : "",
        "ssl" : -1,
        "send" : 0,
        "dns" : -1,
        "blocked" : -1,
        "connect" : -1,
        "wait" : 3700,
        "receive" : 2
      },
      "serverIPAddress" : "127.0.0.1",
      "comment" : "",
      "_katalonRequestInformation" : {
        "name" : "9",
        "testObjectId" : "Object Repository/VoGrow/Farm/FarmPost",
        "harId" : "5bc1cbde-ab8c-40ec-81fd-58b1a12fd002"
      },
      "time" : 3703
    } ],
    "comment" : ""
  }
}