{
  "log" : {
    "version" : "1.2",
    "creator" : {
      "name" : "BrowserMob Proxy",
      "version" : "2.1.5",
      "comment" : ""
    },
    "pages" : [ {
      "id" : "Page 0",
      "startedDateTime" : "2019-04-05T19:30:52.001Z",
      "title" : "Page 0",
      "pageTimings" : {
        "onLoad" : 4791,
        "comment" : ""
      },
      "comment" : ""
    } ],
    "entries" : [ {
      "pageref" : "Page 0",
      "startedDateTime" : "2019-04-05T19:30:52.002Z",
      "request" : {
        "method" : "POST",
        "url" : "http://localhost:10520/WebAPI/api/mobile/v1/fields?",
        "httpVersion" : "HTTP/1.1",
        "cookies" : [ ],
        "headers" : [ {
          "name" : "User-Agent",
          "value" : "Katalon Studio"
        }, {
          "name" : "Content-Type",
          "value" : "application/json"
        }, {
          "name" : "Authorization",
          "value" : "Bearer eyJ0eXAiOiJKV1QiLCJhbGciOiJIUzI1NiJ9.eyJ1bmlxdWVfbmFtZSI6Implbm55Lm1hbGRvbmFkby50eDFAZ21haWwuY29tIiwicm9sZSI6InVzZXIiLCJzdWIiOiJqZW5ueS5tYWxkb25hZG8udHgxQGdtYWlsLmNvbSIsImlzcyI6IkNyb3BNZXRyaWNzIiwiYXVkIjoiYWxsIiwiZXhwIjoxNTU0NDk2NTUxLCJuYmYiOjE1NTQ0OTI2NTF9.1AK7meR5JJYLKmzn9o_YZSOSmWNUN4XX7nnGc9wBbzc"
        }, {
          "name" : "Host",
          "value" : "localhost:10520"
        }, {
          "name" : "Accept",
          "value" : "text/html, image/gif, image/jpeg, *; q=.2, */*; q=.2"
        }, {
          "name" : "Proxy-Connection",
          "value" : "keep-alive"
        }, {
          "name" : "Content-Length",
          "value" : "378"
        } ],
        "queryString" : [ ],
        "postData" : {
          "mimeType" : "application/json",
          "text" : "{\"field\":{\"farm_id\":3,\"name\":\"    \",\"boundary\":{\"boundaries\":[{\"boundary\":{\"coords\":[{\"x\":-101.49568751,\"y\":37.14976293},{\"x\":-101.50049403,\"y\":37.14647907},{\"x\":-101.50049403,\"y\":37.14264773},{\"x\":-101.49723246,\"y\":37.1411425},{\"x\":-101.49019435,\"y\":37.14223722},{\"x\":-101.48933604,\"y\":37.14620541},{\"x\":-101.49294093,\"y\":37.14866833},{\"x\":-101.49568751,\"y\":37.14976293}]}}]}}}",
          "comment" : ""
        },
        "headersSize" : 592,
        "bodySize" : 378,
        "comment" : ""
      },
      "response" : {
        "status" : 400,
        "statusText" : "Bad Request",
        "httpVersion" : "HTTP/1.1",
        "cookies" : [ {
          "name" : ".ASPROLES",
          "value" : "CXcivB5ihGS9X5lII4WkE-GIspTCiODtMW3YyIURk1AircH0yfV4RM6Rsb8j61Z91vKnOg-yUo9wjsK9e0Dvb0JHDWGAtGl63f0CIGW0Rk0aqaZNyDzKT0CkugDEwsI7XcJpMhWadmKKyyRCXdJqhTKAtzkwum-RNPFbNGsfv0pUrd9dZDJ50wouza8z-F0Dq0vTVZ4HTETwbBv2HMvkIqgBn1f6V1PAhqOKxOcW_c_-O4higSmw7whKI7YFsbOSkiT7PHasEjNtyR2OMxeXezSAGp1Me4ATDP5U_UwBGuIYiSKFALLzZZrlujDC5Fo54PBm49QR5shy6VFpoit8LLyhHK_Os2pi8g5UiU-NB-TzN6NvX4YbFl5LOaMY-8Ax2X-fWK226hgtFi4eMIN8H3RB2FxlkjCXndQ6cngMSTe-BvS02rKAKrn0JtmXqSk4JDtU_YsNiWIlQ6TuRnf3vebJxhag71l2IHqgtfN_ny7_acihcSIAli8vrb_D_2_L2IZXNCflz_sotrH832pz0CMOWNk1",
          "path" : "/",
          "httpOnly" : true,
          "secure" : false,
          "comment" : ""
        } ],
        "headers" : [ {
          "name" : "Cache-Control",
          "value" : "private"
        }, {
          "name" : "Content-Type",
          "value" : "application/json; charset=utf-8"
        }, {
          "name" : "Server",
          "value" : "Microsoft-IIS/10.0"
        }, {
          "name" : "Set-Cookie",
          "value" : ".ASPROLES=CXcivB5ihGS9X5lII4WkE-GIspTCiODtMW3YyIURk1AircH0yfV4RM6Rsb8j61Z91vKnOg-yUo9wjsK9e0Dvb0JHDWGAtGl63f0CIGW0Rk0aqaZNyDzKT0CkugDEwsI7XcJpMhWadmKKyyRCXdJqhTKAtzkwum-RNPFbNGsfv0pUrd9dZDJ50wouza8z-F0Dq0vTVZ4HTETwbBv2HMvkIqgBn1f6V1PAhqOKxOcW_c_-O4higSmw7whKI7YFsbOSkiT7PHasEjNtyR2OMxeXezSAGp1Me4ATDP5U_UwBGuIYiSKFALLzZZrlujDC5Fo54PBm49QR5shy6VFpoit8LLyhHK_Os2pi8g5UiU-NB-TzN6NvX4YbFl5LOaMY-8Ax2X-fWK226hgtFi4eMIN8H3RB2FxlkjCXndQ6cngMSTe-BvS02rKAKrn0JtmXqSk4JDtU_YsNiWIlQ6TuRnf3vebJxhag71l2IHqgtfN_ny7_acihcSIAli8vrb_D_2_L2IZXNCflz_sotrH832pz0CMOWNk1; path=/; HttpOnly"
        }, {
          "name" : "X-SourceFiles",
          "value" : "=?UTF-8?B?RDpcVmlydHVhbE9wdGltaXplci1SZWZhY3RvcmluZ1xDcm9wTWV0cmljcy5Wby5BcGlcQ3JvcE1ldHJpY3MuVm8uQXBpXGFwaVxtb2JpbGVcdjFcZmllbGRz?="
        }, {
          "name" : "X-Powered-By",
          "value" : "ASP.NET"
        }, {
          "name" : "Date",
          "value" : "Fri, 05 Apr 2019 19:30:56 GMT"
        }, {
          "name" : "Content-Length",
          "value" : "40"
        } ],
        "content" : {
          "size" : 40,
          "mimeType" : "application/json; charset=utf-8",
          "text" : "{\"message\":\"The Name must be provided.\"}",
          "comment" : ""
        },
        "redirectURL" : "",
        "headersSize" : 940,
        "bodySize" : 40,
        "comment" : ""
      },
      "cache" : { },
      "timings" : {
        "comment" : "",
        "ssl" : -1,
        "connect" : -1,
        "blocked" : -1,
        "send" : 0,
        "dns" : -1,
        "receive" : 0,
        "wait" : 4786
      },
      "serverIPAddress" : "127.0.0.1",
      "comment" : "",
      "_katalonRequestInformation" : {
        "name" : "43",
        "testObjectId" : "Object Repository/VoGrow/Field/FieldPost",
        "harId" : "b32828bd-7305-4c50-9f36-e9f8bafbc7c9"
      },
      "time" : 4787
    } ],
    "comment" : ""
  }
}