{
  "log" : {
    "version" : "1.2",
    "creator" : {
      "name" : "BrowserMob Proxy",
      "version" : "2.1.5",
      "comment" : ""
    },
    "pages" : [ {
      "id" : "Page 0",
      "startedDateTime" : "2019-03-29T21:04:13.359Z",
      "title" : "Page 0",
      "pageTimings" : {
        "onLoad" : 4382,
        "comment" : ""
      },
      "comment" : ""
    } ],
    "entries" : [ {
      "pageref" : "Page 0",
      "startedDateTime" : "2019-03-29T21:04:13.360Z",
      "request" : {
        "method" : "POST",
        "url" : "http://localhost:10520/WebAPI/api/admin/v1/users/?",
        "httpVersion" : "HTTP/1.1",
        "cookies" : [ ],
        "headers" : [ {
          "name" : "User-Agent",
          "value" : "Katalon Studio"
        }, {
          "name" : "Content-Type",
          "value" : "application/x-www-form-urlencoded"
        }, {
          "name" : "Authorization",
          "value" : "Bearer eyJ0eXAiOiJKV1QiLCJhbGciOiJIUzI1NiJ9.eyJ1bmlxdWVfbmFtZSI6ImFkbWluIiwicm9sZSI6InVzZXIiLCJzdWIiOiJhZG1pbiIsImlzcyI6IkNyb3BNZXRyaWNzIiwiYXVkIjoiYWxsIiwiZXhwIjoxNTUzODk3MzUzLCJuYmYiOjE1NTM4OTM0NTN9.QsyP_gFlozowQ59nJOMzTa6befNjIa37jzqPpRK7fPw"
        }, {
          "name" : "Host",
          "value" : "localhost:10520"
        }, {
          "name" : "Accept",
          "value" : "text/html, image/gif, image/jpeg, *; q=.2, */*; q=.2"
        }, {
          "name" : "Proxy-Connection",
          "value" : "keep-alive"
        }, {
          "name" : "Content-Length",
          "value" : "270"
        } ],
        "queryString" : [ ],
        "postData" : {
          "mimeType" : "application/x-www-form-urlencoded",
          "params" : [ {
            "name" : "password",
            "value" : "cropmetrics",
            "comment" : ""
          }, {
            "name" : "email",
            "value" : "cropmetricsvo.fieldcrew@gmail.com",
            "comment" : ""
          }, {
            "name" : "fullname",
            "value" : "test validation",
            "comment" : ""
          }, {
            "name" : "phone",
            "value" : "123",
            "comment" : ""
          }, {
            "name" : "dealer",
            "value" : "x",
            "comment" : ""
          }, {
            "name" : "addressLine1",
            "value" : "address line 1 test validation",
            "comment" : ""
          }, {
            "name" : "addressLine2",
            "value" : "address line 2 test validation",
            "comment" : ""
          }, {
            "name" : "town",
            "value" : "townValidation",
            "comment" : ""
          }, {
            "name" : "state",
            "value" : "stateValidation",
            "comment" : ""
          }, {
            "name" : "zip",
            "value" : "xx",
            "comment" : ""
          }, {
            "name" : "country",
            "value" : "xx",
            "comment" : ""
          }, {
            "name" : "roles",
            "value" : "FieldCrew",
            "comment" : ""
          } ],
          "comment" : ""
        },
        "headersSize" : 544,
        "bodySize" : 270,
        "comment" : ""
      },
      "response" : {
        "status" : 400,
        "statusText" : "Bad Request",
        "httpVersion" : "HTTP/1.1",
        "cookies" : [ {
          "name" : ".ASPROLES",
          "value" : "MzE1p1hfNo4mFN3v643-_xhSQZ88WeB33OdTw65uy8xQ3nTp-7OgHj0sPHlQdxvUqlginI7-rK3tGFsxfHS-xea9mgaXOZMonjIpcP0qc5_JHmXMiM-nvUy7TLO_S6zo-T5EKmAhAfBytezfwH1I393Wpym2USoJQyqNViDQDZpf-8iophPzJjyxWpoawM2qraDL60ZLlD8qnspo-_TX0uQJPTL8vD39lp3K6tXycFqOntup-QoZjxEsxJLg9hx7ETkQWxT4AdYff4-V8K0z7RVjp5-lRwJ-423lgiJmVe8kP_zx4ZrnZerqYKM3aFeC5CMvLMFXr8MLT5qtIJQwGNRT8Lvti1r3tWU1lj6OGqynAKuEHfGmQtylfd2-MufXixPacLE4TMxyJyNILKw_Dy70eK7dcXz_nJfaZ5Ll7HClvZx5dRW6gdTzKkEnqmrc2bGNsvn4Hbvqo9SxDZIg6MtRg-_8OdeswHBjcefCVp5JDkKy0",
          "path" : "/",
          "httpOnly" : true,
          "secure" : false,
          "comment" : ""
        } ],
        "headers" : [ {
          "name" : "Cache-Control",
          "value" : "private"
        }, {
          "name" : "Content-Type",
          "value" : "application/json; charset=utf-8"
        }, {
          "name" : "Server",
          "value" : "Microsoft-IIS/10.0"
        }, {
          "name" : "Set-Cookie",
          "value" : ".ASPROLES=MzE1p1hfNo4mFN3v643-_xhSQZ88WeB33OdTw65uy8xQ3nTp-7OgHj0sPHlQdxvUqlginI7-rK3tGFsxfHS-xea9mgaXOZMonjIpcP0qc5_JHmXMiM-nvUy7TLO_S6zo-T5EKmAhAfBytezfwH1I393Wpym2USoJQyqNViDQDZpf-8iophPzJjyxWpoawM2qraDL60ZLlD8qnspo-_TX0uQJPTL8vD39lp3K6tXycFqOntup-QoZjxEsxJLg9hx7ETkQWxT4AdYff4-V8K0z7RVjp5-lRwJ-423lgiJmVe8kP_zx4ZrnZerqYKM3aFeC5CMvLMFXr8MLT5qtIJQwGNRT8Lvti1r3tWU1lj6OGqynAKuEHfGmQtylfd2-MufXixPacLE4TMxyJyNILKw_Dy70eK7dcXz_nJfaZ5Ll7HClvZx5dRW6gdTzKkEnqmrc2bGNsvn4Hbvqo9SxDZIg6MtRg-_8OdeswHBjcefCVp5JDkKy0; path=/; HttpOnly"
        }, {
          "name" : "X-SourceFiles",
          "value" : "=?UTF-8?B?RDpcVmlydHVhbE9wdGltaXplci1SZWZhY3RvcmluZ1xDcm9wTWV0cmljcy5Wby5BcGlcQ3JvcE1ldHJpY3MuVm8uQXBpXGFwaVxhZG1pblx2MVx1c2Vyc1w=?="
        }, {
          "name" : "X-Powered-By",
          "value" : "ASP.NET"
        }, {
          "name" : "Date",
          "value" : "Fri, 29 Mar 2019 21:04:17 GMT"
        }, {
          "name" : "Content-Length",
          "value" : "70"
        } ],
        "content" : {
          "size" : 70,
          "mimeType" : "application/json; charset=utf-8",
          "text" : "{\"message\":\"Name cropmetricsvo.fieldcrew@gmail.com is already taken.\"}",
          "comment" : ""
        },
        "redirectURL" : "",
        "headersSize" : 897,
        "bodySize" : 70,
        "comment" : ""
      },
      "cache" : { },
      "timings" : {
        "comment" : "",
        "dns" : -1,
        "wait" : 4384,
        "send" : 0,
        "receive" : 0,
        "connect" : -1,
        "blocked" : -1,
        "ssl" : -1
      },
      "serverIPAddress" : "127.0.0.1",
      "comment" : "",
      "_katalonRequestInformation" : {
        "name" : "95",
        "testObjectId" : "Object Repository/VoPro/Account/api_admin_v1_users",
        "harId" : "242c31ae-dd78-4b74-b945-e04dee517c4e"
      },
      "time" : 4385
    } ],
    "comment" : ""
  }
}