{
  "log" : {
    "version" : "1.2",
    "creator" : {
      "name" : "BrowserMob Proxy",
      "version" : "2.1.5",
      "comment" : ""
    },
    "pages" : [ {
      "id" : "Page 0",
      "startedDateTime" : "2019-03-29T21:49:01.674Z",
      "title" : "Page 0",
      "pageTimings" : {
        "onLoad" : 1978,
        "comment" : ""
      },
      "comment" : ""
    } ],
    "entries" : [ {
      "pageref" : "Page 0",
      "startedDateTime" : "2019-03-29T21:49:01.675Z",
      "request" : {
        "method" : "PUT",
        "url" : "http://localhost:10520/WebAPI/api/admin/v1/users/21?",
        "httpVersion" : "HTTP/1.1",
        "cookies" : [ ],
        "headers" : [ {
          "name" : "User-Agent",
          "value" : "Katalon Studio"
        }, {
          "name" : "Content-Type",
          "value" : "application/x-www-form-urlencoded"
        }, {
          "name" : "Authorization",
          "value" : "Bearer eyJ0eXAiOiJKV1QiLCJhbGciOiJIUzI1NiJ9.eyJ1bmlxdWVfbmFtZSI6ImFkbWluIiwicm9sZSI6InVzZXIiLCJzdWIiOiJhZG1pbiIsImlzcyI6IkNyb3BNZXRyaWNzIiwiYXVkIjoiYWxsIiwiZXhwIjoxNTUzOTAwMDQxLCJuYmYiOjE1NTM4OTYxNDF9.688n25Ob4FEyBB2oK7vBJ3nx-_-tas5AdGupovPJpM0"
        }, {
          "name" : "Host",
          "value" : "localhost:10520"
        }, {
          "name" : "Accept",
          "value" : "text/html, image/gif, image/jpeg, *; q=.2, */*; q=.2"
        }, {
          "name" : "Proxy-Connection",
          "value" : "keep-alive"
        }, {
          "name" : "Content-Length",
          "value" : "816"
        } ],
        "queryString" : [ ],
        "postData" : {
          "mimeType" : "application/x-www-form-urlencoded",
          "params" : [ {
            "name" : "password",
            "value" : "cropmetrics",
            "comment" : ""
          }, {
            "name" : "email",
            "value" : "cropmetricsvo.addressline1long@gmail.com",
            "comment" : ""
          }, {
            "name" : "fullname",
            "value" : "x",
            "comment" : ""
          }, {
            "name" : "phone",
            "value" : "1",
            "comment" : ""
          }, {
            "name" : "dealer",
            "value" : "xx",
            "comment" : ""
          }, {
            "name" : "addressLine1",
            "value" : "14 API_ACNT_When_account_updated_have_long_addressline1_attribute_Expected_status_code_20014 API_ACNT_When_account_updated_have_long_addressline1_attribute_Expected_status_code_200 14 API_ACNT_When_account_updated_have_long_addressline1_attribute_Expected_status_code_200 14 API_ACNT_When_account_updated_have_long_addressline1_attribute_Expected_status_code_200 14 API_ACNT_When_account_updated_have_long_addressline1_attribute_Expected_status_code_200 14 API_ACNT_When_account_updated_have_long_addressline1_attribute_Expected_status_code_200",
            "comment" : ""
          }, {
            "name" : "addressLine2",
            "value" : "address line 2 test validation",
            "comment" : ""
          }, {
            "name" : "town",
            "value" : "townValidation",
            "comment" : ""
          }, {
            "name" : "state",
            "value" : "stateValidation",
            "comment" : ""
          }, {
            "name" : "zip",
            "value" : "zipValidation",
            "comment" : ""
          }, {
            "name" : "country",
            "value" : "countryValidation",
            "comment" : ""
          }, {
            "name" : "roles",
            "value" : "Client",
            "comment" : ""
          }, {
            "name" : "userProfileId",
            "value" : "21",
            "comment" : ""
          } ],
          "comment" : ""
        },
        "headersSize" : 545,
        "bodySize" : 816,
        "comment" : ""
      },
      "response" : {
        "status" : 200,
        "statusText" : "OK",
        "httpVersion" : "HTTP/1.1",
        "cookies" : [ {
          "name" : ".ASPROLES",
          "value" : "PhQrzzxY_03AvwI3oiPsgAjn6GoM1uzsDv1prKZQ29nHuEMa2zzUETxfVXKqoGFllstRWWSG5Rx-DyOYBLEEaTEXNfJ1Ky4LkcZI0nHCheYFSm2zR3zhBiwriF3_Wtxub-vTnthEGyVQ22T7_yw-27ti-4hHPWO3gotvSIHgjcRTUWL20TEXTk7HST9TChOnLZsnuLC13hw3JNiFdy3Lb6tO0dKiE5qJ7SsK237Q_6xqdFxdWNeh4Kg07MbaVu6nTWfemwcdsmynVA1B1L2N--u9v_zie4zkZX2icIVUg1AbPl5zIwoP_vdW2RtFXJlZKdDheykbv7DzMDje62sEvro9H574eY4WPm4negWWRCAtnxy-E2KjFY7F8f_FIakwqIg6_0zdVS5BjvhaDJMj6P2eWbs5J7TXS5vM4JSHLH4vBqhRgYEuSS0_-cstp1KZzPeq6sdjKWVCdXgC53nJ2SVwP6oTIBm1hZtYoxqS2ojPSYij0",
          "path" : "/",
          "httpOnly" : true,
          "secure" : false,
          "comment" : ""
        } ],
        "headers" : [ {
          "name" : "Cache-Control",
          "value" : "private"
        }, {
          "name" : "Server",
          "value" : "Microsoft-IIS/10.0"
        }, {
          "name" : "Set-Cookie",
          "value" : ".ASPROLES=PhQrzzxY_03AvwI3oiPsgAjn6GoM1uzsDv1prKZQ29nHuEMa2zzUETxfVXKqoGFllstRWWSG5Rx-DyOYBLEEaTEXNfJ1Ky4LkcZI0nHCheYFSm2zR3zhBiwriF3_Wtxub-vTnthEGyVQ22T7_yw-27ti-4hHPWO3gotvSIHgjcRTUWL20TEXTk7HST9TChOnLZsnuLC13hw3JNiFdy3Lb6tO0dKiE5qJ7SsK237Q_6xqdFxdWNeh4Kg07MbaVu6nTWfemwcdsmynVA1B1L2N--u9v_zie4zkZX2icIVUg1AbPl5zIwoP_vdW2RtFXJlZKdDheykbv7DzMDje62sEvro9H574eY4WPm4negWWRCAtnxy-E2KjFY7F8f_FIakwqIg6_0zdVS5BjvhaDJMj6P2eWbs5J7TXS5vM4JSHLH4vBqhRgYEuSS0_-cstp1KZzPeq6sdjKWVCdXgC53nJ2SVwP6oTIBm1hZtYoxqS2ojPSYij0; path=/; HttpOnly"
        }, {
          "name" : "X-SourceFiles",
          "value" : "=?UTF-8?B?RDpcVmlydHVhbE9wdGltaXplci1SZWZhY3RvcmluZ1xDcm9wTWV0cmljcy5Wby5BcGlcQ3JvcE1ldHJpY3MuVm8uQXBpXGFwaVxhZG1pblx2MVx1c2Vyc1wyMQ==?="
        }, {
          "name" : "X-Powered-By",
          "value" : "ASP.NET"
        }, {
          "name" : "Date",
          "value" : "Fri, 29 Mar 2019 21:49:03 GMT"
        }, {
          "name" : "Content-Length",
          "value" : "0"
        } ],
        "content" : {
          "size" : 0,
          "mimeType" : "",
          "text" : "",
          "encoding" : "base64",
          "comment" : ""
        },
        "redirectURL" : "",
        "headersSize" : 844,
        "bodySize" : 0,
        "comment" : ""
      },
      "cache" : { },
      "timings" : {
        "comment" : "",
        "ssl" : -1,
        "receive" : 0,
        "send" : 0,
        "wait" : 1973,
        "dns" : -1,
        "connect" : -1,
        "blocked" : -1
      },
      "serverIPAddress" : "127.0.0.1",
      "comment" : "",
      "_katalonRequestInformation" : {
        "name" : "33",
        "testObjectId" : "Object Repository/VoPro/Account/api_admin_v1_users_userprofileid",
        "harId" : "81a6fb62-1543-4b54-a06c-7051237bfdf8"
      },
      "time" : 1974
    } ],
    "comment" : ""
  }
}