{
  "log" : {
    "version" : "1.2",
    "creator" : {
      "name" : "BrowserMob Proxy",
      "version" : "2.1.5",
      "comment" : ""
    },
    "pages" : [ {
      "id" : "Page 0",
      "startedDateTime" : "2019-04-24T20:24:33.081Z",
      "title" : "Page 0",
      "pageTimings" : {
        "onLoad" : 43,
        "comment" : ""
      },
      "comment" : ""
    } ],
    "entries" : [ {
      "pageref" : "Page 0",
      "startedDateTime" : "2019-04-24T20:24:33.082Z",
      "request" : {
        "method" : "POST",
        "url" : "http://localhost:10520/WebAPI/api/mobile/v1/farms/?",
        "httpVersion" : "HTTP/1.1",
        "cookies" : [ ],
        "headers" : [ {
          "name" : "User-Agent",
          "value" : "Katalon Studio"
        }, {
          "name" : "Content-Type",
          "value" : "application/json"
        }, {
          "name" : "Authorization",
          "value" : "Bearer eyJ0eXAiOiJKV1QiLCJhbGciOiJIUzI1NiJ9.eyJ1bmlxdWVfbmFtZSI6Implbm55Lm1hbGRvbmFkby50eDFAZ21haWwuY29tIiwicm9sZSI6InVzZXIiLCJzdWIiOiJqZW5ueS5tYWxkb25hZG8udHgxQGdtYWlsLmNvbSIsImlzcyI6IkNyb3BNZXRyaWNzIiwiYXVkIjoiYWxsIiwiZXhwIjoxNTU2MTQxMzcyLCJuYmYiOjE1NTYxMzc0NzJ9.M53n1YOYWL7Q7dvgPdwXyLH31JYJBvlTJ8Vo0Nkzi2w"
        }, {
          "name" : "Host",
          "value" : "localhost:10520"
        }, {
          "name" : "Accept",
          "value" : "text/html, image/gif, image/jpeg, *; q=.2, */*; q=.2"
        }, {
          "name" : "Proxy-Connection",
          "value" : "keep-alive"
        }, {
          "name" : "Content-Length",
          "value" : "47"
        } ],
        "queryString" : [ ],
        "postData" : {
          "mimeType" : "application/json",
          "text" : "{\"name\": \"FarmNameWithOnlychars\", \"user_id\": 2}",
          "comment" : ""
        },
        "headersSize" : 591,
        "bodySize" : 47,
        "comment" : ""
      },
      "response" : {
        "status" : 201,
        "statusText" : "Created",
        "httpVersion" : "HTTP/1.1",
        "cookies" : [ {
          "name" : ".ASPROLES",
          "value" : "lmFIa8SfmHYwjQi-uN5i8fgL8QxMRaL2rQlBUAhEm_9T3oeHQIZTdPF8OgTig8mfno7c0KcH-35c-Oaqo96L_chS6TYXsUQO1drgKb2u20azsfeFUO6v_8hyzZOvDiLiRIQXKRSSc0MAFDn17vTH0680ey3pIC5q0fhszFeqwna7ycgqEMd6c-BHGbWGD3jEaTH6pPlGXlH53JuZzHLNY3gpxq5wIPQwPhVIMQ_F3YeMb6MmbPhk7J_LrpaPuO5meuUX3915BB6vE7jbe43vQMYXuhNpWDFd7SAi7YOyxLQH7Zh7TNf2rwKLuh10lcFzEt2S5A9cfRlLVlafIoixF3BzzV2_5oI24CEFmm5iTz3v4FXx1KAOWlIrnPCR_71A1oEo9VtiRbqctuHMa0eeg7GQ9MndCwvcJh8kn3Q_sMvawHlzVY0Io3jr-xnlOirWkOPPw9bjbijl3D2J8IBy3U81Us4V5kmkq6Ky2-uEAYloLP9ENlNK3-LEqt2E3j_glb0gxup_N9EFKpNswJ7APu2K9Dw1",
          "path" : "/",
          "httpOnly" : true,
          "secure" : false,
          "comment" : ""
        } ],
        "headers" : [ {
          "name" : "Cache-Control",
          "value" : "private"
        }, {
          "name" : "Content-Type",
          "value" : "application/json; charset=utf-8"
        }, {
          "name" : "Location",
          "value" : "api/mobile/v1/farms/6"
        }, {
          "name" : "Server",
          "value" : "Microsoft-IIS/10.0"
        }, {
          "name" : "Set-Cookie",
          "value" : ".ASPROLES=lmFIa8SfmHYwjQi-uN5i8fgL8QxMRaL2rQlBUAhEm_9T3oeHQIZTdPF8OgTig8mfno7c0KcH-35c-Oaqo96L_chS6TYXsUQO1drgKb2u20azsfeFUO6v_8hyzZOvDiLiRIQXKRSSc0MAFDn17vTH0680ey3pIC5q0fhszFeqwna7ycgqEMd6c-BHGbWGD3jEaTH6pPlGXlH53JuZzHLNY3gpxq5wIPQwPhVIMQ_F3YeMb6MmbPhk7J_LrpaPuO5meuUX3915BB6vE7jbe43vQMYXuhNpWDFd7SAi7YOyxLQH7Zh7TNf2rwKLuh10lcFzEt2S5A9cfRlLVlafIoixF3BzzV2_5oI24CEFmm5iTz3v4FXx1KAOWlIrnPCR_71A1oEo9VtiRbqctuHMa0eeg7GQ9MndCwvcJh8kn3Q_sMvawHlzVY0Io3jr-xnlOirWkOPPw9bjbijl3D2J8IBy3U81Us4V5kmkq6Ky2-uEAYloLP9ENlNK3-LEqt2E3j_glb0gxup_N9EFKpNswJ7APu2K9Dw1; path=/; HttpOnly"
        }, {
          "name" : "X-SourceFiles",
          "value" : "=?UTF-8?B?RDpcVmlydHVhbE9wdGltaXplci1SZWZhY3RvcmluZ1xDcm9wTWV0cmljcy5Wby5BcGlcQ3JvcE1ldHJpY3MuVm8uQXBpXGFwaVxtb2JpbGVcdjFcZmFybXNc?="
        }, {
          "name" : "X-Powered-By",
          "value" : "ASP.NET"
        }, {
          "name" : "Date",
          "value" : "Wed, 24 Apr 2019 20:24:33 GMT"
        }, {
          "name" : "Content-Length",
          "value" : "51"
        } ],
        "content" : {
          "size" : 51,
          "mimeType" : "application/json; charset=utf-8",
          "text" : "{\"id\":6,\"name\":\"FarmNameWithOnlychars\",\"user_id\":2}",
          "comment" : ""
        },
        "redirectURL" : "",
        "headersSize" : 969,
        "bodySize" : 51,
        "comment" : ""
      },
      "cache" : { },
      "timings" : {
        "comment" : "",
        "ssl" : -1,
        "blocked" : -1,
        "connect" : -1,
        "receive" : 0,
        "dns" : -1,
        "send" : 0,
        "wait" : 39
      },
      "serverIPAddress" : "127.0.0.1",
      "comment" : "",
      "_katalonRequestInformation" : {
        "name" : "29",
        "testObjectId" : "Object Repository/VoGrow/Farm/FarmPost",
        "harId" : "bba8d3a6-7f3a-47e6-8ca7-b03f66510955"
      },
      "time" : 40
    } ],
    "comment" : ""
  }
}