Suite/Test/Step Name,Browser,Description,Tag,Start time,End time,Duration,Status
DElete_all_databases of the Environment,,,,2019-08-02 15:05:09,2019-08-02 15:05:59,50.728s,PASSED
,,,,,,,
Test Cases/Databases/DeleteDatabases/Functional/DB_Delete_iterisrawdata_database,,,,2019-08-02 15:05:09,2019-08-02 15:05:16,6.682s,PASSED
server = server,,,,2019-08-02 15:05:10,2019-08-02 15:05:10,0.648s,PASSED
port = port,,,,2019-08-02 15:05:10,2019-08-02 15:05:10,0.002s,PASSED
user = userDb,,,,2019-08-02 15:05:10,2019-08-02 15:05:10,0.001s,PASSED
password = passwordDb,,,,2019-08-02 15:05:10,2019-08-02 15:05:10,0.004s,PASSED
pathPostgreSQL = pathPostgreSQLBin,,,,2019-08-02 15:05:10,2019-08-02 15:05:10,0.000s,PASSED
"database = ""iterisRawData""",,,,2019-08-02 15:05:10,2019-08-02 15:05:10,0.000s,PASSED
"command = String.format(""cd ""%s"" && dropdb -h %s -p %d -U %s  %s"", pathPostgreSQL, server, port, user, database)",,,,2019-08-02 15:05:10,2019-08-02 15:05:10,0.000s,PASSED
"commandLine.cmd.cmdLine(command, password)",,,,2019-08-02 15:05:10,2019-08-02 15:05:16,5.336s,PASSED
"println(""The iterisRawData database was deleted..."")",,,,2019-08-02 15:05:16,2019-08-02 15:05:16,0.008s,PASSED
,,,,,,,
Test Cases/Databases/DeleteDatabases/Functional/DB_Delete_virtualoptimizer_database,,,,2019-08-02 15:05:16,2019-08-02 15:05:21,5.355s,PASSED
server = server,,,,2019-08-02 15:05:16,2019-08-02 15:05:16,0.000s,PASSED
port = port,,,,2019-08-02 15:05:16,2019-08-02 15:05:16,0.000s,PASSED
user = userDb,,,,2019-08-02 15:05:16,2019-08-02 15:05:16,0.000s,PASSED
password = passwordDb,,,,2019-08-02 15:05:16,2019-08-02 15:05:16,0.015s,PASSED
pathPostgreSQL = pathPostgreSQLBin,,,,2019-08-02 15:05:16,2019-08-02 15:05:16,0.000s,PASSED
"database = ""virtualoptimizer""",,,,2019-08-02 15:05:16,2019-08-02 15:05:16,0.000s,PASSED
"command = String.format(""cd ""%s"" && dropdb -h %s -p %d -U %s  %s"", pathPostgreSQL, server, port, user, database)",,,,2019-08-02 15:05:16,2019-08-02 15:05:16,0.000s,PASSED
"commandLine.cmd.cmdLine(command, password)",,,,2019-08-02 15:05:16,2019-08-02 15:05:21,5.012s,PASSED
"println(""The virtualoptimizer database was deleted..."")",,,,2019-08-02 15:05:21,2019-08-02 15:05:21,0.002s,PASSED
,,,,,,,
Test Cases/Databases/DeleteDatabases/Functional/DB_Delete_vo_probereadings_database,,,,2019-08-02 15:05:21,2019-08-02 15:05:26,5.401s,PASSED
server = server,,,,2019-08-02 15:05:21,2019-08-02 15:05:21,0.000s,PASSED
port = port,,,,2019-08-02 15:05:21,2019-08-02 15:05:21,0.000s,PASSED
user = userDb,,,,2019-08-02 15:05:21,2019-08-02 15:05:21,0.000s,PASSED
password = passwordDb,,,,2019-08-02 15:05:21,2019-08-02 15:05:21,0.008s,PASSED
pathPostgreSQL = pathPostgreSQLBin,,,,2019-08-02 15:05:21,2019-08-02 15:05:21,0.000s,PASSED
"database = ""vo_probeReadings""",,,,2019-08-02 15:05:21,2019-08-02 15:05:21,0.000s,PASSED
"command = String.format(""cd ""%s"" && dropdb -h %s -p %d -U %s  %s"", pathPostgreSQL, server, port, user, database)",,,,2019-08-02 15:05:21,2019-08-02 15:05:21,0.002s,PASSED
"commandLine.cmd.cmdLine(command, password)",,,,2019-08-02 15:05:21,2019-08-02 15:05:26,5.028s,PASSED
"println(""The vo_probeReadings database was deleted..."")",,,,2019-08-02 15:05:26,2019-08-02 15:05:26,0.001s,PASSED
,,,,,,,
Test Cases/Databases/DeleteDatabases/Functional/DB_Delete_vo_summarizeddata_database,,,,2019-08-02 15:05:26,2019-08-02 15:05:32,5.359s,PASSED
server = server,,,,2019-08-02 15:05:27,2019-08-02 15:05:27,0.002s,PASSED
port = port,,,,2019-08-02 15:05:27,2019-08-02 15:05:27,0.001s,PASSED
user = userDb,,,,2019-08-02 15:05:27,2019-08-02 15:05:27,0.001s,PASSED
password = passwordDb,,,,2019-08-02 15:05:27,2019-08-02 15:05:27,0.001s,PASSED
pathPostgreSQL = pathPostgreSQLBin,,,,2019-08-02 15:05:27,2019-08-02 15:05:27,0.001s,PASSED
"database = ""vo_summarizedData""",,,,2019-08-02 15:05:27,2019-08-02 15:05:27,0.001s,PASSED
"command = String.format(""cd ""%s"" && dropdb -h %s -p %d -U %s  %s"", pathPostgreSQL, server, port, user, database)",,,,2019-08-02 15:05:27,2019-08-02 15:05:27,0.001s,PASSED
"commandLine.cmd.cmdLine(command, password)",,,,2019-08-02 15:05:27,2019-08-02 15:05:32,5.033s,PASSED
"println(""The vo_summarizedData database was deleted..."")",,,,2019-08-02 15:05:32,2019-08-02 15:05:32,0.000s,PASSED
,,,,,,,
Test Cases/Databases/DeleteDatabases/ProbeReadings/DB_Delete_vo_agsenseproberawreadings_database,,,,2019-08-02 15:05:32,2019-08-02 15:05:37,5.287s,PASSED
server = server,,,,2019-08-02 15:05:32,2019-08-02 15:05:32,0.000s,PASSED
port = port,,,,2019-08-02 15:05:32,2019-08-02 15:05:32,0.000s,PASSED
user = userDb,,,,2019-08-02 15:05:32,2019-08-02 15:05:32,0.000s,PASSED
password = passwordDb,,,,2019-08-02 15:05:32,2019-08-02 15:05:32,0.000s,PASSED
pathPostgreSQL = pathPostgreSQLBin,,,,2019-08-02 15:05:32,2019-08-02 15:05:32,0.000s,PASSED
"database = ""vo_agSenseProbeRawReadings""",,,,2019-08-02 15:05:32,2019-08-02 15:05:32,0.003s,PASSED
"command = String.format(""cd ""%s"" && dropdb -h %s -p %d -U %s  %s"", pathPostgreSQL, server, port, user, database)",,,,2019-08-02 15:05:32,2019-08-02 15:05:32,0.001s,PASSED
"commandLine.cmd.cmdLine(command, password)",,,,2019-08-02 15:05:32,2019-08-02 15:05:37,5.013s,PASSED
"println(""The vo_agSenseProbeRawReadings database was deleted..."")",,,,2019-08-02 15:05:37,2019-08-02 15:05:37,0.000s,PASSED
,,,,,,,
Test Cases/Databases/DeleteDatabases/ProbeReadings/DB_Delete_vo_agsenseprobereadings_database,,,,2019-08-02 15:05:37,2019-08-02 15:05:42,5.333s,PASSED
server = server,,,,2019-08-02 15:05:37,2019-08-02 15:05:37,0.000s,PASSED
port = port,,,,2019-08-02 15:05:37,2019-08-02 15:05:37,0.000s,PASSED
user = userDb,,,,2019-08-02 15:05:37,2019-08-02 15:05:37,0.000s,PASSED
password = passwordDb,,,,2019-08-02 15:05:37,2019-08-02 15:05:37,0.000s,PASSED
pathPostgreSQL = pathPostgreSQLBin,,,,2019-08-02 15:05:37,2019-08-02 15:05:37,0.000s,PASSED
"database = ""vo_agSenseProbeReadings""",,,,2019-08-02 15:05:37,2019-08-02 15:05:37,0.000s,PASSED
"command = String.format(""cd ""%s"" && dropdb -h %s -p %d -U %s  %s"", pathPostgreSQL, server, port, user, database)",,,,2019-08-02 15:05:37,2019-08-02 15:05:37,0.015s,PASSED
"commandLine.cmd.cmdLine(command, password)",,,,2019-08-02 15:05:37,2019-08-02 15:05:42,5.017s,PASSED
"println(""The vo_agSenseProbeReadings database was deleted..."")",,,,2019-08-02 15:05:42,2019-08-02 15:05:42,0.001s,PASSED
,,,,,,,
Test Cases/Databases/DeleteDatabases/ProbeReadings/DB_Delete_vo_loraproberawreadings_database,,,,2019-08-02 15:05:42,2019-08-02 15:05:48,5.421s,PASSED
server = server,,,,2019-08-02 15:05:43,2019-08-02 15:05:43,0.001s,PASSED
port = port,,,,2019-08-02 15:05:43,2019-08-02 15:05:43,0.001s,PASSED
user = userDb,,,,2019-08-02 15:05:43,2019-08-02 15:05:43,0.003s,PASSED
password = passwordDb,,,,2019-08-02 15:05:43,2019-08-02 15:05:43,0.002s,PASSED
pathPostgreSQL = pathPostgreSQLBin,,,,2019-08-02 15:05:43,2019-08-02 15:05:43,0.001s,PASSED
"database = ""vo_loraProbeRawReadings""",,,,2019-08-02 15:05:43,2019-08-02 15:05:43,0.000s,PASSED
"command = String.format(""cd ""%s"" && dropdb -h %s -p %d -U %s  %s"", pathPostgreSQL, server, port, user, database)",,,,2019-08-02 15:05:43,2019-08-02 15:05:43,0.001s,PASSED
"commandLine.cmd.cmdLine(command, password)",,,,2019-08-02 15:05:43,2019-08-02 15:05:48,5.018s,PASSED
"println(""The vo_loraProbeRawReadings database was deleted..."")",,,,2019-08-02 15:05:48,2019-08-02 15:05:48,0.001s,PASSED
,,,,,,,
Test Cases/Databases/DeleteDatabases/ProbeReadings/DB_Delete_vo_sentekproberawreadings_database,,,,2019-08-02 15:05:48,2019-08-02 15:05:53,5.335s,PASSED
server = server,,,,2019-08-02 15:05:48,2019-08-02 15:05:48,0.000s,PASSED
port = port,,,,2019-08-02 15:05:48,2019-08-02 15:05:48,0.000s,PASSED
user = userDb,,,,2019-08-02 15:05:48,2019-08-02 15:05:48,0.000s,PASSED
password = passwordDb,,,,2019-08-02 15:05:48,2019-08-02 15:05:48,0.005s,PASSED
pathPostgreSQL = pathPostgreSQLBin,,,,2019-08-02 15:05:48,2019-08-02 15:05:48,0.000s,PASSED
"database = ""vo_sentekProbeRawReadings""",,,,2019-08-02 15:05:48,2019-08-02 15:05:48,0.000s,PASSED
"command = String.format(""cd ""%s"" && dropdb -h %s -p %d -U %s  %s"", pathPostgreSQL, server, port, user, database)",,,,2019-08-02 15:05:48,2019-08-02 15:05:48,0.000s,PASSED
"commandLine.cmd.cmdLine(command, password)",,,,2019-08-02 15:05:48,2019-08-02 15:05:53,5.023s,PASSED
"println(""The vo_sentekProbeRawReadings database was deleted..."")",,,,2019-08-02 15:05:53,2019-08-02 15:05:53,0.006s,PASSED
,,,,,,,
Test Cases/Databases/DeleteDatabases/ProbeReadings/DB_Delete_vo_sentekprobereadings_database,,,,2019-08-02 15:05:53,2019-08-02 15:05:59,5.965s,PASSED
server = server,,,,2019-08-02 15:05:54,2019-08-02 15:05:54,0.007s,PASSED
port = port,,,,2019-08-02 15:05:54,2019-08-02 15:05:54,0.000s,PASSED
user = userDb,,,,2019-08-02 15:05:54,2019-08-02 15:05:54,0.006s,PASSED
password = passwordDb,,,,2019-08-02 15:05:54,2019-08-02 15:05:54,0.004s,PASSED
pathPostgreSQL = pathPostgreSQLBin,,,,2019-08-02 15:05:54,2019-08-02 15:05:54,0.015s,PASSED
"database = ""vo_sentekProbeReadings""",,,,2019-08-02 15:05:54,2019-08-02 15:05:54,0.000s,PASSED
"command = String.format(""cd ""%s"" && dropdb -h %s -p %d -U %s  %s"", pathPostgreSQL, server, port, user, database)",,,,2019-08-02 15:05:54,2019-08-02 15:05:54,0.002s,PASSED
"commandLine.cmd.cmdLine(command, password)",,,,2019-08-02 15:05:54,2019-08-02 15:05:59,5.048s,PASSED
"println(""The vo_sentekProbeReadings database was deleted..."")",,,,2019-08-02 15:05:59,2019-08-02 15:05:59,0.001s,PASSED
