{
  "log" : {
    "version" : "1.2",
    "creator" : {
      "name" : "BrowserMob Proxy",
      "version" : "2.1.5",
      "comment" : ""
    },
    "pages" : [ {
      "id" : "Page 0",
      "startedDateTime" : "2019-04-24T20:24:38.361Z",
      "title" : "Page 0",
      "pageTimings" : {
        "onLoad" : 3251,
        "comment" : ""
      },
      "comment" : ""
    } ],
    "entries" : [ {
      "pageref" : "Page 0",
      "startedDateTime" : "2019-04-24T20:24:38.362Z",
      "request" : {
        "method" : "POST",
        "url" : "http://localhost:10520/WebAPI/api/mobile/v1/farms/?",
        "httpVersion" : "HTTP/1.1",
        "cookies" : [ ],
        "headers" : [ {
          "name" : "User-Agent",
          "value" : "Katalon Studio"
        }, {
          "name" : "Content-Type",
          "value" : "application/json"
        }, {
          "name" : "Authorization",
          "value" : "Bearer eyJ0eXAiOiJKV1QiLCJhbGciOiJIUzI1NiJ9.eyJ1bmlxdWVfbmFtZSI6Implbm55Lm1hbGRvbmFkby50eDFAZ21haWwuY29tIiwicm9sZSI6InVzZXIiLCJzdWIiOiJqZW5ueS5tYWxkb25hZG8udHgxQGdtYWlsLmNvbSIsImlzcyI6IkNyb3BNZXRyaWNzIiwiYXVkIjoiYWxsIiwiZXhwIjoxNTU2MTQxMzc4LCJuYmYiOjE1NTYxMzc0Nzh9.asHJLHIJFCjPcCxhldKX-SN4_JYH6QDpeOfXRabx7rg"
        }, {
          "name" : "Host",
          "value" : "localhost:10520"
        }, {
          "name" : "Accept",
          "value" : "text/html, image/gif, image/jpeg, *; q=.2, */*; q=.2"
        }, {
          "name" : "Proxy-Connection",
          "value" : "keep-alive"
        }, {
          "name" : "Content-Length",
          "value" : "47"
        } ],
        "queryString" : [ ],
        "postData" : {
          "mimeType" : "application/json",
          "text" : "{\"name\": \"FarmNameWithOnlychars\", \"user_id\": 2}",
          "comment" : ""
        },
        "headersSize" : 591,
        "bodySize" : 47,
        "comment" : ""
      },
      "response" : {
        "status" : 400,
        "statusText" : "Bad Request",
        "httpVersion" : "HTTP/1.1",
        "cookies" : [ {
          "name" : ".ASPROLES",
          "value" : "OaPB1xthzao1tHJRpLEn3Vcj4sJUw23IiJIFZxp9YpCpy1mCadEYbxZz0RcV30K96iHrfkyCzbP-6VL4acSCcEJrHBYIIIi6bZSYLjLSt_qVmk9eA_HIrbkwz9j-AoxNxtbjH7zqZkX_I5FTSEFpE1ONczNuCanJo1pjEMeB1HlmmbNQbUuyE0YXP7oaou7XjhWxdVCZv_d7l3bI3X38VQcMkypRWMQotRlDR8A5x5stquA7E6SGVZk3eVHnd2aggzzgMSXWgNlaDv7G3L-46W1CarHfpo1S1raIz7fhE4Vikx-0MSk9WeNv6Zmiq7M43IVlMYFInsu5EnQEcHi5fLrgCwMz1GzImnxbFxUAnRP5hoRaTXlfyinE3wqbePVaGyNpu8AFYkK7mbtqlJNGjPZ2GmWAJnCiunGPIxyqKassTpkCloBY-_1bfebExc4y7uAk-dnLKscolezJRqrYdVX71HZiONt_viFNTPMtAYbmr5a-r8B2-HlRu8VJlzdTZQ0kV7TrHlAEHSOyS7276skquNY1",
          "path" : "/",
          "httpOnly" : true,
          "secure" : false,
          "comment" : ""
        } ],
        "headers" : [ {
          "name" : "Cache-Control",
          "value" : "private"
        }, {
          "name" : "Content-Type",
          "value" : "application/json; charset=utf-8"
        }, {
          "name" : "Server",
          "value" : "Microsoft-IIS/10.0"
        }, {
          "name" : "Set-Cookie",
          "value" : ".ASPROLES=OaPB1xthzao1tHJRpLEn3Vcj4sJUw23IiJIFZxp9YpCpy1mCadEYbxZz0RcV30K96iHrfkyCzbP-6VL4acSCcEJrHBYIIIi6bZSYLjLSt_qVmk9eA_HIrbkwz9j-AoxNxtbjH7zqZkX_I5FTSEFpE1ONczNuCanJo1pjEMeB1HlmmbNQbUuyE0YXP7oaou7XjhWxdVCZv_d7l3bI3X38VQcMkypRWMQotRlDR8A5x5stquA7E6SGVZk3eVHnd2aggzzgMSXWgNlaDv7G3L-46W1CarHfpo1S1raIz7fhE4Vikx-0MSk9WeNv6Zmiq7M43IVlMYFInsu5EnQEcHi5fLrgCwMz1GzImnxbFxUAnRP5hoRaTXlfyinE3wqbePVaGyNpu8AFYkK7mbtqlJNGjPZ2GmWAJnCiunGPIxyqKassTpkCloBY-_1bfebExc4y7uAk-dnLKscolezJRqrYdVX71HZiONt_viFNTPMtAYbmr5a-r8B2-HlRu8VJlzdTZQ0kV7TrHlAEHSOyS7276skquNY1; path=/; HttpOnly"
        }, {
          "name" : "X-SourceFiles",
          "value" : "=?UTF-8?B?RDpcVmlydHVhbE9wdGltaXplci1SZWZhY3RvcmluZ1xDcm9wTWV0cmljcy5Wby5BcGlcQ3JvcE1ldHJpY3MuVm8uQXBpXGFwaVxtb2JpbGVcdjFcZmFybXNc?="
        }, {
          "name" : "X-Powered-By",
          "value" : "ASP.NET"
        }, {
          "name" : "Date",
          "value" : "Wed, 24 Apr 2019 20:24:41 GMT"
        }, {
          "name" : "Content-Length",
          "value" : "43"
        } ],
        "content" : {
          "size" : 43,
          "mimeType" : "application/json; charset=utf-8",
          "text" : "{\"message\":\"The farm name already exists.\"}",
          "comment" : ""
        },
        "redirectURL" : "",
        "headersSize" : 940,
        "bodySize" : 43,
        "comment" : ""
      },
      "cache" : { },
      "timings" : {
        "comment" : "",
        "ssl" : -1,
        "blocked" : -1,
        "connect" : -1,
        "receive" : 0,
        "dns" : -1,
        "send" : 0,
        "wait" : 3247
      },
      "serverIPAddress" : "127.0.0.1",
      "comment" : "",
      "_katalonRequestInformation" : {
        "name" : "33",
        "testObjectId" : "Object Repository/VoGrow/Farm/FarmPost",
        "harId" : "1978fc92-acb8-4940-8274-1c0521d3b5c6"
      },
      "time" : 3248
    } ],
    "comment" : ""
  }
}