{
  "log" : {
    "version" : "1.2",
    "creator" : {
      "name" : "BrowserMob Proxy",
      "version" : "2.1.5",
      "comment" : ""
    },
    "pages" : [ {
      "id" : "Page 0",
      "startedDateTime" : "2019-03-29T22:32:16.300Z",
      "title" : "Page 0",
      "pageTimings" : {
        "onLoad" : 64,
        "comment" : ""
      },
      "comment" : ""
    } ],
    "entries" : [ {
      "pageref" : "Page 0",
      "startedDateTime" : "2019-03-29T22:32:16.301Z",
      "request" : {
        "method" : "PUT",
        "url" : "http://localhost:10520/WebAPI/api/admin/v1/users/14?",
        "httpVersion" : "HTTP/1.1",
        "cookies" : [ ],
        "headers" : [ {
          "name" : "User-Agent",
          "value" : "Katalon Studio"
        }, {
          "name" : "Content-Type",
          "value" : "application/x-www-form-urlencoded"
        }, {
          "name" : "Authorization",
          "value" : "Bearer eyJ0eXAiOiJKV1QiLCJhbGciOiJIUzI1NiJ9.eyJ1bmlxdWVfbmFtZSI6ImFkbWluIiwicm9sZSI6InVzZXIiLCJzdWIiOiJhZG1pbiIsImlzcyI6IkNyb3BNZXRyaWNzIiwiYXVkIjoiYWxsIiwiZXhwIjoxNTUzOTAyNjM2LCJuYmYiOjE1NTM4OTg3MzZ9.AeZbXk7lqjNsgrS8ukT16tjxwN68JOH3GuhEx6ZrDIQ"
        }, {
          "name" : "Host",
          "value" : "localhost:10520"
        }, {
          "name" : "Accept",
          "value" : "text/html, image/gif, image/jpeg, *; q=.2, */*; q=.2"
        }, {
          "name" : "Proxy-Connection",
          "value" : "keep-alive"
        }, {
          "name" : "Content-Length",
          "value" : "310"
        } ],
        "queryString" : [ ],
        "postData" : {
          "mimeType" : "application/x-www-form-urlencoded",
          "params" : [ {
            "name" : "password",
            "value" : "cropmetrics",
            "comment" : ""
          }, {
            "name" : "email",
            "value" : "cropmetricsvo.passwithsymbols@gmail.com",
            "comment" : ""
          }, {
            "name" : "fullname",
            "value" : "test validation",
            "comment" : ""
          }, {
            "name" : "phone",
            "value" : "123",
            "comment" : ""
          }, {
            "name" : "dealer",
            "value" : "x",
            "comment" : ""
          }, {
            "name" : "addressLine1",
            "value" : "address line 1 test validation",
            "comment" : ""
          }, {
            "name" : "addressLine2",
            "value" : "address line 2 test validation",
            "comment" : ""
          }, {
            "name" : "town",
            "value" : "townValidation",
            "comment" : ""
          }, {
            "name" : "state",
            "value" : "stateValidation",
            "comment" : ""
          }, {
            "name" : "zip",
            "value" : "zipValidation",
            "comment" : ""
          }, {
            "name" : "country",
            "value" : "countryValidation",
            "comment" : ""
          }, {
            "name" : "roles",
            "value" : "",
            "comment" : ""
          }, {
            "name" : "userProfileId",
            "value" : "14",
            "comment" : ""
          } ],
          "comment" : ""
        },
        "headersSize" : 545,
        "bodySize" : 310,
        "comment" : ""
      },
      "response" : {
        "status" : 400,
        "statusText" : "Bad Request",
        "httpVersion" : "HTTP/1.1",
        "cookies" : [ {
          "name" : ".ASPROLES",
          "value" : "5tfAaVOdHR2itehExHWXmg6ZuxODKCrRlTeJUR_aIMUeZVm0wfp8Ae7ElBIn5CcZFs_KdPzMn1oFPaq6dO46xWA2-4eROMbRQuNhHp7GmPzlfn97cIZaUMiQSW6Fjw55vGU-7T-B7pC3AIxiHzyTkJ0va1IYTxqd7HWd_QtMUB-LLxT11_eWop6x8H7ffBs4JhI0tNPxva5WobX-5gSz1ILDq6yMS_BBGTvrT1xbccrj5nUdrSYYJhUaXV3aIiNtB5F-47fdw4I0Nzfh5Hm4IKZOl3aAyCChBsZeKhSJgB-oFSttHmhsWwzq1oNkwkXlRNeRszg4DoibLozPSvFBBIulK-_5xqgGJegGTVAMBBkradMjYioYRgHR6i9EhHbBMGHj3Hd0NiHWwe7SFpkalTpp2Dk7kSyqqQ3HKw0VYpQbkdeMkSD3IB0M1XtfBTp5PEOFHzXggyMImcwgOGhsEikkESz17_VIUnJbGrG6R63snUwi0",
          "path" : "/",
          "httpOnly" : true,
          "secure" : false,
          "comment" : ""
        } ],
        "headers" : [ {
          "name" : "Cache-Control",
          "value" : "private"
        }, {
          "name" : "Content-Type",
          "value" : "application/json; charset=utf-8"
        }, {
          "name" : "Server",
          "value" : "Microsoft-IIS/10.0"
        }, {
          "name" : "Set-Cookie",
          "value" : ".ASPROLES=5tfAaVOdHR2itehExHWXmg6ZuxODKCrRlTeJUR_aIMUeZVm0wfp8Ae7ElBIn5CcZFs_KdPzMn1oFPaq6dO46xWA2-4eROMbRQuNhHp7GmPzlfn97cIZaUMiQSW6Fjw55vGU-7T-B7pC3AIxiHzyTkJ0va1IYTxqd7HWd_QtMUB-LLxT11_eWop6x8H7ffBs4JhI0tNPxva5WobX-5gSz1ILDq6yMS_BBGTvrT1xbccrj5nUdrSYYJhUaXV3aIiNtB5F-47fdw4I0Nzfh5Hm4IKZOl3aAyCChBsZeKhSJgB-oFSttHmhsWwzq1oNkwkXlRNeRszg4DoibLozPSvFBBIulK-_5xqgGJegGTVAMBBkradMjYioYRgHR6i9EhHbBMGHj3Hd0NiHWwe7SFpkalTpp2Dk7kSyqqQ3HKw0VYpQbkdeMkSD3IB0M1XtfBTp5PEOFHzXggyMImcwgOGhsEikkESz17_VIUnJbGrG6R63snUwi0; path=/; HttpOnly"
        }, {
          "name" : "X-SourceFiles",
          "value" : "=?UTF-8?B?RDpcVmlydHVhbE9wdGltaXplci1SZWZhY3RvcmluZ1xDcm9wTWV0cmljcy5Wby5BcGlcQ3JvcE1ldHJpY3MuVm8uQXBpXGFwaVxhZG1pblx2MVx1c2Vyc1wxNA==?="
        }, {
          "name" : "X-Powered-By",
          "value" : "ASP.NET"
        }, {
          "name" : "Date",
          "value" : "Fri, 29 Mar 2019 22:32:15 GMT"
        }, {
          "name" : "Content-Length",
          "value" : "97"
        } ],
        "content" : {
          "size" : 97,
          "mimeType" : "application/json; charset=utf-8",
          "text" : "{\"message\":\"The request is invalid. The Roles cannot be blank or the value provided is invalid.\"}",
          "comment" : ""
        },
        "redirectURL" : "",
        "headersSize" : 901,
        "bodySize" : 97,
        "comment" : ""
      },
      "cache" : { },
      "timings" : {
        "comment" : "",
        "ssl" : -1,
        "send" : 0,
        "wait" : 59,
        "receive" : 0,
        "connect" : -1,
        "dns" : -1,
        "blocked" : -1
      },
      "serverIPAddress" : "127.0.0.1",
      "comment" : "",
      "_katalonRequestInformation" : {
        "name" : "115",
        "testObjectId" : "Object Repository/VoPro/Account/api_admin_v1_users_userprofileid",
        "harId" : "c588b71a-6894-4a7a-9eee-d8562f8e6d14"
      },
      "time" : 60
    } ],
    "comment" : ""
  }
}