{
  "log" : {
    "version" : "1.2",
    "creator" : {
      "name" : "BrowserMob Proxy",
      "version" : "2.1.5",
      "comment" : ""
    },
    "pages" : [ {
      "id" : "Page 0",
      "startedDateTime" : "2019-04-24T20:56:16.421Z",
      "title" : "Page 0",
      "pageTimings" : {
        "onLoad" : 3094,
        "comment" : ""
      },
      "comment" : ""
    } ],
    "entries" : [ {
      "pageref" : "Page 0",
      "startedDateTime" : "2019-04-24T20:56:16.422Z",
      "request" : {
        "method" : "POST",
        "url" : "http://localhost:10520/WebAPI/api/mobile/v1/fields?",
        "httpVersion" : "HTTP/1.1",
        "cookies" : [ ],
        "headers" : [ {
          "name" : "User-Agent",
          "value" : "Katalon Studio"
        }, {
          "name" : "Content-Type",
          "value" : "application/json"
        }, {
          "name" : "Authorization",
          "value" : "Bearer eyJ0eXAiOiJKV1QiLCJhbGciOiJIUzI1NiJ9.eyJ1bmlxdWVfbmFtZSI6Implbm55Lm1hbGRvbmFkby50eDFAZ21haWwuY29tIiwicm9sZSI6InVzZXIiLCJzdWIiOiJqZW5ueS5tYWxkb25hZG8udHgxQGdtYWlsLmNvbSIsImlzcyI6IkNyb3BNZXRyaWNzIiwiYXVkIjoiYWxsIiwiZXhwIjoxNTU2MTQzMjc2LCJuYmYiOjE1NTYxMzkzNzZ9.CsiSU7s8Z6G_j2xw1o32Mijo4V10vYF3vL2IPa0ZGTg"
        }, {
          "name" : "Host",
          "value" : "localhost:10520"
        }, {
          "name" : "Accept",
          "value" : "text/html, image/gif, image/jpeg, *; q=.2, */*; q=.2"
        }, {
          "name" : "Proxy-Connection",
          "value" : "keep-alive"
        }, {
          "name" : "Content-Length",
          "value" : "389"
        } ],
        "queryString" : [ ],
        "postData" : {
          "mimeType" : "application/json",
          "text" : "{\"field\":{\"farm_id\":7,\"name\":\"Field without x value in boundary\",\"boundary\":{\"boundaries\":[{\"boundary\":{\"coords\":[{\"y\":37.14976293},{\"x\":-101.50049403,\"y\":37.14647907},{\"x\":-101.50049403,\"y\":37.14264773},{\"x\":-101.49723246,\"y\":37.1411425},{\"x\":-101.49019435,\"y\":37.14223722},{\"x\":-101.48933604,\"y\":37.14620541},{\"x\":-101.49294093,\"y\":37.14866833},{\"x\":-101.49568751,\"y\":37.14976293}]}}]}}}",
          "comment" : ""
        },
        "headersSize" : 592,
        "bodySize" : 389,
        "comment" : ""
      },
      "response" : {
        "status" : 400,
        "statusText" : "Bad Request",
        "httpVersion" : "HTTP/1.1",
        "cookies" : [ {
          "name" : ".ASPROLES",
          "value" : "LSWLu-ElGzb0GxG4TmJR35AqXs7lxnTNPHkSn4OwIHQrE1ZIqh-lVad4RWdkCoVdUDGSPNnELSiQcPfKTK9F2FQd5Ko9ss0-sEUjjaev_GbkRIAiAl9402iX5Zpa6eY9l38qS5XQop3SE6b8niWlPwHKNiACDxgXsm3lnzNkNEUbD8ZGe1Txve_CR3Gtkl1Zvb8F9xBY8V_dNFkG5ql33824wX_N8xlmwYyEZr7Ir7uDErBiwlAHIGlZoT_99pvv_IYUVUog7i2q2eXjy_oJDCcryTYEmdkA90GztHGd_k5kgbPFFoQHSm04VPuJCHvjlZ85WV5rY7RZBXcXyTpxtnM68b7u2o2j8NIw3JInjr5f13w_U5luLaApixGCw2WWzEdjm4GS4LdYt_9RtUqQz8AtqyJiCwFT7CqcDPjRexald1cGmw4t1F1QruPPjmictdR9LtZ_SrHnhNWHvKa8Es0wAhvjY1CKSGTnfdACy51eqLroVA3Dfl_D74oRuhNgMx_sVPk3cjLpjJdwVmGnARRcbSY1",
          "path" : "/",
          "httpOnly" : true,
          "secure" : false,
          "comment" : ""
        } ],
        "headers" : [ {
          "name" : "Cache-Control",
          "value" : "private"
        }, {
          "name" : "Content-Type",
          "value" : "application/json; charset=utf-8"
        }, {
          "name" : "Server",
          "value" : "Microsoft-IIS/10.0"
        }, {
          "name" : "Set-Cookie",
          "value" : ".ASPROLES=LSWLu-ElGzb0GxG4TmJR35AqXs7lxnTNPHkSn4OwIHQrE1ZIqh-lVad4RWdkCoVdUDGSPNnELSiQcPfKTK9F2FQd5Ko9ss0-sEUjjaev_GbkRIAiAl9402iX5Zpa6eY9l38qS5XQop3SE6b8niWlPwHKNiACDxgXsm3lnzNkNEUbD8ZGe1Txve_CR3Gtkl1Zvb8F9xBY8V_dNFkG5ql33824wX_N8xlmwYyEZr7Ir7uDErBiwlAHIGlZoT_99pvv_IYUVUog7i2q2eXjy_oJDCcryTYEmdkA90GztHGd_k5kgbPFFoQHSm04VPuJCHvjlZ85WV5rY7RZBXcXyTpxtnM68b7u2o2j8NIw3JInjr5f13w_U5luLaApixGCw2WWzEdjm4GS4LdYt_9RtUqQz8AtqyJiCwFT7CqcDPjRexald1cGmw4t1F1QruPPjmictdR9LtZ_SrHnhNWHvKa8Es0wAhvjY1CKSGTnfdACy51eqLroVA3Dfl_D74oRuhNgMx_sVPk3cjLpjJdwVmGnARRcbSY1; path=/; HttpOnly"
        }, {
          "name" : "X-SourceFiles",
          "value" : "=?UTF-8?B?RDpcVmlydHVhbE9wdGltaXplci1SZWZhY3RvcmluZ1xDcm9wTWV0cmljcy5Wby5BcGlcQ3JvcE1ldHJpY3MuVm8uQXBpXGFwaVxtb2JpbGVcdjFcZmllbGRz?="
        }, {
          "name" : "X-Powered-By",
          "value" : "ASP.NET"
        }, {
          "name" : "Date",
          "value" : "Wed, 24 Apr 2019 20:56:19 GMT"
        }, {
          "name" : "Content-Length",
          "value" : "119"
        } ],
        "content" : {
          "size" : 119,
          "mimeType" : "application/json; charset=utf-8",
          "text" : "{\"message\":\"The Boundary is not valid. IllegalArgumentException: Points of LinearRing do not form a closed linestring\"}",
          "comment" : ""
        },
        "redirectURL" : "",
        "headersSize" : 941,
        "bodySize" : 119,
        "comment" : ""
      },
      "cache" : { },
      "timings" : {
        "comment" : "",
        "ssl" : -1,
        "wait" : 3089,
        "send" : 0,
        "receive" : 0,
        "blocked" : -1,
        "dns" : -1,
        "connect" : -1
      },
      "serverIPAddress" : "127.0.0.1",
      "comment" : "",
      "_katalonRequestInformation" : {
        "name" : "101",
        "testObjectId" : "Object Repository/VoGrow/Field/FieldPost",
        "harId" : "bff483c7-ebe7-44f2-8083-f9219f53b780"
      },
      "time" : 3091
    } ],
    "comment" : ""
  }
}