{
  "log" : {
    "version" : "1.2",
    "creator" : {
      "name" : "BrowserMob Proxy",
      "version" : "2.1.5",
      "comment" : ""
    },
    "pages" : [ {
      "id" : "Page 0",
      "startedDateTime" : "2019-04-01T13:34:44.887Z",
      "title" : "Page 0",
      "pageTimings" : {
        "onLoad" : 1911,
        "comment" : ""
      },
      "comment" : ""
    } ],
    "entries" : [ {
      "pageref" : "Page 0",
      "startedDateTime" : "2019-04-01T13:34:44.888Z",
      "request" : {
        "method" : "POST",
        "url" : "http://localhost:10520/WebAPI/api/admin/v1/users/?",
        "httpVersion" : "HTTP/1.1",
        "cookies" : [ ],
        "headers" : [ {
          "name" : "User-Agent",
          "value" : "Katalon Studio"
        }, {
          "name" : "Content-Type",
          "value" : "application/x-www-form-urlencoded"
        }, {
          "name" : "Authorization",
          "value" : "Bearer eyJ0eXAiOiJKV1QiLCJhbGciOiJIUzI1NiJ9.eyJ1bmlxdWVfbmFtZSI6ImFkbWluIiwicm9sZSI6InVzZXIiLCJzdWIiOiJhZG1pbiIsImlzcyI6IkNyb3BNZXRyaWNzIiwiYXVkIjoiYWxsIiwiZXhwIjoxNTU0MTI5NTg0LCJuYmYiOjE1NTQxMjU2ODR9.j9XyZIzC14dr_7-mDtTRnvUj5FaYFllOVcm9SSS5F0M"
        }, {
          "name" : "Host",
          "value" : "localhost:10520"
        }, {
          "name" : "Accept",
          "value" : "text/html, image/gif, image/jpeg, *; q=.2, */*; q=.2"
        }, {
          "name" : "Proxy-Connection",
          "value" : "keep-alive"
        }, {
          "name" : "Content-Length",
          "value" : "295"
        } ],
        "queryString" : [ ],
        "postData" : {
          "mimeType" : "application/x-www-form-urlencoded",
          "params" : [ {
            "name" : "password",
            "value" : "15characterspas",
            "comment" : ""
          }, {
            "name" : "email",
            "value" : "cropmetricsvo.15.pass@gmail.com",
            "comment" : ""
          }, {
            "name" : "fullname",
            "value" : "test validation",
            "comment" : ""
          }, {
            "name" : "phone",
            "value" : "123",
            "comment" : ""
          }, {
            "name" : "dealer",
            "value" : "x",
            "comment" : ""
          }, {
            "name" : "addressLine1",
            "value" : "address line 1 test validation",
            "comment" : ""
          }, {
            "name" : "addressLine2",
            "value" : "address line 1 test validation",
            "comment" : ""
          }, {
            "name" : "town",
            "value" : "townValidation",
            "comment" : ""
          }, {
            "name" : "state",
            "value" : "stateValidation",
            "comment" : ""
          }, {
            "name" : "zip",
            "value" : "zipValidation",
            "comment" : ""
          }, {
            "name" : "country",
            "value" : "countryValidation",
            "comment" : ""
          }, {
            "name" : "roles",
            "value" : "Client",
            "comment" : ""
          } ],
          "comment" : ""
        },
        "headersSize" : 544,
        "bodySize" : 295,
        "comment" : ""
      },
      "response" : {
        "status" : 200,
        "statusText" : "OK",
        "httpVersion" : "HTTP/1.1",
        "cookies" : [ {
          "name" : ".ASPROLES",
          "value" : "Iv6xNaSJwOaZIcxdo-80hWPvRX1hA-4dbAC0wkKxioA7aUbHWECRKqb86VuT_Uo7Cmztpe3THT8IerqiUG48WXMsLRgwen4TIyruyHaiaB4Wanw7yif0KoxLeNXTXlgJF7_tW5jfMWoIpyZrKXKWehVi92PcTTp8eOsv6BzCXop1y1dmvF7z6xxsBoXgU8I8BtecYNoqXkmO1Mjmc5SwRAHi22tKGa-JxwQ_Zv4ah3CBbWP0JSl4ySMMzIfEaSeVglJ15QyrNqkg6YdDHnaNfRpGnaqBQ9iB0C0veUztJ1ogwMKCHvGn4Ftuias8-IUbP4mxLOUavNw2Tl1dNusYbNsRmMaF1JUkoSEs1YV20n94EF2CmDCkt2FCxuLFgTkSK1xQ5UkbYSNFuwDPX8SyAKwG2IZgi6UmANLOrVNpiT2fwDu-g272oK4a8VN864B9ZBRdTOrKbSUrI6A4XEqutlSFE6YOCz8X4ZMHolySrGpAfyhF0",
          "path" : "/",
          "httpOnly" : true,
          "secure" : false,
          "comment" : ""
        } ],
        "headers" : [ {
          "name" : "Cache-Control",
          "value" : "private"
        }, {
          "name" : "Content-Type",
          "value" : "application/json; charset=utf-8"
        }, {
          "name" : "Server",
          "value" : "Microsoft-IIS/10.0"
        }, {
          "name" : "Set-Cookie",
          "value" : ".ASPROLES=Iv6xNaSJwOaZIcxdo-80hWPvRX1hA-4dbAC0wkKxioA7aUbHWECRKqb86VuT_Uo7Cmztpe3THT8IerqiUG48WXMsLRgwen4TIyruyHaiaB4Wanw7yif0KoxLeNXTXlgJF7_tW5jfMWoIpyZrKXKWehVi92PcTTp8eOsv6BzCXop1y1dmvF7z6xxsBoXgU8I8BtecYNoqXkmO1Mjmc5SwRAHi22tKGa-JxwQ_Zv4ah3CBbWP0JSl4ySMMzIfEaSeVglJ15QyrNqkg6YdDHnaNfRpGnaqBQ9iB0C0veUztJ1ogwMKCHvGn4Ftuias8-IUbP4mxLOUavNw2Tl1dNusYbNsRmMaF1JUkoSEs1YV20n94EF2CmDCkt2FCxuLFgTkSK1xQ5UkbYSNFuwDPX8SyAKwG2IZgi6UmANLOrVNpiT2fwDu-g272oK4a8VN864B9ZBRdTOrKbSUrI6A4XEqutlSFE6YOCz8X4ZMHolySrGpAfyhF0; path=/; HttpOnly"
        }, {
          "name" : "X-SourceFiles",
          "value" : "=?UTF-8?B?RDpcVmlydHVhbE9wdGltaXplci1SZWZhY3RvcmluZ1xDcm9wTWV0cmljcy5Wby5BcGlcQ3JvcE1ldHJpY3MuVm8uQXBpXGFwaVxhZG1pblx2MVx1c2Vyc1w=?="
        }, {
          "name" : "X-Powered-By",
          "value" : "ASP.NET"
        }, {
          "name" : "Date",
          "value" : "Mon, 01 Apr 2019 13:34:46 GMT"
        }, {
          "name" : "Content-Length",
          "value" : "9"
        } ],
        "content" : {
          "size" : 9,
          "mimeType" : "application/json; charset=utf-8",
          "text" : "{\"id\":13}",
          "comment" : ""
        },
        "redirectURL" : "",
        "headersSize" : 887,
        "bodySize" : 9,
        "comment" : ""
      },
      "cache" : { },
      "timings" : {
        "comment" : "",
        "ssl" : -1,
        "wait" : 1907,
        "receive" : 0,
        "send" : 0,
        "dns" : -1,
        "blocked" : -1,
        "connect" : -1
      },
      "serverIPAddress" : "127.0.0.1",
      "comment" : "",
      "_katalonRequestInformation" : {
        "name" : "37",
        "testObjectId" : "Object Repository/VoPro/Account/api_admin_v1_users",
        "harId" : "b7a07c26-32d1-4738-a422-e407e0d66fa2"
      },
      "time" : 1908
    } ],
    "comment" : ""
  }
}