{
  "log" : {
    "version" : "1.2",
    "creator" : {
      "name" : "BrowserMob Proxy",
      "version" : "2.1.5",
      "comment" : ""
    },
    "pages" : [ {
      "id" : "Page 0",
      "startedDateTime" : "2019-03-29T22:10:35.606Z",
      "title" : "Page 0",
      "pageTimings" : {
        "onLoad" : 1881,
        "comment" : ""
      },
      "comment" : ""
    } ],
    "entries" : [ {
      "pageref" : "Page 0",
      "startedDateTime" : "2019-03-29T22:10:35.607Z",
      "request" : {
        "method" : "POST",
        "url" : "http://localhost:10520/WebAPI/api/admin/v1/users/?",
        "httpVersion" : "HTTP/1.1",
        "cookies" : [ ],
        "headers" : [ {
          "name" : "User-Agent",
          "value" : "Katalon Studio"
        }, {
          "name" : "Content-Type",
          "value" : "application/x-www-form-urlencoded"
        }, {
          "name" : "Authorization",
          "value" : "Bearer eyJ0eXAiOiJKV1QiLCJhbGciOiJIUzI1NiJ9.eyJ1bmlxdWVfbmFtZSI6ImFkbWluIiwicm9sZSI6InVzZXIiLCJzdWIiOiJhZG1pbiIsImlzcyI6IkNyb3BNZXRyaWNzIiwiYXVkIjoiYWxsIiwiZXhwIjoxNTUzOTAxMzM1LCJuYmYiOjE1NTM4OTc0MzV9.mAhYQRVW6vjy3Nj1_OYvXBxB_9QGy_LKc_kU60dMZVs"
        }, {
          "name" : "Host",
          "value" : "localhost:10520"
        }, {
          "name" : "Accept",
          "value" : "text/html, image/gif, image/jpeg, *; q=.2, */*; q=.2"
        }, {
          "name" : "Proxy-Connection",
          "value" : "keep-alive"
        }, {
          "name" : "Content-Length",
          "value" : "282"
        } ],
        "queryString" : [ ],
        "postData" : {
          "mimeType" : "application/x-www-form-urlencoded",
          "params" : [ {
            "name" : "password",
            "value" : "cropmetrics",
            "comment" : ""
          }, {
            "name" : "email",
            "value" : "cropmetricsvo.zipchar@gmail.com",
            "comment" : ""
          }, {
            "name" : "fullname",
            "value" : "test validation",
            "comment" : ""
          }, {
            "name" : "phone",
            "value" : "123",
            "comment" : ""
          }, {
            "name" : "dealer",
            "value" : "x",
            "comment" : ""
          }, {
            "name" : "addressLine1",
            "value" : "address line 1 test validation",
            "comment" : ""
          }, {
            "name" : "addressLine2",
            "value" : "address line 2 test validation",
            "comment" : ""
          }, {
            "name" : "town",
            "value" : "townValidation",
            "comment" : ""
          }, {
            "name" : "state",
            "value" : "stateValidation",
            "comment" : ""
          }, {
            "name" : "zip",
            "value" : "nine",
            "comment" : ""
          }, {
            "name" : "country",
            "value" : "countryValidation",
            "comment" : ""
          }, {
            "name" : "roles",
            "value" : "Client",
            "comment" : ""
          } ],
          "comment" : ""
        },
        "headersSize" : 544,
        "bodySize" : 282,
        "comment" : ""
      },
      "response" : {
        "status" : 200,
        "statusText" : "OK",
        "httpVersion" : "HTTP/1.1",
        "cookies" : [ {
          "name" : ".ASPROLES",
          "value" : "nQxdS7HW__nkE2djLgb6tIkMbYmJ5jrjIUuDEieSE34o_zmO2aQ3ksDRynO7LoxpJTRd7d9gT0ToP3HZUV4_B8WndDS3PHK4_0yEU1Ff4KL1-KTZDg5Ttaz27wwASVpv06b7Vk1SiG4_46haCYrNk1EaBYCk-bSTn_UZCxnxO4LxR-RofKKvE2JR05x7tOgsXuqkZhU14U4fRkjfhaQOMI6mb028L5H97VrQOzo1BwMd_4YGbazMn5edmmnAkOCIBQTzfl86lHtLFTXxiSRnRF7T5WYC2LTwBs4m0FFpdf1cPfrXhE4pTYTBqJw57qrFMCKDA2_9jjcRYrg_2KrJdrMyyt1Obn1j5XWQ30Z_L_0RtqZHpdnhINXy944wHUOSQnV6Gpvqhnz6mbuptudqs_nLgG7IY-uFKynseRQeX0OP2WEw68N6-Eo6094uZv7uMnQByQefr_S52IuZ8pHMeZFo57ioycl_1Spg6j04oLsck8YY0",
          "path" : "/",
          "httpOnly" : true,
          "secure" : false,
          "comment" : ""
        } ],
        "headers" : [ {
          "name" : "Cache-Control",
          "value" : "private"
        }, {
          "name" : "Content-Type",
          "value" : "application/json; charset=utf-8"
        }, {
          "name" : "Server",
          "value" : "Microsoft-IIS/10.0"
        }, {
          "name" : "Set-Cookie",
          "value" : ".ASPROLES=nQxdS7HW__nkE2djLgb6tIkMbYmJ5jrjIUuDEieSE34o_zmO2aQ3ksDRynO7LoxpJTRd7d9gT0ToP3HZUV4_B8WndDS3PHK4_0yEU1Ff4KL1-KTZDg5Ttaz27wwASVpv06b7Vk1SiG4_46haCYrNk1EaBYCk-bSTn_UZCxnxO4LxR-RofKKvE2JR05x7tOgsXuqkZhU14U4fRkjfhaQOMI6mb028L5H97VrQOzo1BwMd_4YGbazMn5edmmnAkOCIBQTzfl86lHtLFTXxiSRnRF7T5WYC2LTwBs4m0FFpdf1cPfrXhE4pTYTBqJw57qrFMCKDA2_9jjcRYrg_2KrJdrMyyt1Obn1j5XWQ30Z_L_0RtqZHpdnhINXy944wHUOSQnV6Gpvqhnz6mbuptudqs_nLgG7IY-uFKynseRQeX0OP2WEw68N6-Eo6094uZv7uMnQByQefr_S52IuZ8pHMeZFo57ioycl_1Spg6j04oLsck8YY0; path=/; HttpOnly"
        }, {
          "name" : "X-SourceFiles",
          "value" : "=?UTF-8?B?RDpcVmlydHVhbE9wdGltaXplci1SZWZhY3RvcmluZ1xDcm9wTWV0cmljcy5Wby5BcGlcQ3JvcE1ldHJpY3MuVm8uQXBpXGFwaVxhZG1pblx2MVx1c2Vyc1w=?="
        }, {
          "name" : "X-Powered-By",
          "value" : "ASP.NET"
        }, {
          "name" : "Date",
          "value" : "Fri, 29 Mar 2019 22:10:37 GMT"
        }, {
          "name" : "Content-Length",
          "value" : "9"
        } ],
        "content" : {
          "size" : 9,
          "mimeType" : "application/json; charset=utf-8",
          "text" : "{\"id\":31}",
          "comment" : ""
        },
        "redirectURL" : "",
        "headersSize" : 887,
        "bodySize" : 9,
        "comment" : ""
      },
      "cache" : { },
      "timings" : {
        "comment" : "",
        "ssl" : -1,
        "connect" : -1,
        "send" : 0,
        "receive" : 0,
        "wait" : 1874,
        "dns" : -1,
        "blocked" : -1
      },
      "serverIPAddress" : "127.0.0.1",
      "comment" : "",
      "_katalonRequestInformation" : {
        "name" : "83",
        "testObjectId" : "Object Repository/VoPro/Account/api_admin_v1_users",
        "harId" : "6125df34-3acd-488f-b59f-9db1e1238211"
      },
      "time" : 1875
    } ],
    "comment" : ""
  }
}