{
  "log" : {
    "version" : "1.2",
    "creator" : {
      "name" : "BrowserMob Proxy",
      "version" : "2.1.5",
      "comment" : ""
    },
    "pages" : [ {
      "id" : "Page 0",
      "startedDateTime" : "2019-04-24T20:34:58.278Z",
      "title" : "Page 0",
      "pageTimings" : {
        "onLoad" : 229,
        "comment" : ""
      },
      "comment" : ""
    } ],
    "entries" : [ {
      "pageref" : "Page 0",
      "startedDateTime" : "2019-04-24T20:34:58.280Z",
      "request" : {
        "method" : "GET",
        "url" : "http://localhost:10520/WebAPI/api/mobile/v1/user?",
        "httpVersion" : "HTTP/1.1",
        "cookies" : [ ],
        "headers" : [ {
          "name" : "User-Agent",
          "value" : "Katalon Studio"
        }, {
          "name" : "Content-Type",
          "value" : "application/json"
        }, {
          "name" : "Authorization",
          "value" : "Bearer eyJ0eXAiOiJKV1QiLCJhbGciOiJIUzI1NiJ9.eyJ1bmlxdWVfbmFtZSI6Implbm55Lm1hbGRvbmFkby50eDFAZ21haWwuY29tIiwicm9sZSI6InVzZXIiLCJzdWIiOiJqZW5ueS5tYWxkb25hZG8udHgxQGdtYWlsLmNvbSIsImlzcyI6IkNyb3BNZXRyaWNzIiwiYXVkIjoiYWxsIiwiZXhwIjoxNTU2MTQxOTk4LCJuYmYiOjE1NTYxMzgwOTh9.ifqFNSHRqoIojK_N3E_gByqwlRKyXc0NQZV9_cAOnCg"
        }, {
          "name" : "Host",
          "value" : "localhost:10520"
        }, {
          "name" : "Accept",
          "value" : "text/html, image/gif, image/jpeg, *; q=.2, */*; q=.2"
        }, {
          "name" : "Proxy-Connection",
          "value" : "keep-alive"
        } ],
        "queryString" : [ ],
        "headersSize" : 568,
        "bodySize" : 0,
        "comment" : ""
      },
      "response" : {
        "status" : 200,
        "statusText" : "OK",
        "httpVersion" : "HTTP/1.1",
        "cookies" : [ {
          "name" : ".ASPROLES",
          "value" : "F4GjrIcyvDglvdEsd77XfPUYahQGiWSRtfo8zkdZH6r66Yj3Hyyk8g-5hopmP6irGmR3PNUMl8P9c8Mi-muE6cJK4OK-H7lRqp8CCfI_oNB_VdjpWjCheUrEUltE1SjKwK8lZPvW7kA6o21tbC6OuwKecDs9byYUBVzzuXZQpPyf0psXHtagHfCoISNUnu1SoLZ9YzlGwt8lcaxEeQsDpymKwodIxv88ZAk0k9qEhML-j9QmlSMQLArJ12UHwXKDdR5oznYK_QyyerwPM3B1gT4xwHFHIgEGWEKUH6zJIfLnjuXVKFohD4ij2qF6kJfrNiWkkDyJVuFodTnqzsdzmUogzqLZLzUIkK-wGaPabZ5_Yx7rrjH6w_eHGYCgKGASWKKq8O2fLhkm90ItVdGPjw3LeUCam7cJ8iRYnVaQsScJo7yovCNYi0QJoTAM4RzpA-5locCKpDY3O9lxiJBP4Qxg9E7ZDByecEVC4EIPFkuPH5awyf8FwT1DfpUoEGX3rkLaZZH8VqcKH1Iw77ZwhU1iqo41",
          "path" : "/",
          "httpOnly" : true,
          "secure" : false,
          "comment" : ""
        } ],
        "headers" : [ {
          "name" : "Cache-Control",
          "value" : "private"
        }, {
          "name" : "Content-Type",
          "value" : "application/json; charset=utf-8"
        }, {
          "name" : "Server",
          "value" : "Microsoft-IIS/10.0"
        }, {
          "name" : "Set-Cookie",
          "value" : ".ASPROLES=F4GjrIcyvDglvdEsd77XfPUYahQGiWSRtfo8zkdZH6r66Yj3Hyyk8g-5hopmP6irGmR3PNUMl8P9c8Mi-muE6cJK4OK-H7lRqp8CCfI_oNB_VdjpWjCheUrEUltE1SjKwK8lZPvW7kA6o21tbC6OuwKecDs9byYUBVzzuXZQpPyf0psXHtagHfCoISNUnu1SoLZ9YzlGwt8lcaxEeQsDpymKwodIxv88ZAk0k9qEhML-j9QmlSMQLArJ12UHwXKDdR5oznYK_QyyerwPM3B1gT4xwHFHIgEGWEKUH6zJIfLnjuXVKFohD4ij2qF6kJfrNiWkkDyJVuFodTnqzsdzmUogzqLZLzUIkK-wGaPabZ5_Yx7rrjH6w_eHGYCgKGASWKKq8O2fLhkm90ItVdGPjw3LeUCam7cJ8iRYnVaQsScJo7yovCNYi0QJoTAM4RzpA-5locCKpDY3O9lxiJBP4Qxg9E7ZDByecEVC4EIPFkuPH5awyf8FwT1DfpUoEGX3rkLaZZH8VqcKH1Iw77ZwhU1iqo41; path=/; HttpOnly"
        }, {
          "name" : "X-SourceFiles",
          "value" : "=?UTF-8?B?RDpcVmlydHVhbE9wdGltaXplci1SZWZhY3RvcmluZ1xDcm9wTWV0cmljcy5Wby5BcGlcQ3JvcE1ldHJpY3MuVm8uQXBpXGFwaVxtb2JpbGVcdjFcdXNlcg==?="
        }, {
          "name" : "X-Powered-By",
          "value" : "ASP.NET"
        }, {
          "name" : "Date",
          "value" : "Wed, 24 Apr 2019 20:34:58 GMT"
        }, {
          "name" : "Content-Length",
          "value" : "209"
        } ],
        "content" : {
          "size" : 209,
          "mimeType" : "application/json; charset=utf-8",
          "text" : "{\"id\":2,\"name\":\"Agent account\",\"email\":\"jenny.maldonado.tx1@gmail.com\",\"address_line1\":\"x\",\"address_line2\":\"\",\"town\":\"x\",\"state\":\"NE\",\"zip\":\"x\",\"country\":\"USA\",\"phone\":\"\",\"role\":\"Agent\",\"roles\":\"Client,Agent\"}",
          "comment" : ""
        },
        "redirectURL" : "",
        "headersSize" : 932,
        "bodySize" : 209,
        "comment" : ""
      },
      "cache" : { },
      "timings" : {
        "comment" : "",
        "blocked" : -1,
        "receive" : 2,
        "connect" : -1,
        "wait" : 221,
        "send" : 0,
        "dns" : -1,
        "ssl" : -1
      },
      "serverIPAddress" : "127.0.0.1",
      "comment" : "",
      "_katalonRequestInformation" : {
        "name" : "5",
        "testObjectId" : "Object Repository/VoGrow/User/User",
        "harId" : "48b85bc4-fd2b-4453-beb5-a7eed0f5cf30"
      },
      "time" : 223
    } ],
    "comment" : ""
  }
}