{
  "log" : {
    "version" : "1.2",
    "creator" : {
      "name" : "BrowserMob Proxy",
      "version" : "2.1.5",
      "comment" : ""
    },
    "pages" : [ {
      "id" : "Page 0",
      "startedDateTime" : "2019-04-09T09:29:40.286Z",
      "title" : "Page 0",
      "pageTimings" : {
        "onLoad" : 13,
        "comment" : ""
      },
      "comment" : ""
    } ],
    "entries" : [ {
      "pageref" : "Page 0",
      "startedDateTime" : "2019-04-09T09:29:40.286Z",
      "request" : {
        "method" : "POST",
        "url" : "http://localhost:10520/WebAPI/api/mobile/v1/farms/?",
        "httpVersion" : "HTTP/1.1",
        "cookies" : [ ],
        "headers" : [ {
          "name" : "User-Agent",
          "value" : "Katalon Studio"
        }, {
          "name" : "Content-Type",
          "value" : "application/json"
        }, {
          "name" : "Authorization",
          "value" : "Bearer eyJ0eXAiOiJKV1QiLCJhbGciOiJIUzI1NiJ9.eyJ1bmlxdWVfbmFtZSI6Implbm55Lm1hbGRvbmFkby50eDFAZ21haWwuY29tIiwicm9sZSI6InVzZXIiLCJzdWIiOiJqZW5ueS5tYWxkb25hZG8udHgxQGdtYWlsLmNvbSIsImlzcyI6IkNyb3BNZXRyaWNzIiwiYXVkIjoiYWxsIiwiZXhwIjoxNTU0ODA2MDgwLCJuYmYiOjE1NTQ4MDIxODB9.DmfUvnbv3m1ogm42CEXfRH4B8FUOgHV7pTBJUTtB26Y"
        }, {
          "name" : "Host",
          "value" : "localhost:10520"
        }, {
          "name" : "Accept",
          "value" : "text/html, image/gif, image/jpeg, *; q=.2, */*; q=.2"
        }, {
          "name" : "Proxy-Connection",
          "value" : "keep-alive"
        }, {
          "name" : "Content-Length",
          "value" : "60"
        } ],
        "queryString" : [ ],
        "postData" : {
          "mimeType" : "application/json",
          "text" : "{\"name\": \"New Farm with userID as spaces\", \"user_id\": \"   \"}",
          "comment" : ""
        },
        "headersSize" : 591,
        "bodySize" : 60,
        "comment" : ""
      },
      "response" : {
        "status" : 400,
        "statusText" : "Bad Request",
        "httpVersion" : "HTTP/1.1",
        "cookies" : [ {
          "name" : ".ASPROLES",
          "value" : "LKtznN0wDIOLNNLWcdYC1_2nxJ4Xudn_2h_-3J8S7_M7-uGJBLUZfqxObr6sKFZyMCKDpxv38-Pc6KujWivixPrTb6ox7Jj0oRkhIULaZiCFkzN6ksrkKSKtq0TZIIQT32etbwVFBHIsFQfXisTWPdJVG-qVnxjgHPtkvqZA_7FVAlFfVZLS9dT60vMstF7S4qq_ERnSaEOPZweyU4WGBe9MPHNUyvwt71ltHI8Cvh3YTtmmKfacsCTHQkg5yXlKEST3yD3mGsOL61dKDpkqAIO0qiGYcKDFMkdGSc-ZmxAnT82PXprjFQi88lvohujOsF132LdYcg4xrarFzwW1stmfHmb2HjxotbLPti4bvFOQCbmo04cyR0ex-FmQcY2wSwPuEZGtDY0EN73k-H9xcB58az4pc7DJ6hjqqWRue5mba4TgAAOxZ2raVNc2fPr3mBIYe8a_9UvDefVno7_I-wMBdDjKAqchgzU73KaD4g2ucD_hCgvb7q5t1UQiry3zDrjVm11aGLqpWq7hd6fbHT7Uh5Y1",
          "path" : "/",
          "httpOnly" : true,
          "secure" : false,
          "comment" : ""
        } ],
        "headers" : [ {
          "name" : "Cache-Control",
          "value" : "private"
        }, {
          "name" : "Content-Type",
          "value" : "application/json; charset=utf-8"
        }, {
          "name" : "Server",
          "value" : "Microsoft-IIS/10.0"
        }, {
          "name" : "Set-Cookie",
          "value" : ".ASPROLES=LKtznN0wDIOLNNLWcdYC1_2nxJ4Xudn_2h_-3J8S7_M7-uGJBLUZfqxObr6sKFZyMCKDpxv38-Pc6KujWivixPrTb6ox7Jj0oRkhIULaZiCFkzN6ksrkKSKtq0TZIIQT32etbwVFBHIsFQfXisTWPdJVG-qVnxjgHPtkvqZA_7FVAlFfVZLS9dT60vMstF7S4qq_ERnSaEOPZweyU4WGBe9MPHNUyvwt71ltHI8Cvh3YTtmmKfacsCTHQkg5yXlKEST3yD3mGsOL61dKDpkqAIO0qiGYcKDFMkdGSc-ZmxAnT82PXprjFQi88lvohujOsF132LdYcg4xrarFzwW1stmfHmb2HjxotbLPti4bvFOQCbmo04cyR0ex-FmQcY2wSwPuEZGtDY0EN73k-H9xcB58az4pc7DJ6hjqqWRue5mba4TgAAOxZ2raVNc2fPr3mBIYe8a_9UvDefVno7_I-wMBdDjKAqchgzU73KaD4g2ucD_hCgvb7q5t1UQiry3zDrjVm11aGLqpWq7hd6fbHT7Uh5Y1; path=/; HttpOnly"
        }, {
          "name" : "X-SourceFiles",
          "value" : "=?UTF-8?B?RDpcVmlydHVhbE9wdGltaXplci1SZWZhY3RvcmluZ1xDcm9wTWV0cmljcy5Wby5BcGlcQ3JvcE1ldHJpY3MuVm8uQXBpXGFwaVxtb2JpbGVcdjFcZmFybXNc?="
        }, {
          "name" : "X-Powered-By",
          "value" : "ASP.NET"
        }, {
          "name" : "Date",
          "value" : "Tue, 09 Apr 2019 09:29:40 GMT"
        }, {
          "name" : "Content-Length",
          "value" : "37"
        } ],
        "content" : {
          "size" : 37,
          "mimeType" : "application/json; charset=utf-8",
          "text" : "{\"message\":\"The request is invalid.\"}",
          "comment" : ""
        },
        "redirectURL" : "",
        "headersSize" : 940,
        "bodySize" : 37,
        "comment" : ""
      },
      "cache" : { },
      "timings" : {
        "comment" : "",
        "ssl" : -1,
        "dns" : -1,
        "send" : 0,
        "wait" : 13,
        "receive" : 0,
        "connect" : -1,
        "blocked" : -1
      },
      "serverIPAddress" : "127.0.0.1",
      "comment" : "",
      "_katalonRequestInformation" : {
        "name" : "45",
        "testObjectId" : "Object Repository/VoGrow/Farm/FarmPost",
        "harId" : "bb2d39cf-0716-4e0b-b4cb-c1da8fb7b919"
      },
      "time" : 14
    } ],
    "comment" : ""
  }
}