{
  "log" : {
    "version" : "1.2",
    "creator" : {
      "name" : "BrowserMob Proxy",
      "version" : "2.1.5",
      "comment" : ""
    },
    "pages" : [ {
      "id" : "Page 0",
      "startedDateTime" : "2019-04-24T20:54:59.654Z",
      "title" : "Page 0",
      "pageTimings" : {
        "onLoad" : 3177,
        "comment" : ""
      },
      "comment" : ""
    } ],
    "entries" : [ {
      "pageref" : "Page 0",
      "startedDateTime" : "2019-04-24T20:54:59.655Z",
      "request" : {
        "method" : "POST",
        "url" : "http://localhost:10520/WebAPI/api/mobile/v1/fields?",
        "httpVersion" : "HTTP/1.1",
        "cookies" : [ ],
        "headers" : [ {
          "name" : "User-Agent",
          "value" : "Katalon Studio"
        }, {
          "name" : "Content-Type",
          "value" : "application/json"
        }, {
          "name" : "Authorization",
          "value" : "Bearer eyJ0eXAiOiJKV1QiLCJhbGciOiJIUzI1NiJ9.eyJ1bmlxdWVfbmFtZSI6Implbm55Lm1hbGRvbmFkby50eDFAZ21haWwuY29tIiwicm9sZSI6InVzZXIiLCJzdWIiOiJqZW5ueS5tYWxkb25hZG8udHgxQGdtYWlsLmNvbSIsImlzcyI6IkNyb3BNZXRyaWNzIiwiYXVkIjoiYWxsIiwiZXhwIjoxNTU2MTQzMTk5LCJuYmYiOjE1NTYxMzkyOTl9.-317WrSqRxTPAjgUzofBcQNKn9T08WFpcSKmb_scdPU"
        }, {
          "name" : "Host",
          "value" : "localhost:10520"
        }, {
          "name" : "Accept",
          "value" : "text/html, image/gif, image/jpeg, *; q=.2, */*; q=.2"
        }, {
          "name" : "Proxy-Connection",
          "value" : "keep-alive"
        }, {
          "name" : "Content-Length",
          "value" : "382"
        } ],
        "queryString" : [ ],
        "postData" : {
          "mimeType" : "application/json",
          "text" : "{\"field\":{\"farm_id\":3,\"name\":\"12345678\",\"boundary\":{\"boundaries\":[{\"boundary\":{\"coords\":[{\"x\":-101.49568751,\"y\":37.14976293},{\"x\":-101.50049403,\"y\":37.14647907},{\"x\":-101.50049403,\"y\":37.14264773},{\"x\":-101.49723246,\"y\":37.1411425},{\"x\":-101.49019435,\"y\":37.14223722},{\"x\":-101.48933604,\"y\":37.14620541},{\"x\":-101.49294093,\"y\":37.14866833},{\"x\":-101.49568751,\"y\":37.14976293}]}}]}}}",
          "comment" : ""
        },
        "headersSize" : 592,
        "bodySize" : 382,
        "comment" : ""
      },
      "response" : {
        "status" : 400,
        "statusText" : "Bad Request",
        "httpVersion" : "HTTP/1.1",
        "cookies" : [ {
          "name" : ".ASPROLES",
          "value" : "DSrJ_1vTehi_AyZ012YKh_ddR3wPw-b_wYnfJl1apsyg5MZGmxmtJWfIZae-qf-jfFjflB_6eiyR2t4Jutcbkt5--ZMkorgjUBO8MK_uU3w4ORv1iepGAJ2Sax3S9Tlv4ULKMU9B-3qIVKUyVRLrGchfNQrqNQTgnurH49uGGhAQpFEHdAd0e5C7D1xKjjb9u6fOdBXj2FwjvM99R98QhjQoT0lIpx5IT25RkTBmP958hLSSUef7ukgyOMWxmxTlss6owShwxHF_gus18kisMg7TEcCVoeY45DFeWVHAEMG9nB2GvMIRvHMFT96iKCf9MksYawxoAvDjKK5C7-x_Of9243XI_JHWZtCqnp4zvu1Qm3E2Z_x9NYEQgdYpx8Fpxjgm5g919AH4v0Tc1YtWPO5aKxRjGHtAiix8Q31ysxnJWLMCeba8xVkH5WRNa_4dNCIjTJ9a6xiPvjLb5nI9hTmDzlnMiy8oJYBHe4cWoMRUmjOUysal8etL5a_RsY8K09WGZSqzLFfOfll_bPh2ayfJqOQ1",
          "path" : "/",
          "httpOnly" : true,
          "secure" : false,
          "comment" : ""
        } ],
        "headers" : [ {
          "name" : "Cache-Control",
          "value" : "private"
        }, {
          "name" : "Content-Type",
          "value" : "application/json; charset=utf-8"
        }, {
          "name" : "Server",
          "value" : "Microsoft-IIS/10.0"
        }, {
          "name" : "Set-Cookie",
          "value" : ".ASPROLES=DSrJ_1vTehi_AyZ012YKh_ddR3wPw-b_wYnfJl1apsyg5MZGmxmtJWfIZae-qf-jfFjflB_6eiyR2t4Jutcbkt5--ZMkorgjUBO8MK_uU3w4ORv1iepGAJ2Sax3S9Tlv4ULKMU9B-3qIVKUyVRLrGchfNQrqNQTgnurH49uGGhAQpFEHdAd0e5C7D1xKjjb9u6fOdBXj2FwjvM99R98QhjQoT0lIpx5IT25RkTBmP958hLSSUef7ukgyOMWxmxTlss6owShwxHF_gus18kisMg7TEcCVoeY45DFeWVHAEMG9nB2GvMIRvHMFT96iKCf9MksYawxoAvDjKK5C7-x_Of9243XI_JHWZtCqnp4zvu1Qm3E2Z_x9NYEQgdYpx8Fpxjgm5g919AH4v0Tc1YtWPO5aKxRjGHtAiix8Q31ysxnJWLMCeba8xVkH5WRNa_4dNCIjTJ9a6xiPvjLb5nI9hTmDzlnMiy8oJYBHe4cWoMRUmjOUysal8etL5a_RsY8K09WGZSqzLFfOfll_bPh2ayfJqOQ1; path=/; HttpOnly"
        }, {
          "name" : "X-SourceFiles",
          "value" : "=?UTF-8?B?RDpcVmlydHVhbE9wdGltaXplci1SZWZhY3RvcmluZ1xDcm9wTWV0cmljcy5Wby5BcGlcQ3JvcE1ldHJpY3MuVm8uQXBpXGFwaVxtb2JpbGVcdjFcZmllbGRz?="
        }, {
          "name" : "X-Powered-By",
          "value" : "ASP.NET"
        }, {
          "name" : "Date",
          "value" : "Wed, 24 Apr 2019 20:55:02 GMT"
        }, {
          "name" : "Content-Length",
          "value" : "56"
        } ],
        "content" : {
          "size" : 56,
          "mimeType" : "application/json; charset=utf-8",
          "text" : "{\"message\":\"The field name already exists in the farm.\"}",
          "comment" : ""
        },
        "redirectURL" : "",
        "headersSize" : 940,
        "bodySize" : 56,
        "comment" : ""
      },
      "cache" : { },
      "timings" : {
        "comment" : "",
        "ssl" : -1,
        "wait" : 3173,
        "send" : 0,
        "receive" : 0,
        "blocked" : -1,
        "dns" : -1,
        "connect" : -1
      },
      "serverIPAddress" : "127.0.0.1",
      "comment" : "",
      "_katalonRequestInformation" : {
        "name" : "57",
        "testObjectId" : "Object Repository/VoGrow/Field/FieldPost",
        "harId" : "97be6e3d-6908-475d-9842-c9845cf0d270"
      },
      "time" : 3174
    } ],
    "comment" : ""
  }
}