{
  "log" : {
    "version" : "1.2",
    "creator" : {
      "name" : "BrowserMob Proxy",
      "version" : "2.1.5",
      "comment" : ""
    },
    "pages" : [ {
      "id" : "Page 0",
      "startedDateTime" : "2019-03-29T20:33:06.388Z",
      "title" : "Page 0",
      "pageTimings" : {
        "onLoad" : 30,
        "comment" : ""
      },
      "comment" : ""
    } ],
    "entries" : [ {
      "pageref" : "Page 0",
      "startedDateTime" : "2019-03-29T20:33:06.389Z",
      "request" : {
        "method" : "POST",
        "url" : "http://localhost:10520/WebAPI/api/admin/v1/users/?",
        "httpVersion" : "HTTP/1.1",
        "cookies" : [ ],
        "headers" : [ {
          "name" : "User-Agent",
          "value" : "Katalon Studio"
        }, {
          "name" : "Content-Type",
          "value" : "application/x-www-form-urlencoded"
        }, {
          "name" : "Authorization",
          "value" : "Bearer eyJ0eXAiOiJKV1QiLCJhbGciOiJIUzI1NiJ9.eyJ1bmlxdWVfbmFtZSI6ImNyb3BtZXRyaWNzdm8uZmllbGRjcmV3QGdtYWlsLmNvbSIsInJvbGUiOiJ1c2VyIiwic3ViIjoiY3JvcG1ldHJpY3N2by5maWVsZGNyZXdAZ21haWwuY29tIiwiaXNzIjoiQ3JvcE1ldHJpY3MiLCJhdWQiOiJhbGwiLCJleHAiOjE1NTM4OTU0ODYsIm5iZiI6MTU1Mzg5MTU4Nn0.5f1tNYhqG084HKLYC9yKSxlBDHDLRZen-4pLNsi8FXM"
        }, {
          "name" : "Host",
          "value" : "localhost:10520"
        }, {
          "name" : "Accept",
          "value" : "text/html, image/gif, image/jpeg, *; q=.2, */*; q=.2"
        }, {
          "name" : "Proxy-Connection",
          "value" : "keep-alive"
        }, {
          "name" : "Content-Length",
          "value" : "275"
        } ],
        "queryString" : [ ],
        "postData" : {
          "mimeType" : "application/x-www-form-urlencoded",
          "params" : [ {
            "name" : "password",
            "value" : "cropmetrics",
            "comment" : ""
          }, {
            "name" : "email",
            "value" : "cropmetricsvo.clientByFieldCrew@gmail.com",
            "comment" : ""
          }, {
            "name" : "fullname",
            "value" : "test validation",
            "comment" : ""
          }, {
            "name" : "phone",
            "value" : "123",
            "comment" : ""
          }, {
            "name" : "dealer",
            "value" : "x",
            "comment" : ""
          }, {
            "name" : "addressLine1",
            "value" : "address line 1 test validation",
            "comment" : ""
          }, {
            "name" : "addressLine2",
            "value" : "address line 2 test validation",
            "comment" : ""
          }, {
            "name" : "town",
            "value" : "townValidation",
            "comment" : ""
          }, {
            "name" : "state",
            "value" : "stateValidation",
            "comment" : ""
          }, {
            "name" : "zip",
            "value" : "xx",
            "comment" : ""
          }, {
            "name" : "country",
            "value" : "xx",
            "comment" : ""
          }, {
            "name" : "roles",
            "value" : "Client",
            "comment" : ""
          } ],
          "comment" : ""
        },
        "headersSize" : 619,
        "bodySize" : 275,
        "comment" : ""
      },
      "response" : {
        "status" : 401,
        "statusText" : "Unauthorized",
        "httpVersion" : "HTTP/1.1",
        "cookies" : [ {
          "name" : ".ASPROLES",
          "value" : "jKTrTgvDn6Yk5UMKQblFM5zl2yoqnFFyg_CkxD99iPvAlrGDoQEQFWpI5-WbbV6rjeNzhNYetjvgnlXoNQJ1MVo_HE5uaP3TEUbXYopvQm05N0rz9T0ajWKwNkz6QxqfOPex2TBfGtilJvIuIYPufWydkqvU3B4h_1a3g7RXrp9ja0A1rq_pI_AsFErTTmkWmey979nl8IN22FzMk_wxqu7LJjly7yWogyyzJrnivUX0y_6LBu578pHqnxLjdiCU6praZK5lt4saCYbvxoBCzJBGmEertbasyHg8kvAMxakvm1SoK4_kUeGmUlXD0WCKKYL_bN8mDklfxXH9D1JOxDHFDieNd-Q_uXa9g_U19DgubSecYJgqpEoia660B2KBhHN-Ih6DzZQkzucTP002ndwhAr6zpmmm7j2z_oAApkPnC7bUOEPqEjy6WxHFjvWMm1w1GgenJgZ8ToDXcmfupgSujf-Sx7PYz1k5Z6wx5EJg5nhg2jLjjc1hcfSVRiVIuxJpt2VLgeZYMoVOMyr6fIA7wTM1",
          "path" : "/",
          "httpOnly" : true,
          "secure" : false,
          "comment" : ""
        } ],
        "headers" : [ {
          "name" : "Cache-Control",
          "value" : "private"
        }, {
          "name" : "Content-Type",
          "value" : "application/json; charset=utf-8"
        }, {
          "name" : "Server",
          "value" : "Microsoft-IIS/10.0"
        }, {
          "name" : "Set-Cookie",
          "value" : ".ASPROLES=jKTrTgvDn6Yk5UMKQblFM5zl2yoqnFFyg_CkxD99iPvAlrGDoQEQFWpI5-WbbV6rjeNzhNYetjvgnlXoNQJ1MVo_HE5uaP3TEUbXYopvQm05N0rz9T0ajWKwNkz6QxqfOPex2TBfGtilJvIuIYPufWydkqvU3B4h_1a3g7RXrp9ja0A1rq_pI_AsFErTTmkWmey979nl8IN22FzMk_wxqu7LJjly7yWogyyzJrnivUX0y_6LBu578pHqnxLjdiCU6praZK5lt4saCYbvxoBCzJBGmEertbasyHg8kvAMxakvm1SoK4_kUeGmUlXD0WCKKYL_bN8mDklfxXH9D1JOxDHFDieNd-Q_uXa9g_U19DgubSecYJgqpEoia660B2KBhHN-Ih6DzZQkzucTP002ndwhAr6zpmmm7j2z_oAApkPnC7bUOEPqEjy6WxHFjvWMm1w1GgenJgZ8ToDXcmfupgSujf-Sx7PYz1k5Z6wx5EJg5nhg2jLjjc1hcfSVRiVIuxJpt2VLgeZYMoVOMyr6fIA7wTM1; path=/; HttpOnly"
        }, {
          "name" : "X-SourceFiles",
          "value" : "=?UTF-8?B?RDpcVmlydHVhbE9wdGltaXplci1SZWZhY3RvcmluZ1xDcm9wTWV0cmljcy5Wby5BcGlcQ3JvcE1ldHJpY3MuVm8uQXBpXGFwaVxhZG1pblx2MVx1c2Vyc1w=?="
        }, {
          "name" : "X-Powered-By",
          "value" : "ASP.NET"
        }, {
          "name" : "Date",
          "value" : "Fri, 29 Mar 2019 20:33:06 GMT"
        }, {
          "name" : "Content-Length",
          "value" : "61"
        } ],
        "content" : {
          "size" : 61,
          "mimeType" : "application/json; charset=utf-8",
          "text" : "{\"message\":\"Authorization has been denied for this request.\"}",
          "comment" : ""
        },
        "redirectURL" : "",
        "headersSize" : 941,
        "bodySize" : 61,
        "comment" : ""
      },
      "cache" : { },
      "timings" : {
        "comment" : "",
        "ssl" : -1,
        "send" : 0,
        "wait" : 27,
        "connect" : -1,
        "blocked" : -1,
        "receive" : 0,
        "dns" : -1
      },
      "serverIPAddress" : "127.0.0.1",
      "comment" : "",
      "_katalonRequestInformation" : {
        "name" : "97",
        "testObjectId" : "Object Repository/VoPro/Account/api_admin_v1_users",
        "harId" : "0ea38835-f208-4c54-9640-d740cc0dc860"
      },
      "time" : 28
    } ],
    "comment" : ""
  }
}