{
  "log" : {
    "version" : "1.2",
    "creator" : {
      "name" : "BrowserMob Proxy",
      "version" : "2.1.5",
      "comment" : ""
    },
    "pages" : [ {
      "id" : "Page 0",
      "startedDateTime" : "2019-04-11T16:39:56.418Z",
      "title" : "Page 0",
      "pageTimings" : {
        "onLoad" : 78,
        "comment" : ""
      },
      "comment" : ""
    } ],
    "entries" : [ {
      "pageref" : "Page 0",
      "startedDateTime" : "2019-04-11T16:39:56.419Z",
      "request" : {
        "method" : "POST",
        "url" : "http://localhost:10520/WebAPI/api/mobile/v1/farms/?",
        "httpVersion" : "HTTP/1.1",
        "cookies" : [ ],
        "headers" : [ {
          "name" : "User-Agent",
          "value" : "Katalon Studio"
        }, {
          "name" : "Content-Type",
          "value" : "application/json"
        }, {
          "name" : "Authorization",
          "value" : "Bearer eyJ0eXAiOiJKV1QiLCJhbGciOiJIUzI1NiJ9.eyJ1bmlxdWVfbmFtZSI6Implbm55Lm1hbGRvbmFkby50eC5hZ2VudC5yb0BnbWFpbC5jb20iLCJyb2xlIjoidXNlciIsInN1YiI6Implbm55Lm1hbGRvbmFkby50eC5hZ2VudC5yb0BnbWFpbC5jb20iLCJpc3MiOiJDcm9wTWV0cmljcyIsImF1ZCI6ImFsbCIsImV4cCI6MTU1NTAwNDY5NiwibmJmIjoxNTU1MDAwNzk2fQ.U4A0QPfSCh6sz4ZLdHB4l0SJ7oxKg65c-pk54yPeoU4"
        }, {
          "name" : "Host",
          "value" : "localhost:10520"
        }, {
          "name" : "Accept",
          "value" : "text/html, image/gif, image/jpeg, *; q=.2, */*; q=.2"
        }, {
          "name" : "Proxy-Connection",
          "value" : "keep-alive"
        }, {
          "name" : "Content-Length",
          "value" : "60"
        } ],
        "queryString" : [ ],
        "postData" : {
          "mimeType" : "application/json",
          "text" : "{\"name\": \"Farm 2 created by dealer read only\", \"user_id\": 3}",
          "comment" : ""
        },
        "headersSize" : 613,
        "bodySize" : 60,
        "comment" : ""
      },
      "response" : {
        "status" : 201,
        "statusText" : "Created",
        "httpVersion" : "HTTP/1.1",
        "cookies" : [ {
          "name" : ".ASPROLES",
          "value" : "jhl8gz7nMz-XpWdeO8lcQITOMqtKSp5xkTACmzkngYsDp4-r1xlA8QQ5P2QzGmeBCvvlMUUzm6gejQO87xPg9tXZW6kXn0XTYZz83s1tqh-ivWEFKR8C9qprjCtilvdniiSmaM82Y8LLGZfXYcpikYd8OzErLELWhyJ7kE7N3BeuX_JdLOUZt-9uZ_gLb1n4YnWFWyTajF7mgGOrjuX-6kPDqsYMtzThkGSsG26VY6mGRgfH8Nhxg2WbmDUlHHi7H693yNvGyKpG16iRXh9PgqvmOLRmHU3Hz9whBZ4_RaHodRQI-HJ1Zfx1rdjIcWe84or_SdZCeCkxTmoYlJ-CQRjmxxSXb0qvS-VAVLLNsCXA80PN-L-yBsyf_v7b4sZlpUSFmK0AFp2J7sI9Pb-PBfh7nYd9O5cYBK7rQhtVwi6I0TPfCX0PU6Z5AKFyQOXF2XkONNMSQV0Mjwpmf74CInXxtnvg-NOa0gcYgFy6PhPOKn9OggkTaFFW6Wp2grvqVxWnpbOXGCVKqBWx8AQbUTX0JJQ1",
          "path" : "/",
          "httpOnly" : true,
          "secure" : false,
          "comment" : ""
        } ],
        "headers" : [ {
          "name" : "Cache-Control",
          "value" : "private"
        }, {
          "name" : "Content-Type",
          "value" : "application/json; charset=utf-8"
        }, {
          "name" : "Location",
          "value" : "api/mobile/v1/farms/8"
        }, {
          "name" : "Server",
          "value" : "Microsoft-IIS/10.0"
        }, {
          "name" : "Set-Cookie",
          "value" : ".ASPROLES=jhl8gz7nMz-XpWdeO8lcQITOMqtKSp5xkTACmzkngYsDp4-r1xlA8QQ5P2QzGmeBCvvlMUUzm6gejQO87xPg9tXZW6kXn0XTYZz83s1tqh-ivWEFKR8C9qprjCtilvdniiSmaM82Y8LLGZfXYcpikYd8OzErLELWhyJ7kE7N3BeuX_JdLOUZt-9uZ_gLb1n4YnWFWyTajF7mgGOrjuX-6kPDqsYMtzThkGSsG26VY6mGRgfH8Nhxg2WbmDUlHHi7H693yNvGyKpG16iRXh9PgqvmOLRmHU3Hz9whBZ4_RaHodRQI-HJ1Zfx1rdjIcWe84or_SdZCeCkxTmoYlJ-CQRjmxxSXb0qvS-VAVLLNsCXA80PN-L-yBsyf_v7b4sZlpUSFmK0AFp2J7sI9Pb-PBfh7nYd9O5cYBK7rQhtVwi6I0TPfCX0PU6Z5AKFyQOXF2XkONNMSQV0Mjwpmf74CInXxtnvg-NOa0gcYgFy6PhPOKn9OggkTaFFW6Wp2grvqVxWnpbOXGCVKqBWx8AQbUTX0JJQ1; path=/; HttpOnly"
        }, {
          "name" : "X-SourceFiles",
          "value" : "=?UTF-8?B?RDpcVmlydHVhbE9wdGltaXplci1SZWZhY3RvcmluZ1xDcm9wTWV0cmljcy5Wby5BcGlcQ3JvcE1ldHJpY3MuVm8uQXBpXGFwaVxtb2JpbGVcdjFcZmFybXNc?="
        }, {
          "name" : "X-Powered-By",
          "value" : "ASP.NET"
        }, {
          "name" : "Date",
          "value" : "Thu, 11 Apr 2019 16:39:56 GMT"
        }, {
          "name" : "Content-Length",
          "value" : "64"
        } ],
        "content" : {
          "size" : 64,
          "mimeType" : "application/json; charset=utf-8",
          "text" : "{\"id\":8,\"name\":\"Farm 2 created by dealer read only\",\"user_id\":3}",
          "comment" : ""
        },
        "redirectURL" : "",
        "headersSize" : 969,
        "bodySize" : 64,
        "comment" : ""
      },
      "cache" : { },
      "timings" : {
        "comment" : "",
        "ssl" : -1,
        "send" : 0,
        "wait" : 74,
        "receive" : 0,
        "connect" : -1,
        "dns" : -1,
        "blocked" : -1
      },
      "serverIPAddress" : "127.0.0.1",
      "comment" : "",
      "_katalonRequestInformation" : {
        "name" : "57",
        "testObjectId" : "Object Repository/VoGrow/Farm/FarmPost",
        "harId" : "2942669f-82f8-41ad-b6a1-cf506e2f6a3b"
      },
      "time" : 75
    } ],
    "comment" : ""
  }
}