{
  "log" : {
    "version" : "1.2",
    "creator" : {
      "name" : "BrowserMob Proxy",
      "version" : "2.1.5",
      "comment" : ""
    },
    "pages" : [ {
      "id" : "Page 0",
      "startedDateTime" : "2019-04-24T20:30:50.671Z",
      "title" : "Page 0",
      "pageTimings" : {
        "onLoad" : 3399,
        "comment" : ""
      },
      "comment" : ""
    } ],
    "entries" : [ {
      "pageref" : "Page 0",
      "startedDateTime" : "2019-04-24T20:30:50.672Z",
      "request" : {
        "method" : "POST",
        "url" : "http://localhost:10520/WebAPI/api/mobile/v1/fields?",
        "httpVersion" : "HTTP/1.1",
        "cookies" : [ ],
        "headers" : [ {
          "name" : "User-Agent",
          "value" : "Katalon Studio"
        }, {
          "name" : "Content-Type",
          "value" : "application/json"
        }, {
          "name" : "Authorization",
          "value" : "Bearer eyJ0eXAiOiJKV1QiLCJhbGciOiJIUzI1NiJ9.eyJ1bmlxdWVfbmFtZSI6Implbm55Lm1hbGRvbmFkby50eDFAZ21haWwuY29tIiwicm9sZSI6InVzZXIiLCJzdWIiOiJqZW5ueS5tYWxkb25hZG8udHgxQGdtYWlsLmNvbSIsImlzcyI6IkNyb3BNZXRyaWNzIiwiYXVkIjoiYWxsIiwiZXhwIjoxNTU2MTQxNzUwLCJuYmYiOjE1NTYxMzc4NTB9.J4WbEQr6y-8IRVHUpbUn8V3AS_ftEeHbHouaQWp1gu0"
        }, {
          "name" : "Host",
          "value" : "localhost:10520"
        }, {
          "name" : "Accept",
          "value" : "text/html, image/gif, image/jpeg, *; q=.2, */*; q=.2"
        }, {
          "name" : "Proxy-Connection",
          "value" : "keep-alive"
        }, {
          "name" : "Content-Length",
          "value" : "391"
        } ],
        "queryString" : [ ],
        "postData" : {
          "mimeType" : "application/json",
          "text" : "{\"field\":{\"farm_id\":7,\"name\":\"Field without x value in boundary\",\"boundary\":{\"boundaries\":[{\"boundary\":{\"coords\":[{\"x\":-101.49568751},{\"x\":-101.50049403,\"y\":37.14647907},{\"x\":-101.50049403,\"y\":37.14264773},{\"x\":-101.49723246,\"y\":37.1411425},{\"x\":-101.49019435,\"y\":37.14223722},{\"x\":-101.48933604,\"y\":37.14620541},{\"x\":-101.49294093,\"y\":37.14866833},{\"x\":-101.49568751,\"y\":37.14976293}]}}]}}}",
          "comment" : ""
        },
        "headersSize" : 592,
        "bodySize" : 391,
        "comment" : ""
      },
      "response" : {
        "status" : 400,
        "statusText" : "Bad Request",
        "httpVersion" : "HTTP/1.1",
        "cookies" : [ {
          "name" : ".ASPROLES",
          "value" : "dA-AMrSMdRYPKtWJu7Xl1xXX5MqnvIDI6wsBFvs7gpWp2R4Ya6nti1A2rKDwITCVyDIr_lAvWNj6GadB4BCizE8HrKFzRlFGprpz8XmnndfdwevfjbO2fnv7hT1eBbAzrJLhgF0dTDP3Qguo0FEGgj-nTcZ4nAIk3zusQ8FvpB3LFxSPraT4BgEmNLiKZbKp4BLJH9LV5cWwaTDIfSPsD7jMyFa9scMcyPnIOkc2GI48ntkUoODIgXIDOzzhiHs478mn0kNlb38evLgBxSOo1aEa_34qDDxNOb_uTogq3Q4_CFmwI3nO7stUSuGvCiD_4qpzKDl27dRvWjUanpUKaIxcv9sJD2Mzoi30LiNY3G9IyFpVCgneihXXBP7S2yCCVSwcEeH6v2IldIdbdMrAmAL05N6vTE5bRatQaf-t2bS1bP-iKFBrNeOLXDwMB2kkyCzo8-HPIcYnaqRaa-kdcjA7appR55UKWJSsmfrVq9aKTksxxYETccf96RHUkqMchhfTOx1XWYRzPhFo6hNHQILl0nM1",
          "path" : "/",
          "httpOnly" : true,
          "secure" : false,
          "comment" : ""
        } ],
        "headers" : [ {
          "name" : "Cache-Control",
          "value" : "private"
        }, {
          "name" : "Content-Type",
          "value" : "application/json; charset=utf-8"
        }, {
          "name" : "Server",
          "value" : "Microsoft-IIS/10.0"
        }, {
          "name" : "Set-Cookie",
          "value" : ".ASPROLES=dA-AMrSMdRYPKtWJu7Xl1xXX5MqnvIDI6wsBFvs7gpWp2R4Ya6nti1A2rKDwITCVyDIr_lAvWNj6GadB4BCizE8HrKFzRlFGprpz8XmnndfdwevfjbO2fnv7hT1eBbAzrJLhgF0dTDP3Qguo0FEGgj-nTcZ4nAIk3zusQ8FvpB3LFxSPraT4BgEmNLiKZbKp4BLJH9LV5cWwaTDIfSPsD7jMyFa9scMcyPnIOkc2GI48ntkUoODIgXIDOzzhiHs478mn0kNlb38evLgBxSOo1aEa_34qDDxNOb_uTogq3Q4_CFmwI3nO7stUSuGvCiD_4qpzKDl27dRvWjUanpUKaIxcv9sJD2Mzoi30LiNY3G9IyFpVCgneihXXBP7S2yCCVSwcEeH6v2IldIdbdMrAmAL05N6vTE5bRatQaf-t2bS1bP-iKFBrNeOLXDwMB2kkyCzo8-HPIcYnaqRaa-kdcjA7appR55UKWJSsmfrVq9aKTksxxYETccf96RHUkqMchhfTOx1XWYRzPhFo6hNHQILl0nM1; path=/; HttpOnly"
        }, {
          "name" : "X-SourceFiles",
          "value" : "=?UTF-8?B?RDpcVmlydHVhbE9wdGltaXplci1SZWZhY3RvcmluZ1xDcm9wTWV0cmljcy5Wby5BcGlcQ3JvcE1ldHJpY3MuVm8uQXBpXGFwaVxtb2JpbGVcdjFcZmllbGRz?="
        }, {
          "name" : "X-Powered-By",
          "value" : "ASP.NET"
        }, {
          "name" : "Date",
          "value" : "Wed, 24 Apr 2019 20:30:54 GMT"
        }, {
          "name" : "Content-Length",
          "value" : "119"
        } ],
        "content" : {
          "size" : 119,
          "mimeType" : "application/json; charset=utf-8",
          "text" : "{\"message\":\"The Boundary is not valid. IllegalArgumentException: Points of LinearRing do not form a closed linestring\"}",
          "comment" : ""
        },
        "redirectURL" : "",
        "headersSize" : 941,
        "bodySize" : 119,
        "comment" : ""
      },
      "cache" : { },
      "timings" : {
        "comment" : "",
        "ssl" : -1,
        "receive" : 1,
        "send" : 0,
        "wait" : 3394,
        "connect" : -1,
        "blocked" : -1,
        "dns" : -1
      },
      "serverIPAddress" : "127.0.0.1",
      "comment" : "",
      "_katalonRequestInformation" : {
        "name" : "108",
        "testObjectId" : "Object Repository/VoGrow/Field/FieldPost",
        "harId" : "b55d11de-79a9-4e11-97b7-fb24a4f74327"
      },
      "time" : 3395
    } ],
    "comment" : ""
  }
}