{
  "log" : {
    "version" : "1.2",
    "creator" : {
      "name" : "BrowserMob Proxy",
      "version" : "2.1.5",
      "comment" : ""
    },
    "pages" : [ {
      "id" : "Page 0",
      "startedDateTime" : "2019-04-24T20:23:42.451Z",
      "title" : "Page 0",
      "pageTimings" : {
        "onLoad" : 10090,
        "comment" : ""
      },
      "comment" : ""
    } ],
    "entries" : [ {
      "pageref" : "Page 0",
      "startedDateTime" : "2019-04-24T20:23:42.452Z",
      "request" : {
        "method" : "POST",
        "url" : "http://localhost:10520/WebAPI/api/mobile/v1/farms/?",
        "httpVersion" : "HTTP/1.1",
        "cookies" : [ ],
        "headers" : [ {
          "name" : "User-Agent",
          "value" : "Katalon Studio"
        }, {
          "name" : "Content-Type",
          "value" : "application/json"
        }, {
          "name" : "Authorization",
          "value" : "Bearer eyJ0eXAiOiJKV1QiLCJhbGciOiJIUzI1NiJ9.eyJ1bmlxdWVfbmFtZSI6Implbm55Lm1hbGRvbmFkby50eDFAZ21haWwuY29tIiwicm9sZSI6InVzZXIiLCJzdWIiOiJqZW5ueS5tYWxkb25hZG8udHgxQGdtYWlsLmNvbSIsImlzcyI6IkNyb3BNZXRyaWNzIiwiYXVkIjoiYWxsIiwiZXhwIjoxNTU2MTQxMzIyLCJuYmYiOjE1NTYxMzc0MjJ9.sjO8ESC9Bk7asqj-YsrJsyIMjyp8OdPCN9zqQqlPCno"
        }, {
          "name" : "Host",
          "value" : "localhost:10520"
        }, {
          "name" : "Accept",
          "value" : "text/html, image/gif, image/jpeg, *; q=.2, */*; q=.2"
        }, {
          "name" : "Proxy-Connection",
          "value" : "keep-alive"
        }, {
          "name" : "Content-Length",
          "value" : "94"
        } ],
        "queryString" : [ ],
        "postData" : {
          "mimeType" : "application/json",
          "text" : "{\"name\": \"Farm not created into the grower does not assined the dealer account\", \"user_id\": 4}",
          "comment" : ""
        },
        "headersSize" : 591,
        "bodySize" : 94,
        "comment" : ""
      },
      "response" : {
        "status" : 400,
        "statusText" : "Bad Request",
        "httpVersion" : "HTTP/1.1",
        "cookies" : [ {
          "name" : ".ASPROLES",
          "value" : "kyr8dOj4G-5iUak6-cbmvsspbn9-6BBFZFtwxNDxw-CF4N_y7pch6HB2c0REq1L9RDq6Qf3Pqy4n-HKTrESvjjBH1fEfQSRLWOTJ3z-KbfoDtcfLMHNOhcTAFoDEKsBxDzOdob0yFTz9vPt_x9IoRfg-GhTDfE8-S3yYSW-886d5VChDFgHM7OycWALun5Oy__44PybpwIC2_ZQ8az8EleegToSjR8gm3xNdBBh3knFxcqNtyxZYJYe20rsALGbkqRFWYEgoGrmZhX240OjDI8o4ljUW4x435l6uD7zIy9b98Fatr4zOHV-sSIFhhNdWQH7Ug-q3d8uuakEEjXHKp-J3g16A1B2nF0w8PyPReUCvt1Yr8PsECEJzgpM7NVzF0Hl-Vhi_KRy0SjfO5vgo-Om_JWMEKdOgNe9AiWkVcYP-_IcrH7b_cBAfFKlNdA0EAh4xuR12Si9Pjusnymuh4Sc4a7MdXUj6aHeU4THtUpk9AahvU0SUZtVr7M-gcToy3Q3dMIqRe7ZAtyNQ5uyARyXyG4k1",
          "path" : "/",
          "httpOnly" : true,
          "secure" : false,
          "comment" : ""
        } ],
        "headers" : [ {
          "name" : "Cache-Control",
          "value" : "private"
        }, {
          "name" : "Content-Type",
          "value" : "application/json; charset=utf-8"
        }, {
          "name" : "Server",
          "value" : "Microsoft-IIS/10.0"
        }, {
          "name" : "Set-Cookie",
          "value" : ".ASPROLES=kyr8dOj4G-5iUak6-cbmvsspbn9-6BBFZFtwxNDxw-CF4N_y7pch6HB2c0REq1L9RDq6Qf3Pqy4n-HKTrESvjjBH1fEfQSRLWOTJ3z-KbfoDtcfLMHNOhcTAFoDEKsBxDzOdob0yFTz9vPt_x9IoRfg-GhTDfE8-S3yYSW-886d5VChDFgHM7OycWALun5Oy__44PybpwIC2_ZQ8az8EleegToSjR8gm3xNdBBh3knFxcqNtyxZYJYe20rsALGbkqRFWYEgoGrmZhX240OjDI8o4ljUW4x435l6uD7zIy9b98Fatr4zOHV-sSIFhhNdWQH7Ug-q3d8uuakEEjXHKp-J3g16A1B2nF0w8PyPReUCvt1Yr8PsECEJzgpM7NVzF0Hl-Vhi_KRy0SjfO5vgo-Om_JWMEKdOgNe9AiWkVcYP-_IcrH7b_cBAfFKlNdA0EAh4xuR12Si9Pjusnymuh4Sc4a7MdXUj6aHeU4THtUpk9AahvU0SUZtVr7M-gcToy3Q3dMIqRe7ZAtyNQ5uyARyXyG4k1; path=/; HttpOnly"
        }, {
          "name" : "X-SourceFiles",
          "value" : "=?UTF-8?B?RDpcVmlydHVhbE9wdGltaXplci1SZWZhY3RvcmluZ1xDcm9wTWV0cmljcy5Wby5BcGlcQ3JvcE1ldHJpY3MuVm8uQXBpXGFwaVxtb2JpbGVcdjFcZmFybXNc?="
        }, {
          "name" : "X-Powered-By",
          "value" : "ASP.NET"
        }, {
          "name" : "Date",
          "value" : "Wed, 24 Apr 2019 20:23:52 GMT"
        }, {
          "name" : "Content-Length",
          "value" : "54"
        } ],
        "content" : {
          "size" : 54,
          "mimeType" : "application/json; charset=utf-8",
          "text" : "{\"message\":\"The grower is not related to the dealer.\"}",
          "comment" : ""
        },
        "redirectURL" : "",
        "headersSize" : 940,
        "bodySize" : 54,
        "comment" : ""
      },
      "cache" : { },
      "timings" : {
        "comment" : "",
        "ssl" : -1,
        "blocked" : -1,
        "connect" : -1,
        "receive" : 0,
        "dns" : -1,
        "send" : 0,
        "wait" : 10020
      },
      "serverIPAddress" : "127.0.0.1",
      "comment" : "",
      "_katalonRequestInformation" : {
        "name" : "5",
        "testObjectId" : "Object Repository/VoGrow/Farm/FarmPost",
        "harId" : "780a3317-dfdc-427e-bbfa-d3adb0bd529c"
      },
      "time" : 10022
    } ],
    "comment" : ""
  }
}