{
  "log" : {
    "version" : "1.2",
    "creator" : {
      "name" : "BrowserMob Proxy",
      "version" : "2.1.5",
      "comment" : ""
    },
    "pages" : [ {
      "id" : "Page 0",
      "startedDateTime" : "2019-03-28T18:58:54.697Z",
      "title" : "Page 0",
      "pageTimings" : {
        "onLoad" : 1556,
        "comment" : ""
      },
      "comment" : ""
    } ],
    "entries" : [ {
      "pageref" : "Page 0",
      "startedDateTime" : "2019-03-28T18:58:54.705Z",
      "request" : {
        "method" : "POST",
        "url" : "http://localhost:10520/WebAPI/api/admin/v1/users/?",
        "httpVersion" : "HTTP/1.1",
        "cookies" : [ ],
        "headers" : [ {
          "name" : "User-Agent",
          "value" : "Katalon Studio"
        }, {
          "name" : "Content-Type",
          "value" : "application/x-www-form-urlencoded"
        }, {
          "name" : "Authorization",
          "value" : "Bearer eyJ0eXAiOiJKV1QiLCJhbGciOiJIUzI1NiJ9.eyJ1bmlxdWVfbmFtZSI6ImFkbWluIiwicm9sZSI6InVzZXIiLCJzdWIiOiJhZG1pbiIsImlzcyI6IkNyb3BNZXRyaWNzIiwiYXVkIjoiYWxsIiwiZXhwIjoxNTUzODAzNDM0LCJuYmYiOjE1NTM3OTk1MzR9.WJQd7ax2pFigFNOzhqOkRU87_wnVRlYUQlR_J_sX-HA"
        }, {
          "name" : "Host",
          "value" : "localhost:10520"
        }, {
          "name" : "Accept",
          "value" : "text/html, image/gif, image/jpeg, *; q=.2, */*; q=.2"
        }, {
          "name" : "Proxy-Connection",
          "value" : "keep-alive"
        }, {
          "name" : "Content-Length",
          "value" : "342"
        } ],
        "queryString" : [ ],
        "postData" : {
          "mimeType" : "application/x-www-form-urlencoded",
          "params" : [ {
            "name" : "password",
            "value" : "     1",
            "comment" : ""
          }, {
            "name" : "email",
            "value" : "cropmetricsvo.passwithspaces@gmail.com",
            "comment" : ""
          }, {
            "name" : "fullname",
            "value" : "test validation phone attribute as characters instead of numbers",
            "comment" : ""
          }, {
            "name" : "phone",
            "value" : "123",
            "comment" : ""
          }, {
            "name" : "dealer",
            "value" : "x",
            "comment" : ""
          }, {
            "name" : "addressLine1",
            "value" : "address line 1 test validation",
            "comment" : ""
          }, {
            "name" : "addressLine2",
            "value" : "address line 1 test validation",
            "comment" : ""
          }, {
            "name" : "town",
            "value" : "townValidation",
            "comment" : ""
          }, {
            "name" : "state",
            "value" : "stateValidation",
            "comment" : ""
          }, {
            "name" : "zip",
            "value" : "zipValidation",
            "comment" : ""
          }, {
            "name" : "country",
            "value" : "countryValidation",
            "comment" : ""
          }, {
            "name" : "roles",
            "value" : "Client",
            "comment" : ""
          } ],
          "comment" : ""
        },
        "headersSize" : 544,
        "bodySize" : 342,
        "comment" : ""
      },
      "response" : {
        "status" : 200,
        "statusText" : "OK",
        "httpVersion" : "HTTP/1.1",
        "cookies" : [ {
          "name" : ".ASPROLES",
          "value" : "udZCrbby7Wm0TZ44VfOtye95dpLwCbTorteH4IIiIt8y_I2F2vC4QI1gn9QHAl3pMT6dIN7MYrBqylrzwuldN2GjikzMRv0rdx4soNxknS50Q_5WX5daPwZUbhiEih1TYX3a2hjB2pI68Kcdwl5OxngGim_4kkHD8krVissjyTmZdmGLVvhjDyjhGj-BGp3BqPC61x0sRpaVqwxRPD-_hOR-mMdY9Hi2PK97mpXVbxjUdTNw2AqME4rYh4aMhkNW0s_8HNKdiRbwg3DiahD_Ic4QSYMzim2xVfcGrL7f9XDhZ1ib4uzC0wVS8aaevx7Z02T5HNIoKGl_8kARNL9eAngx-hxO1ATEpqvxonJru5yYZ2IqOBQ_5AYTHWoQVWLKKGOV40bLQobp3xPVdyXW_GjJBNHXUqDu-Sy_M1x9urdgwdIcDUqihRJd4HQwUFzlhqvFNn_sbSMBRCUR8acqzh7aWFDYH3o8gwC5jELEMJrDp6At0",
          "path" : "/",
          "httpOnly" : true,
          "secure" : false,
          "comment" : ""
        } ],
        "headers" : [ {
          "name" : "Cache-Control",
          "value" : "private"
        }, {
          "name" : "Content-Type",
          "value" : "application/json; charset=utf-8"
        }, {
          "name" : "Server",
          "value" : "Microsoft-IIS/10.0"
        }, {
          "name" : "Set-Cookie",
          "value" : ".ASPROLES=udZCrbby7Wm0TZ44VfOtye95dpLwCbTorteH4IIiIt8y_I2F2vC4QI1gn9QHAl3pMT6dIN7MYrBqylrzwuldN2GjikzMRv0rdx4soNxknS50Q_5WX5daPwZUbhiEih1TYX3a2hjB2pI68Kcdwl5OxngGim_4kkHD8krVissjyTmZdmGLVvhjDyjhGj-BGp3BqPC61x0sRpaVqwxRPD-_hOR-mMdY9Hi2PK97mpXVbxjUdTNw2AqME4rYh4aMhkNW0s_8HNKdiRbwg3DiahD_Ic4QSYMzim2xVfcGrL7f9XDhZ1ib4uzC0wVS8aaevx7Z02T5HNIoKGl_8kARNL9eAngx-hxO1ATEpqvxonJru5yYZ2IqOBQ_5AYTHWoQVWLKKGOV40bLQobp3xPVdyXW_GjJBNHXUqDu-Sy_M1x9urdgwdIcDUqihRJd4HQwUFzlhqvFNn_sbSMBRCUR8acqzh7aWFDYH3o8gwC5jELEMJrDp6At0; path=/; HttpOnly"
        }, {
          "name" : "X-SourceFiles",
          "value" : "=?UTF-8?B?RDpcVmlydHVhbE9wdGltaXplci1SZWZhY3RvcmluZ1xDcm9wTWV0cmljcy5Wby5BcGlcQ3JvcE1ldHJpY3MuVm8uQXBpXGFwaVxhZG1pblx2MVx1c2Vyc1w=?="
        }, {
          "name" : "X-Powered-By",
          "value" : "ASP.NET"
        }, {
          "name" : "Date",
          "value" : "Thu, 28 Mar 2019 18:58:56 GMT"
        }, {
          "name" : "Content-Length",
          "value" : "9"
        } ],
        "content" : {
          "size" : 9,
          "mimeType" : "application/json; charset=utf-8",
          "text" : "{\"id\":14}",
          "comment" : ""
        },
        "redirectURL" : "",
        "headersSize" : 887,
        "bodySize" : 9,
        "comment" : ""
      },
      "cache" : { },
      "timings" : {
        "comment" : "",
        "ssl" : -1,
        "connect" : -1,
        "blocked" : -1,
        "receive" : 1,
        "dns" : -1,
        "wait" : 1540,
        "send" : 0
      },
      "serverIPAddress" : "127.0.0.1",
      "comment" : "",
      "_katalonRequestInformation" : {
        "name" : "35",
        "testObjectId" : "Object Repository/VoPro/Account/api_admin_v1_users",
        "harId" : "b0fd27ac-2fff-41a0-907f-c6a487446cc5"
      },
      "time" : 1541
    } ],
    "comment" : ""
  }
}