{
  "log" : {
    "version" : "1.2",
    "creator" : {
      "name" : "BrowserMob Proxy",
      "version" : "2.1.5",
      "comment" : ""
    },
    "pages" : [ {
      "id" : "Page 0",
      "startedDateTime" : "2019-04-24T20:28:49.436Z",
      "title" : "Page 0",
      "pageTimings" : {
        "onLoad" : 3147,
        "comment" : ""
      },
      "comment" : ""
    } ],
    "entries" : [ {
      "pageref" : "Page 0",
      "startedDateTime" : "2019-04-24T20:28:49.437Z",
      "request" : {
        "method" : "POST",
        "url" : "http://localhost:10520/WebAPI/api/mobile/v1/fields?",
        "httpVersion" : "HTTP/1.1",
        "cookies" : [ ],
        "headers" : [ {
          "name" : "User-Agent",
          "value" : "Katalon Studio"
        }, {
          "name" : "Content-Type",
          "value" : "application/json"
        }, {
          "name" : "Authorization",
          "value" : "Bearer eyJ0eXAiOiJKV1QiLCJhbGciOiJIUzI1NiJ9.eyJ1bmlxdWVfbmFtZSI6Implbm55Lm1hbGRvbmFkby50eDFAZ21haWwuY29tIiwicm9sZSI6InVzZXIiLCJzdWIiOiJqZW5ueS5tYWxkb25hZG8udHgxQGdtYWlsLmNvbSIsImlzcyI6IkNyb3BNZXRyaWNzIiwiYXVkIjoiYWxsIiwiZXhwIjoxNTU2MTQxNjI5LCJuYmYiOjE1NTYxMzc3Mjl9.Ee-2K_BukxjMGXe3y4I9O5rofblQfzKvjSVcJ-wjedg"
        }, {
          "name" : "Host",
          "value" : "localhost:10520"
        }, {
          "name" : "Accept",
          "value" : "text/html, image/gif, image/jpeg, *; q=.2, */*; q=.2"
        }, {
          "name" : "Proxy-Connection",
          "value" : "keep-alive"
        }, {
          "name" : "Content-Length",
          "value" : "402"
        } ],
        "queryString" : [ ],
        "postData" : {
          "mimeType" : "application/json",
          "text" : "{\"field\":{\"farm_id\":333333,\"name\":\"Field by other acccount\",\"boundary\":{\"boundaries\":[{\"boundary\":{\"coords\":[{\"x\":-101.49568751,\"y\":37.14976293},{\"x\":-101.50049403,\"y\":37.14647907},{\"x\":-101.50049403,\"y\":37.14264773},{\"x\":-101.49723246,\"y\":37.1411425},{\"x\":-101.49019435,\"y\":37.14223722},{\"x\":-101.48933604,\"y\":37.14620541},{\"x\":-101.49294093,\"y\":37.14866833},{\"x\":-101.49568751,\"y\":37.14976293}]}}]}}}",
          "comment" : ""
        },
        "headersSize" : 592,
        "bodySize" : 402,
        "comment" : ""
      },
      "response" : {
        "status" : 400,
        "statusText" : "Bad Request",
        "httpVersion" : "HTTP/1.1",
        "cookies" : [ {
          "name" : ".ASPROLES",
          "value" : "-OsJ21DqfgKX5RMYtZA_WVscV02Hn2TuDdg9yB0yMaEdptq3_fXSGKOywjsQwxJQy1BO57SBjuEWRcBuFLcLo-sJXXC24WEHhtPtZLQ0phBCKvpqi6R_VGXI8FBR5rZNuhCGpOBZH9jV6UsrhpOALBayYC7BOE-ac0tc1NxAWlVP3ueOLGKixrHAaJ4lEhQV1ZhMwGxXxuRnZEkzkKDKQyV4vrBfEDqhQ6p7iNUf5kopplaOGjvj5mU9QLhyjBxaWs8QY2A7arF7aP-yn2KBx93g0DhEFidmiHrgm7X5iAba6sUTBqTOJSnrL88neXZ9xJqG8fJHg-QSnvLGo7tmG7IybPyMB7ssG0hhrF_JSiNRKO04Va60aJvyVg9G3LWpIxL8IlYo6Uh4uIhW48F2yK1PsCrPFrLz3PzuNNQ8J5sCik3UAnBaOkBKVVDyY6UBd3ZfM14haAcoRjSiWP6c20MEGGYONGIW9O5Alig_2dxcSqGLHNEfV5xM7121Cl29XNwkCYa8ezWvPtHpIOh7YRPNfN41",
          "path" : "/",
          "httpOnly" : true,
          "secure" : false,
          "comment" : ""
        } ],
        "headers" : [ {
          "name" : "Cache-Control",
          "value" : "private"
        }, {
          "name" : "Content-Type",
          "value" : "application/json; charset=utf-8"
        }, {
          "name" : "Server",
          "value" : "Microsoft-IIS/10.0"
        }, {
          "name" : "Set-Cookie",
          "value" : ".ASPROLES=-OsJ21DqfgKX5RMYtZA_WVscV02Hn2TuDdg9yB0yMaEdptq3_fXSGKOywjsQwxJQy1BO57SBjuEWRcBuFLcLo-sJXXC24WEHhtPtZLQ0phBCKvpqi6R_VGXI8FBR5rZNuhCGpOBZH9jV6UsrhpOALBayYC7BOE-ac0tc1NxAWlVP3ueOLGKixrHAaJ4lEhQV1ZhMwGxXxuRnZEkzkKDKQyV4vrBfEDqhQ6p7iNUf5kopplaOGjvj5mU9QLhyjBxaWs8QY2A7arF7aP-yn2KBx93g0DhEFidmiHrgm7X5iAba6sUTBqTOJSnrL88neXZ9xJqG8fJHg-QSnvLGo7tmG7IybPyMB7ssG0hhrF_JSiNRKO04Va60aJvyVg9G3LWpIxL8IlYo6Uh4uIhW48F2yK1PsCrPFrLz3PzuNNQ8J5sCik3UAnBaOkBKVVDyY6UBd3ZfM14haAcoRjSiWP6c20MEGGYONGIW9O5Alig_2dxcSqGLHNEfV5xM7121Cl29XNwkCYa8ezWvPtHpIOh7YRPNfN41; path=/; HttpOnly"
        }, {
          "name" : "X-SourceFiles",
          "value" : "=?UTF-8?B?RDpcVmlydHVhbE9wdGltaXplci1SZWZhY3RvcmluZ1xDcm9wTWV0cmljcy5Wby5BcGlcQ3JvcE1ldHJpY3MuVm8uQXBpXGFwaVxtb2JpbGVcdjFcZmllbGRz?="
        }, {
          "name" : "X-Powered-By",
          "value" : "ASP.NET"
        }, {
          "name" : "Date",
          "value" : "Wed, 24 Apr 2019 20:28:52 GMT"
        }, {
          "name" : "Content-Length",
          "value" : "39"
        } ],
        "content" : {
          "size" : 39,
          "mimeType" : "application/json; charset=utf-8",
          "text" : "{\"message\":\"The farm id is not valid.\"}",
          "comment" : ""
        },
        "redirectURL" : "",
        "headersSize" : 940,
        "bodySize" : 39,
        "comment" : ""
      },
      "cache" : { },
      "timings" : {
        "comment" : "",
        "ssl" : -1,
        "receive" : 0,
        "send" : 0,
        "wait" : 3141,
        "connect" : -1,
        "blocked" : -1,
        "dns" : -1
      },
      "serverIPAddress" : "127.0.0.1",
      "comment" : "",
      "_katalonRequestInformation" : {
        "name" : "31",
        "testObjectId" : "Object Repository/VoGrow/Field/FieldPost",
        "harId" : "676d897e-52ab-4839-a12c-b2867d05e4bd"
      },
      "time" : 3143
    } ],
    "comment" : ""
  }
}