{
  "log" : {
    "version" : "1.2",
    "creator" : {
      "name" : "BrowserMob Proxy",
      "version" : "2.1.5",
      "comment" : ""
    },
    "pages" : [ {
      "id" : "Page 0",
      "startedDateTime" : "2019-04-11T16:38:57.817Z",
      "title" : "Page 0",
      "pageTimings" : {
        "onLoad" : 3188,
        "comment" : ""
      },
      "comment" : ""
    } ],
    "entries" : [ {
      "pageref" : "Page 0",
      "startedDateTime" : "2019-04-11T16:38:57.819Z",
      "request" : {
        "method" : "POST",
        "url" : "http://localhost:10520/WebAPI/api/mobile/v1/farms/?",
        "httpVersion" : "HTTP/1.1",
        "cookies" : [ ],
        "headers" : [ {
          "name" : "User-Agent",
          "value" : "Katalon Studio"
        }, {
          "name" : "Content-Type",
          "value" : "application/json"
        }, {
          "name" : "Authorization",
          "value" : "Bearer eyJ0eXAiOiJKV1QiLCJhbGciOiJIUzI1NiJ9.eyJ1bmlxdWVfbmFtZSI6Implbm55Lm1hbGRvbmFkby50eDFAZ21haWwuY29tIiwicm9sZSI6InVzZXIiLCJzdWIiOiJqZW5ueS5tYWxkb25hZG8udHgxQGdtYWlsLmNvbSIsImlzcyI6IkNyb3BNZXRyaWNzIiwiYXVkIjoiYWxsIiwiZXhwIjoxNTU1MDA0NjM3LCJuYmYiOjE1NTUwMDA3Mzd9.lzIfGI0yKR8t5PpqRQHs6RCJs3qM5aRTT1LPntlNcwo"
        }, {
          "name" : "Host",
          "value" : "localhost:10520"
        }, {
          "name" : "Accept",
          "value" : "text/html, image/gif, image/jpeg, *; q=.2, */*; q=.2"
        }, {
          "name" : "Proxy-Connection",
          "value" : "keep-alive"
        }, {
          "name" : "Content-Length",
          "value" : "209"
        } ],
        "queryString" : [ ],
        "postData" : {
          "mimeType" : "application/json",
          "text" : "{\"name\": \"API_FARM_When_new_farm_has_name_attribute_with_more_than_128_chars_Expected_status_code_400 API_FARM_When_new_farm_has_name_attribute_with_more_than_128_chars_Expected_status_code_400\", \"user_id\": 2}",
          "comment" : ""
        },
        "headersSize" : 592,
        "bodySize" : 209,
        "comment" : ""
      },
      "response" : {
        "status" : 400,
        "statusText" : "Bad Request",
        "httpVersion" : "HTTP/1.1",
        "cookies" : [ {
          "name" : ".ASPROLES",
          "value" : "3LvcY-d4dQDQNPV0oAICY0jZn_XJJpBIjWPujdvk0z-66LPpZYgvPwnk4jTTfpI9BjNZ_7ooP525RoxpgrhVvsKKC0hos2CcvoiN3NCiX9VIBNJIwoljyRh0QX8lah3bYJiAoyVvoHKI3xYhvXfpCcnfR1BjOmHTWFwZwdyaJd7FNqmYbKtpTGZm9471BcEEhyV1WNVDjyLiRgKsB_J8R1qwDqfU_TYtWFUDJGHF-L3JVNumxJZxzWo39KYi8Ci7W2COVfFRBwf6JB7hAiOpJ4NSMWnOPktfb49tUvM5P1_ePJ7wzacdXFS95VKkhPRiNQR4oqyRRbU3DedFwmhGhZQaypN8e74mEu69VBmIzGZQIPwn-P6yj2dY6FCRSn98mmoXLx7h17Y3ANHxU6Xko4eRSUQveHlJ6qxO2qjDmtHIMkJNOOi4sdlqSPKvwzA-4eVFFC7lcsCLZprPvRU54oogF1Z_9OHcuLy7CSgItnQrZqktVVpHRX1_zlvchMqIPfezAvemcowVNgwzuHVT8eFoG1M1",
          "path" : "/",
          "httpOnly" : true,
          "secure" : false,
          "comment" : ""
        } ],
        "headers" : [ {
          "name" : "Cache-Control",
          "value" : "private"
        }, {
          "name" : "Content-Type",
          "value" : "application/json; charset=utf-8"
        }, {
          "name" : "Server",
          "value" : "Microsoft-IIS/10.0"
        }, {
          "name" : "Set-Cookie",
          "value" : ".ASPROLES=3LvcY-d4dQDQNPV0oAICY0jZn_XJJpBIjWPujdvk0z-66LPpZYgvPwnk4jTTfpI9BjNZ_7ooP525RoxpgrhVvsKKC0hos2CcvoiN3NCiX9VIBNJIwoljyRh0QX8lah3bYJiAoyVvoHKI3xYhvXfpCcnfR1BjOmHTWFwZwdyaJd7FNqmYbKtpTGZm9471BcEEhyV1WNVDjyLiRgKsB_J8R1qwDqfU_TYtWFUDJGHF-L3JVNumxJZxzWo39KYi8Ci7W2COVfFRBwf6JB7hAiOpJ4NSMWnOPktfb49tUvM5P1_ePJ7wzacdXFS95VKkhPRiNQR4oqyRRbU3DedFwmhGhZQaypN8e74mEu69VBmIzGZQIPwn-P6yj2dY6FCRSn98mmoXLx7h17Y3ANHxU6Xko4eRSUQveHlJ6qxO2qjDmtHIMkJNOOi4sdlqSPKvwzA-4eVFFC7lcsCLZprPvRU54oogF1Z_9OHcuLy7CSgItnQrZqktVVpHRX1_zlvchMqIPfezAvemcowVNgwzuHVT8eFoG1M1; path=/; HttpOnly"
        }, {
          "name" : "X-SourceFiles",
          "value" : "=?UTF-8?B?RDpcVmlydHVhbE9wdGltaXplci1SZWZhY3RvcmluZ1xDcm9wTWV0cmljcy5Wby5BcGlcQ3JvcE1ldHJpY3MuVm8uQXBpXGFwaVxtb2JpbGVcdjFcZmFybXNc?="
        }, {
          "name" : "X-Powered-By",
          "value" : "ASP.NET"
        }, {
          "name" : "Date",
          "value" : "Thu, 11 Apr 2019 16:39:00 GMT"
        }, {
          "name" : "Content-Length",
          "value" : "64"
        } ],
        "content" : {
          "size" : 64,
          "mimeType" : "application/json; charset=utf-8",
          "text" : "{\"message\":\"The farm name must contains as max 128 characters.\"}",
          "comment" : ""
        },
        "redirectURL" : "",
        "headersSize" : 940,
        "bodySize" : 64,
        "comment" : ""
      },
      "cache" : { },
      "timings" : {
        "comment" : "",
        "ssl" : -1,
        "send" : 0,
        "wait" : 3178,
        "receive" : 2,
        "connect" : -1,
        "dns" : -1,
        "blocked" : -1
      },
      "serverIPAddress" : "127.0.0.1",
      "comment" : "",
      "_katalonRequestInformation" : {
        "name" : "7",
        "testObjectId" : "Object Repository/VoGrow/Farm/FarmPost",
        "harId" : "7a870ca0-0578-40e4-8d18-d806d6b700c4"
      },
      "time" : 3181
    } ],
    "comment" : ""
  }
}