{
  "log" : {
    "version" : "1.2",
    "creator" : {
      "name" : "BrowserMob Proxy",
      "version" : "2.1.5",
      "comment" : ""
    },
    "pages" : [ {
      "id" : "Page 0",
      "startedDateTime" : "2019-03-29T22:38:01.024Z",
      "title" : "Page 0",
      "pageTimings" : {
        "onLoad" : 1801,
        "comment" : ""
      },
      "comment" : ""
    } ],
    "entries" : [ {
      "pageref" : "Page 0",
      "startedDateTime" : "2019-03-29T22:38:01.028Z",
      "request" : {
        "method" : "POST",
        "url" : "http://localhost:10520/WebAPI/api/admin/v1/users/?",
        "httpVersion" : "HTTP/1.1",
        "cookies" : [ ],
        "headers" : [ {
          "name" : "User-Agent",
          "value" : "Katalon Studio"
        }, {
          "name" : "Content-Type",
          "value" : "application/x-www-form-urlencoded"
        }, {
          "name" : "Authorization",
          "value" : "Bearer eyJ0eXAiOiJKV1QiLCJhbGciOiJIUzI1NiJ9.eyJ1bmlxdWVfbmFtZSI6ImFkbWluIiwicm9sZSI6InVzZXIiLCJzdWIiOiJhZG1pbiIsImlzcyI6IkNyb3BNZXRyaWNzIiwiYXVkIjoiYWxsIiwiZXhwIjoxNTUzOTAyOTgwLCJuYmYiOjE1NTM4OTkwODB9.nFV_mm6ET981-PVtGFcV7-lcRfAOHeXGDlrY5C2jmkk"
        }, {
          "name" : "Host",
          "value" : "localhost:10520"
        }, {
          "name" : "Accept",
          "value" : "text/html, image/gif, image/jpeg, *; q=.2, */*; q=.2"
        }, {
          "name" : "Proxy-Connection",
          "value" : "keep-alive"
        }, {
          "name" : "Content-Length",
          "value" : "300"
        } ],
        "queryString" : [ ],
        "postData" : {
          "mimeType" : "application/x-www-form-urlencoded",
          "params" : [ {
            "name" : "password",
            "value" : "cropmetrics",
            "comment" : ""
          }, {
            "name" : "email",
            "value" : "cropmetricsvo.phonesymbols@gmail.com",
            "comment" : ""
          }, {
            "name" : "fullname",
            "value" : "x",
            "comment" : ""
          }, {
            "name" : "phone",
            "value" : "!@#$%^&",
            "comment" : ""
          }, {
            "name" : "dealer",
            "value" : "x",
            "comment" : ""
          }, {
            "name" : "addressLine1",
            "value" : "address line 1 test validation",
            "comment" : ""
          }, {
            "name" : "addressLine2",
            "value" : "address line 2 test validation",
            "comment" : ""
          }, {
            "name" : "town",
            "value" : "townValidation",
            "comment" : ""
          }, {
            "name" : "state",
            "value" : "stateValidation",
            "comment" : ""
          }, {
            "name" : "zip",
            "value" : "zipValidation",
            "comment" : ""
          }, {
            "name" : "country",
            "value" : "countryValidation",
            "comment" : ""
          }, {
            "name" : "roles",
            "value" : "Client",
            "comment" : ""
          } ],
          "comment" : ""
        },
        "headersSize" : 544,
        "bodySize" : 300,
        "comment" : ""
      },
      "response" : {
        "status" : 200,
        "statusText" : "OK",
        "httpVersion" : "HTTP/1.1",
        "cookies" : [ {
          "name" : ".ASPROLES",
          "value" : "9SHBAlUy83TVyx4LBiXuhm3z67NfY8AV5nnaJVdRnoeDAhgTFIj33FKttjtA4GQK3-jxpUIWT-uYuKbFMsgMk6CGTHGAG9BKgkcU8FohhdGLxqOjuj8g5aVPGZVpVmf69niJ5b3lWKqydtrfAnt146hiH-gePMTI5yjlW9l01l2dcNi0Fi2xTEfqDFUpxuz5hTMj_D8iU9eFOi__k5gdqlqWTfIdWQ77DjJngeo_8RbExJsesudya5HHVtqA5fgcT3eQ_ifwUidb4LfL69I7vgD2NvqIvJagndguwTJ1973G4UzmXZMARjahXKswKuuTYwM5tYoWzpcYPqQ1mvh6wNKWwy29ejmfk5lmjs2E7OlNv3J9B7asLZkHE9DJ3WWHu1khrw8a2aF7tPDq1WpbYdnSOepfg_II0WVvMlU1f2Qfzhls9MC0W46bEzXyIsjL_fLDNfPG_WaZmmmpbxWr1Dz8SMbahKcF25UMN351JQJ8W4It0",
          "path" : "/",
          "httpOnly" : true,
          "secure" : false,
          "comment" : ""
        } ],
        "headers" : [ {
          "name" : "Cache-Control",
          "value" : "private"
        }, {
          "name" : "Content-Type",
          "value" : "application/json; charset=utf-8"
        }, {
          "name" : "Server",
          "value" : "Microsoft-IIS/10.0"
        }, {
          "name" : "Set-Cookie",
          "value" : ".ASPROLES=9SHBAlUy83TVyx4LBiXuhm3z67NfY8AV5nnaJVdRnoeDAhgTFIj33FKttjtA4GQK3-jxpUIWT-uYuKbFMsgMk6CGTHGAG9BKgkcU8FohhdGLxqOjuj8g5aVPGZVpVmf69niJ5b3lWKqydtrfAnt146hiH-gePMTI5yjlW9l01l2dcNi0Fi2xTEfqDFUpxuz5hTMj_D8iU9eFOi__k5gdqlqWTfIdWQ77DjJngeo_8RbExJsesudya5HHVtqA5fgcT3eQ_ifwUidb4LfL69I7vgD2NvqIvJagndguwTJ1973G4UzmXZMARjahXKswKuuTYwM5tYoWzpcYPqQ1mvh6wNKWwy29ejmfk5lmjs2E7OlNv3J9B7asLZkHE9DJ3WWHu1khrw8a2aF7tPDq1WpbYdnSOepfg_II0WVvMlU1f2Qfzhls9MC0W46bEzXyIsjL_fLDNfPG_WaZmmmpbxWr1Dz8SMbahKcF25UMN351JQJ8W4It0; path=/; HttpOnly"
        }, {
          "name" : "X-SourceFiles",
          "value" : "=?UTF-8?B?RDpcVmlydHVhbE9wdGltaXplci1SZWZhY3RvcmluZ1xDcm9wTWV0cmljcy5Wby5BcGlcQ3JvcE1ldHJpY3MuVm8uQXBpXGFwaVxhZG1pblx2MVx1c2Vyc1w=?="
        }, {
          "name" : "X-Powered-By",
          "value" : "ASP.NET"
        }, {
          "name" : "Date",
          "value" : "Fri, 29 Mar 2019 22:38:02 GMT"
        }, {
          "name" : "Content-Length",
          "value" : "9"
        } ],
        "content" : {
          "size" : 9,
          "mimeType" : "application/json; charset=utf-8",
          "text" : "{\"id\":18}",
          "comment" : ""
        },
        "redirectURL" : "",
        "headersSize" : 887,
        "bodySize" : 9,
        "comment" : ""
      },
      "cache" : { },
      "timings" : {
        "comment" : "",
        "ssl" : -1,
        "wait" : 1791,
        "receive" : 0,
        "send" : 1,
        "connect" : -1,
        "dns" : -1,
        "blocked" : -1
      },
      "serverIPAddress" : "127.0.0.1",
      "comment" : "",
      "_katalonRequestInformation" : {
        "name" : "57",
        "testObjectId" : "Object Repository/VoPro/Account/api_admin_v1_users",
        "harId" : "94962584-96f6-4372-a7c8-7ce4f93de34e"
      },
      "time" : 1793
    } ],
    "comment" : ""
  }
}