{
  "log" : {
    "version" : "1.2",
    "creator" : {
      "name" : "BrowserMob Proxy",
      "version" : "2.1.5",
      "comment" : ""
    },
    "pages" : [ {
      "id" : "Page 0",
      "startedDateTime" : "2019-03-29T19:40:47.328Z",
      "title" : "Page 0",
      "pageTimings" : {
        "onLoad" : 1906,
        "comment" : ""
      },
      "comment" : ""
    } ],
    "entries" : [ {
      "pageref" : "Page 0",
      "startedDateTime" : "2019-03-29T19:40:47.329Z",
      "request" : {
        "method" : "POST",
        "url" : "http://localhost:10520/WebAPI/api/admin/v1/users/?",
        "httpVersion" : "HTTP/1.1",
        "cookies" : [ ],
        "headers" : [ {
          "name" : "User-Agent",
          "value" : "Katalon Studio"
        }, {
          "name" : "Content-Type",
          "value" : "application/x-www-form-urlencoded"
        }, {
          "name" : "Authorization",
          "value" : "Bearer eyJ0eXAiOiJKV1QiLCJhbGciOiJIUzI1NiJ9.eyJ1bmlxdWVfbmFtZSI6ImFkbWluIiwicm9sZSI6InVzZXIiLCJzdWIiOiJhZG1pbiIsImlzcyI6IkNyb3BNZXRyaWNzIiwiYXVkIjoiYWxsIiwiZXhwIjoxNTUzODkyMzQ3LCJuYmYiOjE1NTM4ODg0NDd9.a_63unAl7conoHaATmYoA1G5mWas4KZQEKbi2QkklYI"
        }, {
          "name" : "Host",
          "value" : "localhost:10520"
        }, {
          "name" : "Accept",
          "value" : "text/html, image/gif, image/jpeg, *; q=.2, */*; q=.2"
        }, {
          "name" : "Proxy-Connection",
          "value" : "keep-alive"
        }, {
          "name" : "Content-Length",
          "value" : "286"
        } ],
        "queryString" : [ ],
        "postData" : {
          "mimeType" : "application/x-www-form-urlencoded",
          "params" : [ {
            "name" : "password",
            "value" : "cropmetrics",
            "comment" : ""
          }, {
            "name" : "email",
            "value" : "cropmetricsvo.zipnumber@gmail.com",
            "comment" : ""
          }, {
            "name" : "fullname",
            "value" : "test validation",
            "comment" : ""
          }, {
            "name" : "phone",
            "value" : "123",
            "comment" : ""
          }, {
            "name" : "dealer",
            "value" : "x",
            "comment" : ""
          }, {
            "name" : "addressLine1",
            "value" : "address line 1 test validation",
            "comment" : ""
          }, {
            "name" : "addressLine2",
            "value" : "address line 2 test validation",
            "comment" : ""
          }, {
            "name" : "town",
            "value" : "townValidation",
            "comment" : ""
          }, {
            "name" : "state",
            "value" : "stateValidation",
            "comment" : ""
          }, {
            "name" : "zip",
            "value" : "123457",
            "comment" : ""
          }, {
            "name" : "country",
            "value" : "countryValidation",
            "comment" : ""
          }, {
            "name" : "roles",
            "value" : "Client",
            "comment" : ""
          } ],
          "comment" : ""
        },
        "headersSize" : 544,
        "bodySize" : 286,
        "comment" : ""
      },
      "response" : {
        "status" : 200,
        "statusText" : "OK",
        "httpVersion" : "HTTP/1.1",
        "cookies" : [ {
          "name" : ".ASPROLES",
          "value" : "MhV4TVFbU8nYvOuehu9b6kH51ulC71uyBpsQlmZF5TJoeCCFOYrL3zF3Q3l2r0Mi6CEkXrF9Y1mXd7EDYt5xBg9DN8CY0-q5d-zXk0LzJXMRv4zINaz0gdKqDpH3PfM39jY1gxYh9XplXkllkS04HvX4I5DFgasjTBkrQ-yrmOZTw4n640sguxh9APwERSDCTTjMGRH4u1U78NqOKQimtTiFmXKC8pvvFHuyBm1hI4VuE78QZQrVzm7jT-DV7B91T4PZ4oYlhC3edRsAJwE6ru4aG-GADvx1rLFXBgnbbrIM53FVy1mpQ1my1wZRodFQyS9mh-sDspGhfhYaEOIpRL5DhgUND16IlTT_BCV4BQ1cAkPmp7GvGBs_Zzw_7QxCrE2eiZ1GW7u6X8CBVdYkfug-u_QoJUFTUUW5HjRAbYHNm8oKRdRIe4hY3-9WTDziWOvm-gwWQnX8vSCVRa61ytIi50Z7DyQhAKMTsUSVASMxA1ty0",
          "path" : "/",
          "httpOnly" : true,
          "secure" : false,
          "comment" : ""
        } ],
        "headers" : [ {
          "name" : "Cache-Control",
          "value" : "private"
        }, {
          "name" : "Content-Type",
          "value" : "application/json; charset=utf-8"
        }, {
          "name" : "Server",
          "value" : "Microsoft-IIS/10.0"
        }, {
          "name" : "Set-Cookie",
          "value" : ".ASPROLES=MhV4TVFbU8nYvOuehu9b6kH51ulC71uyBpsQlmZF5TJoeCCFOYrL3zF3Q3l2r0Mi6CEkXrF9Y1mXd7EDYt5xBg9DN8CY0-q5d-zXk0LzJXMRv4zINaz0gdKqDpH3PfM39jY1gxYh9XplXkllkS04HvX4I5DFgasjTBkrQ-yrmOZTw4n640sguxh9APwERSDCTTjMGRH4u1U78NqOKQimtTiFmXKC8pvvFHuyBm1hI4VuE78QZQrVzm7jT-DV7B91T4PZ4oYlhC3edRsAJwE6ru4aG-GADvx1rLFXBgnbbrIM53FVy1mpQ1my1wZRodFQyS9mh-sDspGhfhYaEOIpRL5DhgUND16IlTT_BCV4BQ1cAkPmp7GvGBs_Zzw_7QxCrE2eiZ1GW7u6X8CBVdYkfug-u_QoJUFTUUW5HjRAbYHNm8oKRdRIe4hY3-9WTDziWOvm-gwWQnX8vSCVRa61ytIi50Z7DyQhAKMTsUSVASMxA1ty0; path=/; HttpOnly"
        }, {
          "name" : "X-SourceFiles",
          "value" : "=?UTF-8?B?RDpcVmlydHVhbE9wdGltaXplci1SZWZhY3RvcmluZ1xDcm9wTWV0cmljcy5Wby5BcGlcQ3JvcE1ldHJpY3MuVm8uQXBpXGFwaVxhZG1pblx2MVx1c2Vyc1w=?="
        }, {
          "name" : "X-Powered-By",
          "value" : "ASP.NET"
        }, {
          "name" : "Date",
          "value" : "Fri, 29 Mar 2019 19:40:49 GMT"
        }, {
          "name" : "Content-Length",
          "value" : "9"
        } ],
        "content" : {
          "size" : 9,
          "mimeType" : "application/json; charset=utf-8",
          "text" : "{\"id\":34}",
          "comment" : ""
        },
        "redirectURL" : "",
        "headersSize" : 887,
        "bodySize" : 9,
        "comment" : ""
      },
      "cache" : { },
      "timings" : {
        "comment" : "",
        "ssl" : -1,
        "send" : 0,
        "receive" : 0,
        "wait" : 1901,
        "connect" : -1,
        "blocked" : -1,
        "dns" : -1
      },
      "serverIPAddress" : "127.0.0.1",
      "comment" : "",
      "_katalonRequestInformation" : {
        "name" : "89",
        "testObjectId" : "Object Repository/VoPro/Account/api_admin_v1_users",
        "harId" : "52beedee-8a62-46d2-a815-bcf4ac72c1aa"
      },
      "time" : 1902
    } ],
    "comment" : ""
  }
}