{
  "log" : {
    "version" : "1.2",
    "creator" : {
      "name" : "BrowserMob Proxy",
      "version" : "2.1.5",
      "comment" : ""
    },
    "pages" : [ {
      "id" : "Page 0",
      "startedDateTime" : "2019-03-29T19:39:16.833Z",
      "title" : "Page 0",
      "pageTimings" : {
        "onLoad" : 2268,
        "comment" : ""
      },
      "comment" : ""
    } ],
    "entries" : [ {
      "pageref" : "Page 0",
      "startedDateTime" : "2019-03-29T19:39:16.835Z",
      "request" : {
        "method" : "POST",
        "url" : "http://localhost:10520/WebAPI/api/admin/v1/users/?",
        "httpVersion" : "HTTP/1.1",
        "cookies" : [ ],
        "headers" : [ {
          "name" : "User-Agent",
          "value" : "Katalon Studio"
        }, {
          "name" : "Content-Type",
          "value" : "application/x-www-form-urlencoded"
        }, {
          "name" : "Authorization",
          "value" : "Bearer eyJ0eXAiOiJKV1QiLCJhbGciOiJIUzI1NiJ9.eyJ1bmlxdWVfbmFtZSI6ImFkbWluIiwicm9sZSI6InVzZXIiLCJzdWIiOiJhZG1pbiIsImlzcyI6IkNyb3BNZXRyaWNzIiwiYXVkIjoiYWxsIiwiZXhwIjoxNTUzODkyMjU2LCJuYmYiOjE1NTM4ODgzNTZ9.1CNAfp_Fofa9M992CuEfVhV6Au_sc6INO3sZKeyP5z0"
        }, {
          "name" : "Host",
          "value" : "localhost:10520"
        }, {
          "name" : "Accept",
          "value" : "text/html, image/gif, image/jpeg, *; q=.2, */*; q=.2"
        }, {
          "name" : "Proxy-Connection",
          "value" : "keep-alive"
        }, {
          "name" : "Content-Length",
          "value" : "279"
        } ],
        "queryString" : [ ],
        "postData" : {
          "mimeType" : "application/x-www-form-urlencoded",
          "params" : [ {
            "name" : "password",
            "value" : "cropmetrics",
            "comment" : ""
          }, {
            "name" : "email",
            "value" : "cropmetricsvo.no.addressline2@gmail.com",
            "comment" : ""
          }, {
            "name" : "fullname",
            "value" : "test validation",
            "comment" : ""
          }, {
            "name" : "phone",
            "value" : "123",
            "comment" : ""
          }, {
            "name" : "dealer",
            "value" : "dealet test",
            "comment" : ""
          }, {
            "name" : "addressLine1",
            "value" : "address line 1 test validation",
            "comment" : ""
          }, {
            "name" : "addressLine2",
            "value" : "",
            "comment" : ""
          }, {
            "name" : "town",
            "value" : "townValidation",
            "comment" : ""
          }, {
            "name" : "state",
            "value" : "stateValidation",
            "comment" : ""
          }, {
            "name" : "zip",
            "value" : "zipValidation",
            "comment" : ""
          }, {
            "name" : "country",
            "value" : "countryValidation",
            "comment" : ""
          }, {
            "name" : "roles",
            "value" : "Client",
            "comment" : ""
          } ],
          "comment" : ""
        },
        "headersSize" : 544,
        "bodySize" : 279,
        "comment" : ""
      },
      "response" : {
        "status" : 200,
        "statusText" : "OK",
        "httpVersion" : "HTTP/1.1",
        "cookies" : [ {
          "name" : ".ASPROLES",
          "value" : "tRtlUJN5jGOGKV7w58esWJhC-S45Tff0kJR48M1EDs76XM-GkfKN4eJqf2ewlF1AYj3r-pjFTl6rjKZvY7TUY4Q2ruXyVhyCD4y6iJhxmHiCrjN3ZcvieKQvIZWbtsBO6t0pKPAkZXFQipXd2pX_In2YjbfmHgFq4Xq16NBNadUYY0HWfYoOuXFrNYiOCOlamJzwPHhmwqR4e7stlxoMBZo4yrIXB5c5vl3W09hwK62o2whgclVqzBp_ymaKue2_czFWQZdClN2msqYV9LKP6Xb0G9J6PjcIjObSZEPjZ4pOuj4oLhWPtZgPZcfb05XpzJnRhogcKm-Cnv9ezs_XcJS9lU7I61nonJDlZvgCz5JyOW3slfFTiEUwqoQ2r5ZHKEhmvNthWC_MMw_4tr3wAwZOKRBzZRNnetKWVIk5fCxp_sRmRDvBkqsnvRSTA2lEosEYUOnyPBN8ptmp80mGvNioKtrcSyBfqDdLg3fZYCov1lyt0",
          "path" : "/",
          "httpOnly" : true,
          "secure" : false,
          "comment" : ""
        } ],
        "headers" : [ {
          "name" : "Cache-Control",
          "value" : "private"
        }, {
          "name" : "Content-Type",
          "value" : "application/json; charset=utf-8"
        }, {
          "name" : "Server",
          "value" : "Microsoft-IIS/10.0"
        }, {
          "name" : "Set-Cookie",
          "value" : ".ASPROLES=tRtlUJN5jGOGKV7w58esWJhC-S45Tff0kJR48M1EDs76XM-GkfKN4eJqf2ewlF1AYj3r-pjFTl6rjKZvY7TUY4Q2ruXyVhyCD4y6iJhxmHiCrjN3ZcvieKQvIZWbtsBO6t0pKPAkZXFQipXd2pX_In2YjbfmHgFq4Xq16NBNadUYY0HWfYoOuXFrNYiOCOlamJzwPHhmwqR4e7stlxoMBZo4yrIXB5c5vl3W09hwK62o2whgclVqzBp_ymaKue2_czFWQZdClN2msqYV9LKP6Xb0G9J6PjcIjObSZEPjZ4pOuj4oLhWPtZgPZcfb05XpzJnRhogcKm-Cnv9ezs_XcJS9lU7I61nonJDlZvgCz5JyOW3slfFTiEUwqoQ2r5ZHKEhmvNthWC_MMw_4tr3wAwZOKRBzZRNnetKWVIk5fCxp_sRmRDvBkqsnvRSTA2lEosEYUOnyPBN8ptmp80mGvNioKtrcSyBfqDdLg3fZYCov1lyt0; path=/; HttpOnly"
        }, {
          "name" : "X-SourceFiles",
          "value" : "=?UTF-8?B?RDpcVmlydHVhbE9wdGltaXplci1SZWZhY3RvcmluZ1xDcm9wTWV0cmljcy5Wby5BcGlcQ3JvcE1ldHJpY3MuVm8uQXBpXGFwaVxhZG1pblx2MVx1c2Vyc1w=?="
        }, {
          "name" : "X-Powered-By",
          "value" : "ASP.NET"
        }, {
          "name" : "Date",
          "value" : "Fri, 29 Mar 2019 19:39:19 GMT"
        }, {
          "name" : "Content-Length",
          "value" : "8"
        } ],
        "content" : {
          "size" : 8,
          "mimeType" : "application/json; charset=utf-8",
          "text" : "{\"id\":8}",
          "comment" : ""
        },
        "redirectURL" : "",
        "headersSize" : 887,
        "bodySize" : 8,
        "comment" : ""
      },
      "cache" : { },
      "timings" : {
        "comment" : "",
        "ssl" : -1,
        "send" : 0,
        "receive" : 1,
        "wait" : 2263,
        "connect" : -1,
        "blocked" : -1,
        "dns" : -1
      },
      "serverIPAddress" : "127.0.0.1",
      "comment" : "",
      "_katalonRequestInformation" : {
        "name" : "21",
        "testObjectId" : "Object Repository/VoPro/Account/api_admin_v1_users",
        "harId" : "698e6ac1-664e-48ad-858f-f0665f0e6528"
      },
      "time" : 2264
    } ],
    "comment" : ""
  }
}