{
  "log" : {
    "version" : "1.2",
    "creator" : {
      "name" : "BrowserMob Proxy",
      "version" : "2.1.5",
      "comment" : ""
    },
    "pages" : [ {
      "id" : "Page 0",
      "startedDateTime" : "2019-04-05T10:03:37.001Z",
      "title" : "Page 0",
      "pageTimings" : {
        "onLoad" : 568,
        "comment" : ""
      },
      "comment" : ""
    } ],
    "entries" : [ {
      "pageref" : "Page 0",
      "startedDateTime" : "2019-04-05T10:03:37.002Z",
      "request" : {
        "method" : "PUT",
        "url" : "http://localhost:10520/WebAPI/api/mobile/v1/farms/1?",
        "httpVersion" : "HTTP/1.1",
        "cookies" : [ ],
        "headers" : [ {
          "name" : "User-Agent",
          "value" : "Katalon Studio"
        }, {
          "name" : "Content-Type",
          "value" : "application/json"
        }, {
          "name" : "Authorization",
          "value" : "Bearer eyJ0eXAiOiJKV1QiLCJhbGciOiJIUzI1NiJ9.eyJ1bmlxdWVfbmFtZSI6Implbm55Lm1hbGRvbmFkby50eDJAZ21haWwuY29tIiwicm9sZSI6InVzZXIiLCJzdWIiOiJqZW5ueS5tYWxkb25hZG8udHgyQGdtYWlsLmNvbSIsImlzcyI6IkNyb3BNZXRyaWNzIiwiYXVkIjoiYWxsIiwiZXhwIjoxNTU0NDYyNTE2LCJuYmYiOjE1NTQ0NTg2MTZ9.pHyFmkYghw21X2yRNG8Sv8o1rg-U2WMG7QukNh11VdE"
        }, {
          "name" : "Host",
          "value" : "localhost:10520"
        }, {
          "name" : "Accept",
          "value" : "text/html, image/gif, image/jpeg, *; q=.2, */*; q=.2"
        }, {
          "name" : "Proxy-Connection",
          "value" : "keep-alive"
        }, {
          "name" : "Content-Length",
          "value" : "35"
        } ],
        "queryString" : [ ],
        "postData" : {
          "mimeType" : "application/json",
          "text" : "{\"name\": \"Farm 10 katalon Updated\"}",
          "comment" : ""
        },
        "headersSize" : 591,
        "bodySize" : 35,
        "comment" : ""
      },
      "response" : {
        "status" : 200,
        "statusText" : "OK",
        "httpVersion" : "HTTP/1.1",
        "cookies" : [ {
          "name" : ".ASPROLES",
          "value" : "Goe1KXUyex7qC8o2WRsq7_E8agYdXifyA7uTQvY9FyRzpiFFy0ThBvh28xdKye-fiHwaS6PSzfK-sgZRl2N7L_ZS9pm17LgFQDHvmkTNq-BVuogpvgWt7dGhXm6NglUhRD0r0roLGaZ1MmPpPGf1-5E0ZPtO810wUDk-ZfgHROY8TCY4lkAXw8l2sQYQuR1lnPSXZFCpeXF0f9kby2FUwDuKGZzqT6hySQuB5mwT7X-I1-0OrQczdjZSbhh3QpyXbXtd5qe2fblejh1L-uO7k8bzyC_HgQNkYtaMWzJQlvC04DVETenKggqkqp65ri_khEzn6WSDIpFHjOUKtvj_mi271hg-MThTYC89TzvS_LbQ4q9VZNWXXy21treulq5-m7TXi5caWQgdnf6mjPsFg-OSs9SNjuXgMWH48BVIuBUq670tcC729zKoiMx-36sJBOkEBivwTiIHbTq9qpZIc-FfDjYAx0RmlTSYmmBakV1UcRdwXJwxJhKdEoQEau62c8KOEg2",
          "path" : "/",
          "httpOnly" : true,
          "secure" : false,
          "comment" : ""
        } ],
        "headers" : [ {
          "name" : "Cache-Control",
          "value" : "private"
        }, {
          "name" : "Content-Type",
          "value" : "application/json; charset=utf-8"
        }, {
          "name" : "Server",
          "value" : "Microsoft-IIS/10.0"
        }, {
          "name" : "Set-Cookie",
          "value" : ".ASPROLES=Goe1KXUyex7qC8o2WRsq7_E8agYdXifyA7uTQvY9FyRzpiFFy0ThBvh28xdKye-fiHwaS6PSzfK-sgZRl2N7L_ZS9pm17LgFQDHvmkTNq-BVuogpvgWt7dGhXm6NglUhRD0r0roLGaZ1MmPpPGf1-5E0ZPtO810wUDk-ZfgHROY8TCY4lkAXw8l2sQYQuR1lnPSXZFCpeXF0f9kby2FUwDuKGZzqT6hySQuB5mwT7X-I1-0OrQczdjZSbhh3QpyXbXtd5qe2fblejh1L-uO7k8bzyC_HgQNkYtaMWzJQlvC04DVETenKggqkqp65ri_khEzn6WSDIpFHjOUKtvj_mi271hg-MThTYC89TzvS_LbQ4q9VZNWXXy21treulq5-m7TXi5caWQgdnf6mjPsFg-OSs9SNjuXgMWH48BVIuBUq670tcC729zKoiMx-36sJBOkEBivwTiIHbTq9qpZIc-FfDjYAx0RmlTSYmmBakV1UcRdwXJwxJhKdEoQEau62c8KOEg2; path=/; HttpOnly"
        }, {
          "name" : "X-SourceFiles",
          "value" : "=?UTF-8?B?RDpcVmlydHVhbE9wdGltaXplci1SZWZhY3RvcmluZ1xDcm9wTWV0cmljcy5Wby5BcGlcQ3JvcE1ldHJpY3MuVm8uQXBpXGFwaVxtb2JpbGVcdjFcZmFybXNcMQ==?="
        }, {
          "name" : "X-Powered-By",
          "value" : "ASP.NET"
        }, {
          "name" : "Date",
          "value" : "Fri, 05 Apr 2019 10:03:36 GMT"
        }, {
          "name" : "Content-Length",
          "value" : "53"
        } ],
        "content" : {
          "size" : 53,
          "mimeType" : "application/json; charset=utf-8",
          "text" : "{\"id\":1,\"name\":\"Farm 10 katalon Updated\",\"user_id\":4}",
          "comment" : ""
        },
        "redirectURL" : "",
        "headersSize" : 914,
        "bodySize" : 53,
        "comment" : ""
      },
      "cache" : { },
      "timings" : {
        "comment" : "",
        "send" : 2,
        "receive" : 6,
        "wait" : 554,
        "ssl" : -1,
        "dns" : -1,
        "blocked" : -1,
        "connect" : -1
      },
      "serverIPAddress" : "127.0.0.1",
      "comment" : "",
      "_katalonRequestInformation" : {
        "name" : "1",
        "testObjectId" : "Object Repository/VoGrow/Farm/FarmPut",
        "harId" : "3a7d2345-29b1-4dab-afa6-1b719b61db60"
      },
      "time" : 563
    } ],
    "comment" : ""
  }
}