{
  "log" : {
    "version" : "1.2",
    "creator" : {
      "name" : "BrowserMob Proxy",
      "version" : "2.1.5",
      "comment" : ""
    },
    "pages" : [ {
      "id" : "Page 0",
      "startedDateTime" : "2019-03-27T19:35:08.602Z",
      "title" : "Page 0",
      "pageTimings" : {
        "onLoad" : 1962,
        "comment" : ""
      },
      "comment" : ""
    } ],
    "entries" : [ {
      "pageref" : "Page 0",
      "startedDateTime" : "2019-03-27T19:35:08.602Z",
      "request" : {
        "method" : "POST",
        "url" : "http://localhost:10520/WebAPI/api/Account/AdministrativeRegister/?",
        "httpVersion" : "HTTP/1.1",
        "cookies" : [ ],
        "headers" : [ {
          "name" : "User-Agent",
          "value" : "Katalon Studio"
        }, {
          "name" : "Content-Type",
          "value" : "application/x-www-form-urlencoded"
        }, {
          "name" : "Authorization",
          "value" : "Bearer eyJ0eXAiOiJKV1QiLCJhbGciOiJIUzI1NiJ9.eyJ1bmlxdWVfbmFtZSI6ImFkbWluIiwicm9sZSI6InVzZXIiLCJzdWIiOiJhZG1pbiIsImlzcyI6IkNyb3BNZXRyaWNzIiwiYXVkIjoiYWxsIiwiZXhwIjoxNTUzNzE5MjA4LCJuYmYiOjE1NTM3MTUzMDh9.Om7BjEiPaEv0qh-XKg-V0NA66MC2yJjzxhzNAiEe268"
        }, {
          "name" : "Host",
          "value" : "localhost:10520"
        }, {
          "name" : "Accept",
          "value" : "text/html, image/gif, image/jpeg, *; q=.2, */*; q=.2"
        }, {
          "name" : "Proxy-Connection",
          "value" : "keep-alive"
        }, {
          "name" : "Content-Length",
          "value" : "424"
        } ],
        "queryString" : [ ],
        "postData" : {
          "mimeType" : "application/x-www-form-urlencoded",
          "params" : [ {
            "name" : "username",
            "value" : "kuserpasswithspaces",
            "comment" : ""
          }, {
            "name" : "password",
            "value" : "     1",
            "comment" : ""
          }, {
            "name" : "confirmPassword",
            "value" : "cropmetrics",
            "comment" : ""
          }, {
            "name" : "email",
            "value" : "cropmetricsvo@gmail.com",
            "comment" : ""
          }, {
            "name" : "fullname",
            "value" : "test validation phone attribute as characters instead of numbers",
            "comment" : ""
          }, {
            "name" : "phone",
            "value" : "123",
            "comment" : ""
          }, {
            "name" : "dealer",
            "value" : "x",
            "comment" : ""
          }, {
            "name" : "addressLine1",
            "value" : "address line 1 test validation",
            "comment" : ""
          }, {
            "name" : "addressLine2",
            "value" : "address line 1 test validation",
            "comment" : ""
          }, {
            "name" : "town",
            "value" : "townValidation",
            "comment" : ""
          }, {
            "name" : "state",
            "value" : "stateValidation",
            "comment" : ""
          }, {
            "name" : "zip",
            "value" : "zipValidation",
            "comment" : ""
          }, {
            "name" : "country",
            "value" : "countryValidation",
            "comment" : ""
          }, {
            "name" : "roles",
            "value" : "Client",
            "comment" : ""
          }, {
            "name" : "modifierUsername",
            "value" : "admin",
            "comment" : ""
          }, {
            "name" : "modifierUserId",
            "value" : "1",
            "comment" : ""
          } ],
          "comment" : ""
        },
        "headersSize" : 560,
        "bodySize" : 424,
        "comment" : ""
      },
      "response" : {
        "status" : 200,
        "statusText" : "OK",
        "httpVersion" : "HTTP/1.1",
        "cookies" : [ {
          "name" : ".ASPROLES",
          "value" : "z4Zetpl6o6xPFRnb-yMvPyodK6Ei84TAZn5r1l1n8j1Wj243pmOmAz4IEOO7EZ--WHLBQJ1X_ZABHTS477_bse4gE41rJz5dFuLMPH-zy0Mlj_oyDFaYFifFuOAD9MYryCIHgvppfOdQuqbLFTdlEdGjvNFOYJVtWlHkpsm_PhH9x71jwu795Ig6m8ffGuke--72FOfecRsgEfoL7IRwBUlBRGp8fdlSYSI8nnatvUWVZtIo-ElaCXycvXRGF7zoaMMQuqt5gGVMjmBViZwSlKzxMvHIgVJEag_Er-iWd0wf7qkr1excx9BMYd2PMKdKT2xDx41wVDLdfUmzc9xY63ZBHJ2P1kBrkLv1jqYAYIIOpilVFZprnddrIX_bK4HRljyc6TtYmb32RSjcMAWoD5VI1dMnDau9QpoJMebsG3an8ugriExME8MPaZldTSic_1doYyCu3MDeuXJEgvbzmRFbx4bF0trHJlQo_MVLI7GLuUmA0",
          "path" : "/",
          "httpOnly" : true,
          "secure" : false,
          "comment" : ""
        } ],
        "headers" : [ {
          "name" : "Cache-Control",
          "value" : "private"
        }, {
          "name" : "Content-Type",
          "value" : "application/json; charset=utf-8"
        }, {
          "name" : "Server",
          "value" : "Microsoft-IIS/10.0"
        }, {
          "name" : "Set-Cookie",
          "value" : ".ASPROLES=z4Zetpl6o6xPFRnb-yMvPyodK6Ei84TAZn5r1l1n8j1Wj243pmOmAz4IEOO7EZ--WHLBQJ1X_ZABHTS477_bse4gE41rJz5dFuLMPH-zy0Mlj_oyDFaYFifFuOAD9MYryCIHgvppfOdQuqbLFTdlEdGjvNFOYJVtWlHkpsm_PhH9x71jwu795Ig6m8ffGuke--72FOfecRsgEfoL7IRwBUlBRGp8fdlSYSI8nnatvUWVZtIo-ElaCXycvXRGF7zoaMMQuqt5gGVMjmBViZwSlKzxMvHIgVJEag_Er-iWd0wf7qkr1excx9BMYd2PMKdKT2xDx41wVDLdfUmzc9xY63ZBHJ2P1kBrkLv1jqYAYIIOpilVFZprnddrIX_bK4HRljyc6TtYmb32RSjcMAWoD5VI1dMnDau9QpoJMebsG3an8ugriExME8MPaZldTSic_1doYyCu3MDeuXJEgvbzmRFbx4bF0trHJlQo_MVLI7GLuUmA0; path=/; HttpOnly"
        }, {
          "name" : "X-SourceFiles",
          "value" : "=?UTF-8?B?RDpcVmlydHVhbE9wdGltaXplci1SZWZhY3RvcmluZ1xDcm9wTWV0cmljcy5Wby5BcGlcQ3JvcE1ldHJpY3MuVm8uQXBpXGFwaVxBY2NvdW50XEFkbWluaXN0cmF0aXZlUmVnaXN0ZXJc?="
        }, {
          "name" : "X-Powered-By",
          "value" : "ASP.NET"
        }, {
          "name" : "Date",
          "value" : "Wed, 27 Mar 2019 19:35:10 GMT"
        }, {
          "name" : "Content-Length",
          "value" : "9"
        } ],
        "content" : {
          "size" : 9,
          "mimeType" : "application/json; charset=utf-8",
          "text" : "{\"id\":27}",
          "comment" : ""
        },
        "redirectURL" : "",
        "headersSize" : 907,
        "bodySize" : 9,
        "comment" : ""
      },
      "cache" : { },
      "timings" : {
        "comment" : "",
        "ssl" : -1,
        "dns" : -1,
        "receive" : 0,
        "blocked" : -1,
        "wait" : 1893,
        "send" : 0,
        "connect" : -1
      },
      "serverIPAddress" : "127.0.0.1",
      "comment" : "",
      "_katalonRequestInformation" : {
        "name" : "65",
        "testObjectId" : "Object Repository/VoPro/Account/AdministrativeRegister",
        "harId" : "6aa4a5df-ec93-4997-802c-ebf1008765f9"
      },
      "time" : 1894
    } ],
    "comment" : ""
  }
}