{
  "log" : {
    "version" : "1.2",
    "creator" : {
      "name" : "BrowserMob Proxy",
      "version" : "2.1.5",
      "comment" : ""
    },
    "pages" : [ {
      "id" : "Page 0",
      "startedDateTime" : "2019-04-05T10:01:07.954Z",
      "title" : "Page 0",
      "pageTimings" : {
        "onLoad" : 29,
        "comment" : ""
      },
      "comment" : ""
    } ],
    "entries" : [ {
      "pageref" : "Page 0",
      "startedDateTime" : "2019-04-05T10:01:07.955Z",
      "request" : {
        "method" : "POST",
        "url" : "http://localhost:10520/WebAPI/api/mobile/v1/farms/?",
        "httpVersion" : "HTTP/1.1",
        "cookies" : [ ],
        "headers" : [ {
          "name" : "User-Agent",
          "value" : "Katalon Studio"
        }, {
          "name" : "Content-Type",
          "value" : "application/json"
        }, {
          "name" : "Authorization",
          "value" : "Bearer eyJ0eXAiOiJKV1QiLCJhbGciOiJIUzI1NiJ9.eyJ1bmlxdWVfbmFtZSI6Implbm55Lm1hbGRvbmFkby50eDFAZ21haWwuY29tIiwicm9sZSI6InVzZXIiLCJzdWIiOiJqZW5ueS5tYWxkb25hZG8udHgxQGdtYWlsLmNvbSIsImlzcyI6IkNyb3BNZXRyaWNzIiwiYXVkIjoiYWxsIiwiZXhwIjoxNTU0NDYyMzY3LCJuYmYiOjE1NTQ0NTg0Njd9.q3lKap_OSC75N89guXrYutacJAZmbv-6iJnUiSwQxuc"
        }, {
          "name" : "Host",
          "value" : "localhost:10520"
        }, {
          "name" : "Accept",
          "value" : "text/html, image/gif, image/jpeg, *; q=.2, */*; q=.2"
        }, {
          "name" : "Proxy-Connection",
          "value" : "keep-alive"
        }, {
          "name" : "Content-Length",
          "value" : "47"
        } ],
        "queryString" : [ ],
        "postData" : {
          "mimeType" : "application/json",
          "text" : "{\"name\": \"FarmNameWithOnlychars\", \"user_id\": 2}",
          "comment" : ""
        },
        "headersSize" : 591,
        "bodySize" : 47,
        "comment" : ""
      },
      "response" : {
        "status" : 201,
        "statusText" : "Created",
        "httpVersion" : "HTTP/1.1",
        "cookies" : [ {
          "name" : ".ASPROLES",
          "value" : "9tLhdmATmNJoqWzLsjC43mGtJhc48fdN85IK01IoUmr8MwXmiGF1pJWZWhfjKHC_oon5LhMS031onu_HLObuznGiqA7prnEo8vEiTBoaoatvgydmDXfFSuhCogM7jOFAZMSySQEG64SnZtneUbkLqessCEJ2u5GKz3BvU0hnNZ3Hzq0A3_ppmlyLlXcyd_zUYaf0PvkG221Rs3T-7K73ee_5FghnhGew1UO6hPniqh7hDdWteVwGKRD4w9GeVf8LKdFo80RlxE58H7u4FlikNpRLABXYHNRCJQWqUe7HPCvS64Y_UnML4N40djVFZectTh7gwfZmr2ZaNRxJG0HlnUZXbMY6ICewf8Qs1qmnS2yWsH2LIlPMQ7k6VMFyXhmoeyMTfQZGAcAqzSxyTPqdfN0L_fnVkoEMXVuj1ZvcuyzRX-zzOWsKeXSlM7BpULb3C8H6vZ_YCDd3NJZm3YY49qasaQhKEa1SOzpP-djzyMSe12xMhfdiNkLPLulsrnC3iWAVky93YxPWmPUYzHwAlT9GyOI1",
          "path" : "/",
          "httpOnly" : true,
          "secure" : false,
          "comment" : ""
        } ],
        "headers" : [ {
          "name" : "Cache-Control",
          "value" : "private"
        }, {
          "name" : "Content-Type",
          "value" : "application/json; charset=utf-8"
        }, {
          "name" : "Location",
          "value" : "api/mobile/v1/farms/6"
        }, {
          "name" : "Server",
          "value" : "Microsoft-IIS/10.0"
        }, {
          "name" : "Set-Cookie",
          "value" : ".ASPROLES=9tLhdmATmNJoqWzLsjC43mGtJhc48fdN85IK01IoUmr8MwXmiGF1pJWZWhfjKHC_oon5LhMS031onu_HLObuznGiqA7prnEo8vEiTBoaoatvgydmDXfFSuhCogM7jOFAZMSySQEG64SnZtneUbkLqessCEJ2u5GKz3BvU0hnNZ3Hzq0A3_ppmlyLlXcyd_zUYaf0PvkG221Rs3T-7K73ee_5FghnhGew1UO6hPniqh7hDdWteVwGKRD4w9GeVf8LKdFo80RlxE58H7u4FlikNpRLABXYHNRCJQWqUe7HPCvS64Y_UnML4N40djVFZectTh7gwfZmr2ZaNRxJG0HlnUZXbMY6ICewf8Qs1qmnS2yWsH2LIlPMQ7k6VMFyXhmoeyMTfQZGAcAqzSxyTPqdfN0L_fnVkoEMXVuj1ZvcuyzRX-zzOWsKeXSlM7BpULb3C8H6vZ_YCDd3NJZm3YY49qasaQhKEa1SOzpP-djzyMSe12xMhfdiNkLPLulsrnC3iWAVky93YxPWmPUYzHwAlT9GyOI1; path=/; HttpOnly"
        }, {
          "name" : "X-SourceFiles",
          "value" : "=?UTF-8?B?RDpcVmlydHVhbE9wdGltaXplci1SZWZhY3RvcmluZ1xDcm9wTWV0cmljcy5Wby5BcGlcQ3JvcE1ldHJpY3MuVm8uQXBpXGFwaVxtb2JpbGVcdjFcZmFybXNc?="
        }, {
          "name" : "X-Powered-By",
          "value" : "ASP.NET"
        }, {
          "name" : "Date",
          "value" : "Fri, 05 Apr 2019 10:01:07 GMT"
        }, {
          "name" : "Content-Length",
          "value" : "51"
        } ],
        "content" : {
          "size" : 51,
          "mimeType" : "application/json; charset=utf-8",
          "text" : "{\"id\":6,\"name\":\"FarmNameWithOnlychars\",\"user_id\":2}",
          "comment" : ""
        },
        "redirectURL" : "",
        "headersSize" : 969,
        "bodySize" : 51,
        "comment" : ""
      },
      "cache" : { },
      "timings" : {
        "comment" : "",
        "ssl" : -1,
        "send" : 0,
        "wait" : 24,
        "receive" : 1,
        "connect" : -1,
        "dns" : -1,
        "blocked" : -1
      },
      "serverIPAddress" : "127.0.0.1",
      "comment" : "",
      "_katalonRequestInformation" : {
        "name" : "29",
        "testObjectId" : "Object Repository/VoGrow/Farm/FarmPost",
        "harId" : "276c9597-2858-4878-bb03-4124c503ab62"
      },
      "time" : 25
    } ],
    "comment" : ""
  }
}