{
  "log" : {
    "version" : "1.2",
    "creator" : {
      "name" : "BrowserMob Proxy",
      "version" : "2.1.5",
      "comment" : ""
    },
    "pages" : [ {
      "id" : "Page 0",
      "startedDateTime" : "2019-03-28T21:51:41.902Z",
      "title" : "Page 0",
      "pageTimings" : {
        "onLoad" : 1285,
        "comment" : ""
      },
      "comment" : ""
    } ],
    "entries" : [ {
      "pageref" : "Page 0",
      "startedDateTime" : "2019-03-28T21:51:41.903Z",
      "request" : {
        "method" : "POST",
        "url" : "http://localhost:10520/WebAPI/api/admin/v1/users/?",
        "httpVersion" : "HTTP/1.1",
        "cookies" : [ ],
        "headers" : [ {
          "name" : "User-Agent",
          "value" : "Katalon Studio"
        }, {
          "name" : "Content-Type",
          "value" : "application/x-www-form-urlencoded"
        }, {
          "name" : "Authorization",
          "value" : "Bearer eyJ0eXAiOiJKV1QiLCJhbGciOiJIUzI1NiJ9.eyJ1bmlxdWVfbmFtZSI6ImFkbWluIiwicm9sZSI6InVzZXIiLCJzdWIiOiJhZG1pbiIsImlzcyI6IkNyb3BNZXRyaWNzIiwiYXVkIjoiYWxsIiwiZXhwIjoxNTUzODEzODAxLCJuYmYiOjE1NTM4MDk5MDF9.nGSeaFas0a8hw3mytTMcZHNTn8bXt3D4wOH6_jLVesk"
        }, {
          "name" : "Host",
          "value" : "localhost:10520"
        }, {
          "name" : "Accept",
          "value" : "text/html, image/gif, image/jpeg, *; q=.2, */*; q=.2"
        }, {
          "name" : "Proxy-Connection",
          "value" : "keep-alive"
        }, {
          "name" : "Content-Length",
          "value" : "306"
        } ],
        "queryString" : [ ],
        "postData" : {
          "mimeType" : "application/x-www-form-urlencoded",
          "params" : [ {
            "name" : "password",
            "value" : "cropmetrics",
            "comment" : ""
          }, {
            "name" : "email",
            "value" : "cropmetricsvo.zipsymbol@gmail.com",
            "comment" : ""
          }, {
            "name" : "fullname",
            "value" : "test validation",
            "comment" : ""
          }, {
            "name" : "phone",
            "value" : "123",
            "comment" : ""
          }, {
            "name" : "dealer",
            "value" : "x",
            "comment" : ""
          }, {
            "name" : "addressLine1",
            "value" : "address line 1 test validation",
            "comment" : ""
          }, {
            "name" : "addressLine2",
            "value" : "address line 12 test validation",
            "comment" : ""
          }, {
            "name" : "town",
            "value" : "townValidation",
            "comment" : ""
          }, {
            "name" : "state",
            "value" : "stateValidation",
            "comment" : ""
          }, {
            "name" : "zip",
            "value" : "!@#$%^&*(",
            "comment" : ""
          }, {
            "name" : "country",
            "value" : "countryValidation",
            "comment" : ""
          }, {
            "name" : "roles",
            "value" : "Client",
            "comment" : ""
          } ],
          "comment" : ""
        },
        "headersSize" : 544,
        "bodySize" : 306,
        "comment" : ""
      },
      "response" : {
        "status" : 200,
        "statusText" : "OK",
        "httpVersion" : "HTTP/1.1",
        "cookies" : [ {
          "name" : ".ASPROLES",
          "value" : "9x9Xl398s8RpMQtlsSHXC-vN8yUS_pWjInhF8-yuB64kEJiGBbdY5qWUIU6-mp7bXy8lC83D7TMJ53grKh3FQ5n19bNKZbTqKddryC5JKJSJtZNYtWShsouRxOAhhdM4agk4HhmRMgim_mfvq5LfdzaxEbA5sRv4fdQ2zKjRqoWNurJPpys8wpSA8oCGO1mbJ2qJIZsvbuVDvhMKEujRVC9rigarSalsOjrt635GGWQ-PqMe7jVByr96tO0x3HEK1Y7x-xjxwhZBSeihnzQCtTK8ABAOHqugYpg39Md8onIcRMHvDUbEm2qEgiHLHhBy-7diz160p6fqW3OXlzDaR8C9WJGQdgOh2Ls8pqa7dI-d2FXDlN1uG3wWdZKG21kRNTsI6DRW6UjQfJfXtEXL_EH0Ebg9lExQio06PWjJ2j1JvCMYGDjTJxNB-Py6Qq6vWAVftXRlzXIowywWT8RZJA3gRALLkI2WEIbJs5r_VM3XKf_I0",
          "path" : "/",
          "httpOnly" : true,
          "secure" : false,
          "comment" : ""
        } ],
        "headers" : [ {
          "name" : "Cache-Control",
          "value" : "private"
        }, {
          "name" : "Content-Type",
          "value" : "application/json; charset=utf-8"
        }, {
          "name" : "Server",
          "value" : "Microsoft-IIS/10.0"
        }, {
          "name" : "Set-Cookie",
          "value" : ".ASPROLES=9x9Xl398s8RpMQtlsSHXC-vN8yUS_pWjInhF8-yuB64kEJiGBbdY5qWUIU6-mp7bXy8lC83D7TMJ53grKh3FQ5n19bNKZbTqKddryC5JKJSJtZNYtWShsouRxOAhhdM4agk4HhmRMgim_mfvq5LfdzaxEbA5sRv4fdQ2zKjRqoWNurJPpys8wpSA8oCGO1mbJ2qJIZsvbuVDvhMKEujRVC9rigarSalsOjrt635GGWQ-PqMe7jVByr96tO0x3HEK1Y7x-xjxwhZBSeihnzQCtTK8ABAOHqugYpg39Md8onIcRMHvDUbEm2qEgiHLHhBy-7diz160p6fqW3OXlzDaR8C9WJGQdgOh2Ls8pqa7dI-d2FXDlN1uG3wWdZKG21kRNTsI6DRW6UjQfJfXtEXL_EH0Ebg9lExQio06PWjJ2j1JvCMYGDjTJxNB-Py6Qq6vWAVftXRlzXIowywWT8RZJA3gRALLkI2WEIbJs5r_VM3XKf_I0; path=/; HttpOnly"
        }, {
          "name" : "X-SourceFiles",
          "value" : "=?UTF-8?B?RDpcVmlydHVhbE9wdGltaXplci1SZWZhY3RvcmluZ1xDcm9wTWV0cmljcy5Wby5BcGlcQ3JvcE1ldHJpY3MuVm8uQXBpXGFwaVxhZG1pblx2MVx1c2Vyc1w=?="
        }, {
          "name" : "X-Powered-By",
          "value" : "ASP.NET"
        }, {
          "name" : "Date",
          "value" : "Thu, 28 Mar 2019 21:51:43 GMT"
        }, {
          "name" : "Content-Length",
          "value" : "9"
        } ],
        "content" : {
          "size" : 9,
          "mimeType" : "application/json; charset=utf-8",
          "text" : "{\"id\":34}",
          "comment" : ""
        },
        "redirectURL" : "",
        "headersSize" : 887,
        "bodySize" : 9,
        "comment" : ""
      },
      "cache" : { },
      "timings" : {
        "comment" : "",
        "blocked" : -1,
        "wait" : 1281,
        "receive" : 0,
        "dns" : -1,
        "send" : 0,
        "connect" : -1,
        "ssl" : -1
      },
      "serverIPAddress" : "127.0.0.1",
      "comment" : "",
      "_katalonRequestInformation" : {
        "name" : "87",
        "testObjectId" : "Object Repository/VoPro/Account/api_admin_v1_users",
        "harId" : "cda4efba-f223-4d44-8db0-f0cbbfe19bba"
      },
      "time" : 1282
    } ],
    "comment" : ""
  }
}