{
  "log" : {
    "version" : "1.2",
    "creator" : {
      "name" : "BrowserMob Proxy",
      "version" : "2.1.5",
      "comment" : ""
    },
    "pages" : [ {
      "id" : "Page 0",
      "startedDateTime" : "2019-03-28T18:59:52.618Z",
      "title" : "Page 0",
      "pageTimings" : {
        "onLoad" : 1244,
        "comment" : ""
      },
      "comment" : ""
    } ],
    "entries" : [ {
      "pageref" : "Page 0",
      "startedDateTime" : "2019-03-28T18:59:52.619Z",
      "request" : {
        "method" : "POST",
        "url" : "http://localhost:10520/WebAPI/api/admin/v1/users/?",
        "httpVersion" : "HTTP/1.1",
        "cookies" : [ ],
        "headers" : [ {
          "name" : "User-Agent",
          "value" : "Katalon Studio"
        }, {
          "name" : "Content-Type",
          "value" : "application/x-www-form-urlencoded"
        }, {
          "name" : "Authorization",
          "value" : "Bearer eyJ0eXAiOiJKV1QiLCJhbGciOiJIUzI1NiJ9.eyJ1bmlxdWVfbmFtZSI6ImFkbWluIiwicm9sZSI6InVzZXIiLCJzdWIiOiJhZG1pbiIsImlzcyI6IkNyb3BNZXRyaWNzIiwiYXVkIjoiYWxsIiwiZXhwIjoxNTUzODAzNDkyLCJuYmYiOjE1NTM3OTk1OTJ9.4wW-gKGGZCbHO_Lfg63bf2lj7q7NWkWk4QHyesJSdKE"
        }, {
          "name" : "Host",
          "value" : "localhost:10520"
        }, {
          "name" : "Accept",
          "value" : "text/html, image/gif, image/jpeg, *; q=.2, */*; q=.2"
        }, {
          "name" : "Proxy-Connection",
          "value" : "keep-alive"
        }, {
          "name" : "Content-Length",
          "value" : "274"
        } ],
        "queryString" : [ ],
        "postData" : {
          "mimeType" : "application/x-www-form-urlencoded",
          "params" : [ {
            "name" : "password",
            "value" : "cropmetrics",
            "comment" : ""
          }, {
            "name" : "email",
            "value" : "cropmetricsvo.rolefieldcrew@gmail.com",
            "comment" : ""
          }, {
            "name" : "fullname",
            "value" : "test validation",
            "comment" : ""
          }, {
            "name" : "phone",
            "value" : "123",
            "comment" : ""
          }, {
            "name" : "dealer",
            "value" : "x",
            "comment" : ""
          }, {
            "name" : "addressLine1",
            "value" : "address line 1 test validation",
            "comment" : ""
          }, {
            "name" : "addressLine2",
            "value" : "address line 2 test validation",
            "comment" : ""
          }, {
            "name" : "town",
            "value" : "townValidation",
            "comment" : ""
          }, {
            "name" : "state",
            "value" : "stateValidation",
            "comment" : ""
          }, {
            "name" : "zip",
            "value" : "xx",
            "comment" : ""
          }, {
            "name" : "country",
            "value" : "xx",
            "comment" : ""
          }, {
            "name" : "roles",
            "value" : "FieldCrew",
            "comment" : ""
          } ],
          "comment" : ""
        },
        "headersSize" : 544,
        "bodySize" : 274,
        "comment" : ""
      },
      "response" : {
        "status" : 200,
        "statusText" : "OK",
        "httpVersion" : "HTTP/1.1",
        "cookies" : [ {
          "name" : ".ASPROLES",
          "value" : "PJ2nh5wLVDUylhHk4dQL0vzZw42aCcBzCikinuvfs63xUiTNBLB-zr0--gsC9w7IEB6fbJ4vq4J26IRaKBdYyTFLyJQwF7wyofVy-YZX4SRbEzLpHUuaTKclKWrULWayKTG-X70cighso7urj-mMasKo-J89aMe__UgCscJb3IF92eBLJ-h2ZakiwCpuoo6Jbj4W9r8aEOMmVRU_JOdp3QFtZR_IDTP5KqnfGjszaYC7Onlq7InCyBvID1CFXqmnXtpsUMY8L5sjfbvOKnLp8IGvQdyad_zdd9bS3K35-4zvds2eLwTYivQxA4b0jGwfOSwvCxf_AwTy8YRIIkEaTxBfL1TB2beMMj6mMXEpUHCyFu-nMkFzYITZUcN__WdAHTe_lW9vvOlcO3Oh4odN_oIx9P5va4x-FdcQhhNE-oqL0qWSKJYfJS6tz-zARTjgT80NIimTIAWpVh_eCjpSosLiHehFuSFm07jFWZHfarPfPcxL0",
          "path" : "/",
          "httpOnly" : true,
          "secure" : false,
          "comment" : ""
        } ],
        "headers" : [ {
          "name" : "Cache-Control",
          "value" : "private"
        }, {
          "name" : "Content-Type",
          "value" : "application/json; charset=utf-8"
        }, {
          "name" : "Server",
          "value" : "Microsoft-IIS/10.0"
        }, {
          "name" : "Set-Cookie",
          "value" : ".ASPROLES=PJ2nh5wLVDUylhHk4dQL0vzZw42aCcBzCikinuvfs63xUiTNBLB-zr0--gsC9w7IEB6fbJ4vq4J26IRaKBdYyTFLyJQwF7wyofVy-YZX4SRbEzLpHUuaTKclKWrULWayKTG-X70cighso7urj-mMasKo-J89aMe__UgCscJb3IF92eBLJ-h2ZakiwCpuoo6Jbj4W9r8aEOMmVRU_JOdp3QFtZR_IDTP5KqnfGjszaYC7Onlq7InCyBvID1CFXqmnXtpsUMY8L5sjfbvOKnLp8IGvQdyad_zdd9bS3K35-4zvds2eLwTYivQxA4b0jGwfOSwvCxf_AwTy8YRIIkEaTxBfL1TB2beMMj6mMXEpUHCyFu-nMkFzYITZUcN__WdAHTe_lW9vvOlcO3Oh4odN_oIx9P5va4x-FdcQhhNE-oqL0qWSKJYfJS6tz-zARTjgT80NIimTIAWpVh_eCjpSosLiHehFuSFm07jFWZHfarPfPcxL0; path=/; HttpOnly"
        }, {
          "name" : "X-SourceFiles",
          "value" : "=?UTF-8?B?RDpcVmlydHVhbE9wdGltaXplci1SZWZhY3RvcmluZ1xDcm9wTWV0cmljcy5Wby5BcGlcQ3JvcE1ldHJpY3MuVm8uQXBpXGFwaVxhZG1pblx2MVx1c2Vyc1w=?="
        }, {
          "name" : "X-Powered-By",
          "value" : "ASP.NET"
        }, {
          "name" : "Date",
          "value" : "Thu, 28 Mar 2019 18:59:53 GMT"
        }, {
          "name" : "Content-Length",
          "value" : "9"
        } ],
        "content" : {
          "size" : 9,
          "mimeType" : "application/json; charset=utf-8",
          "text" : "{\"id\":44}",
          "comment" : ""
        },
        "redirectURL" : "",
        "headersSize" : 887,
        "bodySize" : 9,
        "comment" : ""
      },
      "cache" : { },
      "timings" : {
        "comment" : "",
        "ssl" : -1,
        "connect" : -1,
        "blocked" : -1,
        "receive" : 0,
        "dns" : -1,
        "wait" : 1239,
        "send" : 0
      },
      "serverIPAddress" : "127.0.0.1",
      "comment" : "",
      "_katalonRequestInformation" : {
        "name" : "109",
        "testObjectId" : "Object Repository/VoPro/Account/api_admin_v1_users",
        "harId" : "687c549f-599a-4dbb-b1a4-6db6628e5808"
      },
      "time" : 1240
    } ],
    "comment" : ""
  }
}