{
  "log" : {
    "version" : "1.2",
    "creator" : {
      "name" : "BrowserMob Proxy",
      "version" : "2.1.5",
      "comment" : ""
    },
    "pages" : [ {
      "id" : "Page 0",
      "startedDateTime" : "2019-03-29T22:26:20.999Z",
      "title" : "Page 0",
      "pageTimings" : {
        "onLoad" : 51,
        "comment" : ""
      },
      "comment" : ""
    } ],
    "entries" : [ {
      "pageref" : "Page 0",
      "startedDateTime" : "2019-03-29T22:26:21.001Z",
      "request" : {
        "method" : "POST",
        "url" : "http://localhost:10520/WebAPI/api/admin/v1/users/?",
        "httpVersion" : "HTTP/1.1",
        "cookies" : [ ],
        "headers" : [ {
          "name" : "User-Agent",
          "value" : "Katalon Studio"
        }, {
          "name" : "Content-Type",
          "value" : "application/x-www-form-urlencoded"
        }, {
          "name" : "Authorization",
          "value" : "Bearer eyJ0eXAiOiJKV1QiLCJhbGciOiJIUzI1NiJ9.eyJ1bmlxdWVfbmFtZSI6ImFkbWluIiwicm9sZSI6InVzZXIiLCJzdWIiOiJhZG1pbiIsImlzcyI6IkNyb3BNZXRyaWNzIiwiYXVkIjoiYWxsIiwiZXhwIjoxNTUzOTAyMjgwLCJuYmYiOjE1NTM4OTgzODB9.L1RLn_3y6lAPTeuWAj9rWrSKX2J_2nkSEATx1_tGKbo"
        }, {
          "name" : "Host",
          "value" : "localhost:10520"
        }, {
          "name" : "Accept",
          "value" : "text/html, image/gif, image/jpeg, *; q=.2, */*; q=.2"
        }, {
          "name" : "Proxy-Connection",
          "value" : "keep-alive"
        }, {
          "name" : "Content-Length",
          "value" : "312"
        } ],
        "queryString" : [ ],
        "postData" : {
          "mimeType" : "application/x-www-form-urlencoded",
          "params" : [ {
            "name" : "password",
            "value" : "lessp",
            "comment" : ""
          }, {
            "name" : "email",
            "value" : "cropmetricsvo.lesspass.test@gmail.com",
            "comment" : ""
          }, {
            "name" : "fullname",
            "value" : "test validation",
            "comment" : ""
          }, {
            "name" : "phone",
            "value" : "123",
            "comment" : ""
          }, {
            "name" : "dealer",
            "value" : "dealer test validation",
            "comment" : ""
          }, {
            "name" : "addressLine1",
            "value" : "address line 1 test validation",
            "comment" : ""
          }, {
            "name" : "addressLine2",
            "value" : "address line 2 test validation",
            "comment" : ""
          }, {
            "name" : "town",
            "value" : "townValidation",
            "comment" : ""
          }, {
            "name" : "state",
            "value" : "stateValidation",
            "comment" : ""
          }, {
            "name" : "zip",
            "value" : "zipValidation",
            "comment" : ""
          }, {
            "name" : "country",
            "value" : "countryValidation",
            "comment" : ""
          }, {
            "name" : "roles",
            "value" : "Client",
            "comment" : ""
          } ],
          "comment" : ""
        },
        "headersSize" : 544,
        "bodySize" : 312,
        "comment" : ""
      },
      "response" : {
        "status" : 400,
        "statusText" : "Bad Request",
        "httpVersion" : "HTTP/1.1",
        "cookies" : [ {
          "name" : ".ASPROLES",
          "value" : "OprhDiI9ekvsvBMoSYSSfR_CyMD2CpywuUpMELY0oB2pIbn9q5cRzW_J1wCgA3XvFF1gA_EwnfvPEoWoHjVyPDwndblUB3eE9IH-r1tvBLuZY69oi-yebR08d9A2Z9xy9-iRdoRzN7B7fpfIqc65wvhoJAe5dKpqo4C_6PRFae447gOHcll46pVc3jSexvuOs6LMyULdSU2kdOhFA8hC88jMLK7uJjfmdEN2aE72o9Fs33o8t3jgWWgPb4qz5_dq2D8x0t1VoVElwci_xE_Jm2eD2H1UZ1q9mqOZ6JaoPKuJRSQMo17JG_xbDSgmtML1ij5-nGV4dSawBWzsDoyguACZNhn43vDa2BFHT1DdgoQOooMvpXl7rhcCubcUECPo2w0OjB3UEJkTU1xySWMq72T0vizdIqWu_msjl5R0wMnHmTDoax5XpXeRAwdi0lgus7b3J4W-krjlqMCdRQ2N0gIxJUEqtEtWPkQ4e1JnBjSKpXcW0",
          "path" : "/",
          "httpOnly" : true,
          "secure" : false,
          "comment" : ""
        } ],
        "headers" : [ {
          "name" : "Cache-Control",
          "value" : "private"
        }, {
          "name" : "Content-Type",
          "value" : "application/json; charset=utf-8"
        }, {
          "name" : "Server",
          "value" : "Microsoft-IIS/10.0"
        }, {
          "name" : "Set-Cookie",
          "value" : ".ASPROLES=OprhDiI9ekvsvBMoSYSSfR_CyMD2CpywuUpMELY0oB2pIbn9q5cRzW_J1wCgA3XvFF1gA_EwnfvPEoWoHjVyPDwndblUB3eE9IH-r1tvBLuZY69oi-yebR08d9A2Z9xy9-iRdoRzN7B7fpfIqc65wvhoJAe5dKpqo4C_6PRFae447gOHcll46pVc3jSexvuOs6LMyULdSU2kdOhFA8hC88jMLK7uJjfmdEN2aE72o9Fs33o8t3jgWWgPb4qz5_dq2D8x0t1VoVElwci_xE_Jm2eD2H1UZ1q9mqOZ6JaoPKuJRSQMo17JG_xbDSgmtML1ij5-nGV4dSawBWzsDoyguACZNhn43vDa2BFHT1DdgoQOooMvpXl7rhcCubcUECPo2w0OjB3UEJkTU1xySWMq72T0vizdIqWu_msjl5R0wMnHmTDoax5XpXeRAwdi0lgus7b3J4W-krjlqMCdRQ2N0gIxJUEqtEtWPkQ4e1JnBjSKpXcW0; path=/; HttpOnly"
        }, {
          "name" : "X-SourceFiles",
          "value" : "=?UTF-8?B?RDpcVmlydHVhbE9wdGltaXplci1SZWZhY3RvcmluZ1xDcm9wTWV0cmljcy5Wby5BcGlcQ3JvcE1ldHJpY3MuVm8uQXBpXGFwaVxhZG1pblx2MVx1c2Vyc1w=?="
        }, {
          "name" : "X-Powered-By",
          "value" : "ASP.NET"
        }, {
          "name" : "Date",
          "value" : "Fri, 29 Mar 2019 22:26:20 GMT"
        }, {
          "name" : "Content-Length",
          "value" : "116"
        } ],
        "content" : {
          "size" : 116,
          "mimeType" : "application/json; charset=utf-8",
          "text" : "{\"message\":\"The request is invalid. The Password must have at least 6 characters (distinct to the space character)\"}",
          "comment" : ""
        },
        "redirectURL" : "",
        "headersSize" : 898,
        "bodySize" : 116,
        "comment" : ""
      },
      "cache" : { },
      "timings" : {
        "comment" : "",
        "ssl" : -1,
        "wait" : 44,
        "send" : 0,
        "receive" : 1,
        "dns" : -1,
        "connect" : -1,
        "blocked" : -1
      },
      "serverIPAddress" : "127.0.0.1",
      "comment" : "",
      "_katalonRequestInformation" : {
        "name" : "33",
        "testObjectId" : "Object Repository/VoPro/Account/api_admin_v1_users",
        "harId" : "9ca4d577-2de3-4d9c-a9a3-77f51d520985"
      },
      "time" : 46
    } ],
    "comment" : ""
  }
}