{
  "log" : {
    "version" : "1.2",
    "creator" : {
      "name" : "BrowserMob Proxy",
      "version" : "2.1.5",
      "comment" : ""
    },
    "pages" : [ {
      "id" : "Page 0",
      "startedDateTime" : "2019-03-29T22:13:34.617Z",
      "title" : "Page 0",
      "pageTimings" : {
        "onLoad" : 1997,
        "comment" : ""
      },
      "comment" : ""
    } ],
    "entries" : [ {
      "pageref" : "Page 0",
      "startedDateTime" : "2019-03-29T22:13:34.621Z",
      "request" : {
        "method" : "PUT",
        "url" : "http://localhost:10520/WebAPI/api/admin/v1/users/16?",
        "httpVersion" : "HTTP/1.1",
        "cookies" : [ ],
        "headers" : [ {
          "name" : "User-Agent",
          "value" : "Katalon Studio"
        }, {
          "name" : "Content-Type",
          "value" : "application/x-www-form-urlencoded"
        }, {
          "name" : "Authorization",
          "value" : "Bearer eyJ0eXAiOiJKV1QiLCJhbGciOiJIUzI1NiJ9.eyJ1bmlxdWVfbmFtZSI6ImFkbWluIiwicm9sZSI6InVzZXIiLCJzdWIiOiJhZG1pbiIsImlzcyI6IkNyb3BNZXRyaWNzIiwiYXVkIjoiYWxsIiwiZXhwIjoxNTUzOTAxNTE0LCJuYmYiOjE1NTM4OTc2MTR9.O8lT8ef34veQxAPovsvF-BxB_LaMxTbvaq1i9Pz3xWU"
        }, {
          "name" : "Host",
          "value" : "localhost:10520"
        }, {
          "name" : "Accept",
          "value" : "text/html, image/gif, image/jpeg, *; q=.2, */*; q=.2"
        }, {
          "name" : "Proxy-Connection",
          "value" : "keep-alive"
        }, {
          "name" : "Content-Length",
          "value" : "333"
        } ],
        "queryString" : [ ],
        "postData" : {
          "mimeType" : "application/x-www-form-urlencoded",
          "params" : [ {
            "name" : "password",
            "value" : "cropmetrics",
            "comment" : ""
          }, {
            "name" : "email",
            "value" : "    cropmetricsvo.spacesfirstemail@gmail.com            ",
            "comment" : ""
          }, {
            "name" : "fullname",
            "value" : "test validation",
            "comment" : ""
          }, {
            "name" : "phone",
            "value" : "123",
            "comment" : ""
          }, {
            "name" : "dealer",
            "value" : "x",
            "comment" : ""
          }, {
            "name" : "addressLine1",
            "value" : "address line 1 test validation",
            "comment" : ""
          }, {
            "name" : "addressLine2",
            "value" : "address line 1 test validation",
            "comment" : ""
          }, {
            "name" : "town",
            "value" : "townValidation",
            "comment" : ""
          }, {
            "name" : "state",
            "value" : "stateValidation",
            "comment" : ""
          }, {
            "name" : "zip",
            "value" : "zipValidation",
            "comment" : ""
          }, {
            "name" : "country",
            "value" : "countryValidation",
            "comment" : ""
          }, {
            "name" : "roles",
            "value" : "Client",
            "comment" : ""
          }, {
            "name" : "userProfileId",
            "value" : "16",
            "comment" : ""
          } ],
          "comment" : ""
        },
        "headersSize" : 545,
        "bodySize" : 333,
        "comment" : ""
      },
      "response" : {
        "status" : 200,
        "statusText" : "OK",
        "httpVersion" : "HTTP/1.1",
        "cookies" : [ {
          "name" : ".ASPROLES",
          "value" : "SC-IgixkF96VsgLsoZ2HQcGTVFa7UcKHE_FbQwF1_UKKnww4vvSpVH0kpIZ3FyqB8dZfMDJZkdJAg_DmkDt-72Jfv067zEFlghzeCallkFIqTp0NwDLDnJif0KvHJMhOEJ4UwOatSPdyKT18x97Sz3UZlG74sqkpg0_Fm9A1YH0fV59YAa5oehfsf-bhN3AT2e_qsKQ-zruWmC74h82gFjZx4Dhn2XwhpAarqivzZ67cpX8y8-YK3nfPJyEEvarj0tEauDzQoeO_VxZnMx0kSRngKjCfGGXnvW_zQZK0dAfNXTEbAclaE_5FYAay-Jkgby-zF2zXB_5HjbC38yt62VjbyVEIQbWYqBn-Zu6fFlwI-SfsqHKQderd3U71uAnGVjE85_ZbqXernyXzw-stveOjcD1d2KBIvTlXmH9HtrqOLKwwaPUPahvdlH02-JbgF_M4Cs23vp4kyCATDlAOWTtOXC9OrcAp7melnNPx9zUYNFVV0",
          "path" : "/",
          "httpOnly" : true,
          "secure" : false,
          "comment" : ""
        } ],
        "headers" : [ {
          "name" : "Cache-Control",
          "value" : "private"
        }, {
          "name" : "Server",
          "value" : "Microsoft-IIS/10.0"
        }, {
          "name" : "Set-Cookie",
          "value" : ".ASPROLES=SC-IgixkF96VsgLsoZ2HQcGTVFa7UcKHE_FbQwF1_UKKnww4vvSpVH0kpIZ3FyqB8dZfMDJZkdJAg_DmkDt-72Jfv067zEFlghzeCallkFIqTp0NwDLDnJif0KvHJMhOEJ4UwOatSPdyKT18x97Sz3UZlG74sqkpg0_Fm9A1YH0fV59YAa5oehfsf-bhN3AT2e_qsKQ-zruWmC74h82gFjZx4Dhn2XwhpAarqivzZ67cpX8y8-YK3nfPJyEEvarj0tEauDzQoeO_VxZnMx0kSRngKjCfGGXnvW_zQZK0dAfNXTEbAclaE_5FYAay-Jkgby-zF2zXB_5HjbC38yt62VjbyVEIQbWYqBn-Zu6fFlwI-SfsqHKQderd3U71uAnGVjE85_ZbqXernyXzw-stveOjcD1d2KBIvTlXmH9HtrqOLKwwaPUPahvdlH02-JbgF_M4Cs23vp4kyCATDlAOWTtOXC9OrcAp7melnNPx9zUYNFVV0; path=/; HttpOnly"
        }, {
          "name" : "X-SourceFiles",
          "value" : "=?UTF-8?B?RDpcVmlydHVhbE9wdGltaXplci1SZWZhY3RvcmluZ1xDcm9wTWV0cmljcy5Wby5BcGlcQ3JvcE1ldHJpY3MuVm8uQXBpXGFwaVxhZG1pblx2MVx1c2Vyc1wxNg==?="
        }, {
          "name" : "X-Powered-By",
          "value" : "ASP.NET"
        }, {
          "name" : "Date",
          "value" : "Fri, 29 Mar 2019 22:13:36 GMT"
        }, {
          "name" : "Content-Length",
          "value" : "0"
        } ],
        "content" : {
          "size" : 0,
          "mimeType" : "",
          "text" : "",
          "encoding" : "base64",
          "comment" : ""
        },
        "redirectURL" : "",
        "headersSize" : 844,
        "bodySize" : 0,
        "comment" : ""
      },
      "cache" : { },
      "timings" : {
        "comment" : "",
        "connect" : -1,
        "wait" : 1989,
        "receive" : 0,
        "dns" : -1,
        "send" : 0,
        "blocked" : -1,
        "ssl" : -1
      },
      "serverIPAddress" : "127.0.0.1",
      "comment" : "",
      "_katalonRequestInformation" : {
        "name" : "21",
        "testObjectId" : "Object Repository/VoPro/Account/api_admin_v1_users_userprofileid",
        "harId" : "8920577c-3f08-4201-98cc-3d0841cedf96"
      },
      "time" : 1990
    } ],
    "comment" : ""
  }
}