{
  "log" : {
    "version" : "1.2",
    "creator" : {
      "name" : "BrowserMob Proxy",
      "version" : "2.1.5",
      "comment" : ""
    },
    "pages" : [ {
      "id" : "Page 0",
      "startedDateTime" : "2019-03-28T20:41:49.637Z",
      "title" : "Page 0",
      "pageTimings" : {
        "onLoad" : 29,
        "comment" : ""
      },
      "comment" : ""
    } ],
    "entries" : [ {
      "pageref" : "Page 0",
      "startedDateTime" : "2019-03-28T20:41:49.638Z",
      "request" : {
        "method" : "POST",
        "url" : "http://localhost:10520/WebAPI/api/admin/v1/users/?",
        "httpVersion" : "HTTP/1.1",
        "cookies" : [ ],
        "headers" : [ {
          "name" : "User-Agent",
          "value" : "Katalon Studio"
        }, {
          "name" : "Content-Type",
          "value" : "application/x-www-form-urlencoded"
        }, {
          "name" : "Authorization",
          "value" : "Bearer eyJ0eXAiOiJKV1QiLCJhbGciOiJIUzI1NiJ9.eyJ1bmlxdWVfbmFtZSI6ImFkbWluIiwicm9sZSI6InVzZXIiLCJzdWIiOiJhZG1pbiIsImlzcyI6IkNyb3BNZXRyaWNzIiwiYXVkIjoiYWxsIiwiZXhwIjoxNTUzODA5NjA5LCJuYmYiOjE1NTM4MDU3MDl9.Kfoc28eAh_1-hbfj_s9trwEdlb1yNZjx0TlBXo6q60s"
        }, {
          "name" : "Host",
          "value" : "localhost:10520"
        }, {
          "name" : "Accept",
          "value" : "text/html, image/gif, image/jpeg, *; q=.2, */*; q=.2"
        }, {
          "name" : "Proxy-Connection",
          "value" : "keep-alive"
        }, {
          "name" : "Content-Length",
          "value" : "342"
        } ],
        "queryString" : [ ],
        "postData" : {
          "mimeType" : "application/x-www-form-urlencoded",
          "params" : [ {
            "name" : "password",
            "value" : "     1",
            "comment" : ""
          }, {
            "name" : "email",
            "value" : "cropmetricsvo.passwithspaces@gmail.com",
            "comment" : ""
          }, {
            "name" : "fullname",
            "value" : "test validation phone attribute as characters instead of numbers",
            "comment" : ""
          }, {
            "name" : "phone",
            "value" : "123",
            "comment" : ""
          }, {
            "name" : "dealer",
            "value" : "x",
            "comment" : ""
          }, {
            "name" : "addressLine1",
            "value" : "address line 1 test validation",
            "comment" : ""
          }, {
            "name" : "addressLine2",
            "value" : "address line 1 test validation",
            "comment" : ""
          }, {
            "name" : "town",
            "value" : "townValidation",
            "comment" : ""
          }, {
            "name" : "state",
            "value" : "stateValidation",
            "comment" : ""
          }, {
            "name" : "zip",
            "value" : "zipValidation",
            "comment" : ""
          }, {
            "name" : "country",
            "value" : "countryValidation",
            "comment" : ""
          }, {
            "name" : "roles",
            "value" : "Client",
            "comment" : ""
          } ],
          "comment" : ""
        },
        "headersSize" : 544,
        "bodySize" : 342,
        "comment" : ""
      },
      "response" : {
        "status" : 400,
        "statusText" : "Bad Request",
        "httpVersion" : "HTTP/1.1",
        "cookies" : [ {
          "name" : ".ASPROLES",
          "value" : "UUO-g5eacyHQUKLIumfBlBpxG3ZR0Qz8vevI5-9M0vJ5VNSKiXy-RSis2wryE7OUtkcSXtffbPxR_b0ikJs5nmYRDL49hEhMJ2ardU6xyqv6OyKAByWc_DXwGYrutTkbo7MuRO2yAgCDhqZq9-bVGCdlb9nAHzaoIzrQCgesq5HjQ37Y93i9Dx57WVVBzSQfr679wOhktcxtZjDH3L91_5KV7Do1VjjyPqjJx9IJw90bnB4ngEsontAOeRdwkPG3_gUlDkLuVpqMjk--ILhTF267V4FVS9mosZ9OxyQLa2A5bFdr-aTIiy55sbaDyLNFzPtG_Q9cmcYKr4iGAuGEmZ3sbY5OfT5Zv7E7xIqCZOfh4ntibSN0LwatJV3xGq51yy588UqSulCgZ0kTXlRxhh3EW29soJqw6dqccrRxYbwlzBU1wuvxGd-GPtmSxtgFFJ-GvxqJvuFrgLCXg7HGYeSS_-3gkC10WGBO6SbvMoe85G6h0",
          "path" : "/",
          "httpOnly" : true,
          "secure" : false,
          "comment" : ""
        } ],
        "headers" : [ {
          "name" : "Cache-Control",
          "value" : "private"
        }, {
          "name" : "Content-Type",
          "value" : "application/json; charset=utf-8"
        }, {
          "name" : "Server",
          "value" : "Microsoft-IIS/10.0"
        }, {
          "name" : "Set-Cookie",
          "value" : ".ASPROLES=UUO-g5eacyHQUKLIumfBlBpxG3ZR0Qz8vevI5-9M0vJ5VNSKiXy-RSis2wryE7OUtkcSXtffbPxR_b0ikJs5nmYRDL49hEhMJ2ardU6xyqv6OyKAByWc_DXwGYrutTkbo7MuRO2yAgCDhqZq9-bVGCdlb9nAHzaoIzrQCgesq5HjQ37Y93i9Dx57WVVBzSQfr679wOhktcxtZjDH3L91_5KV7Do1VjjyPqjJx9IJw90bnB4ngEsontAOeRdwkPG3_gUlDkLuVpqMjk--ILhTF267V4FVS9mosZ9OxyQLa2A5bFdr-aTIiy55sbaDyLNFzPtG_Q9cmcYKr4iGAuGEmZ3sbY5OfT5Zv7E7xIqCZOfh4ntibSN0LwatJV3xGq51yy588UqSulCgZ0kTXlRxhh3EW29soJqw6dqccrRxYbwlzBU1wuvxGd-GPtmSxtgFFJ-GvxqJvuFrgLCXg7HGYeSS_-3gkC10WGBO6SbvMoe85G6h0; path=/; HttpOnly"
        }, {
          "name" : "X-SourceFiles",
          "value" : "=?UTF-8?B?RDpcVmlydHVhbE9wdGltaXplci1SZWZhY3RvcmluZ1xDcm9wTWV0cmljcy5Wby5BcGlcQ3JvcE1ldHJpY3MuVm8uQXBpXGFwaVxhZG1pblx2MVx1c2Vyc1w=?="
        }, {
          "name" : "X-Powered-By",
          "value" : "ASP.NET"
        }, {
          "name" : "Date",
          "value" : "Thu, 28 Mar 2019 20:41:49 GMT"
        }, {
          "name" : "Content-Length",
          "value" : "85"
        } ],
        "content" : {
          "size" : 85,
          "mimeType" : "application/json; charset=utf-8",
          "text" : "{\"message\":\"The request is invalid. The Password can't contain the space character.\"}",
          "comment" : ""
        },
        "redirectURL" : "",
        "headersSize" : 897,
        "bodySize" : 85,
        "comment" : ""
      },
      "cache" : { },
      "timings" : {
        "comment" : "",
        "ssl" : -1,
        "send" : 0,
        "receive" : 0,
        "wait" : 24,
        "connect" : -1,
        "blocked" : -1,
        "dns" : -1
      },
      "serverIPAddress" : "127.0.0.1",
      "comment" : "",
      "_katalonRequestInformation" : {
        "name" : "39",
        "testObjectId" : "Object Repository/VoPro/Account/api_admin_v1_users",
        "harId" : "a6c0d2ac-9119-449d-990a-b29f66b1ada5"
      },
      "time" : 25
    } ],
    "comment" : ""
  }
}