{
  "log" : {
    "version" : "1.2",
    "creator" : {
      "name" : "BrowserMob Proxy",
      "version" : "2.1.5",
      "comment" : ""
    },
    "pages" : [ {
      "id" : "Page 0",
      "startedDateTime" : "2019-03-27T19:52:50.705Z",
      "title" : "Page 0",
      "pageTimings" : {
        "onLoad" : 3392,
        "comment" : ""
      },
      "comment" : ""
    } ],
    "entries" : [ {
      "pageref" : "Page 0",
      "startedDateTime" : "2019-03-27T19:52:50.707Z",
      "request" : {
        "method" : "POST",
        "url" : "http://localhost:10520/WebAPI/api/Account/AdministrativeRegister/?",
        "httpVersion" : "HTTP/1.1",
        "cookies" : [ ],
        "headers" : [ {
          "name" : "User-Agent",
          "value" : "Katalon Studio"
        }, {
          "name" : "Content-Type",
          "value" : "application/x-www-form-urlencoded"
        }, {
          "name" : "Authorization",
          "value" : "Bearer eyJ0eXAiOiJKV1QiLCJhbGciOiJIUzI1NiJ9.eyJ1bmlxdWVfbmFtZSI6ImFkbWluIiwicm9sZSI6InVzZXIiLCJzdWIiOiJhZG1pbiIsImlzcyI6IkNyb3BNZXRyaWNzIiwiYXVkIjoiYWxsIiwiZXhwIjoxNTUzNzIwMjcwLCJuYmYiOjE1NTM3MTYzNzB9.t7bHnfdxAFy6Gu7q_hyPLDOuwpKH77zPXFFvC39bhTo"
        }, {
          "name" : "Host",
          "value" : "localhost:10520"
        }, {
          "name" : "Accept",
          "value" : "text/html, image/gif, image/jpeg, *; q=.2, */*; q=.2"
        }, {
          "name" : "Proxy-Connection",
          "value" : "keep-alive"
        }, {
          "name" : "Content-Length",
          "value" : "386"
        } ],
        "queryString" : [ ],
        "postData" : {
          "mimeType" : "application/x-www-form-urlencoded",
          "params" : [ {
            "name" : "username",
            "value" : "kusernopassword",
            "comment" : ""
          }, {
            "name" : "password",
            "value" : "",
            "comment" : ""
          }, {
            "name" : "confirmPassword",
            "value" : "cropmetrics",
            "comment" : ""
          }, {
            "name" : "email",
            "value" : "cropmetricsvo@gmail.com",
            "comment" : ""
          }, {
            "name" : "fullname",
            "value" : "test validation",
            "comment" : ""
          }, {
            "name" : "phone",
            "value" : "123",
            "comment" : ""
          }, {
            "name" : "dealer",
            "value" : "dealer test validation",
            "comment" : ""
          }, {
            "name" : "addressLine1",
            "value" : "address line 1 test validation",
            "comment" : ""
          }, {
            "name" : "addressLine2",
            "value" : "address line 1 test validation",
            "comment" : ""
          }, {
            "name" : "town",
            "value" : "townValidation",
            "comment" : ""
          }, {
            "name" : "state",
            "value" : "stateValidation",
            "comment" : ""
          }, {
            "name" : "zip",
            "value" : "zipValidation",
            "comment" : ""
          }, {
            "name" : "country",
            "value" : "countryValidation",
            "comment" : ""
          }, {
            "name" : "roles",
            "value" : "Client",
            "comment" : ""
          }, {
            "name" : "modifierUsername",
            "value" : "admin",
            "comment" : ""
          }, {
            "name" : "modifierUserId",
            "value" : "1",
            "comment" : ""
          } ],
          "comment" : ""
        },
        "headersSize" : 560,
        "bodySize" : 386,
        "comment" : ""
      },
      "response" : {
        "status" : 500,
        "statusText" : "Internal Server Error",
        "httpVersion" : "HTTP/1.1",
        "cookies" : [ {
          "name" : ".ASPROLES",
          "value" : "AU8X6dZZSY4cWRQvH9UTH6fOtsFuNEdTPTzpfwnI0qQhgaACVnGai3DZOv9I2G5p_fTVpIUkXdBNgejLzB_mFgVDquTJkkIkAJf0Atb6uyfQwp2i1kAgh1JWsyU5LdNM1MPeKgLRfkYn1DilnRFzok6OgcVFYXXzMLytt__vARu9UOyRLmHIHwR6Ix5YQsOp8Knq3mHCtp00DERimtJgpPADVBdlUf_wpi6Gi2zalxbWwqD9INVPSuA3A_-Eqiv3js-T-nKs0ErxqiF6Km5r3xqATGzVMvQPJefWi1n2B51lpa7gmtZORdSuvVao-fhC4V9fuLOHTIX-7bvQqalaEQhzskCr9IgApxqccB7NW3Tz2bZre80ElXvqbZNJaik6oLHj0-q2y5tkY8gdhT-U2zD1p4PH0wLit6kf1tq1nQABxli9qAIaOPvJabKjo6wWTYY1cXZhJT5yCDrS_X6g9ZwlUZSoPDhpd3AIr2BEZ7LCiZsG0",
          "path" : "/",
          "httpOnly" : true,
          "secure" : false,
          "comment" : ""
        } ],
        "headers" : [ {
          "name" : "Cache-Control",
          "value" : "private"
        }, {
          "name" : "Content-Type",
          "value" : "application/json; charset=utf-8"
        }, {
          "name" : "Server",
          "value" : "Microsoft-IIS/10.0"
        }, {
          "name" : "Set-Cookie",
          "value" : ".ASPROLES=AU8X6dZZSY4cWRQvH9UTH6fOtsFuNEdTPTzpfwnI0qQhgaACVnGai3DZOv9I2G5p_fTVpIUkXdBNgejLzB_mFgVDquTJkkIkAJf0Atb6uyfQwp2i1kAgh1JWsyU5LdNM1MPeKgLRfkYn1DilnRFzok6OgcVFYXXzMLytt__vARu9UOyRLmHIHwR6Ix5YQsOp8Knq3mHCtp00DERimtJgpPADVBdlUf_wpi6Gi2zalxbWwqD9INVPSuA3A_-Eqiv3js-T-nKs0ErxqiF6Km5r3xqATGzVMvQPJefWi1n2B51lpa7gmtZORdSuvVao-fhC4V9fuLOHTIX-7bvQqalaEQhzskCr9IgApxqccB7NW3Tz2bZre80ElXvqbZNJaik6oLHj0-q2y5tkY8gdhT-U2zD1p4PH0wLit6kf1tq1nQABxli9qAIaOPvJabKjo6wWTYY1cXZhJT5yCDrS_X6g9ZwlUZSoPDhpd3AIr2BEZ7LCiZsG0; path=/; HttpOnly"
        }, {
          "name" : "X-SourceFiles",
          "value" : "=?UTF-8?B?RDpcVmlydHVhbE9wdGltaXplci1SZWZhY3RvcmluZ1xDcm9wTWV0cmljcy5Wby5BcGlcQ3JvcE1ldHJpY3MuVm8uQXBpXGFwaVxBY2NvdW50XEFkbWluaXN0cmF0aXZlUmVnaXN0ZXJc?="
        }, {
          "name" : "X-Powered-By",
          "value" : "ASP.NET"
        }, {
          "name" : "Date",
          "value" : "Wed, 27 Mar 2019 19:52:54 GMT"
        }, {
          "name" : "Content-Length",
          "value" : "53"
        } ],
        "content" : {
          "size" : 53,
          "mimeType" : "application/json; charset=utf-8",
          "text" : "{\"message\":\"Internal server error in the processing\"}",
          "comment" : ""
        },
        "redirectURL" : "",
        "headersSize" : 927,
        "bodySize" : 53,
        "comment" : ""
      },
      "cache" : { },
      "timings" : {
        "comment" : "",
        "ssl" : -1,
        "send" : 0,
        "receive" : 1,
        "wait" : 3384,
        "connect" : -1,
        "blocked" : -1,
        "dns" : -1
      },
      "serverIPAddress" : "127.0.0.1",
      "comment" : "",
      "_katalonRequestInformation" : {
        "name" : "7",
        "testObjectId" : "Object Repository/VoPro/Account/AdministrativeRegister",
        "harId" : "3f44197a-dafc-4a6f-b839-ea611e26dfdc"
      },
      "time" : 3386
    } ],
    "comment" : ""
  }
}