{
  "log" : {
    "version" : "1.2",
    "creator" : {
      "name" : "BrowserMob Proxy",
      "version" : "2.1.5",
      "comment" : ""
    },
    "pages" : [ {
      "id" : "Page 0",
      "startedDateTime" : "2019-04-11T16:41:44.822Z",
      "title" : "Page 0",
      "pageTimings" : {
        "onLoad" : 3404,
        "comment" : ""
      },
      "comment" : ""
    } ],
    "entries" : [ {
      "pageref" : "Page 0",
      "startedDateTime" : "2019-04-11T16:41:44.823Z",
      "request" : {
        "method" : "POST",
        "url" : "http://localhost:10520/WebAPI/api/mobile/v1/fields?",
        "httpVersion" : "HTTP/1.1",
        "cookies" : [ ],
        "headers" : [ {
          "name" : "User-Agent",
          "value" : "Katalon Studio"
        }, {
          "name" : "Content-Type",
          "value" : "application/json"
        }, {
          "name" : "Authorization",
          "value" : "Bearer eyJ0eXAiOiJKV1QiLCJhbGciOiJIUzI1NiJ9.eyJ1bmlxdWVfbmFtZSI6Implbm55Lm1hbGRvbmFkby50eEBnbWFpbC5jb20iLCJyb2xlIjoidXNlciIsInN1YiI6Implbm55Lm1hbGRvbmFkby50eEBnbWFpbC5jb20iLCJpc3MiOiJDcm9wTWV0cmljcyIsImF1ZCI6ImFsbCIsImV4cCI6MTU1NTAwNDgwNCwibmJmIjoxNTU1MDAwOTA0fQ.xkXnUtWjvMlL3zsMVibQ4jhKiifOFjTToBtPcZxpXUs"
        }, {
          "name" : "Host",
          "value" : "localhost:10520"
        }, {
          "name" : "Accept",
          "value" : "text/html, image/gif, image/jpeg, *; q=.2, */*; q=.2"
        }, {
          "name" : "Proxy-Connection",
          "value" : "keep-alive"
        }, {
          "name" : "Content-Length",
          "value" : "397"
        } ],
        "queryString" : [ ],
        "postData" : {
          "mimeType" : "application/json",
          "text" : "{\"field\":{\"farm_id\":3,\"name\":\"Field by other acccount\",\"boundary\":{\"boundaries\":[{\"boundary\":{\"coords\":[{\"x\":-101.49568751,\"y\":37.14976293},{\"x\":-101.50049403,\"y\":37.14647907},{\"x\":-101.50049403,\"y\":37.14264773},{\"x\":-101.49723246,\"y\":37.1411425},{\"x\":-101.49019435,\"y\":37.14223722},{\"x\":-101.48933604,\"y\":37.14620541},{\"x\":-101.49294093,\"y\":37.14866833},{\"x\":-101.49568751,\"y\":37.14976293}]}}]}}}",
          "comment" : ""
        },
        "headersSize" : 590,
        "bodySize" : 397,
        "comment" : ""
      },
      "response" : {
        "status" : 400,
        "statusText" : "Bad Request",
        "httpVersion" : "HTTP/1.1",
        "cookies" : [ {
          "name" : ".ASPROLES",
          "value" : "4d5NMqQsd2AT47mybbMiYXlz3i2MdapZmbYu_tG5kyqFtz6ViMA1-mvJHAnNlp9ia8wF-eabk-a1EzIMZ-8S5PwbtFv8T3PBa_DospiYIG74VBSRTLTGvArcju1qEZllI0pnnP3_PurNSXYBBz2EGMuL9v9PzRLsD23SAy6dy02h79Q0GZn5wmcnaaP-7GxtLAK3OMLfaEe3Wcv6R-APMoqmoDRMLSRI2of5ni047XFPqrUbQL6MEAnvryJVFFHehLCYefXVyGmxFJRZTx8XjNaUQL_B4velafzpLZQc_HWKHD3Of534bD6WJWoE-2vDP-U2gtg3aVHnfwIp9IQUP9GXxs0qUlvJ6_eDHDPyWq42i0TiM90pnSJzPGMMqPxF_y3f6Y6M8Qx-iumfs4vhXn48-MNNMYS2_XZMYyKOv2idWmWzlvHlXamjLXyFD6TIic6s2hkvs7BaL-IupIGAa9wfbPTzcCLOBGNZic-MLs4NMDksXcwvTL_slBBkpMemwFIUrA2",
          "path" : "/",
          "httpOnly" : true,
          "secure" : false,
          "comment" : ""
        } ],
        "headers" : [ {
          "name" : "Cache-Control",
          "value" : "private"
        }, {
          "name" : "Content-Type",
          "value" : "application/json; charset=utf-8"
        }, {
          "name" : "Server",
          "value" : "Microsoft-IIS/10.0"
        }, {
          "name" : "Set-Cookie",
          "value" : ".ASPROLES=4d5NMqQsd2AT47mybbMiYXlz3i2MdapZmbYu_tG5kyqFtz6ViMA1-mvJHAnNlp9ia8wF-eabk-a1EzIMZ-8S5PwbtFv8T3PBa_DospiYIG74VBSRTLTGvArcju1qEZllI0pnnP3_PurNSXYBBz2EGMuL9v9PzRLsD23SAy6dy02h79Q0GZn5wmcnaaP-7GxtLAK3OMLfaEe3Wcv6R-APMoqmoDRMLSRI2of5ni047XFPqrUbQL6MEAnvryJVFFHehLCYefXVyGmxFJRZTx8XjNaUQL_B4velafzpLZQc_HWKHD3Of534bD6WJWoE-2vDP-U2gtg3aVHnfwIp9IQUP9GXxs0qUlvJ6_eDHDPyWq42i0TiM90pnSJzPGMMqPxF_y3f6Y6M8Qx-iumfs4vhXn48-MNNMYS2_XZMYyKOv2idWmWzlvHlXamjLXyFD6TIic6s2hkvs7BaL-IupIGAa9wfbPTzcCLOBGNZic-MLs4NMDksXcwvTL_slBBkpMemwFIUrA2; path=/; HttpOnly"
        }, {
          "name" : "X-SourceFiles",
          "value" : "=?UTF-8?B?RDpcVmlydHVhbE9wdGltaXplci1SZWZhY3RvcmluZ1xDcm9wTWV0cmljcy5Wby5BcGlcQ3JvcE1ldHJpY3MuVm8uQXBpXGFwaVxtb2JpbGVcdjFcZmllbGRz?="
        }, {
          "name" : "X-Powered-By",
          "value" : "ASP.NET"
        }, {
          "name" : "Date",
          "value" : "Thu, 11 Apr 2019 16:41:48 GMT"
        }, {
          "name" : "Content-Length",
          "value" : "82"
        } ],
        "content" : {
          "size" : 82,
          "mimeType" : "application/json; charset=utf-8",
          "text" : "{\"message\":\"The modifier doesn't have permissions to modify the field requested.\"}",
          "comment" : ""
        },
        "redirectURL" : "",
        "headersSize" : 919,
        "bodySize" : 82,
        "comment" : ""
      },
      "cache" : { },
      "timings" : {
        "comment" : "",
        "send" : 0,
        "wait" : 3397,
        "receive" : 1,
        "connect" : -1,
        "blocked" : -1,
        "dns" : -1,
        "ssl" : -1
      },
      "serverIPAddress" : "127.0.0.1",
      "comment" : "",
      "_katalonRequestInformation" : {
        "name" : "27",
        "testObjectId" : "Object Repository/VoGrow/Field/FieldPost",
        "harId" : "2465b882-b152-4cf0-a9ed-83e94b18bf25"
      },
      "time" : 3399
    } ],
    "comment" : ""
  }
}