{
  "log" : {
    "version" : "1.2",
    "creator" : {
      "name" : "BrowserMob Proxy",
      "version" : "2.1.5",
      "comment" : ""
    },
    "pages" : [ {
      "id" : "Page 0",
      "startedDateTime" : "2019-03-29T19:41:05.237Z",
      "title" : "Page 0",
      "pageTimings" : {
        "onLoad" : 30,
        "comment" : ""
      },
      "comment" : ""
    } ],
    "entries" : [ {
      "pageref" : "Page 0",
      "startedDateTime" : "2019-03-29T19:41:05.239Z",
      "request" : {
        "method" : "POST",
        "url" : "http://localhost:10520/WebAPI/api/admin/v1/users/?",
        "httpVersion" : "HTTP/1.1",
        "cookies" : [ ],
        "headers" : [ {
          "name" : "User-Agent",
          "value" : "Katalon Studio"
        }, {
          "name" : "Content-Type",
          "value" : "application/x-www-form-urlencoded"
        }, {
          "name" : "Authorization",
          "value" : "Bearer eyJ0eXAiOiJKV1QiLCJhbGciOiJIUzI1NiJ9.eyJ1bmlxdWVfbmFtZSI6ImFkbWluIiwicm9sZSI6InVzZXIiLCJzdWIiOiJhZG1pbiIsImlzcyI6IkNyb3BNZXRyaWNzIiwiYXVkIjoiYWxsIiwiZXhwIjoxNTUzODkyMzY1LCJuYmYiOjE1NTM4ODg0NjV9.Kp6OGuDBvBMfg2vPU1UjKWkqbBZixfHqKWwbYp1PrEs"
        }, {
          "name" : "Host",
          "value" : "localhost:10520"
        }, {
          "name" : "Accept",
          "value" : "text/html, image/gif, image/jpeg, *; q=.2, */*; q=.2"
        }, {
          "name" : "Proxy-Connection",
          "value" : "keep-alive"
        }, {
          "name" : "Content-Length",
          "value" : "285"
        } ],
        "queryString" : [ ],
        "postData" : {
          "mimeType" : "application/x-www-form-urlencoded",
          "params" : [ {
            "name" : "password",
            "value" : "cropmetrics",
            "comment" : ""
          }, {
            "name" : "email",
            "value" : "cropmetricsvo.rolesymbols@gmail.com",
            "comment" : ""
          }, {
            "name" : "fullname",
            "value" : "test validation",
            "comment" : ""
          }, {
            "name" : "phone",
            "value" : "123",
            "comment" : ""
          }, {
            "name" : "dealer",
            "value" : "x",
            "comment" : ""
          }, {
            "name" : "addressLine1",
            "value" : "address line 1 test validation",
            "comment" : ""
          }, {
            "name" : "addressLine2",
            "value" : "address line 2 test validation",
            "comment" : ""
          }, {
            "name" : "town",
            "value" : "townValidation",
            "comment" : ""
          }, {
            "name" : "state",
            "value" : "stateValidation",
            "comment" : ""
          }, {
            "name" : "zip",
            "value" : "xx",
            "comment" : ""
          }, {
            "name" : "country",
            "value" : "xx",
            "comment" : ""
          }, {
            "name" : "roles",
            "value" : "!@#$%^&*",
            "comment" : ""
          } ],
          "comment" : ""
        },
        "headersSize" : 544,
        "bodySize" : 285,
        "comment" : ""
      },
      "response" : {
        "status" : 400,
        "statusText" : "Bad Request",
        "httpVersion" : "HTTP/1.1",
        "cookies" : [ {
          "name" : ".ASPROLES",
          "value" : "EB1zq5rdOhCwfVdbNg9szVkfLPPavUx1AenzOHRl3-p9mcVq1dnU73QECMSx8QRijOamwpoxV5cOSxiUkOJDDknxBeTjo8MGEMB546-_WVslgjBr88t2g-ohyhKyxAQxrRU4LAXRcPhksAIe-0dbxHWLpJ-qEAJzoPtWV6v-WpkX1_cKZ6xJucCjoucXgZMKsHXplv3ieueQOYl1pysS2iwf7G1f9G_J5DTnjqyPdJlWP8Wd-XXlM-1ZOzKM34G40Zclzij2cUxpsGTa1BM8J_m0aIwrXLKgQcTe988-ysSqdLrmTYlK3D4ML8K-EDHQM-53HnzH3WyuWyyxXEAHaJvAhSdHen0Soqx7Ze9XWMVVQ9rWmEdSNUoR_xN7JnDdqtHguT-0nG7MPSlSWDr5P0Z-wf00JP8EQG1KYQYtvp8DHn2dqcBflddQyePIxITER-qCvh9HHvAKtUKkpYoTpCDwpxe0ud0dFb-jxF94y-LQUe7U0",
          "path" : "/",
          "httpOnly" : true,
          "secure" : false,
          "comment" : ""
        } ],
        "headers" : [ {
          "name" : "Cache-Control",
          "value" : "private"
        }, {
          "name" : "Content-Type",
          "value" : "application/json; charset=utf-8"
        }, {
          "name" : "Server",
          "value" : "Microsoft-IIS/10.0"
        }, {
          "name" : "Set-Cookie",
          "value" : ".ASPROLES=EB1zq5rdOhCwfVdbNg9szVkfLPPavUx1AenzOHRl3-p9mcVq1dnU73QECMSx8QRijOamwpoxV5cOSxiUkOJDDknxBeTjo8MGEMB546-_WVslgjBr88t2g-ohyhKyxAQxrRU4LAXRcPhksAIe-0dbxHWLpJ-qEAJzoPtWV6v-WpkX1_cKZ6xJucCjoucXgZMKsHXplv3ieueQOYl1pysS2iwf7G1f9G_J5DTnjqyPdJlWP8Wd-XXlM-1ZOzKM34G40Zclzij2cUxpsGTa1BM8J_m0aIwrXLKgQcTe988-ysSqdLrmTYlK3D4ML8K-EDHQM-53HnzH3WyuWyyxXEAHaJvAhSdHen0Soqx7Ze9XWMVVQ9rWmEdSNUoR_xN7JnDdqtHguT-0nG7MPSlSWDr5P0Z-wf00JP8EQG1KYQYtvp8DHn2dqcBflddQyePIxITER-qCvh9HHvAKtUKkpYoTpCDwpxe0ud0dFb-jxF94y-LQUe7U0; path=/; HttpOnly"
        }, {
          "name" : "X-SourceFiles",
          "value" : "=?UTF-8?B?RDpcVmlydHVhbE9wdGltaXplci1SZWZhY3RvcmluZ1xDcm9wTWV0cmljcy5Wby5BcGlcQ3JvcE1ldHJpY3MuVm8uQXBpXGFwaVxhZG1pblx2MVx1c2Vyc1w=?="
        }, {
          "name" : "X-Powered-By",
          "value" : "ASP.NET"
        }, {
          "name" : "Date",
          "value" : "Fri, 29 Mar 2019 19:41:04 GMT"
        }, {
          "name" : "Content-Length",
          "value" : "92"
        } ],
        "content" : {
          "size" : 92,
          "mimeType" : "application/json; charset=utf-8",
          "text" : "{\"message\":\"The request is invalid. The role  !@#$%^&* requested to assign is not a valid.\"}",
          "comment" : ""
        },
        "redirectURL" : "",
        "headersSize" : 897,
        "bodySize" : 92,
        "comment" : ""
      },
      "cache" : { },
      "timings" : {
        "comment" : "",
        "ssl" : -1,
        "send" : 0,
        "receive" : 0,
        "wait" : 24,
        "connect" : -1,
        "blocked" : -1,
        "dns" : -1
      },
      "serverIPAddress" : "127.0.0.1",
      "comment" : "",
      "_katalonRequestInformation" : {
        "name" : "105",
        "testObjectId" : "Object Repository/VoPro/Account/api_admin_v1_users",
        "harId" : "044cf430-84db-42a5-8250-e4ffd80f7aa6"
      },
      "time" : 25
    } ],
    "comment" : ""
  }
}