{
  "log" : {
    "version" : "1.2",
    "creator" : {
      "name" : "BrowserMob Proxy",
      "version" : "2.1.5",
      "comment" : ""
    },
    "pages" : [ {
      "id" : "Page 0",
      "startedDateTime" : "2019-03-29T22:14:07.230Z",
      "title" : "Page 0",
      "pageTimings" : {
        "onLoad" : 1877,
        "comment" : ""
      },
      "comment" : ""
    } ],
    "entries" : [ {
      "pageref" : "Page 0",
      "startedDateTime" : "2019-03-29T22:14:07.231Z",
      "request" : {
        "method" : "PUT",
        "url" : "http://localhost:10520/WebAPI/api/admin/v1/users/30?",
        "httpVersion" : "HTTP/1.1",
        "cookies" : [ ],
        "headers" : [ {
          "name" : "User-Agent",
          "value" : "Katalon Studio"
        }, {
          "name" : "Content-Type",
          "value" : "application/x-www-form-urlencoded"
        }, {
          "name" : "Authorization",
          "value" : "Bearer eyJ0eXAiOiJKV1QiLCJhbGciOiJIUzI1NiJ9.eyJ1bmlxdWVfbmFtZSI6ImFkbWluIiwicm9sZSI6InVzZXIiLCJzdWIiOiJhZG1pbiIsImlzcyI6IkNyb3BNZXRyaWNzIiwiYXVkIjoiYWxsIiwiZXhwIjoxNTUzOTAxNTQ3LCJuYmYiOjE1NTM4OTc2NDd9.PPKdu9iDZlQ-dihMZbsi83e21I5DF2D-dmHQNGBezK4"
        }, {
          "name" : "Host",
          "value" : "localhost:10520"
        }, {
          "name" : "Accept",
          "value" : "text/html, image/gif, image/jpeg, *; q=.2, */*; q=.2"
        }, {
          "name" : "Proxy-Connection",
          "value" : "keep-alive"
        }, {
          "name" : "Content-Length",
          "value" : "868"
        } ],
        "queryString" : [ ],
        "postData" : {
          "mimeType" : "application/x-www-form-urlencoded",
          "params" : [ {
            "name" : "password",
            "value" : "cropmetrics",
            "comment" : ""
          }, {
            "name" : "email",
            "value" : "cropmetricsvo.ziplong@gmail.com",
            "comment" : ""
          }, {
            "name" : "fullname",
            "value" : "test validation",
            "comment" : ""
          }, {
            "name" : "phone",
            "value" : "123",
            "comment" : ""
          }, {
            "name" : "dealer",
            "value" : "x",
            "comment" : ""
          }, {
            "name" : "addressLine1",
            "value" : "address line 1 test validation",
            "comment" : ""
          }, {
            "name" : "addressLine2",
            "value" : "address line 2 test validation",
            "comment" : ""
          }, {
            "name" : "town",
            "value" : "townValidation",
            "comment" : ""
          }, {
            "name" : "state",
            "value" : "stateValidation",
            "comment" : ""
          }, {
            "name" : "zip",
            "value" : "23 API_ACNT_When_account_updated_have_long_zip_attribute_Expected_status_code_200 23 API_ACNT_When_account_updated_have_long_zip_attribute_Expected_status_code_200 23 API_ACNT_When_account_updated_have_long_zip_attribute_Expected_status_code_200 23 API_ACNT_When_account_updated_have_long_zip_attribute_Expected_status_code_200 23 API_ACNT_When_account_updated_have_long_zip_attribute_Expected_status_code_200 23 API_ACNT_When_account_updated_have_long_zip_attribute_Expected_status_code_200 23 API_ACNT_When_account_updated_have_long_zip_attribute_Expected_status_code_200",
            "comment" : ""
          }, {
            "name" : "country",
            "value" : "countryValidation",
            "comment" : ""
          }, {
            "name" : "roles",
            "value" : "Client",
            "comment" : ""
          }, {
            "name" : "userProfileId",
            "value" : "30",
            "comment" : ""
          } ],
          "comment" : ""
        },
        "headersSize" : 545,
        "bodySize" : 868,
        "comment" : ""
      },
      "response" : {
        "status" : 200,
        "statusText" : "OK",
        "httpVersion" : "HTTP/1.1",
        "cookies" : [ {
          "name" : ".ASPROLES",
          "value" : "Z-jNchUqbRU7iVksXoIFfCMHW8U4kahXGD9zawKEwYO6MoEama2zYLtRVbdCt3zfsngNtov_pibzlrYJHa5DHHPp-anbMA2cvLU8hjx5YiY0CZLTIZeNujvoCQzdYMwuD-NVK7Cn9UBiFS1FV4SxFhcFs1KAoq3Srhm2vZQJItJR24PgjVpZY3DtbZ_8JdUzh0rzJWjtWRnqVOM68BE5o_-2RAMTDZVc-OJypP70zhHAOSqFfGjiz39BjpzuwP0plUm7gtglYini13CwffIR90eVaUZM5LpeGbbYLQf_6ouDZimK26apviczAe5R8EkJV7eujSiUDtjhbvDUjd4xdEgDtNyCvY4ZPpzQGIp45VDb-usgSZoU8DOWpCj4KgeUKR0IsPaqTHGaHIFCDQsJlTV9Sy65cNcVPPfwQmQLa-MnJ8pfxW4T5Igo2jYS6tpHuBBJNl6rkuO4eRsruVQM4UHD1v4A4DZHZtmZkQkagtGoucUb0",
          "path" : "/",
          "httpOnly" : true,
          "secure" : false,
          "comment" : ""
        } ],
        "headers" : [ {
          "name" : "Cache-Control",
          "value" : "private"
        }, {
          "name" : "Server",
          "value" : "Microsoft-IIS/10.0"
        }, {
          "name" : "Set-Cookie",
          "value" : ".ASPROLES=Z-jNchUqbRU7iVksXoIFfCMHW8U4kahXGD9zawKEwYO6MoEama2zYLtRVbdCt3zfsngNtov_pibzlrYJHa5DHHPp-anbMA2cvLU8hjx5YiY0CZLTIZeNujvoCQzdYMwuD-NVK7Cn9UBiFS1FV4SxFhcFs1KAoq3Srhm2vZQJItJR24PgjVpZY3DtbZ_8JdUzh0rzJWjtWRnqVOM68BE5o_-2RAMTDZVc-OJypP70zhHAOSqFfGjiz39BjpzuwP0plUm7gtglYini13CwffIR90eVaUZM5LpeGbbYLQf_6ouDZimK26apviczAe5R8EkJV7eujSiUDtjhbvDUjd4xdEgDtNyCvY4ZPpzQGIp45VDb-usgSZoU8DOWpCj4KgeUKR0IsPaqTHGaHIFCDQsJlTV9Sy65cNcVPPfwQmQLa-MnJ8pfxW4T5Igo2jYS6tpHuBBJNl6rkuO4eRsruVQM4UHD1v4A4DZHZtmZkQkagtGoucUb0; path=/; HttpOnly"
        }, {
          "name" : "X-SourceFiles",
          "value" : "=?UTF-8?B?RDpcVmlydHVhbE9wdGltaXplci1SZWZhY3RvcmluZ1xDcm9wTWV0cmljcy5Wby5BcGlcQ3JvcE1ldHJpY3MuVm8uQXBpXGFwaVxhZG1pblx2MVx1c2Vyc1wzMA==?="
        }, {
          "name" : "X-Powered-By",
          "value" : "ASP.NET"
        }, {
          "name" : "Date",
          "value" : "Fri, 29 Mar 2019 22:14:09 GMT"
        }, {
          "name" : "Content-Length",
          "value" : "0"
        } ],
        "content" : {
          "size" : 0,
          "mimeType" : "",
          "text" : "",
          "encoding" : "base64",
          "comment" : ""
        },
        "redirectURL" : "",
        "headersSize" : 844,
        "bodySize" : 0,
        "comment" : ""
      },
      "cache" : { },
      "timings" : {
        "comment" : "",
        "connect" : -1,
        "wait" : 1872,
        "receive" : 0,
        "dns" : -1,
        "send" : 0,
        "blocked" : -1,
        "ssl" : -1
      },
      "serverIPAddress" : "127.0.0.1",
      "comment" : "",
      "_katalonRequestInformation" : {
        "name" : "51",
        "testObjectId" : "Object Repository/VoPro/Account/api_admin_v1_users_userprofileid",
        "harId" : "c2a2ba86-204d-4f07-8324-c96455aa488f"
      },
      "time" : 1873
    } ],
    "comment" : ""
  }
}