{
  "log" : {
    "version" : "1.2",
    "creator" : {
      "name" : "BrowserMob Proxy",
      "version" : "2.1.5",
      "comment" : ""
    },
    "pages" : [ {
      "id" : "Page 0",
      "startedDateTime" : "2019-03-29T21:50:28.090Z",
      "title" : "Page 0",
      "pageTimings" : {
        "onLoad" : 40,
        "comment" : ""
      },
      "comment" : ""
    } ],
    "entries" : [ {
      "pageref" : "Page 0",
      "startedDateTime" : "2019-03-29T21:50:28.091Z",
      "request" : {
        "method" : "PUT",
        "url" : "http://localhost:10520/WebAPI/api/admin/v1/users/14?",
        "httpVersion" : "HTTP/1.1",
        "cookies" : [ ],
        "headers" : [ {
          "name" : "User-Agent",
          "value" : "Katalon Studio"
        }, {
          "name" : "Content-Type",
          "value" : "application/x-www-form-urlencoded"
        }, {
          "name" : "Authorization",
          "value" : "Bearer eyJ0eXAiOiJKV1QiLCJhbGciOiJIUzI1NiJ9.eyJ1bmlxdWVfbmFtZSI6ImFkbWluIiwicm9sZSI6InVzZXIiLCJzdWIiOiJhZG1pbiIsImlzcyI6IkNyb3BNZXRyaWNzIiwiYXVkIjoiYWxsIiwiZXhwIjoxNTUzOTAwMTI4LCJuYmYiOjE1NTM4OTYyMjh9.LPiePg4FuffcKlLBlaBWg-1fFnbMKLXOGOHVMzSi01w"
        }, {
          "name" : "Host",
          "value" : "localhost:10520"
        }, {
          "name" : "Accept",
          "value" : "text/html, image/gif, image/jpeg, *; q=.2, */*; q=.2"
        }, {
          "name" : "Proxy-Connection",
          "value" : "keep-alive"
        }, {
          "name" : "Content-Length",
          "value" : "305"
        } ],
        "queryString" : [ ],
        "postData" : {
          "mimeType" : "application/x-www-form-urlencoded",
          "params" : [ {
            "name" : "password",
            "value" : "",
            "comment" : ""
          }, {
            "name" : "email",
            "value" : "cropmetricsvo.passwithsymbols@gmail.com",
            "comment" : ""
          }, {
            "name" : "fullname",
            "value" : "test validation",
            "comment" : ""
          }, {
            "name" : "phone",
            "value" : "123",
            "comment" : ""
          }, {
            "name" : "dealer",
            "value" : "x",
            "comment" : ""
          }, {
            "name" : "addressLine1",
            "value" : "address line 1 test validation",
            "comment" : ""
          }, {
            "name" : "addressLine2",
            "value" : "address line 2 test validation",
            "comment" : ""
          }, {
            "name" : "town",
            "value" : "townValidation",
            "comment" : ""
          }, {
            "name" : "state",
            "value" : "stateValidation",
            "comment" : ""
          }, {
            "name" : "zip",
            "value" : "zipValidation",
            "comment" : ""
          }, {
            "name" : "country",
            "value" : "countryValidation",
            "comment" : ""
          }, {
            "name" : "roles",
            "value" : "Client",
            "comment" : ""
          }, {
            "name" : "userProfileId",
            "value" : "14",
            "comment" : ""
          } ],
          "comment" : ""
        },
        "headersSize" : 545,
        "bodySize" : 305,
        "comment" : ""
      },
      "response" : {
        "status" : 200,
        "statusText" : "OK",
        "httpVersion" : "HTTP/1.1",
        "cookies" : [ {
          "name" : ".ASPROLES",
          "value" : "fHN6WkMZ1MpQJvjqnFQia6Wheso0kZmV9xLZqEqwv3uBM3KTNxRdBWbgSPCTYtqHUC8ZnbDrhcspFyvc9rNea1sECZghJYkY-gyt1V_p8yjb8bZPBGTo3ZpR0S749adDUgkSNX_fhDIvr-zK7xzrA_Hm81cB6n8YZXx60oaQ3Kc4UUT-FoF3y_pGmarJJr9kVzSJvfKKXwkZMjyLg-Na9Gw_OlAbDIugzi4yEgQwRxZLWIOWdMsQDAFK7LZMkNE6sy3TYbuxz7-GSbIv7Jrdgcv0YTUd5qxS0VpQN6XB4QH-pcgAB3jiQBgEPynu0kV9ACbcZSOVfZHVVSl-IMMEvuSgzmQKKuwTHIw47s3wqu_1U6JIoEqw852WTEGuuI2jPfsHAsEO2ZJ-sphpAEwRAiX2901daCMJeMvSy4hc2ds4sXxzxhIuaCDlTYOX_VzYchdchg_AQ3OY4QGHUB32Mzm0wD0pxwM5nPXhiHabg53QdvYC0",
          "path" : "/",
          "httpOnly" : true,
          "secure" : false,
          "comment" : ""
        } ],
        "headers" : [ {
          "name" : "Cache-Control",
          "value" : "private"
        }, {
          "name" : "Server",
          "value" : "Microsoft-IIS/10.0"
        }, {
          "name" : "Set-Cookie",
          "value" : ".ASPROLES=fHN6WkMZ1MpQJvjqnFQia6Wheso0kZmV9xLZqEqwv3uBM3KTNxRdBWbgSPCTYtqHUC8ZnbDrhcspFyvc9rNea1sECZghJYkY-gyt1V_p8yjb8bZPBGTo3ZpR0S749adDUgkSNX_fhDIvr-zK7xzrA_Hm81cB6n8YZXx60oaQ3Kc4UUT-FoF3y_pGmarJJr9kVzSJvfKKXwkZMjyLg-Na9Gw_OlAbDIugzi4yEgQwRxZLWIOWdMsQDAFK7LZMkNE6sy3TYbuxz7-GSbIv7Jrdgcv0YTUd5qxS0VpQN6XB4QH-pcgAB3jiQBgEPynu0kV9ACbcZSOVfZHVVSl-IMMEvuSgzmQKKuwTHIw47s3wqu_1U6JIoEqw852WTEGuuI2jPfsHAsEO2ZJ-sphpAEwRAiX2901daCMJeMvSy4hc2ds4sXxzxhIuaCDlTYOX_VzYchdchg_AQ3OY4QGHUB32Mzm0wD0pxwM5nPXhiHabg53QdvYC0; path=/; HttpOnly"
        }, {
          "name" : "X-SourceFiles",
          "value" : "=?UTF-8?B?RDpcVmlydHVhbE9wdGltaXplci1SZWZhY3RvcmluZ1xDcm9wTWV0cmljcy5Wby5BcGlcQ3JvcE1ldHJpY3MuVm8uQXBpXGFwaVxhZG1pblx2MVx1c2Vyc1wxNA==?="
        }, {
          "name" : "X-Powered-By",
          "value" : "ASP.NET"
        }, {
          "name" : "Date",
          "value" : "Fri, 29 Mar 2019 21:50:27 GMT"
        }, {
          "name" : "Content-Length",
          "value" : "0"
        } ],
        "content" : {
          "size" : 0,
          "mimeType" : "",
          "text" : "",
          "encoding" : "base64",
          "comment" : ""
        },
        "redirectURL" : "",
        "headersSize" : 844,
        "bodySize" : 0,
        "comment" : ""
      },
      "cache" : { },
      "timings" : {
        "comment" : "",
        "ssl" : -1,
        "receive" : 0,
        "send" : 0,
        "wait" : 36,
        "dns" : -1,
        "connect" : -1,
        "blocked" : -1
      },
      "serverIPAddress" : "127.0.0.1",
      "comment" : "",
      "_katalonRequestInformation" : {
        "name" : "111",
        "testObjectId" : "Object Repository/VoPro/Account/api_admin_v1_users_userprofileid",
        "harId" : "e4d6b723-c968-42e3-85b0-516f0924b76d"
      },
      "time" : 37
    } ],
    "comment" : ""
  }
}