{
  "log" : {
    "version" : "1.2",
    "creator" : {
      "name" : "BrowserMob Proxy",
      "version" : "2.1.5",
      "comment" : ""
    },
    "pages" : [ {
      "id" : "Page 0",
      "startedDateTime" : "2019-03-29T21:02:17.469Z",
      "title" : "Page 0",
      "pageTimings" : {
        "onLoad" : 3850,
        "comment" : ""
      },
      "comment" : ""
    } ],
    "entries" : [ {
      "pageref" : "Page 0",
      "startedDateTime" : "2019-03-29T21:02:17.477Z",
      "request" : {
        "method" : "POST",
        "url" : "http://localhost:10520/WebAPI/api/admin/v1/users/?",
        "httpVersion" : "HTTP/1.1",
        "cookies" : [ ],
        "headers" : [ {
          "name" : "User-Agent",
          "value" : "Katalon Studio"
        }, {
          "name" : "Content-Type",
          "value" : "application/x-www-form-urlencoded"
        }, {
          "name" : "Authorization",
          "value" : "Bearer eyJ0eXAiOiJKV1QiLCJhbGciOiJIUzI1NiJ9.eyJ1bmlxdWVfbmFtZSI6ImFkbWluIiwicm9sZSI6InVzZXIiLCJzdWIiOiJhZG1pbiIsImlzcyI6IkNyb3BNZXRyaWNzIiwiYXVkIjoiYWxsIiwiZXhwIjoxNTUzODk3MjM3LCJuYmYiOjE1NTM4OTMzMzd9.-6MjMkQx9dSKeALN74Pul8shIBDF8z5gYuwmSUmdleo"
        }, {
          "name" : "Host",
          "value" : "localhost:10520"
        }, {
          "name" : "Accept",
          "value" : "text/html, image/gif, image/jpeg, *; q=.2, */*; q=.2"
        }, {
          "name" : "Proxy-Connection",
          "value" : "keep-alive"
        }, {
          "name" : "Content-Length",
          "value" : "315"
        } ],
        "queryString" : [ ],
        "postData" : {
          "mimeType" : "application/x-www-form-urlencoded",
          "params" : [ {
            "name" : "password",
            "value" : "cropmetrics",
            "comment" : ""
          }, {
            "name" : "email",
            "value" : "cropmetricsvo.pass6chars@gmail.com",
            "comment" : ""
          }, {
            "name" : "fullname",
            "value" : "test validation",
            "comment" : ""
          }, {
            "name" : "phone",
            "value" : "123",
            "comment" : ""
          }, {
            "name" : "dealer",
            "value" : "dealer test validation",
            "comment" : ""
          }, {
            "name" : "addressLine1",
            "value" : "address line 1 test validation",
            "comment" : ""
          }, {
            "name" : "addressLine2",
            "value" : "address line 1 test validation",
            "comment" : ""
          }, {
            "name" : "town",
            "value" : "townValidation",
            "comment" : ""
          }, {
            "name" : "state",
            "value" : "stateValidation",
            "comment" : ""
          }, {
            "name" : "zip",
            "value" : "zipValidation",
            "comment" : ""
          }, {
            "name" : "country",
            "value" : "countryValidation",
            "comment" : ""
          }, {
            "name" : "roles",
            "value" : "Client",
            "comment" : ""
          } ],
          "comment" : ""
        },
        "headersSize" : 544,
        "bodySize" : 315,
        "comment" : ""
      },
      "response" : {
        "status" : 400,
        "statusText" : "Bad Request",
        "httpVersion" : "HTTP/1.1",
        "cookies" : [ {
          "name" : ".ASPROLES",
          "value" : "R2qtzWWi9ukI7xGL4q0Xixv4pWt2EkJ8ZXdqF8SruMPKEucACPHBdBWrdCPEXABrF0LaCiPD_gkUaltmVQ2UaW7bxmNI3RMbvUmAd4DXx1Tx6_EqOhJcR3qs2-Dv2esJWrPg90T_hwKvDOt3lxy0t-ur64Wx7bWYji88nzKOqzXv3pyDyLsiVIBlX1F2UQJmHuB_Hq_YZToIYMmXOh12qx4b0NORSa7F3tSI9PvhS1ifz8hoR9okpZTS5gC14hRqLVucOXgdkm-XlwlK4kOLj5KVdzvT_dkd0xP-xisOOmhNwvEbmWu1-yYiC1syxZquQ6SNpLWeXH1pcObOaESrBGj0RppJvjJhVHdwEKXo3sIyrqbeK6w9aRwh74BjXGiIErnULxE6JltdY7hCQZ12SNbLvr3R6hU6NI1P33b-rVMzArIrh54k5lpUKosFSbFr_IBOskz3Wx8B6eM3ZliQjZAf1uwgBH5_7mF6IDqKoxEKv9Cb0",
          "path" : "/",
          "httpOnly" : true,
          "secure" : false,
          "comment" : ""
        } ],
        "headers" : [ {
          "name" : "Cache-Control",
          "value" : "private"
        }, {
          "name" : "Content-Type",
          "value" : "application/json; charset=utf-8"
        }, {
          "name" : "Server",
          "value" : "Microsoft-IIS/10.0"
        }, {
          "name" : "Set-Cookie",
          "value" : ".ASPROLES=R2qtzWWi9ukI7xGL4q0Xixv4pWt2EkJ8ZXdqF8SruMPKEucACPHBdBWrdCPEXABrF0LaCiPD_gkUaltmVQ2UaW7bxmNI3RMbvUmAd4DXx1Tx6_EqOhJcR3qs2-Dv2esJWrPg90T_hwKvDOt3lxy0t-ur64Wx7bWYji88nzKOqzXv3pyDyLsiVIBlX1F2UQJmHuB_Hq_YZToIYMmXOh12qx4b0NORSa7F3tSI9PvhS1ifz8hoR9okpZTS5gC14hRqLVucOXgdkm-XlwlK4kOLj5KVdzvT_dkd0xP-xisOOmhNwvEbmWu1-yYiC1syxZquQ6SNpLWeXH1pcObOaESrBGj0RppJvjJhVHdwEKXo3sIyrqbeK6w9aRwh74BjXGiIErnULxE6JltdY7hCQZ12SNbLvr3R6hU6NI1P33b-rVMzArIrh54k5lpUKosFSbFr_IBOskz3Wx8B6eM3ZliQjZAf1uwgBH5_7mF6IDqKoxEKv9Cb0; path=/; HttpOnly"
        }, {
          "name" : "X-SourceFiles",
          "value" : "=?UTF-8?B?RDpcVmlydHVhbE9wdGltaXplci1SZWZhY3RvcmluZ1xDcm9wTWV0cmljcy5Wby5BcGlcQ3JvcE1ldHJpY3MuVm8uQXBpXGFwaVxhZG1pblx2MVx1c2Vyc1w=?="
        }, {
          "name" : "X-Powered-By",
          "value" : "ASP.NET"
        }, {
          "name" : "Date",
          "value" : "Fri, 29 Mar 2019 21:02:21 GMT"
        }, {
          "name" : "Content-Length",
          "value" : "71"
        } ],
        "content" : {
          "size" : 71,
          "mimeType" : "application/json; charset=utf-8",
          "text" : "{\"message\":\"Name cropmetricsvo.pass6chars@gmail.com is already taken.\"}",
          "comment" : ""
        },
        "redirectURL" : "",
        "headersSize" : 897,
        "bodySize" : 71,
        "comment" : ""
      },
      "cache" : { },
      "timings" : {
        "comment" : "",
        "dns" : -1,
        "wait" : 3847,
        "send" : 0,
        "receive" : 1,
        "connect" : -1,
        "blocked" : -1,
        "ssl" : -1
      },
      "serverIPAddress" : "127.0.0.1",
      "comment" : "",
      "_katalonRequestInformation" : {
        "name" : "17",
        "testObjectId" : "Object Repository/VoPro/Account/api_admin_v1_users",
        "harId" : "ace5838c-514c-4282-8f27-df58380f4800"
      },
      "time" : 3849
    } ],
    "comment" : ""
  }
}