Suite/Test/Step Name,Browser,Description,Tag,Start time,End time,Duration,Status
Auto_Restore_virtualoptimizer_database_using_backup_file,,,,2019-08-20 09:17:05,2019-08-20 09:17:17,12.046s,PASSED
,,,,,,,
Test Cases/Databases/CreateDatabases/Functional/DB_Create_virtualoptimizer_database,,,,2019-08-20 09:17:06,2019-08-20 09:17:12,6.097s,PASSED
server = server,,,,2019-08-20 09:17:06,2019-08-20 09:17:06,0.504s,PASSED
port = port,,,,2019-08-20 09:17:06,2019-08-20 09:17:06,0.007s,PASSED
user = userDb,,,,2019-08-20 09:17:06,2019-08-20 09:17:06,0.007s,PASSED
password = passwordDb,,,,2019-08-20 09:17:06,2019-08-20 09:17:06,0.002s,PASSED
pathPostgreSQL = pathPostgreSQLBin,,,,2019-08-20 09:17:06,2019-08-20 09:17:06,0.002s,PASSED
"database = ""virtualoptimizer""",,,,2019-08-20 09:17:06,2019-08-20 09:17:06,0.002s,PASSED
"command = String.format(""cd ""%s"" && createdb -h %s -p %d -U %s  %s"", pathPostgreSQL, server, port, user, database)",,,,2019-08-20 09:17:06,2019-08-20 09:17:07,0.009s,PASSED
"commandLine.cmd.cmdLine(command, password)",,,,2019-08-20 09:17:07,2019-08-20 09:17:12,5.074s,PASSED
"println(""The "" + database + "" database was created..."")",,,,2019-08-20 09:17:12,2019-08-20 09:17:12,0.026s,PASSED
,,,,,,,
Test Cases/Databases/DatabasesRestoreWithBakcupFiles/Functional/DB_Restore_virtualoptimizer_with_backup_file,,,,2019-08-20 09:17:12,2019-08-20 09:17:17,5.349s,PASSED
server = server,,,,2019-08-20 09:17:12,2019-08-20 09:17:12,0.001s,PASSED
port = port,,,,2019-08-20 09:17:12,2019-08-20 09:17:12,0.002s,PASSED
user = userDb,,,,2019-08-20 09:17:12,2019-08-20 09:17:12,0.002s,PASSED
password = passwordDb,,,,2019-08-20 09:17:12,2019-08-20 09:17:12,0.005s,PASSED
pathPostgreSQL = pathPostgreSQLBin,,,,2019-08-20 09:17:12,2019-08-20 09:17:12,0.002s,PASSED
"database = ""virtualoptimizer""",,,,2019-08-20 09:17:12,2019-08-20 09:17:12,0.003s,PASSED
"pathDumpFile = Paths.get(pathDumpFiles, database + "".dump"")",,,,2019-08-20 09:17:12,2019-08-20 09:17:12,0.009s,PASSED
"cRestore = String.format(""cd ""%s"" && pg_restore -U %s -h %s -p %d -c -C -d %s -v ""%s"""", pathPostgreSQL, user, server, port, database, pathDumpFile)",,,,2019-08-20 09:17:12,2019-08-20 09:17:12,0.001s,PASSED
"commandLine.cmd.cmdLine(cRestore, password)",,,,2019-08-20 09:17:12,2019-08-20 09:17:17,5.030s,PASSED
"println(""The restore "" + database + "" database was completed..."")",,,,2019-08-20 09:17:17,2019-08-20 09:17:17,0.002s,PASSED
