{
  "log" : {
    "version" : "1.2",
    "creator" : {
      "name" : "BrowserMob Proxy",
      "version" : "2.1.5",
      "comment" : ""
    },
    "pages" : [ {
      "id" : "Page 0",
      "startedDateTime" : "2019-04-01T13:35:23.196Z",
      "title" : "Page 0",
      "pageTimings" : {
        "onLoad" : 2004,
        "comment" : ""
      },
      "comment" : ""
    } ],
    "entries" : [ {
      "pageref" : "Page 0",
      "startedDateTime" : "2019-04-01T13:35:23.197Z",
      "request" : {
        "method" : "POST",
        "url" : "http://localhost:10520/WebAPI/api/admin/v1/users/?",
        "httpVersion" : "HTTP/1.1",
        "cookies" : [ ],
        "headers" : [ {
          "name" : "User-Agent",
          "value" : "Katalon Studio"
        }, {
          "name" : "Content-Type",
          "value" : "application/x-www-form-urlencoded"
        }, {
          "name" : "Authorization",
          "value" : "Bearer eyJ0eXAiOiJKV1QiLCJhbGciOiJIUzI1NiJ9.eyJ1bmlxdWVfbmFtZSI6ImFkbWluIiwicm9sZSI6InVzZXIiLCJzdWIiOiJhZG1pbiIsImlzcyI6IkNyb3BNZXRyaWNzIiwiYXVkIjoiYWxsIiwiZXhwIjoxNTU0MTI5NjIzLCJuYmYiOjE1NTQxMjU3MjN9.ZkewPCX4bYImbGjqjKpzPg1mmF0D9Tznly_cBvdmW_k"
        }, {
          "name" : "Host",
          "value" : "localhost:10520"
        }, {
          "name" : "Accept",
          "value" : "text/html, image/gif, image/jpeg, *; q=.2, */*; q=.2"
        }, {
          "name" : "Proxy-Connection",
          "value" : "keep-alive"
        }, {
          "name" : "Content-Length",
          "value" : "725"
        } ],
        "queryString" : [ ],
        "postData" : {
          "mimeType" : "application/x-www-form-urlencoded",
          "params" : [ {
            "name" : "password",
            "value" : "cropmetrics",
            "comment" : ""
          }, {
            "name" : "email",
            "value" : "cropmetricsvo.statelong@gmail.com",
            "comment" : ""
          }, {
            "name" : "fullname",
            "value" : "x",
            "comment" : ""
          }, {
            "name" : "phone",
            "value" : "1",
            "comment" : ""
          }, {
            "name" : "dealer",
            "value" : "xx",
            "comment" : ""
          }, {
            "name" : "addressLine1",
            "value" : "address line 1 test validation",
            "comment" : ""
          }, {
            "name" : "addressLine2",
            "value" : "address line 2 test validation",
            "comment" : ""
          }, {
            "name" : "town",
            "value" : "xx",
            "comment" : ""
          }, {
            "name" : "state",
            "value" : "20 API_ACNT_When_new_account_have_long_state_attribute_Expected_status_code_20020 API_ACNT_When_new_account_have_long_state_attribute_Expected_status_code_20020 API_ACNT_When_new_account_have_long_state_attribute_Expected_status_code_20020 API_ACNT_When_new_account_have_long_state_attribute_Expected_status_code_20020 API_ACNT_When_new_account_have_long_state_attribute_Expected_status_code_20020 API_ACNT_When_new_account_have_long_state_attribute_Expected_status_code_200",
            "comment" : ""
          }, {
            "name" : "zip",
            "value" : "zipValidation",
            "comment" : ""
          }, {
            "name" : "country",
            "value" : "countryValidation",
            "comment" : ""
          }, {
            "name" : "roles",
            "value" : "Client",
            "comment" : ""
          } ],
          "comment" : ""
        },
        "headersSize" : 544,
        "bodySize" : 725,
        "comment" : ""
      },
      "response" : {
        "status" : 200,
        "statusText" : "OK",
        "httpVersion" : "HTTP/1.1",
        "cookies" : [ {
          "name" : ".ASPROLES",
          "value" : "AVKjbinnh25m7pRV3GNE_W6wHrHyNOEMFUJHLeDny4m-l75KvDOqshwFIUEUzfCQGClkx-8sAyFof8GGcqpHcuPW9noi87pPLxX58r24DFJrcsP0uwT9eieElZUUoYqKvFOfSdGT7P6k6PTK96EdJfECacfku0Wod05x64wrhgPyAUj0RKeqjOrfIzR7GtbiI24ssdQ3SeHwIKIZu2oPyqH2ontKhCJu7ZzXsLG7RvlQaG1V_ntrrmjmv9weC9netvwRAx0CUNGhTK3fQV8oY_uENwSlqZDa5J3CKdOYZDglcuL9gHaocyA-WHWIazcUf46NW7F-LHYjefNSbCvivB2GydeSk74MOkoOI5CKdxncJjxfW57SPN8CD8PO2SCVqBlNiPPTuQwhs7JjAjpr0HnpHEWl19dwAUuD5efobiw6EULzjYrvbcehyGiQCN1yNOkmFtJl036FLgAHOK9LmYsV-J6TDtZAjRzmao8oPJBm3KKk0",
          "path" : "/",
          "httpOnly" : true,
          "secure" : false,
          "comment" : ""
        } ],
        "headers" : [ {
          "name" : "Cache-Control",
          "value" : "private"
        }, {
          "name" : "Content-Type",
          "value" : "application/json; charset=utf-8"
        }, {
          "name" : "Server",
          "value" : "Microsoft-IIS/10.0"
        }, {
          "name" : "Set-Cookie",
          "value" : ".ASPROLES=AVKjbinnh25m7pRV3GNE_W6wHrHyNOEMFUJHLeDny4m-l75KvDOqshwFIUEUzfCQGClkx-8sAyFof8GGcqpHcuPW9noi87pPLxX58r24DFJrcsP0uwT9eieElZUUoYqKvFOfSdGT7P6k6PTK96EdJfECacfku0Wod05x64wrhgPyAUj0RKeqjOrfIzR7GtbiI24ssdQ3SeHwIKIZu2oPyqH2ontKhCJu7ZzXsLG7RvlQaG1V_ntrrmjmv9weC9netvwRAx0CUNGhTK3fQV8oY_uENwSlqZDa5J3CKdOYZDglcuL9gHaocyA-WHWIazcUf46NW7F-LHYjefNSbCvivB2GydeSk74MOkoOI5CKdxncJjxfW57SPN8CD8PO2SCVqBlNiPPTuQwhs7JjAjpr0HnpHEWl19dwAUuD5efobiw6EULzjYrvbcehyGiQCN1yNOkmFtJl036FLgAHOK9LmYsV-J6TDtZAjRzmao8oPJBm3KKk0; path=/; HttpOnly"
        }, {
          "name" : "X-SourceFiles",
          "value" : "=?UTF-8?B?RDpcVmlydHVhbE9wdGltaXplci1SZWZhY3RvcmluZ1xDcm9wTWV0cmljcy5Wby5BcGlcQ3JvcE1ldHJpY3MuVm8uQXBpXGFwaVxhZG1pblx2MVx1c2Vyc1w=?="
        }, {
          "name" : "X-Powered-By",
          "value" : "ASP.NET"
        }, {
          "name" : "Date",
          "value" : "Mon, 01 Apr 2019 13:35:25 GMT"
        }, {
          "name" : "Content-Length",
          "value" : "9"
        } ],
        "content" : {
          "size" : 9,
          "mimeType" : "application/json; charset=utf-8",
          "text" : "{\"id\":27}",
          "comment" : ""
        },
        "redirectURL" : "",
        "headersSize" : 887,
        "bodySize" : 9,
        "comment" : ""
      },
      "cache" : { },
      "timings" : {
        "comment" : "",
        "ssl" : -1,
        "wait" : 1965,
        "receive" : 0,
        "send" : 0,
        "dns" : -1,
        "blocked" : -1,
        "connect" : -1
      },
      "serverIPAddress" : "127.0.0.1",
      "comment" : "",
      "_katalonRequestInformation" : {
        "name" : "75",
        "testObjectId" : "Object Repository/VoPro/Account/api_admin_v1_users",
        "harId" : "098d71c7-fdf5-41aa-8461-7ff207b843bd"
      },
      "time" : 1966
    } ],
    "comment" : ""
  }
}