{
  "log" : {
    "version" : "1.2",
    "creator" : {
      "name" : "BrowserMob Proxy",
      "version" : "2.1.5",
      "comment" : ""
    },
    "pages" : [ {
      "id" : "Page 0",
      "startedDateTime" : "2019-03-29T22:38:07.281Z",
      "title" : "Page 0",
      "pageTimings" : {
        "onLoad" : 1883,
        "comment" : ""
      },
      "comment" : ""
    } ],
    "entries" : [ {
      "pageref" : "Page 0",
      "startedDateTime" : "2019-03-29T22:38:07.282Z",
      "request" : {
        "method" : "POST",
        "url" : "http://localhost:10520/WebAPI/api/admin/v1/users/?",
        "httpVersion" : "HTTP/1.1",
        "cookies" : [ ],
        "headers" : [ {
          "name" : "User-Agent",
          "value" : "Katalon Studio"
        }, {
          "name" : "Content-Type",
          "value" : "application/x-www-form-urlencoded"
        }, {
          "name" : "Authorization",
          "value" : "Bearer eyJ0eXAiOiJKV1QiLCJhbGciOiJIUzI1NiJ9.eyJ1bmlxdWVfbmFtZSI6ImFkbWluIiwicm9sZSI6InVzZXIiLCJzdWIiOiJhZG1pbiIsImlzcyI6IkNyb3BNZXRyaWNzIiwiYXVkIjoiYWxsIiwiZXhwIjoxNTUzOTAyOTg3LCJuYmYiOjE1NTM4OTkwODd9.yKEwMHPvet8P38pXSz9SGLo5c7T6tIcEYO3B_nokRyU"
        }, {
          "name" : "Host",
          "value" : "localhost:10520"
        }, {
          "name" : "Accept",
          "value" : "text/html, image/gif, image/jpeg, *; q=.2, */*; q=.2"
        }, {
          "name" : "Proxy-Connection",
          "value" : "keep-alive"
        }, {
          "name" : "Content-Length",
          "value" : "685"
        } ],
        "queryString" : [ ],
        "postData" : {
          "mimeType" : "application/x-www-form-urlencoded",
          "params" : [ {
            "name" : "password",
            "value" : "cropmetrics",
            "comment" : ""
          }, {
            "name" : "email",
            "value" : "cropmetricsvo.addressline1long@gmail.com",
            "comment" : ""
          }, {
            "name" : "fullname",
            "value" : "x",
            "comment" : ""
          }, {
            "name" : "phone",
            "value" : "1",
            "comment" : ""
          }, {
            "name" : "dealer",
            "value" : "xx",
            "comment" : ""
          }, {
            "name" : "addressLine1",
            "value" : "14 API_ACNT_When_new_account_have_long_addressline1_attribute_Expected_status_code_20014 API_ACNT_When_new_account_have_long_addressline1_attribute_Expected_status_code_20014 API_ACNT_When_new_account_have_long_addressline1_attribute_Expected_status_code_20014 API_ACNT_When_new_account_have_long_addressline1_attribute_Expected_status_code_20014 API_ACNT_When_new_account_have_long_addressline1_attribute_Expected_status_code_200",
            "comment" : ""
          }, {
            "name" : "addressLine2",
            "value" : "address line 2 test validation",
            "comment" : ""
          }, {
            "name" : "town",
            "value" : "townValidation",
            "comment" : ""
          }, {
            "name" : "state",
            "value" : "stateValidation",
            "comment" : ""
          }, {
            "name" : "zip",
            "value" : "zipValidation",
            "comment" : ""
          }, {
            "name" : "country",
            "value" : "countryValidation",
            "comment" : ""
          }, {
            "name" : "roles",
            "value" : "Client",
            "comment" : ""
          } ],
          "comment" : ""
        },
        "headersSize" : 544,
        "bodySize" : 685,
        "comment" : ""
      },
      "response" : {
        "status" : 200,
        "statusText" : "OK",
        "httpVersion" : "HTTP/1.1",
        "cookies" : [ {
          "name" : ".ASPROLES",
          "value" : "2mqK7hv8ttXlrQu3X_NAyLzmSwD84z5ASmjNwvsT3hY6dSCfohqKvYfC7cslHOkoACfEt8BVNT-cxLPkt49dVoIAxlxp5KyvJ5jBOVO95naj9YQzOpod28USAeDUVrdWO-epwHmXlxHEoD184nwjmFvf2Yz8KRL9OPpo5OlJyB9VZgjhVPDIUf_YLwlg2xMkXXToqc7Ws-6oW3auoG2XYg6ZstCTrABOV2Abjr5sKyBDb39RKIsm2-qYKfhtX-yXuG31PGrp7DFvy7goX4rWyjgVOMbPOhm7TnVYGPs7nU6zLTYtRFXEATCk4MdO-RbXzKvYvSEt88Z9aW2wX3Wpci0zqY3I5XlEaaANucurq5qaKcsvhKpvQUxNm3P0Njc1JsJ2ORf4mvekkOQW273jO2ibW7dvSBeqm_iAFvF7lquXgqW_EDxqvKsorEALObRdibG6qHG0SZ0nnig8a0v8SaK501x-HgmtoDzAxnOJ6syvvvEn0",
          "path" : "/",
          "httpOnly" : true,
          "secure" : false,
          "comment" : ""
        } ],
        "headers" : [ {
          "name" : "Cache-Control",
          "value" : "private"
        }, {
          "name" : "Content-Type",
          "value" : "application/json; charset=utf-8"
        }, {
          "name" : "Server",
          "value" : "Microsoft-IIS/10.0"
        }, {
          "name" : "Set-Cookie",
          "value" : ".ASPROLES=2mqK7hv8ttXlrQu3X_NAyLzmSwD84z5ASmjNwvsT3hY6dSCfohqKvYfC7cslHOkoACfEt8BVNT-cxLPkt49dVoIAxlxp5KyvJ5jBOVO95naj9YQzOpod28USAeDUVrdWO-epwHmXlxHEoD184nwjmFvf2Yz8KRL9OPpo5OlJyB9VZgjhVPDIUf_YLwlg2xMkXXToqc7Ws-6oW3auoG2XYg6ZstCTrABOV2Abjr5sKyBDb39RKIsm2-qYKfhtX-yXuG31PGrp7DFvy7goX4rWyjgVOMbPOhm7TnVYGPs7nU6zLTYtRFXEATCk4MdO-RbXzKvYvSEt88Z9aW2wX3Wpci0zqY3I5XlEaaANucurq5qaKcsvhKpvQUxNm3P0Njc1JsJ2ORf4mvekkOQW273jO2ibW7dvSBeqm_iAFvF7lquXgqW_EDxqvKsorEALObRdibG6qHG0SZ0nnig8a0v8SaK501x-HgmtoDzAxnOJ6syvvvEn0; path=/; HttpOnly"
        }, {
          "name" : "X-SourceFiles",
          "value" : "=?UTF-8?B?RDpcVmlydHVhbE9wdGltaXplci1SZWZhY3RvcmluZ1xDcm9wTWV0cmljcy5Wby5BcGlcQ3JvcE1ldHJpY3MuVm8uQXBpXGFwaVxhZG1pblx2MVx1c2Vyc1w=?="
        }, {
          "name" : "X-Powered-By",
          "value" : "ASP.NET"
        }, {
          "name" : "Date",
          "value" : "Fri, 29 Mar 2019 22:38:09 GMT"
        }, {
          "name" : "Content-Length",
          "value" : "9"
        } ],
        "content" : {
          "size" : 9,
          "mimeType" : "application/json; charset=utf-8",
          "text" : "{\"id\":21}",
          "comment" : ""
        },
        "redirectURL" : "",
        "headersSize" : 887,
        "bodySize" : 9,
        "comment" : ""
      },
      "cache" : { },
      "timings" : {
        "comment" : "",
        "ssl" : -1,
        "wait" : 1877,
        "receive" : 0,
        "send" : 0,
        "connect" : -1,
        "dns" : -1,
        "blocked" : -1
      },
      "serverIPAddress" : "127.0.0.1",
      "comment" : "",
      "_katalonRequestInformation" : {
        "name" : "63",
        "testObjectId" : "Object Repository/VoPro/Account/api_admin_v1_users",
        "harId" : "08d24193-6973-4917-9e18-1656ff333f59"
      },
      "time" : 1879
    } ],
    "comment" : ""
  }
}