<?xml version="1.0" encoding="UTF-8" standalone="no"?>
<!DOCTYPE log SYSTEM "logger.dtd">
<log>
<record>
  <date>2019-08-02T09:53:39</date>
  <millis>1564754019114</millis>
  <sequence>0</sequence>
  <level>START</level>
  <class>com.kms.katalon.core.logging.XmlKeywordLogger</class>
  <method>startSuite</method>
  <thread>1</thread>
  <message>Start Test Suite : Test Suites/_EnvironmentSetup/EnvironmentSetupUsingBackupFiles/FunctionalDatabases/Restore_virtualoptimizer_database_using_backup_file</message>
  <nestedLevel>0</nestedLevel>
  <property name="name">Restore_virtualoptimizer_database_using_backup_file</property>
  <property name="description"></property>
  <property name="id">Test Suites/_EnvironmentSetup/EnvironmentSetupUsingBackupFiles/FunctionalDatabases/Restore_virtualoptimizer_database_using_backup_file</property>
</record>
<record>
  <date>2019-08-02T09:53:39</date>
  <millis>1564754019146</millis>
  <sequence>1</sequence>
  <level>RUN_DATA</level>
  <class>com.kms.katalon.core.logging.XmlKeywordLogger</class>
  <method>logMessage</method>
  <thread>1</thread>
  <message>hostName = jenny.maldonado - txbojmaldonado3.bo.truextend.com</message>
  <nestedLevel>0</nestedLevel>
  <property name="hostName">jenny.maldonado - txbojmaldonado3.bo.truextend.com</property>
</record>
<record>
  <date>2019-08-02T09:53:39</date>
  <millis>1564754019148</millis>
  <sequence>2</sequence>
  <level>RUN_DATA</level>
  <class>com.kms.katalon.core.logging.XmlKeywordLogger</class>
  <method>logMessage</method>
  <thread>1</thread>
  <message>os = Windows 10 64bit</message>
  <nestedLevel>0</nestedLevel>
  <property name="os">Windows 10 64bit</property>
</record>
<record>
  <date>2019-08-02T09:53:39</date>
  <millis>1564754019153</millis>
  <sequence>3</sequence>
  <level>RUN_DATA</level>
  <class>com.kms.katalon.core.logging.XmlKeywordLogger</class>
  <method>logMessage</method>
  <thread>1</thread>
  <message>hostAddress = 192.168.56.1</message>
  <nestedLevel>0</nestedLevel>
  <property name="hostAddress">192.168.56.1</property>
</record>
<record>
  <date>2019-08-02T09:53:39</date>
  <millis>1564754019155</millis>
  <sequence>4</sequence>
  <level>RUN_DATA</level>
  <class>com.kms.katalon.core.logging.XmlKeywordLogger</class>
  <method>logMessage</method>
  <thread>1</thread>
  <message>katalonVersion = 6.1.2.2</message>
  <nestedLevel>0</nestedLevel>
  <property name="katalonVersion">6.1.2.2</property>
</record>
<record>
  <date>2019-08-02T09:53:39</date>
  <millis>1564754019636</millis>
  <sequence>5</sequence>
  <level>START</level>
  <class>com.kms.katalon.core.logging.XmlKeywordLogger</class>
  <method>startTest</method>
  <thread>1</thread>
  <message>Start Test Case : Test Cases/Databases/CreateDatabases/Functional/DB_Create_virtualoptimizer_database</message>
  <nestedLevel>1</nestedLevel>
  <property name="name">Test Cases/Databases/CreateDatabases/Functional/DB_Create_virtualoptimizer_database</property>
  <property name="description"></property>
  <property name="id">Test Cases/Databases/CreateDatabases/Functional/DB_Create_virtualoptimizer_database</property>
  <property name="source">C:\\Users\\jenny.maldonado\\git\\cropmetricskatalonstudio\\Test Cases\\Databases\\CreateDatabases\\Functional\\DB_Create_virtualoptimizer_database.tc</property>
  <property name="tag"></property>
  <property name="isOptional">false</property>
</record>
<record>
  <date>2019-08-02T09:53:40</date>
  <millis>1564754020386</millis>
  <sequence>7</sequence>
  <level>START</level>
  <class>com.kms.katalon.core.logging.XmlKeywordLogger</class>
  <method>startKeyword</method>
  <thread>1</thread>
  <message>Start action : server = server</message>
  <nestedLevel>1</nestedLevel>
  <property name="startLine">17</property>
  <property name="stepIndex">1</property>
</record>
<record>
  <date>2019-08-02T09:53:41</date>
  <millis>1564754021065</millis>
  <sequence>8</sequence>
  <level>END</level>
  <class>com.kms.katalon.core.logging.XmlKeywordLogger</class>
  <method>endKeyword</method>
  <thread>1</thread>
  <message>End action : server = server</message>
  <nestedLevel>1</nestedLevel>
</record>
<record>
  <date>2019-08-02T09:53:41</date>
  <millis>1564754021067</millis>
  <sequence>9</sequence>
  <level>START</level>
  <class>com.kms.katalon.core.logging.XmlKeywordLogger</class>
  <method>startKeyword</method>
  <thread>1</thread>
  <message>Start action : port = port</message>
  <nestedLevel>1</nestedLevel>
  <property name="startLine">18</property>
  <property name="stepIndex">2</property>
</record>
<record>
  <date>2019-08-02T09:53:41</date>
  <millis>1564754021069</millis>
  <sequence>10</sequence>
  <level>END</level>
  <class>com.kms.katalon.core.logging.XmlKeywordLogger</class>
  <method>endKeyword</method>
  <thread>1</thread>
  <message>End action : port = port</message>
  <nestedLevel>1</nestedLevel>
</record>
<record>
  <date>2019-08-02T09:53:41</date>
  <millis>1564754021070</millis>
  <sequence>11</sequence>
  <level>START</level>
  <class>com.kms.katalon.core.logging.XmlKeywordLogger</class>
  <method>startKeyword</method>
  <thread>1</thread>
  <message>Start action : user = userDb</message>
  <nestedLevel>1</nestedLevel>
  <property name="startLine">19</property>
  <property name="stepIndex">3</property>
</record>
<record>
  <date>2019-08-02T09:53:41</date>
  <millis>1564754021073</millis>
  <sequence>12</sequence>
  <level>END</level>
  <class>com.kms.katalon.core.logging.XmlKeywordLogger</class>
  <method>endKeyword</method>
  <thread>1</thread>
  <message>End action : user = userDb</message>
  <nestedLevel>1</nestedLevel>
</record>
<record>
  <date>2019-08-02T09:53:41</date>
  <millis>1564754021074</millis>
  <sequence>13</sequence>
  <level>START</level>
  <class>com.kms.katalon.core.logging.XmlKeywordLogger</class>
  <method>startKeyword</method>
  <thread>1</thread>
  <message>Start action : password = passwordDb</message>
  <nestedLevel>1</nestedLevel>
  <property name="startLine">20</property>
  <property name="stepIndex">4</property>
</record>
<record>
  <date>2019-08-02T09:53:41</date>
  <millis>1564754021074</millis>
  <sequence>14</sequence>
  <level>END</level>
  <class>com.kms.katalon.core.logging.XmlKeywordLogger</class>
  <method>endKeyword</method>
  <thread>1</thread>
  <message>End action : password = passwordDb</message>
  <nestedLevel>1</nestedLevel>
</record>
<record>
  <date>2019-08-02T09:53:41</date>
  <millis>1564754021074</millis>
  <sequence>15</sequence>
  <level>START</level>
  <class>com.kms.katalon.core.logging.XmlKeywordLogger</class>
  <method>startKeyword</method>
  <thread>1</thread>
  <message>Start action : pathPostgreSQL = pathPostgreSQLBin</message>
  <nestedLevel>1</nestedLevel>
  <property name="startLine">21</property>
  <property name="stepIndex">5</property>
</record>
<record>
  <date>2019-08-02T09:53:41</date>
  <millis>1564754021079</millis>
  <sequence>16</sequence>
  <level>END</level>
  <class>com.kms.katalon.core.logging.XmlKeywordLogger</class>
  <method>endKeyword</method>
  <thread>1</thread>
  <message>End action : pathPostgreSQL = pathPostgreSQLBin</message>
  <nestedLevel>1</nestedLevel>
</record>
<record>
  <date>2019-08-02T09:53:41</date>
  <millis>1564754021079</millis>
  <sequence>17</sequence>
  <level>START</level>
  <class>com.kms.katalon.core.logging.XmlKeywordLogger</class>
  <method>startKeyword</method>
  <thread>1</thread>
  <message>Start action : database = \&amp;quot;virtualoptimizer\&amp;quot;</message>
  <nestedLevel>1</nestedLevel>
  <property name="startLine">22</property>
  <property name="stepIndex">6</property>
</record>
<record>
  <date>2019-08-02T09:53:41</date>
  <millis>1564754021081</millis>
  <sequence>18</sequence>
  <level>END</level>
  <class>com.kms.katalon.core.logging.XmlKeywordLogger</class>
  <method>endKeyword</method>
  <thread>1</thread>
  <message>End action : database = \&amp;quot;virtualoptimizer\&amp;quot;</message>
  <nestedLevel>1</nestedLevel>
</record>
<record>
  <date>2019-08-02T09:53:41</date>
  <millis>1564754021081</millis>
  <sequence>19</sequence>
  <level>START</level>
  <class>com.kms.katalon.core.logging.XmlKeywordLogger</class>
  <method>startKeyword</method>
  <thread>1</thread>
  <message>Start action : command = String.format(\&amp;quot;cd \&amp;quot;%s\&amp;quot; &amp;amp;&amp;amp; createdb -h %s -p %d -U %s  %s\&amp;quot;, pathPostgreSQL, server, port, user, database)</message>
  <nestedLevel>1</nestedLevel>
  <property name="startLine">25</property>
  <property name="stepIndex">7</property>
</record>
<record>
  <date>2019-08-02T09:53:41</date>
  <millis>1564754021089</millis>
  <sequence>20</sequence>
  <level>END</level>
  <class>com.kms.katalon.core.logging.XmlKeywordLogger</class>
  <method>endKeyword</method>
  <thread>1</thread>
  <message>End action : command = String.format(\&amp;quot;cd \&amp;quot;%s\&amp;quot; &amp;amp;&amp;amp; createdb -h %s -p %d -U %s  %s\&amp;quot;, pathPostgreSQL, server, port, user, database)</message>
  <nestedLevel>1</nestedLevel>
</record>
<record>
  <date>2019-08-02T09:53:41</date>
  <millis>1564754021091</millis>
  <sequence>21</sequence>
  <level>START</level>
  <class>com.kms.katalon.core.logging.XmlKeywordLogger</class>
  <method>startKeyword</method>
  <thread>1</thread>
  <message>Start action : commandLine.cmd.cmdLine(command, password)</message>
  <nestedLevel>1</nestedLevel>
  <property name="startLine">28</property>
  <property name="stepIndex">8</property>
</record>
<record>
  <date>2019-08-02T09:53:46</date>
  <millis>1564754026407</millis>
  <sequence>22</sequence>
  <level>PASSED</level>
  <class>com.kms.katalon.core.logging.XmlKeywordLogger</class>
  <method>logMessage</method>
  <thread>1</thread>
  <message>commandLine.cmd.cmdLine is PASSED</message>
  <nestedLevel>1</nestedLevel>
</record>
<record>
  <date>2019-08-02T09:53:46</date>
  <millis>1564754026407</millis>
  <sequence>23</sequence>
  <level>END</level>
  <class>com.kms.katalon.core.logging.XmlKeywordLogger</class>
  <method>endKeyword</method>
  <thread>1</thread>
  <message>End action : commandLine.cmd.cmdLine(command, password)</message>
  <nestedLevel>1</nestedLevel>
</record>
<record>
  <date>2019-08-02T09:53:46</date>
  <millis>1564754026408</millis>
  <sequence>24</sequence>
  <level>PASSED</level>
  <class>com.kms.katalon.core.logging.XmlKeywordLogger</class>
  <method>logMessage</method>
  <thread>1</thread>
  <message>Test Cases/Databases/CreateDatabases/Functional/DB_Create_virtualoptimizer_database</message>
  <nestedLevel>1</nestedLevel>
</record>
<record>
  <date>2019-08-02T09:53:46</date>
  <millis>1564754026408</millis>
  <sequence>25</sequence>
  <level>END</level>
  <class>com.kms.katalon.core.logging.XmlKeywordLogger</class>
  <method>endTest</method>
  <thread>1</thread>
  <message>End Test Case : Test Cases/Databases/CreateDatabases/Functional/DB_Create_virtualoptimizer_database</message>
  <nestedLevel>0</nestedLevel>
</record>
<record>
  <date>2019-08-02T09:53:46</date>
  <millis>1564754026415</millis>
  <sequence>26</sequence>
  <level>START</level>
  <class>com.kms.katalon.core.logging.XmlKeywordLogger</class>
  <method>startTest</method>
  <thread>1</thread>
  <message>Start Test Case : Test Cases/Databases/DatabasesRestoreWithBakcupFiles/Functional/DB_Restore_virtualoptimizer_wiht_backup_file</message>
  <nestedLevel>1</nestedLevel>
  <property name="name">Test Cases/Databases/DatabasesRestoreWithBakcupFiles/Functional/DB_Restore_virtualoptimizer_wiht_backup_file</property>
  <property name="description"></property>
  <property name="id">Test Cases/Databases/DatabasesRestoreWithBakcupFiles/Functional/DB_Restore_virtualoptimizer_wiht_backup_file</property>
  <property name="source">C:\\Users\\jenny.maldonado\\git\\cropmetricskatalonstudio\\Test Cases\\Databases\\DatabasesRestoreWithBakcupFiles\\Functional\\DB_Restore_virtualoptimizer_wiht_backup_file.tc</property>
  <property name="tag"></property>
  <property name="isOptional">false</property>
</record>
<record>
  <date>2019-08-02T09:53:46</date>
  <millis>1564754026725</millis>
  <sequence>28</sequence>
  <level>START</level>
  <class>com.kms.katalon.core.logging.XmlKeywordLogger</class>
  <method>startKeyword</method>
  <thread>1</thread>
  <message>Start action : server = server</message>
  <nestedLevel>1</nestedLevel>
  <property name="startLine">24</property>
  <property name="stepIndex">1</property>
</record>
<record>
  <date>2019-08-02T09:53:46</date>
  <millis>1564754026768</millis>
  <sequence>29</sequence>
  <level>END</level>
  <class>com.kms.katalon.core.logging.XmlKeywordLogger</class>
  <method>endKeyword</method>
  <thread>1</thread>
  <message>End action : server = server</message>
  <nestedLevel>1</nestedLevel>
</record>
<record>
  <date>2019-08-02T09:53:46</date>
  <millis>1564754026768</millis>
  <sequence>30</sequence>
  <level>START</level>
  <class>com.kms.katalon.core.logging.XmlKeywordLogger</class>
  <method>startKeyword</method>
  <thread>1</thread>
  <message>Start action : port = port</message>
  <nestedLevel>1</nestedLevel>
  <property name="startLine">25</property>
  <property name="stepIndex">2</property>
</record>
<record>
  <date>2019-08-02T09:53:46</date>
  <millis>1564754026770</millis>
  <sequence>31</sequence>
  <level>END</level>
  <class>com.kms.katalon.core.logging.XmlKeywordLogger</class>
  <method>endKeyword</method>
  <thread>1</thread>
  <message>End action : port = port</message>
  <nestedLevel>1</nestedLevel>
</record>
<record>
  <date>2019-08-02T09:53:46</date>
  <millis>1564754026771</millis>
  <sequence>32</sequence>
  <level>START</level>
  <class>com.kms.katalon.core.logging.XmlKeywordLogger</class>
  <method>startKeyword</method>
  <thread>1</thread>
  <message>Start action : user = userDb</message>
  <nestedLevel>1</nestedLevel>
  <property name="startLine">26</property>
  <property name="stepIndex">3</property>
</record>
<record>
  <date>2019-08-02T09:53:46</date>
  <millis>1564754026771</millis>
  <sequence>33</sequence>
  <level>END</level>
  <class>com.kms.katalon.core.logging.XmlKeywordLogger</class>
  <method>endKeyword</method>
  <thread>1</thread>
  <message>End action : user = userDb</message>
  <nestedLevel>1</nestedLevel>
</record>
<record>
  <date>2019-08-02T09:53:46</date>
  <millis>1564754026771</millis>
  <sequence>34</sequence>
  <level>START</level>
  <class>com.kms.katalon.core.logging.XmlKeywordLogger</class>
  <method>startKeyword</method>
  <thread>1</thread>
  <message>Start action : password = passwordDb</message>
  <nestedLevel>1</nestedLevel>
  <property name="startLine">27</property>
  <property name="stepIndex">4</property>
</record>
<record>
  <date>2019-08-02T09:53:46</date>
  <millis>1564754026775</millis>
  <sequence>35</sequence>
  <level>END</level>
  <class>com.kms.katalon.core.logging.XmlKeywordLogger</class>
  <method>endKeyword</method>
  <thread>1</thread>
  <message>End action : password = passwordDb</message>
  <nestedLevel>1</nestedLevel>
</record>
<record>
  <date>2019-08-02T09:53:46</date>
  <millis>1564754026775</millis>
  <sequence>36</sequence>
  <level>START</level>
  <class>com.kms.katalon.core.logging.XmlKeywordLogger</class>
  <method>startKeyword</method>
  <thread>1</thread>
  <message>Start action : pathPostgreSQL = pathPostgreSQLBin</message>
  <nestedLevel>1</nestedLevel>
  <property name="startLine">28</property>
  <property name="stepIndex">5</property>
</record>
<record>
  <date>2019-08-02T09:53:46</date>
  <millis>1564754026775</millis>
  <sequence>37</sequence>
  <level>END</level>
  <class>com.kms.katalon.core.logging.XmlKeywordLogger</class>
  <method>endKeyword</method>
  <thread>1</thread>
  <message>End action : pathPostgreSQL = pathPostgreSQLBin</message>
  <nestedLevel>1</nestedLevel>
</record>
<record>
  <date>2019-08-02T09:53:46</date>
  <millis>1564754026775</millis>
  <sequence>38</sequence>
  <level>START</level>
  <class>com.kms.katalon.core.logging.XmlKeywordLogger</class>
  <method>startKeyword</method>
  <thread>1</thread>
  <message>Start action : database = \&amp;quot;virtualoptimizer\&amp;quot;</message>
  <nestedLevel>1</nestedLevel>
  <property name="startLine">29</property>
  <property name="stepIndex">6</property>
</record>
<record>
  <date>2019-08-02T09:53:46</date>
  <millis>1564754026775</millis>
  <sequence>39</sequence>
  <level>END</level>
  <class>com.kms.katalon.core.logging.XmlKeywordLogger</class>
  <method>endKeyword</method>
  <thread>1</thread>
  <message>End action : database = \&amp;quot;virtualoptimizer\&amp;quot;</message>
  <nestedLevel>1</nestedLevel>
</record>
<record>
  <date>2019-08-02T09:53:46</date>
  <millis>1564754026775</millis>
  <sequence>40</sequence>
  <level>START</level>
  <class>com.kms.katalon.core.logging.XmlKeywordLogger</class>
  <method>startKeyword</method>
  <thread>1</thread>
  <message>Start action : pathDumpFile = \&amp;quot;C:\\KatalonFiles\\virtualoptimizer.dump\&amp;quot;</message>
  <nestedLevel>1</nestedLevel>
  <property name="startLine">30</property>
  <property name="stepIndex">7</property>
</record>
<record>
  <date>2019-08-02T09:53:46</date>
  <millis>1564754026785</millis>
  <sequence>41</sequence>
  <level>END</level>
  <class>com.kms.katalon.core.logging.XmlKeywordLogger</class>
  <method>endKeyword</method>
  <thread>1</thread>
  <message>End action : pathDumpFile = \&amp;quot;C:\\KatalonFiles\\virtualoptimizer.dump\&amp;quot;</message>
  <nestedLevel>1</nestedLevel>
</record>
<record>
  <date>2019-08-02T09:53:46</date>
  <millis>1564754026785</millis>
  <sequence>42</sequence>
  <level>START</level>
  <class>com.kms.katalon.core.logging.XmlKeywordLogger</class>
  <method>startKeyword</method>
  <thread>1</thread>
  <message>Start action : cRestore = String.format(\&amp;quot;cd \&amp;quot;%s\&amp;quot; &amp;amp;&amp;amp; pg_restore -U %s -h %s -p %d -c -C -d %s -v \&amp;quot;%s\&amp;quot;\&amp;quot;, pathPostgreSQL, user, server, port, database, pathDumpFile)</message>
  <nestedLevel>1</nestedLevel>
  <property name="startLine">34</property>
  <property name="stepIndex">8</property>
</record>
<record>
  <date>2019-08-02T09:53:46</date>
  <millis>1564754026785</millis>
  <sequence>43</sequence>
  <level>END</level>
  <class>com.kms.katalon.core.logging.XmlKeywordLogger</class>
  <method>endKeyword</method>
  <thread>1</thread>
  <message>End action : cRestore = String.format(\&amp;quot;cd \&amp;quot;%s\&amp;quot; &amp;amp;&amp;amp; pg_restore -U %s -h %s -p %d -c -C -d %s -v \&amp;quot;%s\&amp;quot;\&amp;quot;, pathPostgreSQL, user, server, port, database, pathDumpFile)</message>
  <nestedLevel>1</nestedLevel>
</record>
<record>
  <date>2019-08-02T09:53:46</date>
  <millis>1564754026785</millis>
  <sequence>44</sequence>
  <level>START</level>
  <class>com.kms.katalon.core.logging.XmlKeywordLogger</class>
  <method>startKeyword</method>
  <thread>1</thread>
  <message>Start action : commandLine.cmd.cmdLine(cRestore, password)</message>
  <nestedLevel>1</nestedLevel>
  <property name="startLine">37</property>
  <property name="stepIndex">9</property>
</record>
<record>
  <date>2019-08-02T09:53:51</date>
  <millis>1564754031821</millis>
  <sequence>45</sequence>
  <level>PASSED</level>
  <class>com.kms.katalon.core.logging.XmlKeywordLogger</class>
  <method>logMessage</method>
  <thread>1</thread>
  <message>commandLine.cmd.cmdLine is PASSED</message>
  <nestedLevel>1</nestedLevel>
</record>
<record>
  <date>2019-08-02T09:53:51</date>
  <millis>1564754031822</millis>
  <sequence>46</sequence>
  <level>END</level>
  <class>com.kms.katalon.core.logging.XmlKeywordLogger</class>
  <method>endKeyword</method>
  <thread>1</thread>
  <message>End action : commandLine.cmd.cmdLine(cRestore, password)</message>
  <nestedLevel>1</nestedLevel>
</record>
<record>
  <date>2019-08-02T09:53:51</date>
  <millis>1564754031823</millis>
  <sequence>47</sequence>
  <level>START</level>
  <class>com.kms.katalon.core.logging.XmlKeywordLogger</class>
  <method>startKeyword</method>
  <thread>1</thread>
  <message>Start action : println(\&amp;quot;The restore virtualoptimizer database was completed...\&amp;quot;)</message>
  <nestedLevel>1</nestedLevel>
  <property name="startLine">39</property>
  <property name="stepIndex">10</property>
</record>
<record>
  <date>2019-08-02T09:53:51</date>
  <millis>1564754031826</millis>
  <sequence>48</sequence>
  <level>END</level>
  <class>com.kms.katalon.core.logging.XmlKeywordLogger</class>
  <method>endKeyword</method>
  <thread>1</thread>
  <message>End action : println(\&amp;quot;The restore virtualoptimizer database was completed...\&amp;quot;)</message>
  <nestedLevel>1</nestedLevel>
</record>
<record>
  <date>2019-08-02T09:53:51</date>
  <millis>1564754031830</millis>
  <sequence>49</sequence>
  <level>PASSED</level>
  <class>com.kms.katalon.core.logging.XmlKeywordLogger</class>
  <method>logMessage</method>
  <thread>1</thread>
  <message>Test Cases/Databases/DatabasesRestoreWithBakcupFiles/Functional/DB_Restore_virtualoptimizer_wiht_backup_file</message>
  <nestedLevel>1</nestedLevel>
</record>
<record>
  <date>2019-08-02T09:53:51</date>
  <millis>1564754031830</millis>
  <sequence>50</sequence>
  <level>END</level>
  <class>com.kms.katalon.core.logging.XmlKeywordLogger</class>
  <method>endTest</method>
  <thread>1</thread>
  <message>End Test Case : Test Cases/Databases/DatabasesRestoreWithBakcupFiles/Functional/DB_Restore_virtualoptimizer_wiht_backup_file</message>
  <nestedLevel>0</nestedLevel>
</record>
<record>
  <date>2019-08-02T09:53:51</date>
  <millis>1564754031895</millis>
  <sequence>51</sequence>
  <level>END</level>
  <class>com.kms.katalon.core.logging.XmlKeywordLogger</class>
  <method>endSuite</method>
  <thread>1</thread>
  <message>End Test Suite : Test Suites/_EnvironmentSetup/EnvironmentSetupUsingBackupFiles/FunctionalDatabases/Restore_virtualoptimizer_database_using_backup_file</message>
  <nestedLevel>0</nestedLevel>
</record>
</log>
