{
  "log" : {
    "version" : "1.2",
    "creator" : {
      "name" : "BrowserMob Proxy",
      "version" : "2.1.5",
      "comment" : ""
    },
    "pages" : [ {
      "id" : "Page 0",
      "startedDateTime" : "2019-04-09T20:39:06.319Z",
      "title" : "Page 0",
      "pageTimings" : {
        "onLoad" : 3209,
        "comment" : ""
      },
      "comment" : ""
    } ],
    "entries" : [ {
      "pageref" : "Page 0",
      "startedDateTime" : "2019-04-09T20:39:06.320Z",
      "request" : {
        "method" : "PUT",
        "url" : "http://localhost:10520/WebAPI/api/mobile/v1/farms/7?",
        "httpVersion" : "HTTP/1.1",
        "cookies" : [ ],
        "headers" : [ {
          "name" : "User-Agent",
          "value" : "Katalon Studio"
        }, {
          "name" : "Content-Type",
          "value" : "application/json"
        }, {
          "name" : "Authorization",
          "value" : "Bearer eyJ0eXAiOiJKV1QiLCJhbGciOiJIUzI1NiJ9.eyJ1bmlxdWVfbmFtZSI6Implbm55Lm1hbGRvbmFkby50eDFAZ21haWwuY29tIiwicm9sZSI6InVzZXIiLCJzdWIiOiJqZW5ueS5tYWxkb25hZG8udHgxQGdtYWlsLmNvbSIsImlzcyI6IkNyb3BNZXRyaWNzIiwiYXVkIjoiYWxsIiwiZXhwIjoxNTU0ODQ2MjQ2LCJuYmYiOjE1NTQ4NDIzNDZ9.QxYA0Y7v412Ek-ZV_en8_rRirR90b9a6UC6tVYxxtBc"
        }, {
          "name" : "Host",
          "value" : "localhost:10520"
        }, {
          "name" : "Accept",
          "value" : "text/html, image/gif, image/jpeg, *; q=.2, */*; q=.2"
        }, {
          "name" : "Proxy-Connection",
          "value" : "keep-alive"
        }, {
          "name" : "Content-Length",
          "value" : "195"
        } ],
        "queryString" : [ ],
        "postData" : {
          "mimeType" : "application/json",
          "text" : "{\"name\": \"API_FARM_When_new_farm_has_name_attribute_with_more_than_128_chars_Expected_status_code_400 API_FARM_When_new_farm_has_name_attribute_with_more_than_128_chars_Expected_status_code_400\"}",
          "comment" : ""
        },
        "headersSize" : 592,
        "bodySize" : 195,
        "comment" : ""
      },
      "response" : {
        "status" : 400,
        "statusText" : "Bad Request",
        "httpVersion" : "HTTP/1.1",
        "cookies" : [ {
          "name" : ".ASPROLES",
          "value" : "CzeB7iKoeZxce3xlrX6Cu1AIXJQVkCKWalMI4Y48SyOy8L40lY12g0Lx3mQuNML1Sxa1P2Pc_qGH3cMrMB6trGnSF1oAbIezOUYHGHcH10mVLoY7K7oB0wgwIH232O1Ct0tayI0II-SKzzatQg9yFCvwJlN_HsJ0F-xdiNJB1ipcgpZSaHUus_h10PiMB8DGcaRlBydU6qgp05Jr0uNW7IKxbUygaPKWYNo7lbZJtIQa6oRX4sAtLRyrpPCFaKu62I2YT4Ox__4vi4mNMDW9FFOQpKSdZ-p-Q6EADx3Otv8gcBENgo5xsENW_ydwczapDMNFkgD7wRLfXUlhFBCBisL0p1r3GZWH5MrMolSUorjcNhHpEuigLtaDeMRdwf2uSFcIXRP7Kygh7j6NvfNHKu67F9I7-8tnVaYL-1Ym08GqEhl17glrVx1rTrcgoLlcezXdey1LXH5s1U_l8_EP8X0_eYr6fIGiDeK-Pj95NeeC64tFskh-XeoLO2qEyw3Iq3Zt_VO7AAOwL2K_32XF0dF2uM41",
          "path" : "/",
          "httpOnly" : true,
          "secure" : false,
          "comment" : ""
        } ],
        "headers" : [ {
          "name" : "Cache-Control",
          "value" : "private"
        }, {
          "name" : "Content-Type",
          "value" : "application/json; charset=utf-8"
        }, {
          "name" : "Server",
          "value" : "Microsoft-IIS/10.0"
        }, {
          "name" : "Set-Cookie",
          "value" : ".ASPROLES=CzeB7iKoeZxce3xlrX6Cu1AIXJQVkCKWalMI4Y48SyOy8L40lY12g0Lx3mQuNML1Sxa1P2Pc_qGH3cMrMB6trGnSF1oAbIezOUYHGHcH10mVLoY7K7oB0wgwIH232O1Ct0tayI0II-SKzzatQg9yFCvwJlN_HsJ0F-xdiNJB1ipcgpZSaHUus_h10PiMB8DGcaRlBydU6qgp05Jr0uNW7IKxbUygaPKWYNo7lbZJtIQa6oRX4sAtLRyrpPCFaKu62I2YT4Ox__4vi4mNMDW9FFOQpKSdZ-p-Q6EADx3Otv8gcBENgo5xsENW_ydwczapDMNFkgD7wRLfXUlhFBCBisL0p1r3GZWH5MrMolSUorjcNhHpEuigLtaDeMRdwf2uSFcIXRP7Kygh7j6NvfNHKu67F9I7-8tnVaYL-1Ym08GqEhl17glrVx1rTrcgoLlcezXdey1LXH5s1U_l8_EP8X0_eYr6fIGiDeK-Pj95NeeC64tFskh-XeoLO2qEyw3Iq3Zt_VO7AAOwL2K_32XF0dF2uM41; path=/; HttpOnly"
        }, {
          "name" : "X-SourceFiles",
          "value" : "=?UTF-8?B?RDpcVmlydHVhbE9wdGltaXplci1SZWZhY3RvcmluZ1xDcm9wTWV0cmljcy5Wby5BcGlcQ3JvcE1ldHJpY3MuVm8uQXBpXGFwaVxtb2JpbGVcdjFcZmFybXNcNw==?="
        }, {
          "name" : "X-Powered-By",
          "value" : "ASP.NET"
        }, {
          "name" : "Date",
          "value" : "Tue, 09 Apr 2019 20:39:09 GMT"
        }, {
          "name" : "Content-Length",
          "value" : "64"
        } ],
        "content" : {
          "size" : 64,
          "mimeType" : "application/json; charset=utf-8",
          "text" : "{\"message\":\"The farm name must contains as max 128 characters.\"}",
          "comment" : ""
        },
        "redirectURL" : "",
        "headersSize" : 944,
        "bodySize" : 64,
        "comment" : ""
      },
      "cache" : { },
      "timings" : {
        "comment" : "",
        "ssl" : -1,
        "blocked" : -1,
        "dns" : -1,
        "send" : 0,
        "receive" : 1,
        "connect" : -1,
        "wait" : 3202
      },
      "serverIPAddress" : "127.0.0.1",
      "comment" : "",
      "_katalonRequestInformation" : {
        "name" : "11",
        "testObjectId" : "Object Repository/VoGrow/Farm/FarmPut",
        "harId" : "ae3bed28-f9e4-45a8-b5ea-2765a948975a"
      },
      "time" : 3204
    } ],
    "comment" : ""
  }
}