{
  "log" : {
    "version" : "1.2",
    "creator" : {
      "name" : "BrowserMob Proxy",
      "version" : "2.1.5",
      "comment" : ""
    },
    "pages" : [ {
      "id" : "Page 0",
      "startedDateTime" : "2019-04-24T20:26:20.010Z",
      "title" : "Page 0",
      "pageTimings" : {
        "onLoad" : 3376,
        "comment" : ""
      },
      "comment" : ""
    } ],
    "entries" : [ {
      "pageref" : "Page 0",
      "startedDateTime" : "2019-04-24T20:26:20.011Z",
      "request" : {
        "method" : "PUT",
        "url" : "http://localhost:10520/WebAPI/api/mobile/v1/farms/7?",
        "httpVersion" : "HTTP/1.1",
        "cookies" : [ ],
        "headers" : [ {
          "name" : "User-Agent",
          "value" : "Katalon Studio"
        }, {
          "name" : "Content-Type",
          "value" : "application/json"
        }, {
          "name" : "Authorization",
          "value" : "Bearer eyJ0eXAiOiJKV1QiLCJhbGciOiJIUzI1NiJ9.eyJ1bmlxdWVfbmFtZSI6Implbm55Lm1hbGRvbmFkby50eDFAZ21haWwuY29tIiwicm9sZSI6InVzZXIiLCJzdWIiOiJqZW5ueS5tYWxkb25hZG8udHgxQGdtYWlsLmNvbSIsImlzcyI6IkNyb3BNZXRyaWNzIiwiYXVkIjoiYWxsIiwiZXhwIjoxNTU2MTQxNDc5LCJuYmYiOjE1NTYxMzc1Nzl9.HHHU4ZCDHy6LQHJezWOJrROawCSc0KrnunbGjBb2rVE"
        }, {
          "name" : "Host",
          "value" : "localhost:10520"
        }, {
          "name" : "Accept",
          "value" : "text/html, image/gif, image/jpeg, *; q=.2, */*; q=.2"
        }, {
          "name" : "Proxy-Connection",
          "value" : "keep-alive"
        }, {
          "name" : "Content-Length",
          "value" : "195"
        } ],
        "queryString" : [ ],
        "postData" : {
          "mimeType" : "application/json",
          "text" : "{\"name\": \"API_FARM_When_new_farm_has_name_attribute_with_more_than_128_chars_Expected_status_code_400 API_FARM_When_new_farm_has_name_attribute_with_more_than_128_chars_Expected_status_code_400\"}",
          "comment" : ""
        },
        "headersSize" : 592,
        "bodySize" : 195,
        "comment" : ""
      },
      "response" : {
        "status" : 400,
        "statusText" : "Bad Request",
        "httpVersion" : "HTTP/1.1",
        "cookies" : [ {
          "name" : ".ASPROLES",
          "value" : "YtQ0NemxUZvZjXk6Igb_znyz0Ie6GHjEo_pe_K0q5KYgrlHEbNKIAXqtzhpcyEkZLhZdmFYTJam1c5m1wZaLPVcwpyAQiCTc_N3lQGh9oZ7ycZdVoXCC9CBE9ZymbP-VUBhY5uDNEc7ER8e2IPWhl5BT0gfH_Mhvs0NL4AkRidlambhLn5dteHxDoqbzsZRJfFM4MuvZ5BpLGynSi0T88K8GyF_bB-DYU6EIc88xVAz3MKw27dJp36hwrpsRGR4kIffVSgRVsL6uU5scIQBzDj9LatIybb2nC51L3bMpHe94q8Vl7Dx9F0M-tFky6TKXzvErY-3ifimZOLvjUu3dK3lAUwh4VAAmAJxgXqO0y0PPvx39nptL4JouHAZ0eRq4TCzYHOTkrPTYQj_aoFUjb6d0iu55wIXS-tX2MkjAsxM3eLcpEg-L1nqjx6yLRNpqJbfel4GPAANVBOT4TSYF5ZL960caVEBD_SQLdLdfneFtf_khe9zR5Q05a5HcphsRy_sbdQxLuj9t-_4SBuaEL_WKvtg1",
          "path" : "/",
          "httpOnly" : true,
          "secure" : false,
          "comment" : ""
        } ],
        "headers" : [ {
          "name" : "Cache-Control",
          "value" : "private"
        }, {
          "name" : "Content-Type",
          "value" : "application/json; charset=utf-8"
        }, {
          "name" : "Server",
          "value" : "Microsoft-IIS/10.0"
        }, {
          "name" : "Set-Cookie",
          "value" : ".ASPROLES=YtQ0NemxUZvZjXk6Igb_znyz0Ie6GHjEo_pe_K0q5KYgrlHEbNKIAXqtzhpcyEkZLhZdmFYTJam1c5m1wZaLPVcwpyAQiCTc_N3lQGh9oZ7ycZdVoXCC9CBE9ZymbP-VUBhY5uDNEc7ER8e2IPWhl5BT0gfH_Mhvs0NL4AkRidlambhLn5dteHxDoqbzsZRJfFM4MuvZ5BpLGynSi0T88K8GyF_bB-DYU6EIc88xVAz3MKw27dJp36hwrpsRGR4kIffVSgRVsL6uU5scIQBzDj9LatIybb2nC51L3bMpHe94q8Vl7Dx9F0M-tFky6TKXzvErY-3ifimZOLvjUu3dK3lAUwh4VAAmAJxgXqO0y0PPvx39nptL4JouHAZ0eRq4TCzYHOTkrPTYQj_aoFUjb6d0iu55wIXS-tX2MkjAsxM3eLcpEg-L1nqjx6yLRNpqJbfel4GPAANVBOT4TSYF5ZL960caVEBD_SQLdLdfneFtf_khe9zR5Q05a5HcphsRy_sbdQxLuj9t-_4SBuaEL_WKvtg1; path=/; HttpOnly"
        }, {
          "name" : "X-SourceFiles",
          "value" : "=?UTF-8?B?RDpcVmlydHVhbE9wdGltaXplci1SZWZhY3RvcmluZ1xDcm9wTWV0cmljcy5Wby5BcGlcQ3JvcE1ldHJpY3MuVm8uQXBpXGFwaVxtb2JpbGVcdjFcZmFybXNcNw==?="
        }, {
          "name" : "X-Powered-By",
          "value" : "ASP.NET"
        }, {
          "name" : "Date",
          "value" : "Wed, 24 Apr 2019 20:26:23 GMT"
        }, {
          "name" : "Content-Length",
          "value" : "64"
        } ],
        "content" : {
          "size" : 64,
          "mimeType" : "application/json; charset=utf-8",
          "text" : "{\"message\":\"The farm name must contains as max 128 characters.\"}",
          "comment" : ""
        },
        "redirectURL" : "",
        "headersSize" : 944,
        "bodySize" : 64,
        "comment" : ""
      },
      "cache" : { },
      "timings" : {
        "comment" : "",
        "connect" : -1,
        "wait" : 3370,
        "send" : 0,
        "receive" : 1,
        "dns" : -1,
        "blocked" : -1,
        "ssl" : -1
      },
      "serverIPAddress" : "127.0.0.1",
      "comment" : "",
      "_katalonRequestInformation" : {
        "name" : "11",
        "testObjectId" : "Object Repository/VoGrow/Farm/FarmPut",
        "harId" : "403b372e-1e3a-4b3b-a2ca-d9ae28324378"
      },
      "time" : 3371
    } ],
    "comment" : ""
  }
}