{
  "log" : {
    "version" : "1.2",
    "creator" : {
      "name" : "BrowserMob Proxy",
      "version" : "2.1.5",
      "comment" : ""
    },
    "pages" : [ {
      "id" : "Page 0",
      "startedDateTime" : "2019-03-29T13:29:19.107Z",
      "title" : "Page 0",
      "pageTimings" : {
        "onLoad" : 2560,
        "comment" : ""
      },
      "comment" : ""
    } ],
    "entries" : [ {
      "pageref" : "Page 0",
      "startedDateTime" : "2019-03-29T13:29:19.107Z",
      "request" : {
        "method" : "POST",
        "url" : "http://localhost:10520/WebAPI/api/admin/v1/users/?",
        "httpVersion" : "HTTP/1.1",
        "cookies" : [ ],
        "headers" : [ {
          "name" : "User-Agent",
          "value" : "Katalon Studio"
        }, {
          "name" : "Content-Type",
          "value" : "application/x-www-form-urlencoded"
        }, {
          "name" : "Authorization",
          "value" : "Bearer eyJ0eXAiOiJKV1QiLCJhbGciOiJIUzI1NiJ9.eyJ1bmlxdWVfbmFtZSI6ImFkbWluIiwicm9sZSI6InVzZXIiLCJzdWIiOiJhZG1pbiIsImlzcyI6IkNyb3BNZXRyaWNzIiwiYXVkIjoiYWxsIiwiZXhwIjoxNTUzODcwMDU5LCJuYmYiOjE1NTM4NjYxNTl9.AIfmUMUEZa2uuAO724tgfq-srn8qz21b5nLSCRsbaCs"
        }, {
          "name" : "Host",
          "value" : "localhost:10520"
        }, {
          "name" : "Accept",
          "value" : "text/html, image/gif, image/jpeg, *; q=.2, */*; q=.2"
        }, {
          "name" : "Proxy-Connection",
          "value" : "keep-alive"
        }, {
          "name" : "Content-Length",
          "value" : "315"
        } ],
        "queryString" : [ ],
        "postData" : {
          "mimeType" : "application/x-www-form-urlencoded",
          "params" : [ {
            "name" : "password",
            "value" : "cropmetrics",
            "comment" : ""
          }, {
            "name" : "email",
            "value" : "cropmetricsvo.pass6chars@gmail.com",
            "comment" : ""
          }, {
            "name" : "fullname",
            "value" : "test validation",
            "comment" : ""
          }, {
            "name" : "phone",
            "value" : "123",
            "comment" : ""
          }, {
            "name" : "dealer",
            "value" : "dealer test validation",
            "comment" : ""
          }, {
            "name" : "addressLine1",
            "value" : "address line 1 test validation",
            "comment" : ""
          }, {
            "name" : "addressLine2",
            "value" : "address line 1 test validation",
            "comment" : ""
          }, {
            "name" : "town",
            "value" : "townValidation",
            "comment" : ""
          }, {
            "name" : "state",
            "value" : "stateValidation",
            "comment" : ""
          }, {
            "name" : "zip",
            "value" : "zipValidation",
            "comment" : ""
          }, {
            "name" : "country",
            "value" : "countryValidation",
            "comment" : ""
          }, {
            "name" : "roles",
            "value" : "Client",
            "comment" : ""
          } ],
          "comment" : ""
        },
        "headersSize" : 544,
        "bodySize" : 315,
        "comment" : ""
      },
      "response" : {
        "status" : 400,
        "statusText" : "Bad Request",
        "httpVersion" : "HTTP/1.1",
        "cookies" : [ {
          "name" : ".ASPROLES",
          "value" : "i-26Eo5ZLsvPAYaHRs5oapELy5LlbrLHoItzPXcXu1g3czTElF39veCQ0N_VSuoRWZodMo0pWKDtGfMakyaQwXRDX-WG8VJ7JLXgCp1HRtXqTYA9vgnuLCGBnvQWTQaj2OUb78k4OtR_P_wZM7qxyEXxVIL1y5KzKGZ6HvCUV9asZo8wpKa5QIarpWHt0riH0sGLdQy9ZPb5ulh1G9tmnWIwpISGfY-l15rfECzLsZJnlPQLraJ7DFox_crAqFohbnDqfaFwaynbX1k9RyoKKWtpNrX0ixzzDyeEXnZCGxLV1r06_WCjFh3e54x0QoHDcqm0z5q3x32hYhUvRy9JrpgsgXfGSGmHO0KswOSObqI-7kBwK8YEWxXRtrVCZqEVMLQnpjhRnVGEjq9l_MtAwUE3U3m7v5M-9-AThFmMs5aykEHjcWLdRtVT81W6qHlcY1V2X3uxHZnffHvl8u82qlv-vT8fO17wRIAX7lDM6Z_Dsdda0",
          "path" : "/",
          "httpOnly" : true,
          "secure" : false,
          "comment" : ""
        } ],
        "headers" : [ {
          "name" : "Cache-Control",
          "value" : "private"
        }, {
          "name" : "Content-Type",
          "value" : "application/json; charset=utf-8"
        }, {
          "name" : "Server",
          "value" : "Microsoft-IIS/10.0"
        }, {
          "name" : "Set-Cookie",
          "value" : ".ASPROLES=i-26Eo5ZLsvPAYaHRs5oapELy5LlbrLHoItzPXcXu1g3czTElF39veCQ0N_VSuoRWZodMo0pWKDtGfMakyaQwXRDX-WG8VJ7JLXgCp1HRtXqTYA9vgnuLCGBnvQWTQaj2OUb78k4OtR_P_wZM7qxyEXxVIL1y5KzKGZ6HvCUV9asZo8wpKa5QIarpWHt0riH0sGLdQy9ZPb5ulh1G9tmnWIwpISGfY-l15rfECzLsZJnlPQLraJ7DFox_crAqFohbnDqfaFwaynbX1k9RyoKKWtpNrX0ixzzDyeEXnZCGxLV1r06_WCjFh3e54x0QoHDcqm0z5q3x32hYhUvRy9JrpgsgXfGSGmHO0KswOSObqI-7kBwK8YEWxXRtrVCZqEVMLQnpjhRnVGEjq9l_MtAwUE3U3m7v5M-9-AThFmMs5aykEHjcWLdRtVT81W6qHlcY1V2X3uxHZnffHvl8u82qlv-vT8fO17wRIAX7lDM6Z_Dsdda0; path=/; HttpOnly"
        }, {
          "name" : "X-SourceFiles",
          "value" : "=?UTF-8?B?RDpcVmlydHVhbE9wdGltaXplci1SZWZhY3RvcmluZ1xDcm9wTWV0cmljcy5Wby5BcGlcQ3JvcE1ldHJpY3MuVm8uQXBpXGFwaVxhZG1pblx2MVx1c2Vyc1w=?="
        }, {
          "name" : "X-Powered-By",
          "value" : "ASP.NET"
        }, {
          "name" : "Date",
          "value" : "Fri, 29 Mar 2019 13:29:21 GMT"
        }, {
          "name" : "Content-Length",
          "value" : "71"
        } ],
        "content" : {
          "size" : 71,
          "mimeType" : "application/json; charset=utf-8",
          "text" : "{\"message\":\"Name cropmetricsvo.pass6chars@gmail.com is already taken.\"}",
          "comment" : ""
        },
        "redirectURL" : "",
        "headersSize" : 897,
        "bodySize" : 71,
        "comment" : ""
      },
      "cache" : { },
      "timings" : {
        "comment" : "",
        "ssl" : -1,
        "send" : 0,
        "wait" : 2566,
        "receive" : 0,
        "blocked" : -1,
        "connect" : -1,
        "dns" : -1
      },
      "serverIPAddress" : "127.0.0.1",
      "comment" : "",
      "_katalonRequestInformation" : {
        "name" : "17",
        "testObjectId" : "Object Repository/VoPro/Account/api_admin_v1_users",
        "harId" : "70a8c949-ada1-4a9b-b2c8-572527634eda"
      },
      "time" : 2567
    } ],
    "comment" : ""
  }
}