{
  "log" : {
    "version" : "1.2",
    "creator" : {
      "name" : "BrowserMob Proxy",
      "version" : "2.1.5",
      "comment" : ""
    },
    "pages" : [ {
      "id" : "Page 0",
      "startedDateTime" : "2019-04-01T13:37:37.576Z",
      "title" : "Page 0",
      "pageTimings" : {
        "onLoad" : 9875,
        "comment" : ""
      },
      "comment" : ""
    } ],
    "entries" : [ {
      "pageref" : "Page 0",
      "startedDateTime" : "2019-04-01T13:37:37.579Z",
      "request" : {
        "method" : "PUT",
        "url" : "http://localhost:10520/WebAPI/api/admin/v1/users/4?",
        "httpVersion" : "HTTP/1.1",
        "cookies" : [ ],
        "headers" : [ {
          "name" : "User-Agent",
          "value" : "Katalon Studio"
        }, {
          "name" : "Content-Type",
          "value" : "application/x-www-form-urlencoded"
        }, {
          "name" : "Authorization",
          "value" : "Bearer eyJ0eXAiOiJKV1QiLCJhbGciOiJIUzI1NiJ9.eyJ1bmlxdWVfbmFtZSI6ImFkbWluIiwicm9sZSI6InVzZXIiLCJzdWIiOiJhZG1pbiIsImlzcyI6IkNyb3BNZXRyaWNzIiwiYXVkIjoiYWxsIiwiZXhwIjoxNTU0MTI5NzU2LCJuYmYiOjE1NTQxMjU4NTZ9.bT8hqNt_FiWMxEHG9kvlhpauC5awqQd60abVDwBEsLc"
        }, {
          "name" : "Host",
          "value" : "localhost:10520"
        }, {
          "name" : "Accept",
          "value" : "text/html, image/gif, image/jpeg, *; q=.2, */*; q=.2"
        }, {
          "name" : "Proxy-Connection",
          "value" : "keep-alive"
        }, {
          "name" : "Content-Length",
          "value" : "365"
        } ],
        "queryString" : [ ],
        "postData" : {
          "mimeType" : "application/x-www-form-urlencoded",
          "params" : [ {
            "name" : "password",
            "value" : "",
            "comment" : ""
          }, {
            "name" : "email",
            "value" : "    cropmetricsvo.spaces.updated@gmail.com     ",
            "comment" : ""
          }, {
            "name" : "fullname",
            "value" : "test updated admin",
            "comment" : ""
          }, {
            "name" : "phone",
            "value" : "phone updated admin",
            "comment" : ""
          }, {
            "name" : "dealer",
            "value" : "dealer updated admin",
            "comment" : ""
          }, {
            "name" : "addressLine1",
            "value" : "address line 1 updated admin",
            "comment" : ""
          }, {
            "name" : "addressLine2",
            "value" : "address line 2 updated admin",
            "comment" : ""
          }, {
            "name" : "town",
            "value" : "townupdated admin",
            "comment" : ""
          }, {
            "name" : "state",
            "value" : "stateupdated admin",
            "comment" : ""
          }, {
            "name" : "zip",
            "value" : "zipupdated admin",
            "comment" : ""
          }, {
            "name" : "country",
            "value" : "countryupdated admin",
            "comment" : ""
          }, {
            "name" : "roles",
            "value" : "Administrator",
            "comment" : ""
          }, {
            "name" : "userProfileId",
            "value" : "4",
            "comment" : ""
          } ],
          "comment" : ""
        },
        "headersSize" : 544,
        "bodySize" : 365,
        "comment" : ""
      },
      "response" : {
        "status" : 200,
        "statusText" : "OK",
        "httpVersion" : "HTTP/1.1",
        "cookies" : [ {
          "name" : ".ASPROLES",
          "value" : "8mrioS4ShGQfvNApEd2KiiNv_0YyBsazJOcDmuWpWbIzgftAn1vnhcBihUagYxOlef01a9mOy62sFoKS3AjrRIgcdHlM8PGVoGZnoiXyYXF19p4-AmjhJE8xzpH_uB4SgiFc4yvieaepoWaOTEJiYirqEku6gRlxK0Eiwq7cZg694sn5wO3ZqAkzfSqy1_pG_A_rIl544rYK92e9N5v51M4BrnOfr3qvYElImx-ORkErDPY2sooaR3RgkmahhuxGVBy3z_TR2LikNeNQVovoUr_wfKAM7Ism84nJv-61etHO3RJlf566sfUGwD4KIl9NH_zo8JdrkLg7l0CxzSo-lxOGInizvs-d1xeD9-Acx2w4nhDgZg5Y4Bo13-Yu1oTIjw9dm8uvLfo_EdDpY4xvvTxl0fSpQVWyH50O4I1NcLa5HOGoWe7CIxVreOSDTStZdrDABmTU5uh6LXVUdS7n2XSdrK7gAgbLu09yen-lz5q77rwg0",
          "path" : "/",
          "httpOnly" : true,
          "secure" : false,
          "comment" : ""
        } ],
        "headers" : [ {
          "name" : "Cache-Control",
          "value" : "private"
        }, {
          "name" : "Server",
          "value" : "Microsoft-IIS/10.0"
        }, {
          "name" : "Set-Cookie",
          "value" : ".ASPROLES=8mrioS4ShGQfvNApEd2KiiNv_0YyBsazJOcDmuWpWbIzgftAn1vnhcBihUagYxOlef01a9mOy62sFoKS3AjrRIgcdHlM8PGVoGZnoiXyYXF19p4-AmjhJE8xzpH_uB4SgiFc4yvieaepoWaOTEJiYirqEku6gRlxK0Eiwq7cZg694sn5wO3ZqAkzfSqy1_pG_A_rIl544rYK92e9N5v51M4BrnOfr3qvYElImx-ORkErDPY2sooaR3RgkmahhuxGVBy3z_TR2LikNeNQVovoUr_wfKAM7Ism84nJv-61etHO3RJlf566sfUGwD4KIl9NH_zo8JdrkLg7l0CxzSo-lxOGInizvs-d1xeD9-Acx2w4nhDgZg5Y4Bo13-Yu1oTIjw9dm8uvLfo_EdDpY4xvvTxl0fSpQVWyH50O4I1NcLa5HOGoWe7CIxVreOSDTStZdrDABmTU5uh6LXVUdS7n2XSdrK7gAgbLu09yen-lz5q77rwg0; path=/; HttpOnly"
        }, {
          "name" : "X-SourceFiles",
          "value" : "=?UTF-8?B?RDpcVmlydHVhbE9wdGltaXplci1SZWZhY3RvcmluZ1xDcm9wTWV0cmljcy5Wby5BcGlcQ3JvcE1ldHJpY3MuVm8uQXBpXGFwaVxhZG1pblx2MVx1c2Vyc1w0?="
        }, {
          "name" : "X-Powered-By",
          "value" : "ASP.NET"
        }, {
          "name" : "Date",
          "value" : "Mon, 01 Apr 2019 13:37:47 GMT"
        }, {
          "name" : "Content-Length",
          "value" : "0"
        } ],
        "content" : {
          "size" : 0,
          "mimeType" : "",
          "comment" : ""
        },
        "redirectURL" : "",
        "headersSize" : 840,
        "bodySize" : -1,
        "comment" : ""
      },
      "cache" : { },
      "timings" : {
        "comment" : "",
        "blocked" : -1,
        "connect" : -1,
        "dns" : -1,
        "ssl" : -1,
        "send" : 2,
        "wait" : 9857,
        "receive" : 0
      },
      "serverIPAddress" : "127.0.0.1",
      "comment" : "",
      "_katalonRequestInformation" : {
        "name" : "1",
        "testObjectId" : "Object Repository/VoPro/Account/api_admin_v1_users_userprofileid",
        "harId" : "f83e8c59-4c1e-45b0-b616-933690bdfd23"
      },
      "time" : 9860
    } ],
    "comment" : ""
  }
}