{
  "log" : {
    "version" : "1.2",
    "creator" : {
      "name" : "BrowserMob Proxy",
      "version" : "2.1.5",
      "comment" : ""
    },
    "pages" : [ {
      "id" : "Page 0",
      "startedDateTime" : "2019-04-11T16:05:14.608Z",
      "title" : "Page 0",
      "pageTimings" : {
        "onLoad" : 3456,
        "comment" : ""
      },
      "comment" : ""
    } ],
    "entries" : [ {
      "pageref" : "Page 0",
      "startedDateTime" : "2019-04-11T16:05:14.609Z",
      "request" : {
        "method" : "PUT",
        "url" : "http://localhost:10520/WebAPI/api/mobile/v1/farms/7?",
        "httpVersion" : "HTTP/1.1",
        "cookies" : [ ],
        "headers" : [ {
          "name" : "User-Agent",
          "value" : "Katalon Studio"
        }, {
          "name" : "Content-Type",
          "value" : "application/json"
        }, {
          "name" : "Authorization",
          "value" : "Bearer eyJ0eXAiOiJKV1QiLCJhbGciOiJIUzI1NiJ9.eyJ1bmlxdWVfbmFtZSI6Implbm55Lm1hbGRvbmFkby50eDFAZ21haWwuY29tIiwicm9sZSI6InVzZXIiLCJzdWIiOiJqZW5ueS5tYWxkb25hZG8udHgxQGdtYWlsLmNvbSIsImlzcyI6IkNyb3BNZXRyaWNzIiwiYXVkIjoiYWxsIiwiZXhwIjoxNTU1MDAyNjE0LCJuYmYiOjE1NTQ5OTg3MTR9.9a4fsX473Thc95IJBcIQwkKful_PhVREZX7FWGIGwO8"
        }, {
          "name" : "Host",
          "value" : "localhost:10520"
        }, {
          "name" : "Accept",
          "value" : "text/html, image/gif, image/jpeg, *; q=.2, */*; q=.2"
        }, {
          "name" : "Proxy-Connection",
          "value" : "keep-alive"
        }, {
          "name" : "Content-Length",
          "value" : "12"
        } ],
        "queryString" : [ ],
        "postData" : {
          "mimeType" : "application/json",
          "text" : "{\"name\": \"\"}",
          "comment" : ""
        },
        "headersSize" : 591,
        "bodySize" : 12,
        "comment" : ""
      },
      "response" : {
        "status" : 400,
        "statusText" : "Bad Request",
        "httpVersion" : "HTTP/1.1",
        "cookies" : [ {
          "name" : ".ASPROLES",
          "value" : "DEdZWE2AVzNv7af9YKtK-F5bsbfHX5yLA-mYzKSrHr52oyAFOlDRW6DG1bIc1N-prQepgHiZDUQpCJ2-UfEBWNqH4ewaI0Yv0yNVv-NehxggMWSZzutZGdZ-J8K5cREKSZPxrf1iI9rW8ZuR-T6vclsW_IBocv3zgWb4QyQOVIHbzW7YdTJIs0TwyaZX0RC3LVA2KcD5oCFbOvDiKWogP3ukrUDhnJIbORfooLMqjHcIhHiaYKvMlgR2w5DIETtoDwa-d12JmgCc4Mkh4bv1VNcp3pMDaFU6JR00AocpKtm5wrESdEuSaaIzaZWZdoUE0C4p5lz2KCs-DkanFWcrFykdhcRqegpO1_gCNhK3083Rilup9p0NK9oZXEvuQjmctAZI4yHDnJcaJQ2-CDwCyIZlkBMjUe_dkDPNBxa2c0ut1XBxxGC4Tg4FL5fvOasPN4TJifZyAHuZp6zEqym1dAAU_yUv9amqIBbHIwh0zZfBnWKT41NupeszpyHQdG02Htq-5epBz2S9hn3c-RkZaAcxyig1",
          "path" : "/",
          "httpOnly" : true,
          "secure" : false,
          "comment" : ""
        } ],
        "headers" : [ {
          "name" : "Cache-Control",
          "value" : "private"
        }, {
          "name" : "Content-Type",
          "value" : "application/json; charset=utf-8"
        }, {
          "name" : "Server",
          "value" : "Microsoft-IIS/10.0"
        }, {
          "name" : "Set-Cookie",
          "value" : ".ASPROLES=DEdZWE2AVzNv7af9YKtK-F5bsbfHX5yLA-mYzKSrHr52oyAFOlDRW6DG1bIc1N-prQepgHiZDUQpCJ2-UfEBWNqH4ewaI0Yv0yNVv-NehxggMWSZzutZGdZ-J8K5cREKSZPxrf1iI9rW8ZuR-T6vclsW_IBocv3zgWb4QyQOVIHbzW7YdTJIs0TwyaZX0RC3LVA2KcD5oCFbOvDiKWogP3ukrUDhnJIbORfooLMqjHcIhHiaYKvMlgR2w5DIETtoDwa-d12JmgCc4Mkh4bv1VNcp3pMDaFU6JR00AocpKtm5wrESdEuSaaIzaZWZdoUE0C4p5lz2KCs-DkanFWcrFykdhcRqegpO1_gCNhK3083Rilup9p0NK9oZXEvuQjmctAZI4yHDnJcaJQ2-CDwCyIZlkBMjUe_dkDPNBxa2c0ut1XBxxGC4Tg4FL5fvOasPN4TJifZyAHuZp6zEqym1dAAU_yUv9amqIBbHIwh0zZfBnWKT41NupeszpyHQdG02Htq-5epBz2S9hn3c-RkZaAcxyig1; path=/; HttpOnly"
        }, {
          "name" : "X-SourceFiles",
          "value" : "=?UTF-8?B?RDpcVmlydHVhbE9wdGltaXplci1SZWZhY3RvcmluZ1xDcm9wTWV0cmljcy5Wby5BcGlcQ3JvcE1ldHJpY3MuVm8uQXBpXGFwaVxtb2JpbGVcdjFcZmFybXNcNw==?="
        }, {
          "name" : "X-Powered-By",
          "value" : "ASP.NET"
        }, {
          "name" : "Date",
          "value" : "Thu, 11 Apr 2019 16:05:18 GMT"
        }, {
          "name" : "Content-Length",
          "value" : "45"
        } ],
        "content" : {
          "size" : 45,
          "mimeType" : "application/json; charset=utf-8",
          "text" : "{\"message\":\"The farm name must be provided.\"}",
          "comment" : ""
        },
        "redirectURL" : "",
        "headersSize" : 944,
        "bodySize" : 45,
        "comment" : ""
      },
      "cache" : { },
      "timings" : {
        "comment" : "",
        "send" : 4,
        "receive" : 0,
        "dns" : -1,
        "wait" : 3447,
        "connect" : -1,
        "blocked" : -1,
        "ssl" : -1
      },
      "serverIPAddress" : "127.0.0.1",
      "comment" : "",
      "_katalonRequestInformation" : {
        "name" : "19",
        "testObjectId" : "Object Repository/VoGrow/Farm/FarmPut",
        "harId" : "8558440b-3cb8-4267-8b4e-ed8c8de2ddd9"
      },
      "time" : 3452
    } ],
    "comment" : ""
  }
}