{
  "log" : {
    "version" : "1.2",
    "creator" : {
      "name" : "BrowserMob Proxy",
      "version" : "2.1.5",
      "comment" : ""
    },
    "pages" : [ {
      "id" : "Page 0",
      "startedDateTime" : "2019-03-28T18:55:32.070Z",
      "title" : "Page 0",
      "pageTimings" : {
        "onLoad" : 3296,
        "comment" : ""
      },
      "comment" : ""
    } ],
    "entries" : [ {
      "pageref" : "Page 0",
      "startedDateTime" : "2019-03-28T18:55:32.072Z",
      "request" : {
        "method" : "POST",
        "url" : "http://localhost:10520/WebAPI/api/admin/v1/users/?",
        "httpVersion" : "HTTP/1.1",
        "cookies" : [ ],
        "headers" : [ {
          "name" : "User-Agent",
          "value" : "Katalon Studio"
        }, {
          "name" : "Content-Type",
          "value" : "application/x-www-form-urlencoded"
        }, {
          "name" : "Authorization",
          "value" : "Bearer eyJ0eXAiOiJKV1QiLCJhbGciOiJIUzI1NiJ9.eyJ1bmlxdWVfbmFtZSI6ImFkbWluIiwicm9sZSI6InVzZXIiLCJzdWIiOiJhZG1pbiIsImlzcyI6IkNyb3BNZXRyaWNzIiwiYXVkIjoiYWxsIiwiZXhwIjoxNTUzODAzMjMxLCJuYmYiOjE1NTM3OTkzMzF9.qqnYoWyQTvOKgSYD0GkRxQuvqpwnuuumNJu5p9tm5uA"
        }, {
          "name" : "Host",
          "value" : "localhost:10520"
        }, {
          "name" : "Accept",
          "value" : "text/html, image/gif, image/jpeg, *; q=.2, */*; q=.2"
        }, {
          "name" : "Proxy-Connection",
          "value" : "keep-alive"
        }, {
          "name" : "Content-Length",
          "value" : "172"
        } ],
        "queryString" : [ ],
        "postData" : {
          "mimeType" : "application/x-www-form-urlencoded",
          "params" : [ {
            "name" : "password",
            "value" : "cropmetrics",
            "comment" : ""
          }, {
            "name" : "email",
            "value" : "jenny.maldonado.tx@gmail.com",
            "comment" : ""
          }, {
            "name" : "fullname",
            "value" : "account status",
            "comment" : ""
          }, {
            "name" : "phone",
            "value" : "x",
            "comment" : ""
          }, {
            "name" : "dealer",
            "value" : "x",
            "comment" : ""
          }, {
            "name" : "addressLine1",
            "value" : "x",
            "comment" : ""
          }, {
            "name" : "addressLine2",
            "value" : "x",
            "comment" : ""
          }, {
            "name" : "town",
            "value" : "x",
            "comment" : ""
          }, {
            "name" : "state",
            "value" : "x",
            "comment" : ""
          }, {
            "name" : "zip",
            "value" : "x",
            "comment" : ""
          }, {
            "name" : "country",
            "value" : "x",
            "comment" : ""
          }, {
            "name" : "roles",
            "value" : "Client",
            "comment" : ""
          } ],
          "comment" : ""
        },
        "headersSize" : 544,
        "bodySize" : 172,
        "comment" : ""
      },
      "response" : {
        "status" : 400,
        "statusText" : "Bad Request",
        "httpVersion" : "HTTP/1.1",
        "cookies" : [ {
          "name" : ".ASPROLES",
          "value" : "2H912MIVFB7s8KsVsZFDKmjP3M8zTdfohV_9CJaSA-1ntfEbVcMcvGVWVOkfNggix0JYONrVg9Vl3FvRfpzJBN3oz6ClGwib-AJkuhV9wuUIqDH5sqzzBQaH1QXkoSSlA-r37M5W0lx4LZKSgpRtSvC_dO-HRw42b-dWTBtFyd3HBHVprrExKmqu576zvI9fP-VpHKhTDap1CVjCnmFHfygq_lbF5dNHfZiqn89zr1qbH-KM46-bwWLhVatAbyV1jTXKHhxhqEs0kTU9QqxOIQTPl1u6yIO1KPW33ZydVsyXPasHXhIXl1fI4Cfk7VzUbOxhbLa5hE4Ram9PRRS0budgjpTTV76SXPb2SEgdZopUldJmGR-TzOwSWqrXQlX_9W0UxMXMuk_03MP3nPSww12YiI316Wdnhcxh1vRKWxfhw9V06V9K4UFH2VTpnR9pIqGzLML8oFvG0ls2wCxZwc7jWnoJ0qEta-INNYYMzH6zfpdr0",
          "path" : "/",
          "httpOnly" : true,
          "secure" : false,
          "comment" : ""
        } ],
        "headers" : [ {
          "name" : "Cache-Control",
          "value" : "private"
        }, {
          "name" : "Content-Type",
          "value" : "application/json; charset=utf-8"
        }, {
          "name" : "Server",
          "value" : "Microsoft-IIS/10.0"
        }, {
          "name" : "Set-Cookie",
          "value" : ".ASPROLES=2H912MIVFB7s8KsVsZFDKmjP3M8zTdfohV_9CJaSA-1ntfEbVcMcvGVWVOkfNggix0JYONrVg9Vl3FvRfpzJBN3oz6ClGwib-AJkuhV9wuUIqDH5sqzzBQaH1QXkoSSlA-r37M5W0lx4LZKSgpRtSvC_dO-HRw42b-dWTBtFyd3HBHVprrExKmqu576zvI9fP-VpHKhTDap1CVjCnmFHfygq_lbF5dNHfZiqn89zr1qbH-KM46-bwWLhVatAbyV1jTXKHhxhqEs0kTU9QqxOIQTPl1u6yIO1KPW33ZydVsyXPasHXhIXl1fI4Cfk7VzUbOxhbLa5hE4Ram9PRRS0budgjpTTV76SXPb2SEgdZopUldJmGR-TzOwSWqrXQlX_9W0UxMXMuk_03MP3nPSww12YiI316Wdnhcxh1vRKWxfhw9V06V9K4UFH2VTpnR9pIqGzLML8oFvG0ls2wCxZwc7jWnoJ0qEta-INNYYMzH6zfpdr0; path=/; HttpOnly"
        }, {
          "name" : "X-SourceFiles",
          "value" : "=?UTF-8?B?RDpcVmlydHVhbE9wdGltaXplci1SZWZhY3RvcmluZ1xDcm9wTWV0cmljcy5Wby5BcGlcQ3JvcE1ldHJpY3MuVm8uQXBpXGFwaVxhZG1pblx2MVx1c2Vyc1w=?="
        }, {
          "name" : "X-Powered-By",
          "value" : "ASP.NET"
        }, {
          "name" : "Date",
          "value" : "Thu, 28 Mar 2019 18:55:35 GMT"
        }, {
          "name" : "Content-Length",
          "value" : "65"
        } ],
        "content" : {
          "size" : 65,
          "mimeType" : "application/json; charset=utf-8",
          "text" : "{\"message\":\"Name jenny.maldonado.tx@gmail.com is already taken.\"}",
          "comment" : ""
        },
        "redirectURL" : "",
        "headersSize" : 897,
        "bodySize" : 65,
        "comment" : ""
      },
      "cache" : { },
      "timings" : {
        "comment" : "",
        "ssl" : -1,
        "wait" : 3281,
        "receive" : 5,
        "send" : 3,
        "connect" : -1,
        "blocked" : -1,
        "dns" : -1
      },
      "serverIPAddress" : "127.0.0.1",
      "comment" : "",
      "_katalonRequestInformation" : {
        "name" : "1",
        "testObjectId" : "Object Repository/VoPro/Account/api_admin_v1_users",
        "harId" : "59e5abbe-5be3-4258-9f3f-f533337d6f01"
      },
      "time" : 3289
    } ],
    "comment" : ""
  }
}