{
  "log" : {
    "version" : "1.2",
    "creator" : {
      "name" : "BrowserMob Proxy",
      "version" : "2.1.5",
      "comment" : ""
    },
    "pages" : [ {
      "id" : "Page 0",
      "startedDateTime" : "2019-03-29T14:37:54.019Z",
      "title" : "Page 0",
      "pageTimings" : {
        "onLoad" : 1265,
        "comment" : ""
      },
      "comment" : ""
    } ],
    "entries" : [ {
      "pageref" : "Page 0",
      "startedDateTime" : "2019-03-29T14:37:54.019Z",
      "request" : {
        "method" : "PUT",
        "url" : "http://localhost:10520/WebAPI/api/admin/v1/users/39?",
        "httpVersion" : "HTTP/1.1",
        "cookies" : [ ],
        "headers" : [ {
          "name" : "User-Agent",
          "value" : "Katalon Studio"
        }, {
          "name" : "Content-Type",
          "value" : "application/x-www-form-urlencoded"
        }, {
          "name" : "Authorization",
          "value" : "Bearer eyJ0eXAiOiJKV1QiLCJhbGciOiJIUzI1NiJ9.eyJ1bmlxdWVfbmFtZSI6ImFkbWluIiwicm9sZSI6InVzZXIiLCJzdWIiOiJhZG1pbiIsImlzcyI6IkNyb3BNZXRyaWNzIiwiYXVkIjoiYWxsIiwiZXhwIjoxNTUzODc0MTc0LCJuYmYiOjE1NTM4NzAyNzR9.37EzLDD1IimUkvUPf_pwRQDmNp74dWleFmLLsqFG3C0"
        }, {
          "name" : "Host",
          "value" : "localhost:10520"
        }, {
          "name" : "Accept",
          "value" : "text/html, image/gif, image/jpeg, *; q=.2, */*; q=.2"
        }, {
          "name" : "Proxy-Connection",
          "value" : "keep-alive"
        }, {
          "name" : "Content-Length",
          "value" : "304"
        } ],
        "queryString" : [ ],
        "postData" : {
          "mimeType" : "application/x-www-form-urlencoded",
          "params" : [ {
            "name" : "password",
            "value" : "cropmetrics",
            "comment" : ""
          }, {
            "name" : "email",
            "value" : "cropmetricsvo.countrysymbonls@gmail.com",
            "comment" : ""
          }, {
            "name" : "fullname",
            "value" : "test validation",
            "comment" : ""
          }, {
            "name" : "phone",
            "value" : "123",
            "comment" : ""
          }, {
            "name" : "dealer",
            "value" : "x",
            "comment" : ""
          }, {
            "name" : "addressLine1",
            "value" : "address line 1 test validation",
            "comment" : ""
          }, {
            "name" : "addressLine2",
            "value" : "address line 2 test validation",
            "comment" : ""
          }, {
            "name" : "town",
            "value" : "townValidation",
            "comment" : ""
          }, {
            "name" : "state",
            "value" : "stateValidation",
            "comment" : ""
          }, {
            "name" : "zip",
            "value" : "123457",
            "comment" : ""
          }, {
            "name" : "country",
            "value" : "!!!!",
            "comment" : ""
          }, {
            "name" : "roles",
            "value" : "Client",
            "comment" : ""
          }, {
            "name" : "userProfileId",
            "value" : "39",
            "comment" : ""
          } ],
          "comment" : ""
        },
        "headersSize" : 545,
        "bodySize" : 304,
        "comment" : ""
      },
      "response" : {
        "status" : 200,
        "statusText" : "OK",
        "httpVersion" : "HTTP/1.1",
        "cookies" : [ {
          "name" : ".ASPROLES",
          "value" : "NbbOOXqLO1uVZCy6-tk9-721mCKUd4ouLkhYoqHzrd4CROlQw2Sr5ob7D7DKGn2cHRYlVH9LscY3Mve-pXlmh2tQVwiI0bjgPIlqYJzwOBJEgCSL-8_DOoRFQ2wF6Q_xH0ayYqIMwo9hOhbeSIOUwb5ZSbpBPkTG_nyqkZQ1m1BVT1Q-YYwzgwBbPcKxuURLgrkSgML76gdEKERVbnTUjregeeQUqPm5jLQnWWXPe_UJXJP0aHKULTWAuGNBZZ2pDbvK9VCUOuvrr37QMYlJmoBalPHTnj2mgxE6bRYUVquS0NQSahE4wuUzg44SKPpq30t-x_Tj3iQM5incQdn3l0W2LljG1jj0_L9126OWagwSEmXJs1NOX2F5xegSJyudRxEx1Mi1x-Ucf4BS2euYJTrrS0gBnB1kYnssMNLMKySkuoEumCOifHg1i1En2RwxUrHH4uMjtg-PCwBzW2wOJvkcx7wjkHGD-BUOI5WoFrhIVvpn0",
          "path" : "/",
          "httpOnly" : true,
          "secure" : false,
          "comment" : ""
        } ],
        "headers" : [ {
          "name" : "Cache-Control",
          "value" : "private"
        }, {
          "name" : "Server",
          "value" : "Microsoft-IIS/10.0"
        }, {
          "name" : "Set-Cookie",
          "value" : ".ASPROLES=NbbOOXqLO1uVZCy6-tk9-721mCKUd4ouLkhYoqHzrd4CROlQw2Sr5ob7D7DKGn2cHRYlVH9LscY3Mve-pXlmh2tQVwiI0bjgPIlqYJzwOBJEgCSL-8_DOoRFQ2wF6Q_xH0ayYqIMwo9hOhbeSIOUwb5ZSbpBPkTG_nyqkZQ1m1BVT1Q-YYwzgwBbPcKxuURLgrkSgML76gdEKERVbnTUjregeeQUqPm5jLQnWWXPe_UJXJP0aHKULTWAuGNBZZ2pDbvK9VCUOuvrr37QMYlJmoBalPHTnj2mgxE6bRYUVquS0NQSahE4wuUzg44SKPpq30t-x_Tj3iQM5incQdn3l0W2LljG1jj0_L9126OWagwSEmXJs1NOX2F5xegSJyudRxEx1Mi1x-Ucf4BS2euYJTrrS0gBnB1kYnssMNLMKySkuoEumCOifHg1i1En2RwxUrHH4uMjtg-PCwBzW2wOJvkcx7wjkHGD-BUOI5WoFrhIVvpn0; path=/; HttpOnly"
        }, {
          "name" : "X-SourceFiles",
          "value" : "=?UTF-8?B?RDpcVmlydHVhbE9wdGltaXplci1SZWZhY3RvcmluZ1xDcm9wTWV0cmljcy5Wby5BcGlcQ3JvcE1ldHJpY3MuVm8uQXBpXGFwaVxhZG1pblx2MVx1c2Vyc1wzOQ==?="
        }, {
          "name" : "X-Powered-By",
          "value" : "ASP.NET"
        }, {
          "name" : "Date",
          "value" : "Fri, 29 Mar 2019 14:37:55 GMT"
        }, {
          "name" : "Content-Length",
          "value" : "0"
        } ],
        "content" : {
          "size" : 0,
          "mimeType" : "",
          "text" : "",
          "encoding" : "base64",
          "comment" : ""
        },
        "redirectURL" : "",
        "headersSize" : 844,
        "bodySize" : 0,
        "comment" : ""
      },
      "cache" : { },
      "timings" : {
        "comment" : "",
        "ssl" : -1,
        "send" : 0,
        "connect" : -1,
        "blocked" : -1,
        "dns" : -1,
        "wait" : 1267,
        "receive" : 0
      },
      "serverIPAddress" : "127.0.0.1",
      "comment" : "",
      "_katalonRequestInformation" : {
        "name" : "67",
        "testObjectId" : "Object Repository/VoPro/Account/api_admin_v1_users_userprofileid",
        "harId" : "a44fb964-2709-4f34-831b-d02e391e8a30"
      },
      "time" : 1268
    } ],
    "comment" : ""
  }
}