{
  "log" : {
    "version" : "1.2",
    "creator" : {
      "name" : "BrowserMob Proxy",
      "version" : "2.1.5",
      "comment" : ""
    },
    "pages" : [ {
      "id" : "Page 0",
      "startedDateTime" : "2019-03-27T19:54:02.057Z",
      "title" : "Page 0",
      "pageTimings" : {
        "onLoad" : 1300,
        "comment" : ""
      },
      "comment" : ""
    } ],
    "entries" : [ {
      "pageref" : "Page 0",
      "startedDateTime" : "2019-03-27T19:54:02.057Z",
      "request" : {
        "method" : "POST",
        "url" : "http://localhost:10520/WebAPI/api/Account/AdministrativeRegister/?",
        "httpVersion" : "HTTP/1.1",
        "cookies" : [ ],
        "headers" : [ {
          "name" : "User-Agent",
          "value" : "Katalon Studio"
        }, {
          "name" : "Content-Type",
          "value" : "application/x-www-form-urlencoded"
        }, {
          "name" : "Authorization",
          "value" : "Bearer eyJ0eXAiOiJKV1QiLCJhbGciOiJIUzI1NiJ9.eyJ1bmlxdWVfbmFtZSI6ImFkbWluIiwicm9sZSI6InVzZXIiLCJzdWIiOiJhZG1pbiIsImlzcyI6IkNyb3BNZXRyaWNzIiwiYXVkIjoiYWxsIiwiZXhwIjoxNTUzNzIwMzQyLCJuYmYiOjE1NTM3MTY0NDJ9.emXHkZY5fXTizujLB_GYm3g-vvwdz-j_88fY1GAkUvk"
        }, {
          "name" : "Host",
          "value" : "localhost:10520"
        }, {
          "name" : "Accept",
          "value" : "text/html, image/gif, image/jpeg, *; q=.2, */*; q=.2"
        }, {
          "name" : "Proxy-Connection",
          "value" : "keep-alive"
        }, {
          "name" : "Content-Length",
          "value" : "388"
        } ],
        "queryString" : [ ],
        "postData" : {
          "mimeType" : "application/x-www-form-urlencoded",
          "params" : [ {
            "name" : "username",
            "value" : "kuserzipsymbol",
            "comment" : ""
          }, {
            "name" : "password",
            "value" : "cropmetrics",
            "comment" : ""
          }, {
            "name" : "confirmPassword",
            "value" : "cropmetrics",
            "comment" : ""
          }, {
            "name" : "email",
            "value" : "cropmetricsvo@gmail.com",
            "comment" : ""
          }, {
            "name" : "fullname",
            "value" : "test validation",
            "comment" : ""
          }, {
            "name" : "phone",
            "value" : "123",
            "comment" : ""
          }, {
            "name" : "dealer",
            "value" : "x",
            "comment" : ""
          }, {
            "name" : "addressLine1",
            "value" : "address line 1 test validation",
            "comment" : ""
          }, {
            "name" : "addressLine2",
            "value" : "address line 12 test validation",
            "comment" : ""
          }, {
            "name" : "town",
            "value" : "townValidation",
            "comment" : ""
          }, {
            "name" : "state",
            "value" : "stateValidation",
            "comment" : ""
          }, {
            "name" : "zip",
            "value" : "!@#$%^&*(",
            "comment" : ""
          }, {
            "name" : "country",
            "value" : "countryValidation",
            "comment" : ""
          }, {
            "name" : "roles",
            "value" : "Client",
            "comment" : ""
          }, {
            "name" : "modifierUsername",
            "value" : "admin",
            "comment" : ""
          }, {
            "name" : "modifierUserId",
            "value" : "1",
            "comment" : ""
          } ],
          "comment" : ""
        },
        "headersSize" : 560,
        "bodySize" : 388,
        "comment" : ""
      },
      "response" : {
        "status" : 200,
        "statusText" : "OK",
        "httpVersion" : "HTTP/1.1",
        "cookies" : [ {
          "name" : ".ASPROLES",
          "value" : "m_Ckg3SWY43Bog3Zz12vS_coK-dkIfU7Z0Mbp8IuTbQoEg1SFKo3_ShsXN7j3oxA8t44ucTMXSHaHodymeFTO0fu2QpDS6NXr-2wz6jP92e7A32k3dCAwFWirKV0kr8NxU1W-iLRAf5IeuKgsnKYS9F0BGTKkCEx6x8i8Lc8zVCsOw-Xrhz7PwgKTXSgLtBp2HTS8M_S4CR3kXEwTl3XgSAiTMw2LOyQ5vwBJ1YENaGZQvgd69tUMkXagPhHMr0UzzCk0yZUkx4pSl-4JTP3AsV6JqLWN1IJ186NkR5MWH2y7QLaOHyhXr0ECSw-OE-2KDkTGbzzpKjRy_5Fo8fZC8WacUMCMGjNaeSuKfoxqESc5_QW1yYCE-u5XJ2cbqPWbimUBb45wKYbwVf54bOZL4ytRSg3ZMzDKoQAaR-v8o6VUOUz5b9INi7lG1TGScDrYHXnKrjmD56mZOQ8va6SgUZdIW_6dbDXwo-4iLQmy4T0WXDU0",
          "path" : "/",
          "httpOnly" : true,
          "secure" : false,
          "comment" : ""
        } ],
        "headers" : [ {
          "name" : "Cache-Control",
          "value" : "private"
        }, {
          "name" : "Content-Type",
          "value" : "application/json; charset=utf-8"
        }, {
          "name" : "Server",
          "value" : "Microsoft-IIS/10.0"
        }, {
          "name" : "Set-Cookie",
          "value" : ".ASPROLES=m_Ckg3SWY43Bog3Zz12vS_coK-dkIfU7Z0Mbp8IuTbQoEg1SFKo3_ShsXN7j3oxA8t44ucTMXSHaHodymeFTO0fu2QpDS6NXr-2wz6jP92e7A32k3dCAwFWirKV0kr8NxU1W-iLRAf5IeuKgsnKYS9F0BGTKkCEx6x8i8Lc8zVCsOw-Xrhz7PwgKTXSgLtBp2HTS8M_S4CR3kXEwTl3XgSAiTMw2LOyQ5vwBJ1YENaGZQvgd69tUMkXagPhHMr0UzzCk0yZUkx4pSl-4JTP3AsV6JqLWN1IJ186NkR5MWH2y7QLaOHyhXr0ECSw-OE-2KDkTGbzzpKjRy_5Fo8fZC8WacUMCMGjNaeSuKfoxqESc5_QW1yYCE-u5XJ2cbqPWbimUBb45wKYbwVf54bOZL4ytRSg3ZMzDKoQAaR-v8o6VUOUz5b9INi7lG1TGScDrYHXnKrjmD56mZOQ8va6SgUZdIW_6dbDXwo-4iLQmy4T0WXDU0; path=/; HttpOnly"
        }, {
          "name" : "X-SourceFiles",
          "value" : "=?UTF-8?B?RDpcVmlydHVhbE9wdGltaXplci1SZWZhY3RvcmluZ1xDcm9wTWV0cmljcy5Wby5BcGlcQ3JvcE1ldHJpY3MuVm8uQXBpXGFwaVxBY2NvdW50XEFkbWluaXN0cmF0aXZlUmVnaXN0ZXJc?="
        }, {
          "name" : "X-Powered-By",
          "value" : "ASP.NET"
        }, {
          "name" : "Date",
          "value" : "Wed, 27 Mar 2019 19:54:03 GMT"
        }, {
          "name" : "Content-Length",
          "value" : "9"
        } ],
        "content" : {
          "size" : 9,
          "mimeType" : "application/json; charset=utf-8",
          "text" : "{\"id\":34}",
          "comment" : ""
        },
        "redirectURL" : "",
        "headersSize" : 907,
        "bodySize" : 9,
        "comment" : ""
      },
      "cache" : { },
      "timings" : {
        "comment" : "",
        "ssl" : -1,
        "send" : 0,
        "receive" : 0,
        "wait" : 1290,
        "connect" : -1,
        "blocked" : -1,
        "dns" : -1
      },
      "serverIPAddress" : "127.0.0.1",
      "comment" : "",
      "_katalonRequestInformation" : {
        "name" : "79",
        "testObjectId" : "Object Repository/VoPro/Account/AdministrativeRegister",
        "harId" : "7c80ff9e-ce06-46e9-8350-c8ae513efab5"
      },
      "time" : 1291
    } ],
    "comment" : ""
  }
}