{
  "log" : {
    "version" : "1.2",
    "creator" : {
      "name" : "BrowserMob Proxy",
      "version" : "2.1.5",
      "comment" : ""
    },
    "pages" : [ {
      "id" : "Page 0",
      "startedDateTime" : "2019-04-09T20:47:49.815Z",
      "title" : "Page 0",
      "pageTimings" : {
        "onLoad" : 3109,
        "comment" : ""
      },
      "comment" : ""
    } ],
    "entries" : [ {
      "pageref" : "Page 0",
      "startedDateTime" : "2019-04-09T20:47:49.817Z",
      "request" : {
        "method" : "POST",
        "url" : "http://localhost:10520/WebAPI/api/mobile/v1/fields?",
        "httpVersion" : "HTTP/1.1",
        "cookies" : [ ],
        "headers" : [ {
          "name" : "User-Agent",
          "value" : "Katalon Studio"
        }, {
          "name" : "Content-Type",
          "value" : "application/json"
        }, {
          "name" : "Authorization",
          "value" : "Bearer eyJ0eXAiOiJKV1QiLCJhbGciOiJIUzI1NiJ9.eyJ1bmlxdWVfbmFtZSI6Implbm55Lm1hbGRvbmFkby50eDFAZ21haWwuY29tIiwicm9sZSI6InVzZXIiLCJzdWIiOiJqZW5ueS5tYWxkb25hZG8udHgxQGdtYWlsLmNvbSIsImlzcyI6IkNyb3BNZXRyaWNzIiwiYXVkIjoiYWxsIiwiZXhwIjoxNTU0ODQ2NzY5LCJuYmYiOjE1NTQ4NDI4Njl9.V1P56QIGylyIAWyKmXISdW6IsuKO9x2i0PBD-pBV1lw"
        }, {
          "name" : "Host",
          "value" : "localhost:10520"
        }, {
          "name" : "Accept",
          "value" : "text/html, image/gif, image/jpeg, *; q=.2, */*; q=.2"
        }, {
          "name" : "Proxy-Connection",
          "value" : "keep-alive"
        }, {
          "name" : "Content-Length",
          "value" : "102"
        } ],
        "queryString" : [ ],
        "postData" : {
          "mimeType" : "application/json",
          "text" : "{\"field\":{\"farm_id\":7,\"name\":\"Field whit empty boundary\",\"boundary\":{\"boundaries\":[{\"boundary\":{}}]}}}",
          "comment" : ""
        },
        "headersSize" : 592,
        "bodySize" : 102,
        "comment" : ""
      },
      "response" : {
        "status" : 400,
        "statusText" : "Bad Request",
        "httpVersion" : "HTTP/1.1",
        "cookies" : [ {
          "name" : ".ASPROLES",
          "value" : "523RZmTH93OWK_b8gGVCou0436YjakjSCUN1gn3WXFUe6osNbmYQx3xHkl1wedOQ_RffaJpRp0YlUn_YYOsc9fvDi-VGCoFlWG7VvakolRiE1wz_8J9rxddtVhC01xb1AY-to-JoZ4X5b8kUaNZtRkGGUyp9F2_FqT0QIQ9HvHsb9f-PLxpPVUjiBeMxG3dG5ck-DsyO7V_0tqbrzhDHscA8fkSUU_2EsqukxnLVn45S5Tzl_iLh8hBHPD2Jumg-ofe5iyM1U20Zs3KILjeHKGM94TUqMaWGBpe8rmTCNF3iSBgpisodML5xj-plxJI1UD3cg0k0Qnhs-2zoyGuQnm98rxWbPlfki909FuCWVPMnfX-ucmXSv8TU4-aJRfPXIOwvmgV2oaI0bLqsDY5Q6AXoIrnRzsXBsX81JryKU5wa7Z9OhvUWpHgy3hfFgdB3eQXKMNtE5ufcOT9L9HjrF3xWZI1bWwqgDvQMvx2-W7M5w8lNrjs-LSYlJkLNBIPloGjnVU_yhJn73f98DQe98Kj40_81",
          "path" : "/",
          "httpOnly" : true,
          "secure" : false,
          "comment" : ""
        } ],
        "headers" : [ {
          "name" : "Cache-Control",
          "value" : "private"
        }, {
          "name" : "Content-Type",
          "value" : "application/json; charset=utf-8"
        }, {
          "name" : "Server",
          "value" : "Microsoft-IIS/10.0"
        }, {
          "name" : "Set-Cookie",
          "value" : ".ASPROLES=523RZmTH93OWK_b8gGVCou0436YjakjSCUN1gn3WXFUe6osNbmYQx3xHkl1wedOQ_RffaJpRp0YlUn_YYOsc9fvDi-VGCoFlWG7VvakolRiE1wz_8J9rxddtVhC01xb1AY-to-JoZ4X5b8kUaNZtRkGGUyp9F2_FqT0QIQ9HvHsb9f-PLxpPVUjiBeMxG3dG5ck-DsyO7V_0tqbrzhDHscA8fkSUU_2EsqukxnLVn45S5Tzl_iLh8hBHPD2Jumg-ofe5iyM1U20Zs3KILjeHKGM94TUqMaWGBpe8rmTCNF3iSBgpisodML5xj-plxJI1UD3cg0k0Qnhs-2zoyGuQnm98rxWbPlfki909FuCWVPMnfX-ucmXSv8TU4-aJRfPXIOwvmgV2oaI0bLqsDY5Q6AXoIrnRzsXBsX81JryKU5wa7Z9OhvUWpHgy3hfFgdB3eQXKMNtE5ufcOT9L9HjrF3xWZI1bWwqgDvQMvx2-W7M5w8lNrjs-LSYlJkLNBIPloGjnVU_yhJn73f98DQe98Kj40_81; path=/; HttpOnly"
        }, {
          "name" : "X-SourceFiles",
          "value" : "=?UTF-8?B?RDpcVmlydHVhbE9wdGltaXplci1SZWZhY3RvcmluZ1xDcm9wTWV0cmljcy5Wby5BcGlcQ3JvcE1ldHJpY3MuVm8uQXBpXGFwaVxtb2JpbGVcdjFcZmllbGRz?="
        }, {
          "name" : "X-Powered-By",
          "value" : "ASP.NET"
        }, {
          "name" : "Date",
          "value" : "Tue, 09 Apr 2019 20:47:52 GMT"
        }, {
          "name" : "Content-Length",
          "value" : "59"
        } ],
        "content" : {
          "size" : 59,
          "mimeType" : "application/json; charset=utf-8",
          "text" : "{\"message\":\"The Boundary is not a valid geojson geometry.\"}",
          "comment" : ""
        },
        "redirectURL" : "",
        "headersSize" : 940,
        "bodySize" : 59,
        "comment" : ""
      },
      "cache" : { },
      "timings" : {
        "comment" : "",
        "ssl" : -1,
        "receive" : 1,
        "dns" : -1,
        "send" : 0,
        "blocked" : -1,
        "connect" : -1,
        "wait" : 3102
      },
      "serverIPAddress" : "127.0.0.1",
      "comment" : "",
      "_katalonRequestInformation" : {
        "name" : "86",
        "testObjectId" : "Object Repository/VoGrow/Field/FieldPost",
        "harId" : "fcc756ef-b91c-46a9-bd8a-04584c868423"
      },
      "time" : 3104
    } ],
    "comment" : ""
  }
}