{
  "log" : {
    "version" : "1.2",
    "creator" : {
      "name" : "BrowserMob Proxy",
      "version" : "2.1.5",
      "comment" : ""
    },
    "pages" : [ {
      "id" : "Page 0",
      "startedDateTime" : "2019-03-29T22:26:46.585Z",
      "title" : "Page 0",
      "pageTimings" : {
        "onLoad" : 1911,
        "comment" : ""
      },
      "comment" : ""
    } ],
    "entries" : [ {
      "pageref" : "Page 0",
      "startedDateTime" : "2019-03-29T22:26:46.586Z",
      "request" : {
        "method" : "POST",
        "url" : "http://localhost:10520/WebAPI/api/admin/v1/users/?",
        "httpVersion" : "HTTP/1.1",
        "cookies" : [ ],
        "headers" : [ {
          "name" : "User-Agent",
          "value" : "Katalon Studio"
        }, {
          "name" : "Content-Type",
          "value" : "application/x-www-form-urlencoded"
        }, {
          "name" : "Authorization",
          "value" : "Bearer eyJ0eXAiOiJKV1QiLCJhbGciOiJIUzI1NiJ9.eyJ1bmlxdWVfbmFtZSI6ImFkbWluIiwicm9sZSI6InVzZXIiLCJzdWIiOiJhZG1pbiIsImlzcyI6IkNyb3BNZXRyaWNzIiwiYXVkIjoiYWxsIiwiZXhwIjoxNTUzOTAyMzA2LCJuYmYiOjE1NTM4OTg0MDZ9.fzVmKQ7-uyp1q6Nu3COmbkm7P9gJQuMeDJOlinKDqes"
        }, {
          "name" : "Host",
          "value" : "localhost:10520"
        }, {
          "name" : "Accept",
          "value" : "text/html, image/gif, image/jpeg, *; q=.2, */*; q=.2"
        }, {
          "name" : "Proxy-Connection",
          "value" : "keep-alive"
        }, {
          "name" : "Content-Length",
          "value" : "280"
        } ],
        "queryString" : [ ],
        "postData" : {
          "mimeType" : "application/x-www-form-urlencoded",
          "params" : [ {
            "name" : "password",
            "value" : "cropmetrics",
            "comment" : ""
          }, {
            "name" : "email",
            "value" : "cropmetricsvo.addressline1symbols@gmail.com",
            "comment" : ""
          }, {
            "name" : "fullname",
            "value" : "x",
            "comment" : ""
          }, {
            "name" : "phone",
            "value" : "1",
            "comment" : ""
          }, {
            "name" : "dealer",
            "value" : "xx",
            "comment" : ""
          }, {
            "name" : "addressLine1",
            "value" : "!@#$%^&*",
            "comment" : ""
          }, {
            "name" : "addressLine2",
            "value" : "address line 2 test validation",
            "comment" : ""
          }, {
            "name" : "town",
            "value" : "townValidation",
            "comment" : ""
          }, {
            "name" : "state",
            "value" : "stateValidation",
            "comment" : ""
          }, {
            "name" : "zip",
            "value" : "zipValidation",
            "comment" : ""
          }, {
            "name" : "country",
            "value" : "countryValidation",
            "comment" : ""
          }, {
            "name" : "roles",
            "value" : "Client",
            "comment" : ""
          } ],
          "comment" : ""
        },
        "headersSize" : 544,
        "bodySize" : 280,
        "comment" : ""
      },
      "response" : {
        "status" : 200,
        "statusText" : "OK",
        "httpVersion" : "HTTP/1.1",
        "cookies" : [ {
          "name" : ".ASPROLES",
          "value" : "l911gvPyjLFP2ACMrLxmu7Z0Dqwg0YxLpD-FHGy3KsU3wDC-iq2BhFQe6YxkW-JGNmNAvxOSoVWTpGwA8isme5e5dhRDp383BfAXgNDw9o2M4gNOkyr7wEuxR351sOw4Q29wRjg4GW0IalIf5D_AYK5tFXs2nJ1atKypX1HCBY3vqdAkcJ-VaboMl8QaMo9eecwzc6KJaRfwC16YNHzPKTHxVKEgrW1kPBBH6h4hHAqDWVntw0e6p9fBP3OsZMvEeJgbMTcIJTKqj_BSM21bNCi_mWViCTdkgl_Cm7JvScwv5pXU4drQT_jduCdhmORIQJJVQ69q-Ebf3ltpAYIMQ_EWbKaPKp_7zbVxtxwcnPT6e0p1EdDTHrGOiM_uk0nGJePkl4lre4PRWktg2V23sRTIPyg43c1puNY_cUlNKnbOaEx9n0P3qWE1T4PczaTpPO83t5a3k72H0WOd7jyOHjL7TnS4Bth8FTUS1IvXnIG7VTOY0",
          "path" : "/",
          "httpOnly" : true,
          "secure" : false,
          "comment" : ""
        } ],
        "headers" : [ {
          "name" : "Cache-Control",
          "value" : "private"
        }, {
          "name" : "Content-Type",
          "value" : "application/json; charset=utf-8"
        }, {
          "name" : "Server",
          "value" : "Microsoft-IIS/10.0"
        }, {
          "name" : "Set-Cookie",
          "value" : ".ASPROLES=l911gvPyjLFP2ACMrLxmu7Z0Dqwg0YxLpD-FHGy3KsU3wDC-iq2BhFQe6YxkW-JGNmNAvxOSoVWTpGwA8isme5e5dhRDp383BfAXgNDw9o2M4gNOkyr7wEuxR351sOw4Q29wRjg4GW0IalIf5D_AYK5tFXs2nJ1atKypX1HCBY3vqdAkcJ-VaboMl8QaMo9eecwzc6KJaRfwC16YNHzPKTHxVKEgrW1kPBBH6h4hHAqDWVntw0e6p9fBP3OsZMvEeJgbMTcIJTKqj_BSM21bNCi_mWViCTdkgl_Cm7JvScwv5pXU4drQT_jduCdhmORIQJJVQ69q-Ebf3ltpAYIMQ_EWbKaPKp_7zbVxtxwcnPT6e0p1EdDTHrGOiM_uk0nGJePkl4lre4PRWktg2V23sRTIPyg43c1puNY_cUlNKnbOaEx9n0P3qWE1T4PczaTpPO83t5a3k72H0WOd7jyOHjL7TnS4Bth8FTUS1IvXnIG7VTOY0; path=/; HttpOnly"
        }, {
          "name" : "X-SourceFiles",
          "value" : "=?UTF-8?B?RDpcVmlydHVhbE9wdGltaXplci1SZWZhY3RvcmluZ1xDcm9wTWV0cmljcy5Wby5BcGlcQ3JvcE1ldHJpY3MuVm8uQXBpXGFwaVxhZG1pblx2MVx1c2Vyc1w=?="
        }, {
          "name" : "X-Powered-By",
          "value" : "ASP.NET"
        }, {
          "name" : "Date",
          "value" : "Fri, 29 Mar 2019 22:26:48 GMT"
        }, {
          "name" : "Content-Length",
          "value" : "9"
        } ],
        "content" : {
          "size" : 9,
          "mimeType" : "application/json; charset=utf-8",
          "text" : "{\"id\":22}",
          "comment" : ""
        },
        "redirectURL" : "",
        "headersSize" : 887,
        "bodySize" : 9,
        "comment" : ""
      },
      "cache" : { },
      "timings" : {
        "comment" : "",
        "ssl" : -1,
        "wait" : 1906,
        "send" : 0,
        "receive" : 0,
        "dns" : -1,
        "connect" : -1,
        "blocked" : -1
      },
      "serverIPAddress" : "127.0.0.1",
      "comment" : "",
      "_katalonRequestInformation" : {
        "name" : "65",
        "testObjectId" : "Object Repository/VoPro/Account/api_admin_v1_users",
        "harId" : "ba66b737-ed77-4cdc-8d52-12fafcb8a0a1"
      },
      "time" : 1907
    } ],
    "comment" : ""
  }
}