{
  "log" : {
    "version" : "1.2",
    "creator" : {
      "name" : "BrowserMob Proxy",
      "version" : "2.1.5",
      "comment" : ""
    },
    "pages" : [ {
      "id" : "Page 0",
      "startedDateTime" : "2019-03-29T13:15:13.561Z",
      "title" : "Page 0",
      "pageTimings" : {
        "onLoad" : 17693,
        "comment" : ""
      },
      "comment" : ""
    } ],
    "entries" : [ {
      "pageref" : "Page 0",
      "startedDateTime" : "2019-03-29T13:15:13.576Z",
      "request" : {
        "method" : "POST",
        "url" : "http://localhost:10520/WebAPI/api/admin/v1/users/?",
        "httpVersion" : "HTTP/1.1",
        "cookies" : [ ],
        "headers" : [ {
          "name" : "User-Agent",
          "value" : "Katalon Studio"
        }, {
          "name" : "Content-Type",
          "value" : "application/x-www-form-urlencoded"
        }, {
          "name" : "Authorization",
          "value" : "Bearer eyJ0eXAiOiJKV1QiLCJhbGciOiJIUzI1NiJ9.eyJ1bmlxdWVfbmFtZSI6ImFkbWluIiwicm9sZSI6InVzZXIiLCJzdWIiOiJhZG1pbiIsImlzcyI6IkNyb3BNZXRyaWNzIiwiYXVkIjoiYWxsIiwiZXhwIjoxNTUzODY5MjEzLCJuYmYiOjE1NTM4NjUzMTN9.BQ9ObnfNnupntMFqRjInxiBqeFSvQCgpPYdyC8YdjoA"
        }, {
          "name" : "Host",
          "value" : "localhost:10520"
        }, {
          "name" : "Accept",
          "value" : "text/html, image/gif, image/jpeg, *; q=.2, */*; q=.2"
        }, {
          "name" : "Proxy-Connection",
          "value" : "keep-alive"
        }, {
          "name" : "Content-Length",
          "value" : "305"
        } ],
        "queryString" : [ ],
        "postData" : {
          "mimeType" : "application/x-www-form-urlencoded",
          "params" : [ {
            "name" : "password",
            "value" : "",
            "comment" : ""
          }, {
            "name" : "email",
            "value" : "cropmetricsvo.no.password@gmail.com",
            "comment" : ""
          }, {
            "name" : "fullname",
            "value" : "test validation",
            "comment" : ""
          }, {
            "name" : "phone",
            "value" : "123",
            "comment" : ""
          }, {
            "name" : "dealer",
            "value" : "dealer test validation",
            "comment" : ""
          }, {
            "name" : "addressLine1",
            "value" : "address line 1 test validation",
            "comment" : ""
          }, {
            "name" : "addressLine2",
            "value" : "address line 2 test validation",
            "comment" : ""
          }, {
            "name" : "town",
            "value" : "townValidation",
            "comment" : ""
          }, {
            "name" : "state",
            "value" : "stateValidation",
            "comment" : ""
          }, {
            "name" : "zip",
            "value" : "zipValidation",
            "comment" : ""
          }, {
            "name" : "country",
            "value" : "countryValidation",
            "comment" : ""
          }, {
            "name" : "roles",
            "value" : "Client",
            "comment" : ""
          } ],
          "comment" : ""
        },
        "headersSize" : 544,
        "bodySize" : 305,
        "comment" : ""
      },
      "response" : {
        "status" : 500,
        "statusText" : "Internal Server Error",
        "httpVersion" : "HTTP/1.1",
        "cookies" : [ {
          "name" : ".ASPROLES",
          "value" : "YvbGYp55z9mbi6ZAYuAWGFkgECxtbV1cqU6rYpNFMCgr7lCuWSj8mnFjMj_w1pHO0ojOunfMd0qQrv2krsgkrIHUize4j3u-wE0PzmMYM9NAi0u6ehwIrnr_08-HdR48lLodBJ4-M6o-mhB7-9mVB8SJAaT5u3MkPbueYVFjPheN8ad-8osJT6i6ooH85dEsIPSqnLcTbdKieE8CQm6gQTOGumIt6lJDvzdX5c9KULgk8txFJCo_PJxmjE1umRxXzOc5huvAGz4LMifbPsBS10kbBMkclF1Yav8clYc5p75SuT8dUK7mvDhG5IAeEN0-SX1mZfkRfCGjDs09TdAV8Vmnot11HTKqVmjrAWuWDQwni5hHpDai8iluRvZABxB6YItnYmV96zGcz4_z5BCpXrA8zIUgD0TA2TbIUbDuehtR5v_i3HoSGKCn7CfIa8oLOCUNBNXxJafdasg4bVHgMuHOK1kZ1ABTuzCAC2pKIWCdNG_D0",
          "path" : "/",
          "httpOnly" : true,
          "secure" : false,
          "comment" : ""
        } ],
        "headers" : [ {
          "name" : "Cache-Control",
          "value" : "private"
        }, {
          "name" : "Content-Type",
          "value" : "application/json; charset=utf-8"
        }, {
          "name" : "Server",
          "value" : "Microsoft-IIS/10.0"
        }, {
          "name" : "Set-Cookie",
          "value" : ".ASPROLES=YvbGYp55z9mbi6ZAYuAWGFkgECxtbV1cqU6rYpNFMCgr7lCuWSj8mnFjMj_w1pHO0ojOunfMd0qQrv2krsgkrIHUize4j3u-wE0PzmMYM9NAi0u6ehwIrnr_08-HdR48lLodBJ4-M6o-mhB7-9mVB8SJAaT5u3MkPbueYVFjPheN8ad-8osJT6i6ooH85dEsIPSqnLcTbdKieE8CQm6gQTOGumIt6lJDvzdX5c9KULgk8txFJCo_PJxmjE1umRxXzOc5huvAGz4LMifbPsBS10kbBMkclF1Yav8clYc5p75SuT8dUK7mvDhG5IAeEN0-SX1mZfkRfCGjDs09TdAV8Vmnot11HTKqVmjrAWuWDQwni5hHpDai8iluRvZABxB6YItnYmV96zGcz4_z5BCpXrA8zIUgD0TA2TbIUbDuehtR5v_i3HoSGKCn7CfIa8oLOCUNBNXxJafdasg4bVHgMuHOK1kZ1ABTuzCAC2pKIWCdNG_D0; path=/; HttpOnly"
        }, {
          "name" : "X-SourceFiles",
          "value" : "=?UTF-8?B?RDpcVmlydHVhbE9wdGltaXplci1SZWZhY3RvcmluZ1xDcm9wTWV0cmljcy5Wby5BcGlcQ3JvcE1ldHJpY3MuVm8uQXBpXGFwaVxhZG1pblx2MVx1c2Vyc1w=?="
        }, {
          "name" : "X-Powered-By",
          "value" : "ASP.NET"
        }, {
          "name" : "Date",
          "value" : "Fri, 29 Mar 2019 13:15:31 GMT"
        }, {
          "name" : "Content-Length",
          "value" : "53"
        } ],
        "content" : {
          "size" : 53,
          "mimeType" : "application/json; charset=utf-8",
          "text" : "{\"message\":\"Internal server error in the processing\"}",
          "comment" : ""
        },
        "redirectURL" : "",
        "headersSize" : 907,
        "bodySize" : 53,
        "comment" : ""
      },
      "cache" : { },
      "timings" : {
        "comment" : "",
        "ssl" : -1,
        "receive" : 1,
        "wait" : 17669,
        "send" : 1,
        "connect" : -1,
        "dns" : -1,
        "blocked" : -1
      },
      "serverIPAddress" : "127.0.0.1",
      "comment" : "",
      "_katalonRequestInformation" : {
        "name" : "5",
        "testObjectId" : "Object Repository/VoPro/Account/api_admin_v1_users",
        "harId" : "ad9731ab-1bb3-4c69-84a4-33f7f36ada7f"
      },
      "time" : 17671
    } ],
    "comment" : ""
  }
}