{
  "log" : {
    "version" : "1.2",
    "creator" : {
      "name" : "BrowserMob Proxy",
      "version" : "2.1.5",
      "comment" : ""
    },
    "pages" : [ {
      "id" : "Page 0",
      "startedDateTime" : "2019-03-26T13:20:11.820Z",
      "title" : "Page 0",
      "pageTimings" : {
        "onLoad" : 3242,
        "comment" : ""
      },
      "comment" : ""
    } ],
    "entries" : [ {
      "pageref" : "Page 0",
      "startedDateTime" : "2019-03-26T13:20:11.821Z",
      "request" : {
        "method" : "POST",
        "url" : "http://localhost:10520/WebAPI/api/Account/AdministrativeRegister/?",
        "httpVersion" : "HTTP/1.1",
        "cookies" : [ ],
        "headers" : [ {
          "name" : "User-Agent",
          "value" : "Katalon Studio"
        }, {
          "name" : "Content-Type",
          "value" : "application/x-www-form-urlencoded"
        }, {
          "name" : "Authorization",
          "value" : "Bearer eyJ0eXAiOiJKV1QiLCJhbGciOiJIUzI1NiJ9.eyJ1bmlxdWVfbmFtZSI6ImFkbWluIiwicm9sZSI6InVzZXIiLCJzdWIiOiJhZG1pbiIsImlzcyI6IkNyb3BNZXRyaWNzIiwiYXVkIjoiYWxsIiwiZXhwIjoxNTUzNjEwMzExLCJuYmYiOjE1NTM2MDY0MTF9.BrG_pc9TIKa1EDyfNgwQHnPyRCV83BA_lHsGX5T_o9g"
        }, {
          "name" : "Host",
          "value" : "localhost:10520"
        }, {
          "name" : "Accept",
          "value" : "text/html, image/gif, image/jpeg, *; q=.2, */*; q=.2"
        }, {
          "name" : "Proxy-Connection",
          "value" : "keep-alive"
        }, {
          "name" : "Content-Length",
          "value" : "382"
        } ],
        "queryString" : [ ],
        "postData" : {
          "mimeType" : "application/x-www-form-urlencoded",
          "params" : [ {
            "name" : "username",
            "value" : "kusernofullname",
            "comment" : ""
          }, {
            "name" : "password",
            "value" : "cropmetrics",
            "comment" : ""
          }, {
            "name" : "confirmPassword",
            "value" : "cropmetrics",
            "comment" : ""
          }, {
            "name" : "email",
            "value" : "cropmetricsvo@gmail.com",
            "comment" : ""
          }, {
            "name" : "fullname",
            "value" : "",
            "comment" : ""
          }, {
            "name" : "phone",
            "value" : "123",
            "comment" : ""
          }, {
            "name" : "dealer",
            "value" : "dealer test validation",
            "comment" : ""
          }, {
            "name" : "addressLine1",
            "value" : "address line 1 test validation",
            "comment" : ""
          }, {
            "name" : "addressLine2",
            "value" : "address line 1 test validation",
            "comment" : ""
          }, {
            "name" : "town",
            "value" : "townValidation",
            "comment" : ""
          }, {
            "name" : "state",
            "value" : "stateValidation",
            "comment" : ""
          }, {
            "name" : "zip",
            "value" : "zipValidation",
            "comment" : ""
          }, {
            "name" : "country",
            "value" : "countryValidation",
            "comment" : ""
          }, {
            "name" : "roles",
            "value" : "Client",
            "comment" : ""
          }, {
            "name" : "modifierUsername",
            "value" : "admin",
            "comment" : ""
          }, {
            "name" : "modifierUserId",
            "value" : "1",
            "comment" : ""
          } ],
          "comment" : ""
        },
        "headersSize" : 560,
        "bodySize" : 382,
        "comment" : ""
      },
      "response" : {
        "status" : 500,
        "statusText" : "Internal Server Error",
        "httpVersion" : "HTTP/1.1",
        "cookies" : [ {
          "name" : ".ASPROLES",
          "value" : "nTm_Beu8nWgvMu7uqiyGJ9_3t8LgQC7g7G7NOUk0daG-0NSFG4l75cMs4oHEo7CUavHDzvQvVfNj8u8xF9KnKs7mQRgwvPyxdZBBm1-iy0yyRbzlUzHLeSVd_S-vmiH9-tYBFIt84Uc_WpQxjpggQXPx0WNqa1NXkO5SRcHtWRTWxwA5lgBt4pSQiE79X7u0XZDeTVDTbWOuuR7K6_c6UKM6Hpi_pKTaWtgcGggXSt-mvrFQfbCkijsM_AAJ4_ji1tvii_dS-i6hTvzjk3ya9PjXe-m7ZoPsOuMq7s-YOLCFphzJJaO1VL93CP1QdiVOH-DDVlBfs-YABAFcip2lCUCN50u3yXhCxJyNbbIoSkPT1TJG96MhllKedl1xShJcp3_OlXW43LYTBR0ckcKmaTIEgoujOpTaVNNgImwJfoGzrAmL-SVo3JZo1l55l0aeq56-J4V4xqZXQeUD5Wl8HNUsd9Ft4dYbRTYcH9mPiMtu14lz0",
          "path" : "/",
          "httpOnly" : true,
          "secure" : false,
          "comment" : ""
        } ],
        "headers" : [ {
          "name" : "Cache-Control",
          "value" : "private"
        }, {
          "name" : "Content-Type",
          "value" : "application/json; charset=utf-8"
        }, {
          "name" : "Server",
          "value" : "Microsoft-IIS/10.0"
        }, {
          "name" : "Set-Cookie",
          "value" : ".ASPROLES=nTm_Beu8nWgvMu7uqiyGJ9_3t8LgQC7g7G7NOUk0daG-0NSFG4l75cMs4oHEo7CUavHDzvQvVfNj8u8xF9KnKs7mQRgwvPyxdZBBm1-iy0yyRbzlUzHLeSVd_S-vmiH9-tYBFIt84Uc_WpQxjpggQXPx0WNqa1NXkO5SRcHtWRTWxwA5lgBt4pSQiE79X7u0XZDeTVDTbWOuuR7K6_c6UKM6Hpi_pKTaWtgcGggXSt-mvrFQfbCkijsM_AAJ4_ji1tvii_dS-i6hTvzjk3ya9PjXe-m7ZoPsOuMq7s-YOLCFphzJJaO1VL93CP1QdiVOH-DDVlBfs-YABAFcip2lCUCN50u3yXhCxJyNbbIoSkPT1TJG96MhllKedl1xShJcp3_OlXW43LYTBR0ckcKmaTIEgoujOpTaVNNgImwJfoGzrAmL-SVo3JZo1l55l0aeq56-J4V4xqZXQeUD5Wl8HNUsd9Ft4dYbRTYcH9mPiMtu14lz0; path=/; HttpOnly"
        }, {
          "name" : "X-SourceFiles",
          "value" : "=?UTF-8?B?RDpcVmlydHVhbE9wdGltaXplci1SZWZhY3RvcmluZ1xDcm9wTWV0cmljcy5Wby5BcGlcQ3JvcE1ldHJpY3MuVm8uQXBpXGFwaVxBY2NvdW50XEFkbWluaXN0cmF0aXZlUmVnaXN0ZXJc?="
        }, {
          "name" : "X-Powered-By",
          "value" : "ASP.NET"
        }, {
          "name" : "Date",
          "value" : "Tue, 26 Mar 2019 13:20:15 GMT"
        }, {
          "name" : "Content-Length",
          "value" : "53"
        } ],
        "content" : {
          "size" : 53,
          "mimeType" : "application/json; charset=utf-8",
          "text" : "{\"message\":\"Internal server error in the processing\"}",
          "comment" : ""
        },
        "redirectURL" : "",
        "headersSize" : 927,
        "bodySize" : 53,
        "comment" : ""
      },
      "cache" : { },
      "timings" : {
        "comment" : "",
        "receive" : 1,
        "wait" : 3234,
        "connect" : -1,
        "blocked" : -1,
        "dns" : -1,
        "send" : 0,
        "ssl" : -1
      },
      "serverIPAddress" : "127.0.0.1",
      "comment" : "",
      "_katalonRequestInformation" : {
        "name" : "13",
        "testObjectId" : "Object Repository/VoPro/Account/AdministrativeRegister",
        "harId" : "a2930654-e0b2-4bd7-8402-cf6f7d3643df"
      },
      "time" : 3236
    } ],
    "comment" : ""
  }
}