{
  "log" : {
    "version" : "1.2",
    "creator" : {
      "name" : "BrowserMob Proxy",
      "version" : "2.1.5",
      "comment" : ""
    },
    "pages" : [ {
      "id" : "Page 0",
      "startedDateTime" : "2019-03-29T22:30:30.661Z",
      "title" : "Page 0",
      "pageTimings" : {
        "onLoad" : 35,
        "comment" : ""
      },
      "comment" : ""
    } ],
    "entries" : [ {
      "pageref" : "Page 0",
      "startedDateTime" : "2019-03-29T22:30:30.663Z",
      "request" : {
        "method" : "PUT",
        "url" : "http://localhost:10520/WebAPI/api/admin/v1/users/22?",
        "httpVersion" : "HTTP/1.1",
        "cookies" : [ ],
        "headers" : [ {
          "name" : "User-Agent",
          "value" : "Katalon Studio"
        }, {
          "name" : "Content-Type",
          "value" : "application/x-www-form-urlencoded"
        }, {
          "name" : "Authorization",
          "value" : "Bearer eyJ0eXAiOiJKV1QiLCJhbGciOiJIUzI1NiJ9.eyJ1bmlxdWVfbmFtZSI6ImFkbWluIiwicm9sZSI6InVzZXIiLCJzdWIiOiJhZG1pbiIsImlzcyI6IkNyb3BNZXRyaWNzIiwiYXVkIjoiYWxsIiwiZXhwIjoxNTUzOTAyNTMwLCJuYmYiOjE1NTM4OTg2MzB9.L22R0GmdYgtnTLhoyzXAu0DbfwNQlLAh9wsmW9u1tDA"
        }, {
          "name" : "Host",
          "value" : "localhost:10520"
        }, {
          "name" : "Accept",
          "value" : "text/html, image/gif, image/jpeg, *; q=.2, */*; q=.2"
        }, {
          "name" : "Proxy-Connection",
          "value" : "keep-alive"
        }, {
          "name" : "Content-Length",
          "value" : "367"
        } ],
        "queryString" : [ ],
        "postData" : {
          "mimeType" : "application/x-www-form-urlencoded",
          "params" : [ {
            "name" : "password",
            "value" : "     1",
            "comment" : ""
          }, {
            "name" : "email",
            "value" : "cropmetricsvo.passwithspaces.testsss@gmail.com",
            "comment" : ""
          }, {
            "name" : "fullname",
            "value" : "test validation phone attribute as characters instead of numbers",
            "comment" : ""
          }, {
            "name" : "phone",
            "value" : "123",
            "comment" : ""
          }, {
            "name" : "dealer",
            "value" : "x",
            "comment" : ""
          }, {
            "name" : "addressLine1",
            "value" : "address line 1 test validation",
            "comment" : ""
          }, {
            "name" : "addressLine2",
            "value" : "address line 1 test validation",
            "comment" : ""
          }, {
            "name" : "town",
            "value" : "townValidation",
            "comment" : ""
          }, {
            "name" : "state",
            "value" : "stateValidation",
            "comment" : ""
          }, {
            "name" : "zip",
            "value" : "zipValidation",
            "comment" : ""
          }, {
            "name" : "country",
            "value" : "countryValidation",
            "comment" : ""
          }, {
            "name" : "roles",
            "value" : "Client",
            "comment" : ""
          }, {
            "name" : "userProfileId",
            "value" : "22",
            "comment" : ""
          } ],
          "comment" : ""
        },
        "headersSize" : 545,
        "bodySize" : 367,
        "comment" : ""
      },
      "response" : {
        "status" : 400,
        "statusText" : "Bad Request",
        "httpVersion" : "HTTP/1.1",
        "cookies" : [ {
          "name" : ".ASPROLES",
          "value" : "nP7aNccsy9VB352ELfFUrbL70mnkqnIrCkqSJgs0YjFKF-6RVRkf3mzizYPx-qtKBnD0h_Uak9VdqsOLdNa9PidCg5vA3wE7W5H8SBqvWxD9_MRVeynXIiht2o3DkcuAQoTHlQ1VJZfPwFUvPrv8bzJ6xpGN3Lmy1l7wNww2Ccjbxw_bKhiyCuYbKRoVrbfEzfKJTJCG5U0Swgedp2x-CfdnPPi4q4y7wOjBSv1faF9IduQAyI6FvYlkjZVyX0fXfliBPHc6Z5skGtFCqyWPKoMcDwY5RAEkgWr_g-FQku1WPcf4871IRrNqg7z0b4SBoyq-l8gmGtGVb5hGpNG-1oSByErMCKZM9e847hhUWf28U0dXsRRg2m8CnheOqg7iFZQjX0vf9CV10_cGnAcz0IXr9sDqBMY8-aRUEfD3fjvSdt1K8eYAIDzCQqxaGFLlCdUVl5Q4mGC-6mtbo_wCbv8SpXaQgRRAXuX3HDbX8ETAGaG30",
          "path" : "/",
          "httpOnly" : true,
          "secure" : false,
          "comment" : ""
        } ],
        "headers" : [ {
          "name" : "Cache-Control",
          "value" : "private"
        }, {
          "name" : "Content-Type",
          "value" : "application/json; charset=utf-8"
        }, {
          "name" : "Server",
          "value" : "Microsoft-IIS/10.0"
        }, {
          "name" : "Set-Cookie",
          "value" : ".ASPROLES=nP7aNccsy9VB352ELfFUrbL70mnkqnIrCkqSJgs0YjFKF-6RVRkf3mzizYPx-qtKBnD0h_Uak9VdqsOLdNa9PidCg5vA3wE7W5H8SBqvWxD9_MRVeynXIiht2o3DkcuAQoTHlQ1VJZfPwFUvPrv8bzJ6xpGN3Lmy1l7wNww2Ccjbxw_bKhiyCuYbKRoVrbfEzfKJTJCG5U0Swgedp2x-CfdnPPi4q4y7wOjBSv1faF9IduQAyI6FvYlkjZVyX0fXfliBPHc6Z5skGtFCqyWPKoMcDwY5RAEkgWr_g-FQku1WPcf4871IRrNqg7z0b4SBoyq-l8gmGtGVb5hGpNG-1oSByErMCKZM9e847hhUWf28U0dXsRRg2m8CnheOqg7iFZQjX0vf9CV10_cGnAcz0IXr9sDqBMY8-aRUEfD3fjvSdt1K8eYAIDzCQqxaGFLlCdUVl5Q4mGC-6mtbo_wCbv8SpXaQgRRAXuX3HDbX8ETAGaG30; path=/; HttpOnly"
        }, {
          "name" : "X-SourceFiles",
          "value" : "=?UTF-8?B?RDpcVmlydHVhbE9wdGltaXplci1SZWZhY3RvcmluZ1xDcm9wTWV0cmljcy5Wby5BcGlcQ3JvcE1ldHJpY3MuVm8uQXBpXGFwaVxhZG1pblx2MVx1c2Vyc1wyMg==?="
        }, {
          "name" : "X-Powered-By",
          "value" : "ASP.NET"
        }, {
          "name" : "Date",
          "value" : "Fri, 29 Mar 2019 22:30:30 GMT"
        }, {
          "name" : "Content-Length",
          "value" : "85"
        } ],
        "content" : {
          "size" : 85,
          "mimeType" : "application/json; charset=utf-8",
          "text" : "{\"message\":\"The request is invalid. The password can't contain the space character.\"}",
          "comment" : ""
        },
        "redirectURL" : "",
        "headersSize" : 901,
        "bodySize" : 85,
        "comment" : ""
      },
      "cache" : { },
      "timings" : {
        "comment" : "",
        "ssl" : -1,
        "send" : 3,
        "wait" : 26,
        "receive" : 0,
        "connect" : -1,
        "dns" : -1,
        "blocked" : -1
      },
      "serverIPAddress" : "127.0.0.1",
      "comment" : "",
      "_katalonRequestInformation" : {
        "name" : "9",
        "testObjectId" : "Object Repository/VoPro/Account/api_admin_v1_users_userprofileid",
        "harId" : "22462c77-ef8f-40ff-ae38-0bdde018b933"
      },
      "time" : 30
    } ],
    "comment" : ""
  }
}