{
  "log" : {
    "version" : "1.2",
    "creator" : {
      "name" : "BrowserMob Proxy",
      "version" : "2.1.5",
      "comment" : ""
    },
    "pages" : [ {
      "id" : "Page 0",
      "startedDateTime" : "2019-03-28T20:24:09.854Z",
      "title" : "Page 0",
      "pageTimings" : {
        "onLoad" : 1257,
        "comment" : ""
      },
      "comment" : ""
    } ],
    "entries" : [ {
      "pageref" : "Page 0",
      "startedDateTime" : "2019-03-28T20:24:09.856Z",
      "request" : {
        "method" : "POST",
        "url" : "http://localhost:10520/WebAPI/api/admin/v1/users/?",
        "httpVersion" : "HTTP/1.1",
        "cookies" : [ ],
        "headers" : [ {
          "name" : "User-Agent",
          "value" : "Katalon Studio"
        }, {
          "name" : "Content-Type",
          "value" : "application/x-www-form-urlencoded"
        }, {
          "name" : "Authorization",
          "value" : "Bearer eyJ0eXAiOiJKV1QiLCJhbGciOiJIUzI1NiJ9.eyJ1bmlxdWVfbmFtZSI6ImFkbWluIiwicm9sZSI6InVzZXIiLCJzdWIiOiJhZG1pbiIsImlzcyI6IkNyb3BNZXRyaWNzIiwiYXVkIjoiYWxsIiwiZXhwIjoxNTUzODA4NTQ5LCJuYmYiOjE1NTM4MDQ2NDl9.UY_uZ-aahXI0EptBgJsQvRG37njkZxv-YxbLnmw-F-M"
        }, {
          "name" : "Host",
          "value" : "localhost:10520"
        }, {
          "name" : "Accept",
          "value" : "text/html, image/gif, image/jpeg, *; q=.2, */*; q=.2"
        }, {
          "name" : "Proxy-Connection",
          "value" : "keep-alive"
        }, {
          "name" : "Content-Length",
          "value" : "657"
        } ],
        "queryString" : [ ],
        "postData" : {
          "mimeType" : "application/x-www-form-urlencoded",
          "params" : [ {
            "name" : "password",
            "value" : "cropmetrics",
            "comment" : ""
          }, {
            "name" : "email",
            "value" : "cropmetricsvo.addressline2long@gmail.com",
            "comment" : ""
          }, {
            "name" : "fullname",
            "value" : "x",
            "comment" : ""
          }, {
            "name" : "phone",
            "value" : "1",
            "comment" : ""
          }, {
            "name" : "dealer",
            "value" : "xx",
            "comment" : ""
          }, {
            "name" : "addressLine1",
            "value" : "xx",
            "comment" : ""
          }, {
            "name" : "addressLine2",
            "value" : "16 API_ACNT_When_new_account_have_long_addressline2_attribute_Expected_status_code_20016 API_ACNT_When_new_account_have_long_addressline2_attribute_Expected_status_code_20016 API_ACNT_When_new_account_have_long_addressline2_attribute_Expected_status_code_20016 API_ACNT_When_new_account_have_long_addressline2_attribute_Expected_status_code_20016 API_ACNT_When_new_account_have_long_addressline2_attribute_Expected_status_code_200",
            "comment" : ""
          }, {
            "name" : "town",
            "value" : "townValidation",
            "comment" : ""
          }, {
            "name" : "state",
            "value" : "stateValidation",
            "comment" : ""
          }, {
            "name" : "zip",
            "value" : "zipValidation",
            "comment" : ""
          }, {
            "name" : "country",
            "value" : "countryValidation",
            "comment" : ""
          }, {
            "name" : "roles",
            "value" : "Client",
            "comment" : ""
          } ],
          "comment" : ""
        },
        "headersSize" : 544,
        "bodySize" : 657,
        "comment" : ""
      },
      "response" : {
        "status" : 200,
        "statusText" : "OK",
        "httpVersion" : "HTTP/1.1",
        "cookies" : [ {
          "name" : ".ASPROLES",
          "value" : "TjjbySywtcRgBcmk1o1SR6v1Tz5j1wu-dStCG44XWyubEwid_50zUYADZR4F6ok-wvug9DZG_7W5avd15Ll6g1vO5XvnFeaQ5fUSzFCZtV_peV18F9R-XGMOq3DTh2csDSAGofOrovc6-VThopn7GDE6E75Tjuucnv5LVFqS8gd-Efrdrr_fwTJTGlYXOZ9Dn368T-q92UIq99f7zi_1_AH9pOlFnzXirJcxnayYvAPe4XnNIc3hK0Mt2Q39DUSYE0lyNDzf7zbDvd9mtSXfoWZ0E1Tz9xWZ3uTGl0zgWIqc6uho1RLSKTsXrCqvLfxFQHsNlH9FS_KCIs7Spjc6AOqjwoYvYyvZlDN4WDVgw9PmWzVALJCF4l8fKT6sW14B3iWN-m5rRdHaONghE3fFte4hRf9WmlglgL3S7HC_W9X8h5kegs43HmsjoYurQR6qVJNW1L116alt4hvAoHkvyRMGjq2cahocSfw7aG_QN80V-u_l0",
          "path" : "/",
          "httpOnly" : true,
          "secure" : false,
          "comment" : ""
        } ],
        "headers" : [ {
          "name" : "Cache-Control",
          "value" : "private"
        }, {
          "name" : "Content-Type",
          "value" : "application/json; charset=utf-8"
        }, {
          "name" : "Server",
          "value" : "Microsoft-IIS/10.0"
        }, {
          "name" : "Set-Cookie",
          "value" : ".ASPROLES=TjjbySywtcRgBcmk1o1SR6v1Tz5j1wu-dStCG44XWyubEwid_50zUYADZR4F6ok-wvug9DZG_7W5avd15Ll6g1vO5XvnFeaQ5fUSzFCZtV_peV18F9R-XGMOq3DTh2csDSAGofOrovc6-VThopn7GDE6E75Tjuucnv5LVFqS8gd-Efrdrr_fwTJTGlYXOZ9Dn368T-q92UIq99f7zi_1_AH9pOlFnzXirJcxnayYvAPe4XnNIc3hK0Mt2Q39DUSYE0lyNDzf7zbDvd9mtSXfoWZ0E1Tz9xWZ3uTGl0zgWIqc6uho1RLSKTsXrCqvLfxFQHsNlH9FS_KCIs7Spjc6AOqjwoYvYyvZlDN4WDVgw9PmWzVALJCF4l8fKT6sW14B3iWN-m5rRdHaONghE3fFte4hRf9WmlglgL3S7HC_W9X8h5kegs43HmsjoYurQR6qVJNW1L116alt4hvAoHkvyRMGjq2cahocSfw7aG_QN80V-u_l0; path=/; HttpOnly"
        }, {
          "name" : "X-SourceFiles",
          "value" : "=?UTF-8?B?RDpcVmlydHVhbE9wdGltaXplci1SZWZhY3RvcmluZ1xDcm9wTWV0cmljcy5Wby5BcGlcQ3JvcE1ldHJpY3MuVm8uQXBpXGFwaVxhZG1pblx2MVx1c2Vyc1w=?="
        }, {
          "name" : "X-Powered-By",
          "value" : "ASP.NET"
        }, {
          "name" : "Date",
          "value" : "Thu, 28 Mar 2019 20:24:11 GMT"
        }, {
          "name" : "Content-Length",
          "value" : "9"
        } ],
        "content" : {
          "size" : 9,
          "mimeType" : "application/json; charset=utf-8",
          "text" : "{\"id\":23}",
          "comment" : ""
        },
        "redirectURL" : "",
        "headersSize" : 887,
        "bodySize" : 9,
        "comment" : ""
      },
      "cache" : { },
      "timings" : {
        "comment" : "",
        "wait" : 1251,
        "dns" : -1,
        "blocked" : -1,
        "connect" : -1,
        "receive" : 0,
        "send" : 0,
        "ssl" : -1
      },
      "serverIPAddress" : "127.0.0.1",
      "comment" : "",
      "_katalonRequestInformation" : {
        "name" : "63",
        "testObjectId" : "Object Repository/VoPro/Account/api_admin_v1_users",
        "harId" : "0abfb570-1033-4800-9725-7b2e929305ac"
      },
      "time" : 1253
    } ],
    "comment" : ""
  }
}