{
  "log" : {
    "version" : "1.2",
    "creator" : {
      "name" : "BrowserMob Proxy",
      "version" : "2.1.5",
      "comment" : ""
    },
    "pages" : [ {
      "id" : "Page 0",
      "startedDateTime" : "2019-04-09T21:26:24.130Z",
      "title" : "Page 0",
      "pageTimings" : {
        "onLoad" : 3886,
        "comment" : ""
      },
      "comment" : ""
    } ],
    "entries" : [ {
      "pageref" : "Page 0",
      "startedDateTime" : "2019-04-09T21:26:24.130Z",
      "request" : {
        "method" : "PUT",
        "url" : "http://localhost:10520/WebAPI/api/mobile/v1/fields/6?",
        "httpVersion" : "HTTP/1.1",
        "cookies" : [ ],
        "headers" : [ {
          "name" : "User-Agent",
          "value" : "Katalon Studio"
        }, {
          "name" : "Content-Type",
          "value" : "application/json"
        }, {
          "name" : "Authorization",
          "value" : "Bearer eyJ0eXAiOiJKV1QiLCJhbGciOiJIUzI1NiJ9.eyJ1bmlxdWVfbmFtZSI6Implbm55Lm1hbGRvbmFkby50eDFAZ21haWwuY29tIiwicm9sZSI6InVzZXIiLCJzdWIiOiJqZW5ueS5tYWxkb25hZG8udHgxQGdtYWlsLmNvbSIsImlzcyI6IkNyb3BNZXRyaWNzIiwiYXVkIjoiYWxsIiwiZXhwIjoxNTU0ODQ5MDg0LCJuYmYiOjE1NTQ4NDUxODR9.WF338HQ3EAtVeSUvYOgQo7AqOnxxwZiO4lr-dhnUkKU"
        }, {
          "name" : "Host",
          "value" : "localhost:10520"
        }, {
          "name" : "Accept",
          "value" : "text/html, image/gif, image/jpeg, *; q=.2, */*; q=.2"
        }, {
          "name" : "Proxy-Connection",
          "value" : "keep-alive"
        }, {
          "name" : "Content-Length",
          "value" : "368"
        } ],
        "queryString" : [ ],
        "postData" : {
          "mimeType" : "application/json",
          "text" : "{\"field\":{\"name\":\"!@#$%^\",\"boundary\":{\"boundaries\":[{\"boundary\":{\"coords\":[{\"x\":-101.49568751,\"y\":37.14976293},{\"x\":-101.50049403,\"y\":37.14647907},{\"x\":-101.50049403,\"y\":37.14264773},{\"x\":-101.49723246,\"y\":37.1411425},{\"x\":-101.49019435,\"y\":37.14223722},{\"x\":-101.48933604,\"y\":37.14620541},{\"x\":-101.49294093,\"y\":37.14866833},{\"x\":-101.49568751,\"y\":37.14976293}]}}]}}}",
          "comment" : ""
        },
        "headersSize" : 593,
        "bodySize" : 368,
        "comment" : ""
      },
      "response" : {
        "status" : 400,
        "statusText" : "Bad Request",
        "httpVersion" : "HTTP/1.1",
        "cookies" : [ {
          "name" : ".ASPROLES",
          "value" : "s0I-5sJFaUkZW_dzw_pI3z8RGcCDFwCSXYLeZLUkpcIDDArttYjiv2f7VSD_wvyUyYeUmp9fzcFy4h2H1RST37-6kEEh0TXe8x8sk3lKqIeZ0Em8U5AqJ-VGcO6MNatbKfJR1Du_GDlWw95kpgy37-5mfZflQWYSszIKOT1G60y1-LpOti_dG4Mz5FChUbgQgCM6STgXTURmwoRqTuYuqL-plwqekreZaisObUP6R8oGoMyhKGNTq3zgDUsrWhuKlb1JkMqcKbQ0qcxU4wFmcE0QZ2aLcUqkK9vHf30jbRVhCTTaUaKw3rRbjsN6CrYtj05ICgqp_7KYGeFEsplg3sckvvZqttvc0kAr6L3cgLq3HyWx81B7gspQPYcukvbQvUO1D2XUqMRbFxqXHTAscJJNto3AVLu_VucPtuwLZvTXmRwRUuXjOcZiunrSdJ2ALBd3M2tntYauOQe6TeAP5KY0rkfkF6Sth-GZrxoBotiNNdL1SJU4kIkAPgZu8-n-QNmA_E8rB4FiIUi3ISeg2PpGJ8w1",
          "path" : "/",
          "httpOnly" : true,
          "secure" : false,
          "comment" : ""
        } ],
        "headers" : [ {
          "name" : "Cache-Control",
          "value" : "private"
        }, {
          "name" : "Content-Type",
          "value" : "application/json; charset=utf-8"
        }, {
          "name" : "Server",
          "value" : "Microsoft-IIS/10.0"
        }, {
          "name" : "Set-Cookie",
          "value" : ".ASPROLES=s0I-5sJFaUkZW_dzw_pI3z8RGcCDFwCSXYLeZLUkpcIDDArttYjiv2f7VSD_wvyUyYeUmp9fzcFy4h2H1RST37-6kEEh0TXe8x8sk3lKqIeZ0Em8U5AqJ-VGcO6MNatbKfJR1Du_GDlWw95kpgy37-5mfZflQWYSszIKOT1G60y1-LpOti_dG4Mz5FChUbgQgCM6STgXTURmwoRqTuYuqL-plwqekreZaisObUP6R8oGoMyhKGNTq3zgDUsrWhuKlb1JkMqcKbQ0qcxU4wFmcE0QZ2aLcUqkK9vHf30jbRVhCTTaUaKw3rRbjsN6CrYtj05ICgqp_7KYGeFEsplg3sckvvZqttvc0kAr6L3cgLq3HyWx81B7gspQPYcukvbQvUO1D2XUqMRbFxqXHTAscJJNto3AVLu_VucPtuwLZvTXmRwRUuXjOcZiunrSdJ2ALBd3M2tntYauOQe6TeAP5KY0rkfkF6Sth-GZrxoBotiNNdL1SJU4kIkAPgZu8-n-QNmA_E8rB4FiIUi3ISeg2PpGJ8w1; path=/; HttpOnly"
        }, {
          "name" : "X-SourceFiles",
          "value" : "=?UTF-8?B?RDpcVmlydHVhbE9wdGltaXplci1SZWZhY3RvcmluZ1xDcm9wTWV0cmljcy5Wby5BcGlcQ3JvcE1ldHJpY3MuVm8uQXBpXGFwaVxtb2JpbGVcdjFcZmllbGRzXDY=?="
        }, {
          "name" : "X-Powered-By",
          "value" : "ASP.NET"
        }, {
          "name" : "Date",
          "value" : "Tue, 09 Apr 2019 21:26:28 GMT"
        }, {
          "name" : "Content-Length",
          "value" : "98"
        } ],
        "content" : {
          "size" : 98,
          "mimeType" : "application/json; charset=utf-8",
          "text" : "{\"message\":\"The field name must contain only alphanumeric characters, apostrophes and/or spaces.\"}",
          "comment" : ""
        },
        "redirectURL" : "",
        "headersSize" : 944,
        "bodySize" : 98,
        "comment" : ""
      },
      "cache" : { },
      "timings" : {
        "comment" : "",
        "send" : 0,
        "connect" : -1,
        "blocked" : -1,
        "dns" : -1,
        "receive" : 0,
        "wait" : 3881,
        "ssl" : -1
      },
      "serverIPAddress" : "127.0.0.1",
      "comment" : "",
      "_katalonRequestInformation" : {
        "name" : "49",
        "testObjectId" : "Object Repository/VoGrow/Field/FieldPut",
        "harId" : "33c9cb99-a788-45a9-aa54-dbdead195c21"
      },
      "time" : 3882
    } ],
    "comment" : ""
  }
}