{
  "log" : {
    "version" : "1.2",
    "creator" : {
      "name" : "BrowserMob Proxy",
      "version" : "2.1.5",
      "comment" : ""
    },
    "pages" : [ {
      "id" : "Page 0",
      "startedDateTime" : "2019-04-11T16:03:17.663Z",
      "title" : "Page 0",
      "pageTimings" : {
        "onLoad" : 3369,
        "comment" : ""
      },
      "comment" : ""
    } ],
    "entries" : [ {
      "pageref" : "Page 0",
      "startedDateTime" : "2019-04-11T16:03:17.665Z",
      "request" : {
        "method" : "POST",
        "url" : "http://localhost:10520/WebAPI/api/mobile/v1/farms/?",
        "httpVersion" : "HTTP/1.1",
        "cookies" : [ ],
        "headers" : [ {
          "name" : "User-Agent",
          "value" : "Katalon Studio"
        }, {
          "name" : "Content-Type",
          "value" : "application/json"
        }, {
          "name" : "Authorization",
          "value" : "Bearer eyJ0eXAiOiJKV1QiLCJhbGciOiJIUzI1NiJ9.eyJ1bmlxdWVfbmFtZSI6Implbm55Lm1hbGRvbmFkby50eDFAZ21haWwuY29tIiwicm9sZSI6InVzZXIiLCJzdWIiOiJqZW5ueS5tYWxkb25hZG8udHgxQGdtYWlsLmNvbSIsImlzcyI6IkNyb3BNZXRyaWNzIiwiYXVkIjoiYWxsIiwiZXhwIjoxNTU1MDAyNDk3LCJuYmYiOjE1NTQ5OTg1OTd9.wniPb2w79ek0LA28BBfR6Ak6MTN7uL9gjlVPoTci1aQ"
        }, {
          "name" : "Host",
          "value" : "localhost:10520"
        }, {
          "name" : "Accept",
          "value" : "text/html, image/gif, image/jpeg, *; q=.2, */*; q=.2"
        }, {
          "name" : "Proxy-Connection",
          "value" : "keep-alive"
        }, {
          "name" : "Content-Length",
          "value" : "50"
        } ],
        "queryString" : [ ],
        "postData" : {
          "mimeType" : "application/json",
          "text" : "{\"name\": \"Farm 2 created by dealer\", \"user_id\": 3}",
          "comment" : ""
        },
        "headersSize" : 591,
        "bodySize" : 50,
        "comment" : ""
      },
      "response" : {
        "status" : 400,
        "statusText" : "Bad Request",
        "httpVersion" : "HTTP/1.1",
        "cookies" : [ {
          "name" : ".ASPROLES",
          "value" : "nyZDJuIypqWvzWL1RLWrUPII0tcPsZirtwdlCAASlF9nkFukMdG6F9FP1XsYuhoFEqdJDsUElKpT7ZUtChR6rq75IS91b5u_Y4TzVImMbMCrwt-C2ipbYSFGzB2v5-OqmHbcZqKb_avcJ6L4kwDhfkz_XQdfJ09mxae2wb5ytP0h-0eBvjrxvcEf0jimPnTDaScQ1ASt0Crm-VsI3vL2I03u8IEuU4JiLXDFkJsM4jTlSgYSpOb07UW5dj70rBQFAlo_Ha5xgMy36v7jrYKFLoKhWdYzTAOjVIQfKhfsx6auz1l1H_EvTkvz3mlA47EUqgDCB_l8qp4MTXEW7HdChiYL12CF98oYeJitwUJD6sMpQmaZMKns98s7bcunVSXEDKyXTEEcXJ0Qp5E8DVg0lGGbUKxdaNV1XPj8q0PWRFT0rupsC7nz0PeHxcIU34Xts4PMz9gxiS6MPVfo4xMELHJB0joBURAwDcS571WIWhP5swpPQkFT5jND8VtU1WlvotjsO8LR8P0GRkK6cgr4A3BOj2g1",
          "path" : "/",
          "httpOnly" : true,
          "secure" : false,
          "comment" : ""
        } ],
        "headers" : [ {
          "name" : "Cache-Control",
          "value" : "private"
        }, {
          "name" : "Content-Type",
          "value" : "application/json; charset=utf-8"
        }, {
          "name" : "Server",
          "value" : "Microsoft-IIS/10.0"
        }, {
          "name" : "Set-Cookie",
          "value" : ".ASPROLES=nyZDJuIypqWvzWL1RLWrUPII0tcPsZirtwdlCAASlF9nkFukMdG6F9FP1XsYuhoFEqdJDsUElKpT7ZUtChR6rq75IS91b5u_Y4TzVImMbMCrwt-C2ipbYSFGzB2v5-OqmHbcZqKb_avcJ6L4kwDhfkz_XQdfJ09mxae2wb5ytP0h-0eBvjrxvcEf0jimPnTDaScQ1ASt0Crm-VsI3vL2I03u8IEuU4JiLXDFkJsM4jTlSgYSpOb07UW5dj70rBQFAlo_Ha5xgMy36v7jrYKFLoKhWdYzTAOjVIQfKhfsx6auz1l1H_EvTkvz3mlA47EUqgDCB_l8qp4MTXEW7HdChiYL12CF98oYeJitwUJD6sMpQmaZMKns98s7bcunVSXEDKyXTEEcXJ0Qp5E8DVg0lGGbUKxdaNV1XPj8q0PWRFT0rupsC7nz0PeHxcIU34Xts4PMz9gxiS6MPVfo4xMELHJB0joBURAwDcS571WIWhP5swpPQkFT5jND8VtU1WlvotjsO8LR8P0GRkK6cgr4A3BOj2g1; path=/; HttpOnly"
        }, {
          "name" : "X-SourceFiles",
          "value" : "=?UTF-8?B?RDpcVmlydHVhbE9wdGltaXplci1SZWZhY3RvcmluZ1xDcm9wTWV0cmljcy5Wby5BcGlcQ3JvcE1ldHJpY3MuVm8uQXBpXGFwaVxtb2JpbGVcdjFcZmFybXNc?="
        }, {
          "name" : "X-Powered-By",
          "value" : "ASP.NET"
        }, {
          "name" : "Date",
          "value" : "Thu, 11 Apr 2019 16:03:21 GMT"
        }, {
          "name" : "Content-Length",
          "value" : "43"
        } ],
        "content" : {
          "size" : 43,
          "mimeType" : "application/json; charset=utf-8",
          "text" : "{\"message\":\"The farm name already exists.\"}",
          "comment" : ""
        },
        "redirectURL" : "",
        "headersSize" : 940,
        "bodySize" : 43,
        "comment" : ""
      },
      "cache" : { },
      "timings" : {
        "comment" : "",
        "ssl" : -1,
        "send" : 0,
        "dns" : -1,
        "blocked" : -1,
        "connect" : -1,
        "wait" : 3361,
        "receive" : 1
      },
      "serverIPAddress" : "127.0.0.1",
      "comment" : "",
      "_katalonRequestInformation" : {
        "name" : "3",
        "testObjectId" : "Object Repository/VoGrow/Farm/FarmPost",
        "harId" : "485460b0-f037-4012-865d-af0de6ebabd9"
      },
      "time" : 3364
    } ],
    "comment" : ""
  }
}