{
  "log" : {
    "version" : "1.2",
    "creator" : {
      "name" : "BrowserMob Proxy",
      "version" : "2.1.5",
      "comment" : ""
    },
    "pages" : [ {
      "id" : "Page 0",
      "startedDateTime" : "2019-04-11T16:40:16.434Z",
      "title" : "Page 0",
      "pageTimings" : {
        "onLoad" : 3103,
        "comment" : ""
      },
      "comment" : ""
    } ],
    "entries" : [ {
      "pageref" : "Page 0",
      "startedDateTime" : "2019-04-11T16:40:16.435Z",
      "request" : {
        "method" : "PUT",
        "url" : "http://localhost:10520/WebAPI/api/mobile/v1/farms/1?",
        "httpVersion" : "HTTP/1.1",
        "cookies" : [ ],
        "headers" : [ {
          "name" : "User-Agent",
          "value" : "Katalon Studio"
        }, {
          "name" : "Content-Type",
          "value" : "application/json"
        }, {
          "name" : "Authorization",
          "value" : "Bearer eyJ0eXAiOiJKV1QiLCJhbGciOiJIUzI1NiJ9.eyJ1bmlxdWVfbmFtZSI6Implbm55Lm1hbGRvbmFkby50eDFAZ21haWwuY29tIiwicm9sZSI6InVzZXIiLCJzdWIiOiJqZW5ueS5tYWxkb25hZG8udHgxQGdtYWlsLmNvbSIsImlzcyI6IkNyb3BNZXRyaWNzIiwiYXVkIjoiYWxsIiwiZXhwIjoxNTU1MDA0NzE2LCJuYmYiOjE1NTUwMDA4MTZ9.3rkonEsWVhRpaLwbO6uTRMAB4llwy_gaEUNGpr3AdC8"
        }, {
          "name" : "Host",
          "value" : "localhost:10520"
        }, {
          "name" : "Accept",
          "value" : "text/html, image/gif, image/jpeg, *; q=.2, */*; q=.2"
        }, {
          "name" : "Proxy-Connection",
          "value" : "keep-alive"
        }, {
          "name" : "Content-Length",
          "value" : "80"
        } ],
        "queryString" : [ ],
        "postData" : {
          "mimeType" : "application/json",
          "text" : "{\"name\": \"Farm not updated into the grower does not assined the dealer account\"}",
          "comment" : ""
        },
        "headersSize" : 591,
        "bodySize" : 80,
        "comment" : ""
      },
      "response" : {
        "status" : 400,
        "statusText" : "Bad Request",
        "httpVersion" : "HTTP/1.1",
        "cookies" : [ {
          "name" : ".ASPROLES",
          "value" : "IXa4HnpTlFROKY-x_vnz5EikArXqRMM19744brxgyRPFyk7rBKckhLW2h_4EpmY4VNsV2UJr7pfqVrqwOahnApfYyBSWxh_orIRIU2NBQRQWLocAeeYBGmgBQ0h3LvHahJUiDcMbsKyXMEZHOlmr062SdgHyy4UMoaBS997xm8wTfk-tj5KtteOxGc7gfWVJ-Hhh3wbmvc2AeP_rB9XiG9nA-Qppd474sR9C7MqbivSD-gGpL4stZJl4B-JGkzEkzrTQ6m_2ERyKxQk38YeIqnKQHA1OvRPydzzv4jI0pnjE14Co9qOZiNitzaPrPKWPUg9EYsSQxx3fyb6Vlc8XVOcCURReGc2kjvG-TU5fC7VZoYcmOKC1_fmpRqiww7ig1KgVSD5-32708Le-gA5UOEWot2dBpaJCFCvAj1iKwtnQoyp_PabyRfJGRo5jJ7JNqj3NynssoFyFi8ZpNK4LAu61CQpRR6BmX-FQeCTPzO0S_RW4Qzyj3ZbDbqHIgygWpxpyqqLvwlTttAQLvlXyO2jmBXw1",
          "path" : "/",
          "httpOnly" : true,
          "secure" : false,
          "comment" : ""
        } ],
        "headers" : [ {
          "name" : "Cache-Control",
          "value" : "private"
        }, {
          "name" : "Content-Type",
          "value" : "application/json; charset=utf-8"
        }, {
          "name" : "Server",
          "value" : "Microsoft-IIS/10.0"
        }, {
          "name" : "Set-Cookie",
          "value" : ".ASPROLES=IXa4HnpTlFROKY-x_vnz5EikArXqRMM19744brxgyRPFyk7rBKckhLW2h_4EpmY4VNsV2UJr7pfqVrqwOahnApfYyBSWxh_orIRIU2NBQRQWLocAeeYBGmgBQ0h3LvHahJUiDcMbsKyXMEZHOlmr062SdgHyy4UMoaBS997xm8wTfk-tj5KtteOxGc7gfWVJ-Hhh3wbmvc2AeP_rB9XiG9nA-Qppd474sR9C7MqbivSD-gGpL4stZJl4B-JGkzEkzrTQ6m_2ERyKxQk38YeIqnKQHA1OvRPydzzv4jI0pnjE14Co9qOZiNitzaPrPKWPUg9EYsSQxx3fyb6Vlc8XVOcCURReGc2kjvG-TU5fC7VZoYcmOKC1_fmpRqiww7ig1KgVSD5-32708Le-gA5UOEWot2dBpaJCFCvAj1iKwtnQoyp_PabyRfJGRo5jJ7JNqj3NynssoFyFi8ZpNK4LAu61CQpRR6BmX-FQeCTPzO0S_RW4Qzyj3ZbDbqHIgygWpxpyqqLvwlTttAQLvlXyO2jmBXw1; path=/; HttpOnly"
        }, {
          "name" : "X-SourceFiles",
          "value" : "=?UTF-8?B?RDpcVmlydHVhbE9wdGltaXplci1SZWZhY3RvcmluZ1xDcm9wTWV0cmljcy5Wby5BcGlcQ3JvcE1ldHJpY3MuVm8uQXBpXGFwaVxtb2JpbGVcdjFcZmFybXNcMQ==?="
        }, {
          "name" : "X-Powered-By",
          "value" : "ASP.NET"
        }, {
          "name" : "Date",
          "value" : "Thu, 11 Apr 2019 16:40:19 GMT"
        }, {
          "name" : "Content-Length",
          "value" : "81"
        } ],
        "content" : {
          "size" : 81,
          "mimeType" : "application/json; charset=utf-8",
          "text" : "{\"message\":\"The modifier doesn't have permissions to modify the farm requested.\"}",
          "comment" : ""
        },
        "redirectURL" : "",
        "headersSize" : 944,
        "bodySize" : 81,
        "comment" : ""
      },
      "cache" : { },
      "timings" : {
        "comment" : "",
        "ssl" : -1,
        "wait" : 3095,
        "dns" : -1,
        "blocked" : -1,
        "send" : 0,
        "receive" : 1,
        "connect" : -1
      },
      "serverIPAddress" : "127.0.0.1",
      "comment" : "",
      "_katalonRequestInformation" : {
        "name" : "7",
        "testObjectId" : "Object Repository/VoGrow/Farm/FarmPut",
        "harId" : "8ed6e51b-eb4c-4ee1-b3a7-b47e55362eff"
      },
      "time" : 3097
    } ],
    "comment" : ""
  }
}