{
  "log" : {
    "version" : "1.2",
    "creator" : {
      "name" : "BrowserMob Proxy",
      "version" : "2.1.5",
      "comment" : ""
    },
    "pages" : [ {
      "id" : "Page 0",
      "startedDateTime" : "2019-03-28T20:24:13.560Z",
      "title" : "Page 0",
      "pageTimings" : {
        "onLoad" : 1224,
        "comment" : ""
      },
      "comment" : ""
    } ],
    "entries" : [ {
      "pageref" : "Page 0",
      "startedDateTime" : "2019-03-28T20:24:13.562Z",
      "request" : {
        "method" : "POST",
        "url" : "http://localhost:10520/WebAPI/api/admin/v1/users/?",
        "httpVersion" : "HTTP/1.1",
        "cookies" : [ ],
        "headers" : [ {
          "name" : "User-Agent",
          "value" : "Katalon Studio"
        }, {
          "name" : "Content-Type",
          "value" : "application/x-www-form-urlencoded"
        }, {
          "name" : "Authorization",
          "value" : "Bearer eyJ0eXAiOiJKV1QiLCJhbGciOiJIUzI1NiJ9.eyJ1bmlxdWVfbmFtZSI6ImFkbWluIiwicm9sZSI6InVzZXIiLCJzdWIiOiJhZG1pbiIsImlzcyI6IkNyb3BNZXRyaWNzIiwiYXVkIjoiYWxsIiwiZXhwIjoxNTUzODA4NTUzLCJuYmYiOjE1NTM4MDQ2NTN9.yC-O4gy47bKdMkEbmwT_h-YYDTv7fuj2QRPbBGUJvSY"
        }, {
          "name" : "Host",
          "value" : "localhost:10520"
        }, {
          "name" : "Accept",
          "value" : "text/html, image/gif, image/jpeg, *; q=.2, */*; q=.2"
        }, {
          "name" : "Proxy-Connection",
          "value" : "keep-alive"
        }, {
          "name" : "Content-Length",
          "value" : "731"
        } ],
        "queryString" : [ ],
        "postData" : {
          "mimeType" : "application/x-www-form-urlencoded",
          "params" : [ {
            "name" : "password",
            "value" : "cropmetrics",
            "comment" : ""
          }, {
            "name" : "email",
            "value" : "cropmetricsvo.townlong@gmail.com",
            "comment" : ""
          }, {
            "name" : "fullname",
            "value" : "x",
            "comment" : ""
          }, {
            "name" : "phone",
            "value" : "1",
            "comment" : ""
          }, {
            "name" : "dealer",
            "value" : "xx",
            "comment" : ""
          }, {
            "name" : "addressLine1",
            "value" : "address line 1 test validation",
            "comment" : ""
          }, {
            "name" : "addressLine2",
            "value" : "address line 2 test validation",
            "comment" : ""
          }, {
            "name" : "town",
            "value" : "18 API_ACNT_When_new_account_have_long_town_attribute_Expected_status_code_20018 API_ACNT_When_new_account_have_long_town_attribute_Expected_status_code_20018 API_ACNT_When_new_account_have_long_town_attribute_Expected_status_code_20018 API_ACNT_When_new_account_have_long_town_attribute_Expected_status_code_20018 API_ACNT_When_new_account_have_long_town_attribute_Expected_status_code_20018 API_ACNT_When_new_account_have_long_town_attribute_Expected_status_code_200",
            "comment" : ""
          }, {
            "name" : "state",
            "value" : "stateValidation",
            "comment" : ""
          }, {
            "name" : "zip",
            "value" : "zipValidation",
            "comment" : ""
          }, {
            "name" : "country",
            "value" : "countryValidation",
            "comment" : ""
          }, {
            "name" : "roles",
            "value" : "Client",
            "comment" : ""
          } ],
          "comment" : ""
        },
        "headersSize" : 544,
        "bodySize" : 731,
        "comment" : ""
      },
      "response" : {
        "status" : 200,
        "statusText" : "OK",
        "httpVersion" : "HTTP/1.1",
        "cookies" : [ {
          "name" : ".ASPROLES",
          "value" : "83P6MC8xGc4qgK_Fgb68_wZKBiIUgjEV94SRyGis09ZGOhWhDhT_vdmKn-oVcakVc_2h5RFNhvfPpKQeCHfPAz_1ZJBrXaqCJfXWIAkLX_wdgeAKVV2dSg3W_-R8KdAwdmnD29rMY9ItJsZlrXIm3pyEx-JFImFbRQwAvNXXiKmpYFup4Z510b5nk8Dl36WMwy81DMUwZokIrQb7-F59DZ-mwla-hgNgx58TKKnA59NoUkzIy9CjXNngllrDbyMryUVcKu1I9VjOD9OHAV8aFp3rGg7wLu7uKVg4Bu-EUAK6MKuPb0vfELB6DwQ2AACsW-2IcBmRIlAQdpkJaU7sKZiZZ1LjmFLqzVC7JXH9PB1lbQSq5kVkc_tH5j6Xq44nC3KH0QNNdrZyVnsu-cSmz4141XCmAV1jbCG_kBnKYSP3hGBboDeV9f6nLWvOgbPebM2UI_yU27uKRXihK83H7WdOq2BDAOYDmaSj3Ok7tqtRqz0j0",
          "path" : "/",
          "httpOnly" : true,
          "secure" : false,
          "comment" : ""
        } ],
        "headers" : [ {
          "name" : "Cache-Control",
          "value" : "private"
        }, {
          "name" : "Content-Type",
          "value" : "application/json; charset=utf-8"
        }, {
          "name" : "Server",
          "value" : "Microsoft-IIS/10.0"
        }, {
          "name" : "Set-Cookie",
          "value" : ".ASPROLES=83P6MC8xGc4qgK_Fgb68_wZKBiIUgjEV94SRyGis09ZGOhWhDhT_vdmKn-oVcakVc_2h5RFNhvfPpKQeCHfPAz_1ZJBrXaqCJfXWIAkLX_wdgeAKVV2dSg3W_-R8KdAwdmnD29rMY9ItJsZlrXIm3pyEx-JFImFbRQwAvNXXiKmpYFup4Z510b5nk8Dl36WMwy81DMUwZokIrQb7-F59DZ-mwla-hgNgx58TKKnA59NoUkzIy9CjXNngllrDbyMryUVcKu1I9VjOD9OHAV8aFp3rGg7wLu7uKVg4Bu-EUAK6MKuPb0vfELB6DwQ2AACsW-2IcBmRIlAQdpkJaU7sKZiZZ1LjmFLqzVC7JXH9PB1lbQSq5kVkc_tH5j6Xq44nC3KH0QNNdrZyVnsu-cSmz4141XCmAV1jbCG_kBnKYSP3hGBboDeV9f6nLWvOgbPebM2UI_yU27uKRXihK83H7WdOq2BDAOYDmaSj3Ok7tqtRqz0j0; path=/; HttpOnly"
        }, {
          "name" : "X-SourceFiles",
          "value" : "=?UTF-8?B?RDpcVmlydHVhbE9wdGltaXplci1SZWZhY3RvcmluZ1xDcm9wTWV0cmljcy5Wby5BcGlcQ3JvcE1ldHJpY3MuVm8uQXBpXGFwaVxhZG1pblx2MVx1c2Vyc1w=?="
        }, {
          "name" : "X-Powered-By",
          "value" : "ASP.NET"
        }, {
          "name" : "Date",
          "value" : "Thu, 28 Mar 2019 20:24:14 GMT"
        }, {
          "name" : "Content-Length",
          "value" : "9"
        } ],
        "content" : {
          "size" : 9,
          "mimeType" : "application/json; charset=utf-8",
          "text" : "{\"id\":25}",
          "comment" : ""
        },
        "redirectURL" : "",
        "headersSize" : 887,
        "bodySize" : 9,
        "comment" : ""
      },
      "cache" : { },
      "timings" : {
        "comment" : "",
        "wait" : 1217,
        "dns" : -1,
        "blocked" : -1,
        "connect" : -1,
        "receive" : 0,
        "send" : 0,
        "ssl" : -1
      },
      "serverIPAddress" : "127.0.0.1",
      "comment" : "",
      "_katalonRequestInformation" : {
        "name" : "67",
        "testObjectId" : "Object Repository/VoPro/Account/api_admin_v1_users",
        "harId" : "7e75176e-d80c-4513-be29-7c9c2c93e5bc"
      },
      "time" : 1219
    } ],
    "comment" : ""
  }
}