{
  "log" : {
    "version" : "1.2",
    "creator" : {
      "name" : "BrowserMob Proxy",
      "version" : "2.1.5",
      "comment" : ""
    },
    "pages" : [ {
      "id" : "Page 0",
      "startedDateTime" : "2019-04-09T20:49:05.340Z",
      "title" : "Page 0",
      "pageTimings" : {
        "onLoad" : 3126,
        "comment" : ""
      },
      "comment" : ""
    } ],
    "entries" : [ {
      "pageref" : "Page 0",
      "startedDateTime" : "2019-04-09T20:49:05.342Z",
      "request" : {
        "method" : "PUT",
        "url" : "http://localhost:10520/WebAPI/api/mobile/v1/fields/11111111?",
        "httpVersion" : "HTTP/1.1",
        "cookies" : [ ],
        "headers" : [ {
          "name" : "User-Agent",
          "value" : "Katalon Studio"
        }, {
          "name" : "Content-Type",
          "value" : "application/json"
        }, {
          "name" : "Authorization",
          "value" : "Bearer eyJ0eXAiOiJKV1QiLCJhbGciOiJIUzI1NiJ9.eyJ1bmlxdWVfbmFtZSI6Implbm55Lm1hbGRvbmFkby50eDFAZ21haWwuY29tIiwicm9sZSI6InVzZXIiLCJzdWIiOiJqZW5ueS5tYWxkb25hZG8udHgxQGdtYWlsLmNvbSIsImlzcyI6IkNyb3BNZXRyaWNzIiwiYXVkIjoiYWxsIiwiZXhwIjoxNTU0ODQ2ODQ1LCJuYmYiOjE1NTQ4NDI5NDV9.iK0QVwLzyTyvj7aFuRx_ISASDTd8CQuJnltplGua0WA"
        }, {
          "name" : "Host",
          "value" : "localhost:10520"
        }, {
          "name" : "Accept",
          "value" : "text/html, image/gif, image/jpeg, *; q=.2, */*; q=.2"
        }, {
          "name" : "Proxy-Connection",
          "value" : "keep-alive"
        }, {
          "name" : "Content-Length",
          "value" : "389"
        } ],
        "queryString" : [ ],
        "postData" : {
          "mimeType" : "application/json",
          "text" : "{\"field\":{\"name\":\"Field by agent not assigned\",\"boundary\":{\"boundaries\":[{\"boundary\":{\"coords\":[{\"x\":-101.49568751,\"y\":37.14976293},{\"x\":-101.50049403,\"y\":37.14647907},{\"x\":-101.50049403,\"y\":37.14264773},{\"x\":-101.49723246,\"y\":37.1411425},{\"x\":-101.49019435,\"y\":37.14223722},{\"x\":-101.48933604,\"y\":37.14620541},{\"x\":-101.49294093,\"y\":37.14866833},{\"x\":-101.49568751,\"y\":37.14976293}]}}]}}}",
          "comment" : ""
        },
        "headersSize" : 600,
        "bodySize" : 389,
        "comment" : ""
      },
      "response" : {
        "status" : 400,
        "statusText" : "Bad Request",
        "httpVersion" : "HTTP/1.1",
        "cookies" : [ {
          "name" : ".ASPROLES",
          "value" : "u2j_NEpgT6N7LPVwhvV8YbMdUdVeY0whkd7_S-sXqVewMMspOH2yGpjh_HSLeHC6AR5Hc-X75_xsTWmKO_qokVCoyrrPDYVAuQHfxLoGj89RHw_imApoHQ0lx-jhIiP60sG1TdrnPmwuQoYbcSQIxfsuMM0XgXbvA55QpDm0WI6Elxd7SqM9hxOKhU3b4px_rlUlWt9brQFiFjy6l7E97mAsQ4IJJ7IgJzgZR0j_968FRwZRjn3yImKiuu9mfw4VZJ71VK0iWo7K7Kx7U-fAoN5MRJuHuxDxGC0gQJo2HyZSRxPT2EMuWvJwKwLJ3Fk7mpKjnbM8JWqygcBcXQkVmGDRXXOhT9_0OoLOy34Ey18FvV91FIgxHqU0y3FoDd4mTopuwjEKVeUql-gMVd6NyD6gCPzmmxtPd3PMLoYu53YfapRXRpyzdBD_-IdR5U3TxLBK8Wx7hAMYDVj_CK9Y_82EID1TITG1tX_4MG0bnFtz2wtCAH3K-WiMuSok7OuyM__P4hJSRvaWeMAqJGp8f-K1W6A1",
          "path" : "/",
          "httpOnly" : true,
          "secure" : false,
          "comment" : ""
        } ],
        "headers" : [ {
          "name" : "Cache-Control",
          "value" : "private"
        }, {
          "name" : "Content-Type",
          "value" : "application/json; charset=utf-8"
        }, {
          "name" : "Server",
          "value" : "Microsoft-IIS/10.0"
        }, {
          "name" : "Set-Cookie",
          "value" : ".ASPROLES=u2j_NEpgT6N7LPVwhvV8YbMdUdVeY0whkd7_S-sXqVewMMspOH2yGpjh_HSLeHC6AR5Hc-X75_xsTWmKO_qokVCoyrrPDYVAuQHfxLoGj89RHw_imApoHQ0lx-jhIiP60sG1TdrnPmwuQoYbcSQIxfsuMM0XgXbvA55QpDm0WI6Elxd7SqM9hxOKhU3b4px_rlUlWt9brQFiFjy6l7E97mAsQ4IJJ7IgJzgZR0j_968FRwZRjn3yImKiuu9mfw4VZJ71VK0iWo7K7Kx7U-fAoN5MRJuHuxDxGC0gQJo2HyZSRxPT2EMuWvJwKwLJ3Fk7mpKjnbM8JWqygcBcXQkVmGDRXXOhT9_0OoLOy34Ey18FvV91FIgxHqU0y3FoDd4mTopuwjEKVeUql-gMVd6NyD6gCPzmmxtPd3PMLoYu53YfapRXRpyzdBD_-IdR5U3TxLBK8Wx7hAMYDVj_CK9Y_82EID1TITG1tX_4MG0bnFtz2wtCAH3K-WiMuSok7OuyM__P4hJSRvaWeMAqJGp8f-K1W6A1; path=/; HttpOnly"
        }, {
          "name" : "X-SourceFiles",
          "value" : "=?UTF-8?B?RDpcVmlydHVhbE9wdGltaXplci1SZWZhY3RvcmluZ1xDcm9wTWV0cmljcy5Wby5BcGlcQ3JvcE1ldHJpY3MuVm8uQXBpXGFwaVxtb2JpbGVcdjFcZmllbGRzXDExMTExMTEx?="
        }, {
          "name" : "X-Powered-By",
          "value" : "ASP.NET"
        }, {
          "name" : "Date",
          "value" : "Tue, 09 Apr 2019 20:49:08 GMT"
        }, {
          "name" : "Content-Length",
          "value" : "40"
        } ],
        "content" : {
          "size" : 40,
          "mimeType" : "application/json; charset=utf-8",
          "text" : "{\"message\":\"The field id is not valid.\"}",
          "comment" : ""
        },
        "redirectURL" : "",
        "headersSize" : 952,
        "bodySize" : 40,
        "comment" : ""
      },
      "cache" : { },
      "timings" : {
        "comment" : "",
        "send" : 0,
        "wait" : 3120,
        "receive" : 0,
        "connect" : -1,
        "blocked" : -1,
        "dns" : -1,
        "ssl" : -1
      },
      "serverIPAddress" : "127.0.0.1",
      "comment" : "",
      "_katalonRequestInformation" : {
        "name" : "25",
        "testObjectId" : "Object Repository/VoGrow/Field/FieldPut",
        "harId" : "1572a504-46ca-4ae3-a67b-730c47955e3b"
      },
      "time" : 3121
    } ],
    "comment" : ""
  }
}