{
  "log" : {
    "version" : "1.2",
    "creator" : {
      "name" : "BrowserMob Proxy",
      "version" : "2.1.5",
      "comment" : ""
    },
    "pages" : [ {
      "id" : "Page 0",
      "startedDateTime" : "2019-03-29T21:03:41.000Z",
      "title" : "Page 0",
      "pageTimings" : {
        "onLoad" : 40,
        "comment" : ""
      },
      "comment" : ""
    } ],
    "entries" : [ {
      "pageref" : "Page 0",
      "startedDateTime" : "2019-03-29T21:03:41.000Z",
      "request" : {
        "method" : "PUT",
        "url" : "http://localhost:10520/WebAPI/api/admin/v1/users/41?",
        "httpVersion" : "HTTP/1.1",
        "cookies" : [ ],
        "headers" : [ {
          "name" : "User-Agent",
          "value" : "Katalon Studio"
        }, {
          "name" : "Content-Type",
          "value" : "application/x-www-form-urlencoded"
        }, {
          "name" : "Authorization",
          "value" : "Bearer eyJ0eXAiOiJKV1QiLCJhbGciOiJIUzI1NiJ9.eyJ1bmlxdWVfbmFtZSI6ImFkbWluIiwicm9sZSI6InVzZXIiLCJzdWIiOiJhZG1pbiIsImlzcyI6IkNyb3BNZXRyaWNzIiwiYXVkIjoiYWxsIiwiZXhwIjoxNTUzODk3MzIwLCJuYmYiOjE1NTM4OTM0MjB9.d0OFDOGY3s3x7m-pYDLPES5ze2LoYS1eeadReUjypR8"
        }, {
          "name" : "Host",
          "value" : "localhost:10520"
        }, {
          "name" : "Accept",
          "value" : "text/html, image/gif, image/jpeg, *; q=.2, */*; q=.2"
        }, {
          "name" : "Proxy-Connection",
          "value" : "keep-alive"
        }, {
          "name" : "Content-Length",
          "value" : "299"
        } ],
        "queryString" : [ ],
        "postData" : {
          "mimeType" : "application/x-www-form-urlencoded",
          "params" : [ {
            "name" : "password",
            "value" : "cropmetrics",
            "comment" : ""
          }, {
            "name" : "email",
            "value" : "cropmetricsvo.roleadmi@gmail.com",
            "comment" : ""
          }, {
            "name" : "fullname",
            "value" : "test validation",
            "comment" : ""
          }, {
            "name" : "phone",
            "value" : "123",
            "comment" : ""
          }, {
            "name" : "dealer",
            "value" : "x",
            "comment" : ""
          }, {
            "name" : "addressLine1",
            "value" : "address line 1 test validation",
            "comment" : ""
          }, {
            "name" : "addressLine2",
            "value" : "address line 2 test validation",
            "comment" : ""
          }, {
            "name" : "town",
            "value" : "townValidation",
            "comment" : ""
          }, {
            "name" : "state",
            "value" : "stateValidation",
            "comment" : ""
          }, {
            "name" : "zip",
            "value" : "xx",
            "comment" : ""
          }, {
            "name" : "country",
            "value" : "xx",
            "comment" : ""
          }, {
            "name" : "roles",
            "value" : "!@#$%^&*",
            "comment" : ""
          }, {
            "name" : "userProfileId",
            "value" : "41",
            "comment" : ""
          } ],
          "comment" : ""
        },
        "headersSize" : 545,
        "bodySize" : 299,
        "comment" : ""
      },
      "response" : {
        "status" : 400,
        "statusText" : "Bad Request",
        "httpVersion" : "HTTP/1.1",
        "cookies" : [ {
          "name" : ".ASPROLES",
          "value" : "XvD2EzI8mE79CsmwBczrIz2iAm348o8ynsPSSrPKwI2dB1m1iVxPbwM_RXrnyXCWFVHGlPYsOtYbS79VI2VLAubwO_G83pqE2vz3ULHHGleez2_4u5HiY8IOHlY1LbtFMOC5X07Z3q_-XcbMFU17-lGVgK0serrEOoYyiHxRMmbaq9uXuiIkMtiNteNWwdKBXT3Zq1pS8t-BLXB0PhQYJ74CPAbTEqZrYTpMY6XSYfM2VMcKEDKAbtD6a56WYx1vuKqNOqCx2LXVOnXHmWZ2qI90lV-Isi9UE4outA53gq1Vz_IkfbJWe5WZ-OdbIClfcGlNsqGbG9fIgfH3LVai0TEMNqv9SmcCAYBMtI3gRcIad5QsDv-VBM1iDZdoP2QsY3wiIAA52UtEd1cYmBOc7VxDvETjAcajCTsMbWsVTCeqwTs0FUXhInGw84STRl_GSOWWurObPd_xInOT4nlti05T8Wjvw2BSXNc4E0K43-fv9ync0",
          "path" : "/",
          "httpOnly" : true,
          "secure" : false,
          "comment" : ""
        } ],
        "headers" : [ {
          "name" : "Cache-Control",
          "value" : "private"
        }, {
          "name" : "Content-Type",
          "value" : "application/json; charset=utf-8"
        }, {
          "name" : "Server",
          "value" : "Microsoft-IIS/10.0"
        }, {
          "name" : "Set-Cookie",
          "value" : ".ASPROLES=XvD2EzI8mE79CsmwBczrIz2iAm348o8ynsPSSrPKwI2dB1m1iVxPbwM_RXrnyXCWFVHGlPYsOtYbS79VI2VLAubwO_G83pqE2vz3ULHHGleez2_4u5HiY8IOHlY1LbtFMOC5X07Z3q_-XcbMFU17-lGVgK0serrEOoYyiHxRMmbaq9uXuiIkMtiNteNWwdKBXT3Zq1pS8t-BLXB0PhQYJ74CPAbTEqZrYTpMY6XSYfM2VMcKEDKAbtD6a56WYx1vuKqNOqCx2LXVOnXHmWZ2qI90lV-Isi9UE4outA53gq1Vz_IkfbJWe5WZ-OdbIClfcGlNsqGbG9fIgfH3LVai0TEMNqv9SmcCAYBMtI3gRcIad5QsDv-VBM1iDZdoP2QsY3wiIAA52UtEd1cYmBOc7VxDvETjAcajCTsMbWsVTCeqwTs0FUXhInGw84STRl_GSOWWurObPd_xInOT4nlti05T8Wjvw2BSXNc4E0K43-fv9ync0; path=/; HttpOnly"
        }, {
          "name" : "X-SourceFiles",
          "value" : "=?UTF-8?B?RDpcVmlydHVhbE9wdGltaXplci1SZWZhY3RvcmluZ1xDcm9wTWV0cmljcy5Wby5BcGlcQ3JvcE1ldHJpY3MuVm8uQXBpXGFwaVxhZG1pblx2MVx1c2Vyc1w0MQ==?="
        }, {
          "name" : "X-Powered-By",
          "value" : "ASP.NET"
        }, {
          "name" : "Date",
          "value" : "Fri, 29 Mar 2019 21:03:40 GMT"
        }, {
          "name" : "Content-Length",
          "value" : "88"
        } ],
        "content" : {
          "size" : 88,
          "mimeType" : "application/json; charset=utf-8",
          "text" : "{\"message\":\"The request is invalid. The role '!@#$%^&*' to be assigned is not a valid.\"}",
          "comment" : ""
        },
        "redirectURL" : "",
        "headersSize" : 901,
        "bodySize" : 88,
        "comment" : ""
      },
      "cache" : { },
      "timings" : {
        "comment" : "",
        "dns" : -1,
        "wait" : 23,
        "send" : 0,
        "receive" : 0,
        "connect" : -1,
        "blocked" : -1,
        "ssl" : -1
      },
      "serverIPAddress" : "127.0.0.1",
      "comment" : "",
      "_katalonRequestInformation" : {
        "name" : "75",
        "testObjectId" : "Object Repository/VoPro/Account/api_admin_v1_users_userprofileid",
        "harId" : "5f215abc-2a37-4489-be8a-5f359cc8d32f"
      },
      "time" : 24
    } ],
    "comment" : ""
  }
}