{
  "log" : {
    "version" : "1.2",
    "creator" : {
      "name" : "BrowserMob Proxy",
      "version" : "2.1.5",
      "comment" : ""
    },
    "pages" : [ {
      "id" : "Page 0",
      "startedDateTime" : "2019-04-01T13:38:38.868Z",
      "title" : "Page 0",
      "pageTimings" : {
        "onLoad" : 2108,
        "comment" : ""
      },
      "comment" : ""
    } ],
    "entries" : [ {
      "pageref" : "Page 0",
      "startedDateTime" : "2019-04-01T13:38:38.869Z",
      "request" : {
        "method" : "PUT",
        "url" : "http://localhost:10520/WebAPI/api/admin/v1/users/31?",
        "httpVersion" : "HTTP/1.1",
        "cookies" : [ ],
        "headers" : [ {
          "name" : "User-Agent",
          "value" : "Katalon Studio"
        }, {
          "name" : "Content-Type",
          "value" : "application/x-www-form-urlencoded"
        }, {
          "name" : "Authorization",
          "value" : "Bearer eyJ0eXAiOiJKV1QiLCJhbGciOiJIUzI1NiJ9.eyJ1bmlxdWVfbmFtZSI6ImFkbWluIiwicm9sZSI6InVzZXIiLCJzdWIiOiJhZG1pbiIsImlzcyI6IkNyb3BNZXRyaWNzIiwiYXVkIjoiYWxsIiwiZXhwIjoxNTU0MTI5ODE4LCJuYmYiOjE1NTQxMjU5MTh9.Z3ZUwTWJ5Uug79waVvRToyp5Xls247IUsT1t0y6oCfw"
        }, {
          "name" : "Host",
          "value" : "localhost:10520"
        }, {
          "name" : "Accept",
          "value" : "text/html, image/gif, image/jpeg, *; q=.2, */*; q=.2"
        }, {
          "name" : "Proxy-Connection",
          "value" : "keep-alive"
        }, {
          "name" : "Content-Length",
          "value" : "298"
        } ],
        "queryString" : [ ],
        "postData" : {
          "mimeType" : "application/x-www-form-urlencoded",
          "params" : [ {
            "name" : "password",
            "value" : "cropmetrics",
            "comment" : ""
          }, {
            "name" : "email",
            "value" : "cropmetricsvo.zipchar@gmail.com",
            "comment" : ""
          }, {
            "name" : "fullname",
            "value" : "test validation",
            "comment" : ""
          }, {
            "name" : "phone",
            "value" : "123",
            "comment" : ""
          }, {
            "name" : "dealer",
            "value" : "x",
            "comment" : ""
          }, {
            "name" : "addressLine1",
            "value" : "address line 1 test validation",
            "comment" : ""
          }, {
            "name" : "addressLine2",
            "value" : "address line 2 test validation",
            "comment" : ""
          }, {
            "name" : "town",
            "value" : "townValidation",
            "comment" : ""
          }, {
            "name" : "state",
            "value" : "stateValidation",
            "comment" : ""
          }, {
            "name" : "zip",
            "value" : "ten",
            "comment" : ""
          }, {
            "name" : "country",
            "value" : "countryValidation",
            "comment" : ""
          }, {
            "name" : "roles",
            "value" : "Client",
            "comment" : ""
          }, {
            "name" : "userProfileId",
            "value" : "31",
            "comment" : ""
          } ],
          "comment" : ""
        },
        "headersSize" : 545,
        "bodySize" : 298,
        "comment" : ""
      },
      "response" : {
        "status" : 200,
        "statusText" : "OK",
        "httpVersion" : "HTTP/1.1",
        "cookies" : [ {
          "name" : ".ASPROLES",
          "value" : "u2wB5dL1mGEFap9Z3hqpE9VcQLfT2bvq0WWR_fsH9HBN7F-vSmLHEacrbbBZCyRK7lFvEK9ihvL7h94Bi5TFgu3SwaxaWr2C6swOk-eAWk29DkJ-Qdn2KWmNKZCOb2Az5L5WALCRNCQq6f-v129X6y7ohQbdULc0Lpu_v5DE11p7lW459HiGc5QIzUaVK1OBllxJNFix9zFZ5jZ7RfcO5hs1Anc-Efhi5qycA591Jh1yI07KoLwQsRrcwit45y5pBkOl-Uulhiue5-Ede3O-CXEfKNfr9A2P0Xc6nzFgGIU3FRQj-DX8Ck-26eWIulX2jR7GxDNeOU7UQ8nL3oknic5EKkd3dQm1JRxt8EJ1_HrWw5mTvB0R-na3uf1ZHORFBSdN6H_jNA6xuu1Nk6TxoWsAQA-P67SxfoAb4-13iZCZRwlEoNrJdIIEyhUobtgCvgBrwrwNj8XlPoDS2sNxOhQggoFn4MfW-zCKllvfwhe2Hk1M0",
          "path" : "/",
          "httpOnly" : true,
          "secure" : false,
          "comment" : ""
        } ],
        "headers" : [ {
          "name" : "Cache-Control",
          "value" : "private"
        }, {
          "name" : "Server",
          "value" : "Microsoft-IIS/10.0"
        }, {
          "name" : "Set-Cookie",
          "value" : ".ASPROLES=u2wB5dL1mGEFap9Z3hqpE9VcQLfT2bvq0WWR_fsH9HBN7F-vSmLHEacrbbBZCyRK7lFvEK9ihvL7h94Bi5TFgu3SwaxaWr2C6swOk-eAWk29DkJ-Qdn2KWmNKZCOb2Az5L5WALCRNCQq6f-v129X6y7ohQbdULc0Lpu_v5DE11p7lW459HiGc5QIzUaVK1OBllxJNFix9zFZ5jZ7RfcO5hs1Anc-Efhi5qycA591Jh1yI07KoLwQsRrcwit45y5pBkOl-Uulhiue5-Ede3O-CXEfKNfr9A2P0Xc6nzFgGIU3FRQj-DX8Ck-26eWIulX2jR7GxDNeOU7UQ8nL3oknic5EKkd3dQm1JRxt8EJ1_HrWw5mTvB0R-na3uf1ZHORFBSdN6H_jNA6xuu1Nk6TxoWsAQA-P67SxfoAb4-13iZCZRwlEoNrJdIIEyhUobtgCvgBrwrwNj8XlPoDS2sNxOhQggoFn4MfW-zCKllvfwhe2Hk1M0; path=/; HttpOnly"
        }, {
          "name" : "X-SourceFiles",
          "value" : "=?UTF-8?B?RDpcVmlydHVhbE9wdGltaXplci1SZWZhY3RvcmluZ1xDcm9wTWV0cmljcy5Wby5BcGlcQ3JvcE1ldHJpY3MuVm8uQXBpXGFwaVxhZG1pblx2MVx1c2Vyc1wzMQ==?="
        }, {
          "name" : "X-Powered-By",
          "value" : "ASP.NET"
        }, {
          "name" : "Date",
          "value" : "Mon, 01 Apr 2019 13:38:40 GMT"
        }, {
          "name" : "Content-Length",
          "value" : "0"
        } ],
        "content" : {
          "size" : 0,
          "mimeType" : "",
          "text" : "",
          "encoding" : "base64",
          "comment" : ""
        },
        "redirectURL" : "",
        "headersSize" : 844,
        "bodySize" : 0,
        "comment" : ""
      },
      "cache" : { },
      "timings" : {
        "comment" : "",
        "blocked" : -1,
        "connect" : -1,
        "dns" : -1,
        "ssl" : -1,
        "send" : 0,
        "wait" : 2078,
        "receive" : 0
      },
      "serverIPAddress" : "127.0.0.1",
      "comment" : "",
      "_katalonRequestInformation" : {
        "name" : "53",
        "testObjectId" : "Object Repository/VoPro/Account/api_admin_v1_users_userprofileid",
        "harId" : "17dbb87e-12d5-4f65-8bc8-7b1312fa6e49"
      },
      "time" : 2079
    } ],
    "comment" : ""
  }
}