{
  "log" : {
    "version" : "1.2",
    "creator" : {
      "name" : "BrowserMob Proxy",
      "version" : "2.1.5",
      "comment" : ""
    },
    "pages" : [ {
      "id" : "Page 0",
      "startedDateTime" : "2019-03-29T22:26:48.856Z",
      "title" : "Page 0",
      "pageTimings" : {
        "onLoad" : 1827,
        "comment" : ""
      },
      "comment" : ""
    } ],
    "entries" : [ {
      "pageref" : "Page 0",
      "startedDateTime" : "2019-03-29T22:26:48.857Z",
      "request" : {
        "method" : "POST",
        "url" : "http://localhost:10520/WebAPI/api/admin/v1/users/?",
        "httpVersion" : "HTTP/1.1",
        "cookies" : [ ],
        "headers" : [ {
          "name" : "User-Agent",
          "value" : "Katalon Studio"
        }, {
          "name" : "Content-Type",
          "value" : "application/x-www-form-urlencoded"
        }, {
          "name" : "Authorization",
          "value" : "Bearer eyJ0eXAiOiJKV1QiLCJhbGciOiJIUzI1NiJ9.eyJ1bmlxdWVfbmFtZSI6ImFkbWluIiwicm9sZSI6InVzZXIiLCJzdWIiOiJhZG1pbiIsImlzcyI6IkNyb3BNZXRyaWNzIiwiYXVkIjoiYWxsIiwiZXhwIjoxNTUzOTAyMzA4LCJuYmYiOjE1NTM4OTg0MDh9.uMZueSV8w8FJebQbmXeT14Wi_OTzQuNLY8qMFN8rL5Y"
        }, {
          "name" : "Host",
          "value" : "localhost:10520"
        }, {
          "name" : "Accept",
          "value" : "text/html, image/gif, image/jpeg, *; q=.2, */*; q=.2"
        }, {
          "name" : "Proxy-Connection",
          "value" : "keep-alive"
        }, {
          "name" : "Content-Length",
          "value" : "657"
        } ],
        "queryString" : [ ],
        "postData" : {
          "mimeType" : "application/x-www-form-urlencoded",
          "params" : [ {
            "name" : "password",
            "value" : "cropmetrics",
            "comment" : ""
          }, {
            "name" : "email",
            "value" : "cropmetricsvo.addressline2long@gmail.com",
            "comment" : ""
          }, {
            "name" : "fullname",
            "value" : "x",
            "comment" : ""
          }, {
            "name" : "phone",
            "value" : "1",
            "comment" : ""
          }, {
            "name" : "dealer",
            "value" : "xx",
            "comment" : ""
          }, {
            "name" : "addressLine1",
            "value" : "xx",
            "comment" : ""
          }, {
            "name" : "addressLine2",
            "value" : "16 API_ACNT_When_new_account_have_long_addressline2_attribute_Expected_status_code_20016 API_ACNT_When_new_account_have_long_addressline2_attribute_Expected_status_code_20016 API_ACNT_When_new_account_have_long_addressline2_attribute_Expected_status_code_20016 API_ACNT_When_new_account_have_long_addressline2_attribute_Expected_status_code_20016 API_ACNT_When_new_account_have_long_addressline2_attribute_Expected_status_code_200",
            "comment" : ""
          }, {
            "name" : "town",
            "value" : "townValidation",
            "comment" : ""
          }, {
            "name" : "state",
            "value" : "stateValidation",
            "comment" : ""
          }, {
            "name" : "zip",
            "value" : "zipValidation",
            "comment" : ""
          }, {
            "name" : "country",
            "value" : "countryValidation",
            "comment" : ""
          }, {
            "name" : "roles",
            "value" : "Client",
            "comment" : ""
          } ],
          "comment" : ""
        },
        "headersSize" : 544,
        "bodySize" : 657,
        "comment" : ""
      },
      "response" : {
        "status" : 200,
        "statusText" : "OK",
        "httpVersion" : "HTTP/1.1",
        "cookies" : [ {
          "name" : ".ASPROLES",
          "value" : "CsNAaH6rbJLXCv7AlMcVuzP9PRCn9wfYKvsIqzNBzVThqxI-dIb6GBlQ36P0PmuQxRm7wphXT3lGgLrpizd_S_UFxclRJTeSjFtJravpH4zTXlueOr8wW7aQm1iXQ8sEQRmHBo9H-vzrWVzsB08vBv6mrLGc3ujqBddGbLPxjLdmAXm4zGXjCeRBjzuFq_dFTtKxeqz8CC6KgmEFJ17rRweOkm3IIoGouptKXNTqFMwiKe7Dm0DbBnHUUIt8cQSq7RjVlesLD0ve3ftHhYagQciF2WIUQ4GeTMWU0X2Ppcjh-X9fowVxS66N_mUUspb9dgbdjO3KVCEuPrcsn8I1WedShzm2g_-Q9qzTl6tZul2287CyEhnFvOMsbOMVEHjFrAjZ-JUzHNNWehpOT3ZZbjlDD5JosYT0OVOELdpeb4xV5oe_gZ2FibSZ9jTU4y2aQuSk6nj6Tfm7Ab7svMvDCRKfQHfKGQ5UvhXCX8ucf6s-SAxx0",
          "path" : "/",
          "httpOnly" : true,
          "secure" : false,
          "comment" : ""
        } ],
        "headers" : [ {
          "name" : "Cache-Control",
          "value" : "private"
        }, {
          "name" : "Content-Type",
          "value" : "application/json; charset=utf-8"
        }, {
          "name" : "Server",
          "value" : "Microsoft-IIS/10.0"
        }, {
          "name" : "Set-Cookie",
          "value" : ".ASPROLES=CsNAaH6rbJLXCv7AlMcVuzP9PRCn9wfYKvsIqzNBzVThqxI-dIb6GBlQ36P0PmuQxRm7wphXT3lGgLrpizd_S_UFxclRJTeSjFtJravpH4zTXlueOr8wW7aQm1iXQ8sEQRmHBo9H-vzrWVzsB08vBv6mrLGc3ujqBddGbLPxjLdmAXm4zGXjCeRBjzuFq_dFTtKxeqz8CC6KgmEFJ17rRweOkm3IIoGouptKXNTqFMwiKe7Dm0DbBnHUUIt8cQSq7RjVlesLD0ve3ftHhYagQciF2WIUQ4GeTMWU0X2Ppcjh-X9fowVxS66N_mUUspb9dgbdjO3KVCEuPrcsn8I1WedShzm2g_-Q9qzTl6tZul2287CyEhnFvOMsbOMVEHjFrAjZ-JUzHNNWehpOT3ZZbjlDD5JosYT0OVOELdpeb4xV5oe_gZ2FibSZ9jTU4y2aQuSk6nj6Tfm7Ab7svMvDCRKfQHfKGQ5UvhXCX8ucf6s-SAxx0; path=/; HttpOnly"
        }, {
          "name" : "X-SourceFiles",
          "value" : "=?UTF-8?B?RDpcVmlydHVhbE9wdGltaXplci1SZWZhY3RvcmluZ1xDcm9wTWV0cmljcy5Wby5BcGlcQ3JvcE1ldHJpY3MuVm8uQXBpXGFwaVxhZG1pblx2MVx1c2Vyc1w=?="
        }, {
          "name" : "X-Powered-By",
          "value" : "ASP.NET"
        }, {
          "name" : "Date",
          "value" : "Fri, 29 Mar 2019 22:26:50 GMT"
        }, {
          "name" : "Content-Length",
          "value" : "9"
        } ],
        "content" : {
          "size" : 9,
          "mimeType" : "application/json; charset=utf-8",
          "text" : "{\"id\":23}",
          "comment" : ""
        },
        "redirectURL" : "",
        "headersSize" : 887,
        "bodySize" : 9,
        "comment" : ""
      },
      "cache" : { },
      "timings" : {
        "comment" : "",
        "ssl" : -1,
        "wait" : 1822,
        "send" : 0,
        "receive" : 0,
        "dns" : -1,
        "connect" : -1,
        "blocked" : -1
      },
      "serverIPAddress" : "127.0.0.1",
      "comment" : "",
      "_katalonRequestInformation" : {
        "name" : "67",
        "testObjectId" : "Object Repository/VoPro/Account/api_admin_v1_users",
        "harId" : "42618203-79cb-436f-bbd7-278ac7dfc3b3"
      },
      "time" : 1823
    } ],
    "comment" : ""
  }
}