{
  "log" : {
    "version" : "1.2",
    "creator" : {
      "name" : "BrowserMob Proxy",
      "version" : "2.1.5",
      "comment" : ""
    },
    "pages" : [ {
      "id" : "Page 0",
      "startedDateTime" : "2019-04-11T16:42:50.636Z",
      "title" : "Page 0",
      "pageTimings" : {
        "onLoad" : 3183,
        "comment" : ""
      },
      "comment" : ""
    } ],
    "entries" : [ {
      "pageref" : "Page 0",
      "startedDateTime" : "2019-04-11T16:42:50.637Z",
      "request" : {
        "method" : "POST",
        "url" : "http://localhost:10520/WebAPI/api/mobile/v1/fields?",
        "httpVersion" : "HTTP/1.1",
        "cookies" : [ ],
        "headers" : [ {
          "name" : "User-Agent",
          "value" : "Katalon Studio"
        }, {
          "name" : "Content-Type",
          "value" : "application/json"
        }, {
          "name" : "Authorization",
          "value" : "Bearer eyJ0eXAiOiJKV1QiLCJhbGciOiJIUzI1NiJ9.eyJ1bmlxdWVfbmFtZSI6Implbm55Lm1hbGRvbmFkby50eDFAZ21haWwuY29tIiwicm9sZSI6InVzZXIiLCJzdWIiOiJqZW5ueS5tYWxkb25hZG8udHgxQGdtYWlsLmNvbSIsImlzcyI6IkNyb3BNZXRyaWNzIiwiYXVkIjoiYWxsIiwiZXhwIjoxNTU1MDA0ODcwLCJuYmYiOjE1NTUwMDA5NzB9.D5bPCTYOY1M9cu4Zx3Sz-ubmK7AEcTJo855tWTlU5AI"
        }, {
          "name" : "Host",
          "value" : "localhost:10520"
        }, {
          "name" : "Accept",
          "value" : "text/html, image/gif, image/jpeg, *; q=.2, */*; q=.2"
        }, {
          "name" : "Proxy-Connection",
          "value" : "keep-alive"
        }, {
          "name" : "Content-Length",
          "value" : "402"
        } ],
        "queryString" : [ ],
        "postData" : {
          "mimeType" : "application/json",
          "text" : "{\"field\":{\"farm_id\":3,\"name\":\"Field added on farm disabled\",\"boundary\":{\"boundaries\":[{\"boundary\":{\"coords\":[{\"x\":-101.49568751,\"y\":37.14976293},{\"x\":-101.50049403,\"y\":37.14647907},{\"x\":-101.50049403,\"y\":37.14264773},{\"x\":-101.49723246,\"y\":37.1411425},{\"x\":-101.49019435,\"y\":37.14223722},{\"x\":-101.48933604,\"y\":37.14620541},{\"x\":-101.49294093,\"y\":37.14866833},{\"x\":-101.49568751,\"y\":37.14976293}]}}]}}}",
          "comment" : ""
        },
        "headersSize" : 592,
        "bodySize" : 402,
        "comment" : ""
      },
      "response" : {
        "status" : 400,
        "statusText" : "Bad Request",
        "httpVersion" : "HTTP/1.1",
        "cookies" : [ {
          "name" : ".ASPROLES",
          "value" : "ob_8-Xcn2UC6VC3fwIaJUn1rs51_m7FIdhCH_wlILirrSOKKQchIc-NHfPe5C-1Ww_oi-YQaUiyuRc4esvVJM2o0BbuO0kZO1ZD-BSycMSKVdSKzo9Dv7PzY1-rtkjusC7MpF5bZK2B7CjjoTXhK0T-M7kLpUxzNJB4ccqW3PFNgyIPOmOqEm7KsxJVOwR3k4zzghAoj-KfnNqIF-N-aA1UYn0WB0pVpZ-fun2b-1NrYFIDalTN1Nb5ehsVuh7RWoUtOe752DEEb8zUGaX7Nvl2KupA_En5mGsrEjNLXNSv1f_hcIeBgt8t6WwsqlZG-Ys6XYyNc3eivUpjgko6SWl0fKmnJIbm9DKzhHLxMPnmqP90v5DE-zydSpnysp7cjC_zjSJj3htU2g_qCJ3YSLHeBzV0hMaxT7_1YmSvEBXvodb1Upx0l2ZUZwEPfdMFxYd39qP5upM36CNtV-SyHw0OUxFMqF--L4k90ee_dj7CCWZr8LEmrd7elQDftF-u6crbo7u2ndM-e8JY9aP9bA2ox2v41",
          "path" : "/",
          "httpOnly" : true,
          "secure" : false,
          "comment" : ""
        } ],
        "headers" : [ {
          "name" : "Cache-Control",
          "value" : "private"
        }, {
          "name" : "Content-Type",
          "value" : "application/json; charset=utf-8"
        }, {
          "name" : "Server",
          "value" : "Microsoft-IIS/10.0"
        }, {
          "name" : "Set-Cookie",
          "value" : ".ASPROLES=ob_8-Xcn2UC6VC3fwIaJUn1rs51_m7FIdhCH_wlILirrSOKKQchIc-NHfPe5C-1Ww_oi-YQaUiyuRc4esvVJM2o0BbuO0kZO1ZD-BSycMSKVdSKzo9Dv7PzY1-rtkjusC7MpF5bZK2B7CjjoTXhK0T-M7kLpUxzNJB4ccqW3PFNgyIPOmOqEm7KsxJVOwR3k4zzghAoj-KfnNqIF-N-aA1UYn0WB0pVpZ-fun2b-1NrYFIDalTN1Nb5ehsVuh7RWoUtOe752DEEb8zUGaX7Nvl2KupA_En5mGsrEjNLXNSv1f_hcIeBgt8t6WwsqlZG-Ys6XYyNc3eivUpjgko6SWl0fKmnJIbm9DKzhHLxMPnmqP90v5DE-zydSpnysp7cjC_zjSJj3htU2g_qCJ3YSLHeBzV0hMaxT7_1YmSvEBXvodb1Upx0l2ZUZwEPfdMFxYd39qP5upM36CNtV-SyHw0OUxFMqF--L4k90ee_dj7CCWZr8LEmrd7elQDftF-u6crbo7u2ndM-e8JY9aP9bA2ox2v41; path=/; HttpOnly"
        }, {
          "name" : "X-SourceFiles",
          "value" : "=?UTF-8?B?RDpcVmlydHVhbE9wdGltaXplci1SZWZhY3RvcmluZ1xDcm9wTWV0cmljcy5Wby5BcGlcQ3JvcE1ldHJpY3MuVm8uQXBpXGFwaVxtb2JpbGVcdjFcZmllbGRz?="
        }, {
          "name" : "X-Powered-By",
          "value" : "ASP.NET"
        }, {
          "name" : "Date",
          "value" : "Thu, 11 Apr 2019 16:42:53 GMT"
        }, {
          "name" : "Content-Length",
          "value" : "39"
        } ],
        "content" : {
          "size" : 39,
          "mimeType" : "application/json; charset=utf-8",
          "text" : "{\"message\":\"The farm id is not valid.\"}",
          "comment" : ""
        },
        "redirectURL" : "",
        "headersSize" : 940,
        "bodySize" : 39,
        "comment" : ""
      },
      "cache" : { },
      "timings" : {
        "comment" : "",
        "send" : 0,
        "wait" : 3179,
        "receive" : 0,
        "connect" : -1,
        "blocked" : -1,
        "dns" : -1,
        "ssl" : -1
      },
      "serverIPAddress" : "127.0.0.1",
      "comment" : "",
      "_katalonRequestInformation" : {
        "name" : "70",
        "testObjectId" : "Object Repository/VoGrow/Field/FieldPost",
        "harId" : "02b9548b-8191-4d88-9785-fa9b6d31dd64"
      },
      "time" : 3180
    } ],
    "comment" : ""
  }
}