{
  "log" : {
    "version" : "1.2",
    "creator" : {
      "name" : "BrowserMob Proxy",
      "version" : "2.1.5",
      "comment" : ""
    },
    "pages" : [ {
      "id" : "Page 0",
      "startedDateTime" : "2019-03-28T20:24:36.676Z",
      "title" : "Page 0",
      "pageTimings" : {
        "onLoad" : 46,
        "comment" : ""
      },
      "comment" : ""
    } ],
    "entries" : [ {
      "pageref" : "Page 0",
      "startedDateTime" : "2019-03-28T20:24:36.677Z",
      "request" : {
        "method" : "POST",
        "url" : "http://localhost:10520/WebAPI/api/admin/v1/users/?",
        "httpVersion" : "HTTP/1.1",
        "cookies" : [ ],
        "headers" : [ {
          "name" : "User-Agent",
          "value" : "Katalon Studio"
        }, {
          "name" : "Content-Type",
          "value" : "application/x-www-form-urlencoded"
        }, {
          "name" : "Authorization",
          "value" : "Bearer eyJ0eXAiOiJKV1QiLCJhbGciOiJIUzI1NiJ9.eyJ1bmlxdWVfbmFtZSI6ImFkbWluIiwicm9sZSI6InVzZXIiLCJzdWIiOiJhZG1pbiIsImlzcyI6IkNyb3BNZXRyaWNzIiwiYXVkIjoiYWxsIiwiZXhwIjoxNTUzODA4NTc2LCJuYmYiOjE1NTM4MDQ2NzZ9.J4jAdZIvqzSRVBlcA6ocLIpCz_qmdjdfGroHBubAoBA"
        }, {
          "name" : "Host",
          "value" : "localhost:10520"
        }, {
          "name" : "Accept",
          "value" : "text/html, image/gif, image/jpeg, *; q=.2, */*; q=.2"
        }, {
          "name" : "Proxy-Connection",
          "value" : "keep-alive"
        }, {
          "name" : "Content-Length",
          "value" : "263"
        } ],
        "queryString" : [ ],
        "postData" : {
          "mimeType" : "application/x-www-form-urlencoded",
          "params" : [ {
            "name" : "password",
            "value" : "cropmetrics",
            "comment" : ""
          }, {
            "name" : "email",
            "value" : "cropmetricsvo.rolenumber@gmail.com",
            "comment" : ""
          }, {
            "name" : "fullname",
            "value" : "test validation",
            "comment" : ""
          }, {
            "name" : "phone",
            "value" : "123",
            "comment" : ""
          }, {
            "name" : "dealer",
            "value" : "x",
            "comment" : ""
          }, {
            "name" : "addressLine1",
            "value" : "address line 1 test validation",
            "comment" : ""
          }, {
            "name" : "addressLine2",
            "value" : "address line 2 test validation",
            "comment" : ""
          }, {
            "name" : "town",
            "value" : "townValidation",
            "comment" : ""
          }, {
            "name" : "state",
            "value" : "stateValidation",
            "comment" : ""
          }, {
            "name" : "zip",
            "value" : "xx",
            "comment" : ""
          }, {
            "name" : "country",
            "value" : "xx",
            "comment" : ""
          }, {
            "name" : "roles",
            "value" : "1",
            "comment" : ""
          } ],
          "comment" : ""
        },
        "headersSize" : 544,
        "bodySize" : 263,
        "comment" : ""
      },
      "response" : {
        "status" : 400,
        "statusText" : "Bad Request",
        "httpVersion" : "HTTP/1.1",
        "cookies" : [ {
          "name" : ".ASPROLES",
          "value" : "XUAdUemRbbbCfCOD0jKlzIm87CftEBGK8pRRzzupOblHLCuBWioz1hqLXiD5WDOGGl3zIxqEbgPtRzahjC7K6m6E7C1ZOdKN4aqVYHYpg7kZPUX1T9yQCtDoRBG__Cscp0zyH5uH262tneq2xPMewvygCv6LnIvksbFXpXNFjLixdTVsvVUv-P3Q1nO_hilswddH6JCOTaIdhsktA-bjLTUhuLW7PialU13iu0YhmoQMHXsWhbUvfq0Us3-xHyTi246VNr2nKnBqj1nZFXcaBrsbWqngslzoIhowNWg0ROSqIRHmsNi7cjddGgYVfRdiBOgt4rNrk9JRveRl8vIrZ_JaF3rr8I27AVNERlORwNCCESqmQy1OaeZmVewnnEN9MevukYmowSLDonm53ryEptDs7D9Cnfc7K0CR0uVkixJUooAFTaqlw5ENcZxwwIvKM5IKCBb8LIb8yy03_yhBH93-TwhosURs5vDaQ-r9vGAUp3Y40",
          "path" : "/",
          "httpOnly" : true,
          "secure" : false,
          "comment" : ""
        } ],
        "headers" : [ {
          "name" : "Cache-Control",
          "value" : "private"
        }, {
          "name" : "Content-Type",
          "value" : "application/json; charset=utf-8"
        }, {
          "name" : "Server",
          "value" : "Microsoft-IIS/10.0"
        }, {
          "name" : "Set-Cookie",
          "value" : ".ASPROLES=XUAdUemRbbbCfCOD0jKlzIm87CftEBGK8pRRzzupOblHLCuBWioz1hqLXiD5WDOGGl3zIxqEbgPtRzahjC7K6m6E7C1ZOdKN4aqVYHYpg7kZPUX1T9yQCtDoRBG__Cscp0zyH5uH262tneq2xPMewvygCv6LnIvksbFXpXNFjLixdTVsvVUv-P3Q1nO_hilswddH6JCOTaIdhsktA-bjLTUhuLW7PialU13iu0YhmoQMHXsWhbUvfq0Us3-xHyTi246VNr2nKnBqj1nZFXcaBrsbWqngslzoIhowNWg0ROSqIRHmsNi7cjddGgYVfRdiBOgt4rNrk9JRveRl8vIrZ_JaF3rr8I27AVNERlORwNCCESqmQy1OaeZmVewnnEN9MevukYmowSLDonm53ryEptDs7D9Cnfc7K0CR0uVkixJUooAFTaqlw5ENcZxwwIvKM5IKCBb8LIb8yy03_yhBH93-TwhosURs5vDaQ-r9vGAUp3Y40; path=/; HttpOnly"
        }, {
          "name" : "X-SourceFiles",
          "value" : "=?UTF-8?B?RDpcVmlydHVhbE9wdGltaXplci1SZWZhY3RvcmluZ1xDcm9wTWV0cmljcy5Wby5BcGlcQ3JvcE1ldHJpY3MuVm8uQXBpXGFwaVxhZG1pblx2MVx1c2Vyc1w=?="
        }, {
          "name" : "X-Powered-By",
          "value" : "ASP.NET"
        }, {
          "name" : "Date",
          "value" : "Thu, 28 Mar 2019 20:24:35 GMT"
        }, {
          "name" : "Content-Length",
          "value" : "85"
        } ],
        "content" : {
          "size" : 85,
          "mimeType" : "application/json; charset=utf-8",
          "text" : "{\"message\":\"The request is invalid. The role  1 requested to assign is not a valid.\"}",
          "comment" : ""
        },
        "redirectURL" : "",
        "headersSize" : 897,
        "bodySize" : 85,
        "comment" : ""
      },
      "cache" : { },
      "timings" : {
        "comment" : "",
        "wait" : 42,
        "dns" : -1,
        "blocked" : -1,
        "connect" : -1,
        "receive" : 0,
        "send" : 0,
        "ssl" : -1
      },
      "serverIPAddress" : "127.0.0.1",
      "comment" : "",
      "_katalonRequestInformation" : {
        "name" : "97",
        "testObjectId" : "Object Repository/VoPro/Account/api_admin_v1_users",
        "harId" : "bc5ac5db-79b3-4b3a-abbc-c57fc1cdbaa7"
      },
      "time" : 43
    } ],
    "comment" : ""
  }
}