{
  "log" : {
    "version" : "1.2",
    "creator" : {
      "name" : "BrowserMob Proxy",
      "version" : "2.1.5",
      "comment" : ""
    },
    "pages" : [ {
      "id" : "Page 0",
      "startedDateTime" : "2019-04-09T09:31:23.303Z",
      "title" : "Page 0",
      "pageTimings" : {
        "onLoad" : 24,
        "comment" : ""
      },
      "comment" : ""
    } ],
    "entries" : [ {
      "pageref" : "Page 0",
      "startedDateTime" : "2019-04-09T09:31:23.304Z",
      "request" : {
        "method" : "PUT",
        "url" : "http://localhost:10520/WebAPI/api/mobile/v1/farms/7?",
        "httpVersion" : "HTTP/1.1",
        "cookies" : [ ],
        "headers" : [ {
          "name" : "User-Agent",
          "value" : "Katalon Studio"
        }, {
          "name" : "Content-Type",
          "value" : "application/json"
        }, {
          "name" : "Authorization",
          "value" : "Bearer eyJ0eXAiOiJKV1QiLCJhbGciOiJIUzI1NiJ9.eyJ1bmlxdWVfbmFtZSI6Implbm55Lm1hbGRvbmFkby50eDFAZ21haWwuY29tIiwicm9sZSI6InVzZXIiLCJzdWIiOiJqZW5ueS5tYWxkb25hZG8udHgxQGdtYWlsLmNvbSIsImlzcyI6IkNyb3BNZXRyaWNzIiwiYXVkIjoiYWxsIiwiZXhwIjoxNTU0ODA2MTgzLCJuYmYiOjE1NTQ4MDIyODN9.fPuGI0__Y7XbSvavgG5bcq9WlzgjWq5m3hkMZOKipRg"
        }, {
          "name" : "Host",
          "value" : "localhost:10520"
        }, {
          "name" : "Accept",
          "value" : "text/html, image/gif, image/jpeg, *; q=.2, */*; q=.2"
        }, {
          "name" : "Proxy-Connection",
          "value" : "keep-alive"
        }, {
          "name" : "Content-Length",
          "value" : "22"
        } ],
        "queryString" : [ ],
        "postData" : {
          "mimeType" : "application/json",
          "text" : "{\"name\": \"5555555555\"}",
          "comment" : ""
        },
        "headersSize" : 591,
        "bodySize" : 22,
        "comment" : ""
      },
      "response" : {
        "status" : 200,
        "statusText" : "OK",
        "httpVersion" : "HTTP/1.1",
        "cookies" : [ {
          "name" : ".ASPROLES",
          "value" : "wMbUX0U1Wd8No_HyrIFpcpnCdjvw-PNL_RH_gdRIM8bqzxP6vCTZ00mknzWn94kqTItcPxz0kHrkH7paN-QWRcG31nAfL29VQYFFQXqvWMg7Dw5GZ9z6ZuRYi0QUqb2gGbZ8ThQT5bRZvKMjLyayFB3wSrqu4DTTeC2A2AG_Icu0VWVQ__Gm5tSsoWpK-cOyrdSnf1Ky1se94h_82ZVTjuB_vMpifyLEsZ9JRmVXfaUonxhdE5LWqTp3VfBeWDjPAhmeyEV8jYIbsnNXQl0LhfhFNQ57wWXu3a04OsyK51j0B88DdZLV0KPBnOuGjMRU5dhKTSY_avTjlGV3jy8LW_56uSljAzKnP6vYAqJ5YSx3v5OhG4_zAtc5Vs___cuijmOE99XkrcCuKDKLxop91Iu9Qnr7Vx7pFfK1YVV4PMsCtxYgrpN-v79vwTzd8e18t-jK2H8LUpBx-Qx7npZf537rmS6AGnMgfMmD0LQrN8VKhzUoh0LMXbizPdv5xXY0GnaLBc1aguioyze00nY2g31M-JU1",
          "path" : "/",
          "httpOnly" : true,
          "secure" : false,
          "comment" : ""
        } ],
        "headers" : [ {
          "name" : "Cache-Control",
          "value" : "private"
        }, {
          "name" : "Content-Type",
          "value" : "application/json; charset=utf-8"
        }, {
          "name" : "Server",
          "value" : "Microsoft-IIS/10.0"
        }, {
          "name" : "Set-Cookie",
          "value" : ".ASPROLES=wMbUX0U1Wd8No_HyrIFpcpnCdjvw-PNL_RH_gdRIM8bqzxP6vCTZ00mknzWn94kqTItcPxz0kHrkH7paN-QWRcG31nAfL29VQYFFQXqvWMg7Dw5GZ9z6ZuRYi0QUqb2gGbZ8ThQT5bRZvKMjLyayFB3wSrqu4DTTeC2A2AG_Icu0VWVQ__Gm5tSsoWpK-cOyrdSnf1Ky1se94h_82ZVTjuB_vMpifyLEsZ9JRmVXfaUonxhdE5LWqTp3VfBeWDjPAhmeyEV8jYIbsnNXQl0LhfhFNQ57wWXu3a04OsyK51j0B88DdZLV0KPBnOuGjMRU5dhKTSY_avTjlGV3jy8LW_56uSljAzKnP6vYAqJ5YSx3v5OhG4_zAtc5Vs___cuijmOE99XkrcCuKDKLxop91Iu9Qnr7Vx7pFfK1YVV4PMsCtxYgrpN-v79vwTzd8e18t-jK2H8LUpBx-Qx7npZf537rmS6AGnMgfMmD0LQrN8VKhzUoh0LMXbizPdv5xXY0GnaLBc1aguioyze00nY2g31M-JU1; path=/; HttpOnly"
        }, {
          "name" : "X-SourceFiles",
          "value" : "=?UTF-8?B?RDpcVmlydHVhbE9wdGltaXplci1SZWZhY3RvcmluZ1xDcm9wTWV0cmljcy5Wby5BcGlcQ3JvcE1ldHJpY3MuVm8uQXBpXGFwaVxtb2JpbGVcdjFcZmFybXNcNw==?="
        }, {
          "name" : "X-Powered-By",
          "value" : "ASP.NET"
        }, {
          "name" : "Date",
          "value" : "Tue, 09 Apr 2019 09:31:22 GMT"
        }, {
          "name" : "Content-Length",
          "value" : "40"
        } ],
        "content" : {
          "size" : 40,
          "mimeType" : "application/json; charset=utf-8",
          "text" : "{\"id\":7,\"name\":\"5555555555\",\"user_id\":3}",
          "comment" : ""
        },
        "redirectURL" : "",
        "headersSize" : 935,
        "bodySize" : 40,
        "comment" : ""
      },
      "cache" : { },
      "timings" : {
        "comment" : "",
        "ssl" : -1,
        "receive" : 0,
        "blocked" : -1,
        "connect" : -1,
        "send" : 0,
        "wait" : 19,
        "dns" : -1
      },
      "serverIPAddress" : "127.0.0.1",
      "comment" : "",
      "_katalonRequestInformation" : {
        "name" : "29",
        "testObjectId" : "Object Repository/VoGrow/Farm/FarmPut",
        "harId" : "cbc40d66-770d-4acf-9cb8-9a15e45a55de"
      },
      "time" : 20
    } ],
    "comment" : ""
  }
}