{
  "log" : {
    "version" : "1.2",
    "creator" : {
      "name" : "BrowserMob Proxy",
      "version" : "2.1.5",
      "comment" : ""
    },
    "pages" : [ {
      "id" : "Page 0",
      "startedDateTime" : "2019-04-11T16:43:06.525Z",
      "title" : "Page 0",
      "pageTimings" : {
        "onLoad" : 3229,
        "comment" : ""
      },
      "comment" : ""
    } ],
    "entries" : [ {
      "pageref" : "Page 0",
      "startedDateTime" : "2019-04-11T16:43:06.526Z",
      "request" : {
        "method" : "POST",
        "url" : "http://localhost:10520/WebAPI/api/mobile/v1/fields?",
        "httpVersion" : "HTTP/1.1",
        "cookies" : [ ],
        "headers" : [ {
          "name" : "User-Agent",
          "value" : "Katalon Studio"
        }, {
          "name" : "Content-Type",
          "value" : "application/json"
        }, {
          "name" : "Authorization",
          "value" : "Bearer eyJ0eXAiOiJKV1QiLCJhbGciOiJIUzI1NiJ9.eyJ1bmlxdWVfbmFtZSI6Implbm55Lm1hbGRvbmFkby50eDFAZ21haWwuY29tIiwicm9sZSI6InVzZXIiLCJzdWIiOiJqZW5ueS5tYWxkb25hZG8udHgxQGdtYWlsLmNvbSIsImlzcyI6IkNyb3BNZXRyaWNzIiwiYXVkIjoiYWxsIiwiZXhwIjoxNTU1MDA0ODg2LCJuYmYiOjE1NTUwMDA5ODZ9.KmFh60fobUY-e8BEGeJygkO7ghGPzG6e5odmGMyFhkg"
        }, {
          "name" : "Host",
          "value" : "localhost:10520"
        }, {
          "name" : "Accept",
          "value" : "text/html, image/gif, image/jpeg, *; q=.2, */*; q=.2"
        }, {
          "name" : "Proxy-Connection",
          "value" : "keep-alive"
        }, {
          "name" : "Content-Length",
          "value" : "102"
        } ],
        "queryString" : [ ],
        "postData" : {
          "mimeType" : "application/json",
          "text" : "{\"field\":{\"farm_id\":7,\"name\":\"Field whit empty boundary\",\"boundary\":{\"boundaries\":[{\"boundary\":{}}]}}}",
          "comment" : ""
        },
        "headersSize" : 592,
        "bodySize" : 102,
        "comment" : ""
      },
      "response" : {
        "status" : 400,
        "statusText" : "Bad Request",
        "httpVersion" : "HTTP/1.1",
        "cookies" : [ {
          "name" : ".ASPROLES",
          "value" : "K70pGQWt_wFw_EwzuNati78gckF9u9ZPCGX0kOiv9h-2QZp7-PgpN-VjiFeOfNaWeYzWoo0ztVZW87ngPHMeZZNaAEbilTPsQDcIZONTzlmRW_ivuNs-jxZW-0o3Bt4HGmit5sCwPY2EmSNWRi286IDgAtmXWje-jbzAW3kPMBrlYztcWK-t_omFiNmcYlqjalqr2oM-NkaxYPVU_GXT6D1ID2zKmd0rqo5U5dQVVFDYKDW6BJpwNf8zL1V7xeESkrpu0l0JhAyHE8PgPULxKIqTij6EFLqolO_-CqJDcTQNVjmNJPOroTlX0fD_RtfrxIY6ej5OvRiASbuVsLeVy_2aNP-AA-ri3w8HPFiB49viQ1aKcgauJZ_E7xwz9STVi8kBBB2L6k-8Y2NBz5CRcDmEQWQvm3hHTTFNjRq0cyVvdm7G8ZIECwpr33rEJsfU8un3P6b91BvWRunIlKk92ooIow1Yw6S3NXCrGX_6i-9nVkG05XGOcGbLr4zP8MN8U40fuUQGS3kMtd8vZIhrLZoDCLc1",
          "path" : "/",
          "httpOnly" : true,
          "secure" : false,
          "comment" : ""
        } ],
        "headers" : [ {
          "name" : "Cache-Control",
          "value" : "private"
        }, {
          "name" : "Content-Type",
          "value" : "application/json; charset=utf-8"
        }, {
          "name" : "Server",
          "value" : "Microsoft-IIS/10.0"
        }, {
          "name" : "Set-Cookie",
          "value" : ".ASPROLES=K70pGQWt_wFw_EwzuNati78gckF9u9ZPCGX0kOiv9h-2QZp7-PgpN-VjiFeOfNaWeYzWoo0ztVZW87ngPHMeZZNaAEbilTPsQDcIZONTzlmRW_ivuNs-jxZW-0o3Bt4HGmit5sCwPY2EmSNWRi286IDgAtmXWje-jbzAW3kPMBrlYztcWK-t_omFiNmcYlqjalqr2oM-NkaxYPVU_GXT6D1ID2zKmd0rqo5U5dQVVFDYKDW6BJpwNf8zL1V7xeESkrpu0l0JhAyHE8PgPULxKIqTij6EFLqolO_-CqJDcTQNVjmNJPOroTlX0fD_RtfrxIY6ej5OvRiASbuVsLeVy_2aNP-AA-ri3w8HPFiB49viQ1aKcgauJZ_E7xwz9STVi8kBBB2L6k-8Y2NBz5CRcDmEQWQvm3hHTTFNjRq0cyVvdm7G8ZIECwpr33rEJsfU8un3P6b91BvWRunIlKk92ooIow1Yw6S3NXCrGX_6i-9nVkG05XGOcGbLr4zP8MN8U40fuUQGS3kMtd8vZIhrLZoDCLc1; path=/; HttpOnly"
        }, {
          "name" : "X-SourceFiles",
          "value" : "=?UTF-8?B?RDpcVmlydHVhbE9wdGltaXplci1SZWZhY3RvcmluZ1xDcm9wTWV0cmljcy5Wby5BcGlcQ3JvcE1ldHJpY3MuVm8uQXBpXGFwaVxtb2JpbGVcdjFcZmllbGRz?="
        }, {
          "name" : "X-Powered-By",
          "value" : "ASP.NET"
        }, {
          "name" : "Date",
          "value" : "Thu, 11 Apr 2019 16:43:09 GMT"
        }, {
          "name" : "Content-Length",
          "value" : "59"
        } ],
        "content" : {
          "size" : 59,
          "mimeType" : "application/json; charset=utf-8",
          "text" : "{\"message\":\"The Boundary is not a valid geojson geometry.\"}",
          "comment" : ""
        },
        "redirectURL" : "",
        "headersSize" : 940,
        "bodySize" : 59,
        "comment" : ""
      },
      "cache" : { },
      "timings" : {
        "comment" : "",
        "send" : 0,
        "wait" : 3223,
        "receive" : 1,
        "connect" : -1,
        "blocked" : -1,
        "dns" : -1,
        "ssl" : -1
      },
      "serverIPAddress" : "127.0.0.1",
      "comment" : "",
      "_katalonRequestInformation" : {
        "name" : "86",
        "testObjectId" : "Object Repository/VoGrow/Field/FieldPost",
        "harId" : "faa83c4c-2f72-4759-8037-3ad848c9e712"
      },
      "time" : 3224
    } ],
    "comment" : ""
  }
}