{
  "log" : {
    "version" : "1.2",
    "creator" : {
      "name" : "BrowserMob Proxy",
      "version" : "2.1.5",
      "comment" : ""
    },
    "pages" : [ {
      "id" : "Page 0",
      "startedDateTime" : "2019-03-29T16:38:16.389Z",
      "title" : "Page 0",
      "pageTimings" : {
        "onLoad" : 1846,
        "comment" : ""
      },
      "comment" : ""
    } ],
    "entries" : [ {
      "pageref" : "Page 0",
      "startedDateTime" : "2019-03-29T16:38:16.390Z",
      "request" : {
        "method" : "POST",
        "url" : "http://localhost:10520/WebAPI/api/admin/v1/users/?",
        "httpVersion" : "HTTP/1.1",
        "cookies" : [ ],
        "headers" : [ {
          "name" : "User-Agent",
          "value" : "Katalon Studio"
        }, {
          "name" : "Content-Type",
          "value" : "application/x-www-form-urlencoded"
        }, {
          "name" : "Authorization",
          "value" : "Bearer eyJ0eXAiOiJKV1QiLCJhbGciOiJIUzI1NiJ9.eyJ1bmlxdWVfbmFtZSI6ImFkbWluIiwicm9sZSI6InVzZXIiLCJzdWIiOiJhZG1pbiIsImlzcyI6IkNyb3BNZXRyaWNzIiwiYXVkIjoiYWxsIiwiZXhwIjoxNTUzODgxMzk2LCJuYmYiOjE1NTM4Nzc0OTZ9.1JJicnn-TXOlxM-ge9GcP0jrJgm2F3pR0q7ie0dhWZ4"
        }, {
          "name" : "Host",
          "value" : "localhost:10520"
        }, {
          "name" : "Accept",
          "value" : "text/html, image/gif, image/jpeg, *; q=.2, */*; q=.2"
        }, {
          "name" : "Proxy-Connection",
          "value" : "keep-alive"
        }, {
          "name" : "Content-Length",
          "value" : "279"
        } ],
        "queryString" : [ ],
        "postData" : {
          "mimeType" : "application/x-www-form-urlencoded",
          "params" : [ {
            "name" : "password",
            "value" : "cropmetrics",
            "comment" : ""
          }, {
            "name" : "email",
            "value" : "cropmetricsvo.no.addressline1@gmail.com",
            "comment" : ""
          }, {
            "name" : "fullname",
            "value" : "test validation",
            "comment" : ""
          }, {
            "name" : "phone",
            "value" : "123",
            "comment" : ""
          }, {
            "name" : "dealer",
            "value" : "dealet test",
            "comment" : ""
          }, {
            "name" : "addressLine1",
            "value" : "",
            "comment" : ""
          }, {
            "name" : "addressLine2",
            "value" : "address line 2 test validation",
            "comment" : ""
          }, {
            "name" : "town",
            "value" : "townValidation",
            "comment" : ""
          }, {
            "name" : "state",
            "value" : "stateValidation",
            "comment" : ""
          }, {
            "name" : "zip",
            "value" : "zipValidation",
            "comment" : ""
          }, {
            "name" : "country",
            "value" : "countryValidation",
            "comment" : ""
          }, {
            "name" : "roles",
            "value" : "Client",
            "comment" : ""
          } ],
          "comment" : ""
        },
        "headersSize" : 544,
        "bodySize" : 279,
        "comment" : ""
      },
      "response" : {
        "status" : 200,
        "statusText" : "OK",
        "httpVersion" : "HTTP/1.1",
        "cookies" : [ {
          "name" : ".ASPROLES",
          "value" : "zNR8ed062oCmkoRJNc9vr_hDi0jtgFBXWYZO4QbR5EtvpQH8_D5VR6Kxz7OoDJ0qdoc-1a1ZrrqTA3tOD8r6xELI9cagWWY--40KKSbsezFkgkn26sZ1hq2TJ1DtCEkhFObS_boz5yrHAsnwSaJo1pXFmmUSyAKfoEC5Gh2HkGGRkBTsKyuyW6Ct1zk28-l0kh4qbHcUKslr_yoibjh1eOPlHJOmXHrRO7n-lybq5BxN7o08LCA-TMQMOJGUBLEiS3InMXhFho8FM6PRaVu8_7TlK1O66mhSozY-OBu3W4x1eNSrcGV_l39-HT_m6EmEiGaWubHur74O680nOjV1v07V3zIeWet17203BmO41BWAuSB9flsMNo72VhiY-xi23LcSvsFTjIjpdqLTHA70K3fL8AfA2vtg1bsRz7uUKP9IR6EKO8cQMIQ9vlAQvAs7gVH4ayJhvcv-74ryrWdbXQsU3W1kGes4tHMGtHKqPu7Gxa8Q0",
          "path" : "/",
          "httpOnly" : true,
          "secure" : false,
          "comment" : ""
        } ],
        "headers" : [ {
          "name" : "Cache-Control",
          "value" : "private"
        }, {
          "name" : "Content-Type",
          "value" : "application/json; charset=utf-8"
        }, {
          "name" : "Server",
          "value" : "Microsoft-IIS/10.0"
        }, {
          "name" : "Set-Cookie",
          "value" : ".ASPROLES=zNR8ed062oCmkoRJNc9vr_hDi0jtgFBXWYZO4QbR5EtvpQH8_D5VR6Kxz7OoDJ0qdoc-1a1ZrrqTA3tOD8r6xELI9cagWWY--40KKSbsezFkgkn26sZ1hq2TJ1DtCEkhFObS_boz5yrHAsnwSaJo1pXFmmUSyAKfoEC5Gh2HkGGRkBTsKyuyW6Ct1zk28-l0kh4qbHcUKslr_yoibjh1eOPlHJOmXHrRO7n-lybq5BxN7o08LCA-TMQMOJGUBLEiS3InMXhFho8FM6PRaVu8_7TlK1O66mhSozY-OBu3W4x1eNSrcGV_l39-HT_m6EmEiGaWubHur74O680nOjV1v07V3zIeWet17203BmO41BWAuSB9flsMNo72VhiY-xi23LcSvsFTjIjpdqLTHA70K3fL8AfA2vtg1bsRz7uUKP9IR6EKO8cQMIQ9vlAQvAs7gVH4ayJhvcv-74ryrWdbXQsU3W1kGes4tHMGtHKqPu7Gxa8Q0; path=/; HttpOnly"
        }, {
          "name" : "X-SourceFiles",
          "value" : "=?UTF-8?B?RDpcVmlydHVhbE9wdGltaXplci1SZWZhY3RvcmluZ1xDcm9wTWV0cmljcy5Wby5BcGlcQ3JvcE1ldHJpY3MuVm8uQXBpXGFwaVxhZG1pblx2MVx1c2Vyc1w=?="
        }, {
          "name" : "X-Powered-By",
          "value" : "ASP.NET"
        }, {
          "name" : "Date",
          "value" : "Fri, 29 Mar 2019 16:38:18 GMT"
        }, {
          "name" : "Content-Length",
          "value" : "8"
        } ],
        "content" : {
          "size" : 8,
          "mimeType" : "application/json; charset=utf-8",
          "text" : "{\"id\":8}",
          "comment" : ""
        },
        "redirectURL" : "",
        "headersSize" : 887,
        "bodySize" : 8,
        "comment" : ""
      },
      "cache" : { },
      "timings" : {
        "comment" : "",
        "ssl" : -1,
        "wait" : 1853,
        "connect" : -1,
        "send" : 0,
        "blocked" : -1,
        "receive" : 1,
        "dns" : -1
      },
      "serverIPAddress" : "127.0.0.1",
      "comment" : "",
      "_katalonRequestInformation" : {
        "name" : "19",
        "testObjectId" : "Object Repository/VoPro/Account/api_admin_v1_users",
        "harId" : "cd56312f-4562-43c2-ba2a-a03c1c6a770c"
      },
      "time" : 1854
    } ],
    "comment" : ""
  }
}