{
  "log" : {
    "version" : "1.2",
    "creator" : {
      "name" : "BrowserMob Proxy",
      "version" : "2.1.5",
      "comment" : ""
    },
    "pages" : [ {
      "id" : "Page 0",
      "startedDateTime" : "2019-04-11T16:07:29.509Z",
      "title" : "Page 0",
      "pageTimings" : {
        "onLoad" : 3271,
        "comment" : ""
      },
      "comment" : ""
    } ],
    "entries" : [ {
      "pageref" : "Page 0",
      "startedDateTime" : "2019-04-11T16:07:29.510Z",
      "request" : {
        "method" : "POST",
        "url" : "http://localhost:10520/WebAPI/api/mobile/v1/fields?",
        "httpVersion" : "HTTP/1.1",
        "cookies" : [ ],
        "headers" : [ {
          "name" : "User-Agent",
          "value" : "Katalon Studio"
        }, {
          "name" : "Content-Type",
          "value" : "application/json"
        }, {
          "name" : "Authorization",
          "value" : "Bearer eyJ0eXAiOiJKV1QiLCJhbGciOiJIUzI1NiJ9.eyJ1bmlxdWVfbmFtZSI6Implbm55Lm1hbGRvbmFkby50eDFAZ21haWwuY29tIiwicm9sZSI6InVzZXIiLCJzdWIiOiJqZW5ueS5tYWxkb25hZG8udHgxQGdtYWlsLmNvbSIsImlzcyI6IkNyb3BNZXRyaWNzIiwiYXVkIjoiYWxsIiwiZXhwIjoxNTU1MDAyNzQ5LCJuYmYiOjE1NTQ5OTg4NDl9.QHgty9GegWD-HhCyFiBjTo4OOQzwLTI-7ydbfyIFMlY"
        }, {
          "name" : "Host",
          "value" : "localhost:10520"
        }, {
          "name" : "Accept",
          "value" : "text/html, image/gif, image/jpeg, *; q=.2, */*; q=.2"
        }, {
          "name" : "Proxy-Connection",
          "value" : "keep-alive"
        }, {
          "name" : "Content-Length",
          "value" : "396"
        } ],
        "queryString" : [ ],
        "postData" : {
          "mimeType" : "application/json",
          "text" : "{\"field\":{\"farm_id\":3,\"name\":\"FieldNameWithOnlyChars\",\"boundary\":{\"boundaries\":[{\"boundary\":{\"coords\":[{\"x\":-101.49568751,\"y\":37.14976293},{\"x\":-101.50049403,\"y\":37.14647907},{\"x\":-101.50049403,\"y\":37.14264773},{\"x\":-101.49723246,\"y\":37.1411425},{\"x\":-101.49019435,\"y\":37.14223722},{\"x\":-101.48933604,\"y\":37.14620541},{\"x\":-101.49294093,\"y\":37.14866833},{\"x\":-101.49568751,\"y\":37.14976293}]}}]}}}",
          "comment" : ""
        },
        "headersSize" : 592,
        "bodySize" : 396,
        "comment" : ""
      },
      "response" : {
        "status" : 400,
        "statusText" : "Bad Request",
        "httpVersion" : "HTTP/1.1",
        "cookies" : [ {
          "name" : ".ASPROLES",
          "value" : "8azgVhBqKIFD7xri0y-bU7iZF_XN0MFrMslvwvBlZdgxPoqszHbF1da_c1A2lznTr7o0_NVVTzf28LN8ETfXDjPj1XP14K8okd4hSBcDHhUCWcLkidUzeN1Tp1dep42K5715U3T6SMjZ06neMomXKLYsT4jq5Wuif8qRtE1C1JXY1F7GDCQHksTuVdYa1tEIk5_Y4dheK3FNcOo3uFe6fmOTj3pJFMkpx48N78b_E5F74rf7FXkHh1A2sX1GjHyju2SJdBZjsSRzyls-bpFRN0B8KHRyMPTd12IzIRIi0_vlh0BICZIksMXS56AkVa76R7vOPU3OjZ5HmoDtX4a9jIfbOg8a_6YryRj46Z5EXsvJJUDBi426TteFiWZ52awTrsmXiE1e8pev9c-9jjV0IWKfT3PvFGVPj-5RKP7LvWriUtVGFBElGnJNLIhCDLagVI2ZU_lKa2jPFUQq2YA5F2KdnIGWKBpDHLcgbChC_YkwnUl13Nm9gbgsv_TWWh0JgsZuoFmZrHXaqZNHARVRHUL9vYU1",
          "path" : "/",
          "httpOnly" : true,
          "secure" : false,
          "comment" : ""
        } ],
        "headers" : [ {
          "name" : "Cache-Control",
          "value" : "private"
        }, {
          "name" : "Content-Type",
          "value" : "application/json; charset=utf-8"
        }, {
          "name" : "Server",
          "value" : "Microsoft-IIS/10.0"
        }, {
          "name" : "Set-Cookie",
          "value" : ".ASPROLES=8azgVhBqKIFD7xri0y-bU7iZF_XN0MFrMslvwvBlZdgxPoqszHbF1da_c1A2lznTr7o0_NVVTzf28LN8ETfXDjPj1XP14K8okd4hSBcDHhUCWcLkidUzeN1Tp1dep42K5715U3T6SMjZ06neMomXKLYsT4jq5Wuif8qRtE1C1JXY1F7GDCQHksTuVdYa1tEIk5_Y4dheK3FNcOo3uFe6fmOTj3pJFMkpx48N78b_E5F74rf7FXkHh1A2sX1GjHyju2SJdBZjsSRzyls-bpFRN0B8KHRyMPTd12IzIRIi0_vlh0BICZIksMXS56AkVa76R7vOPU3OjZ5HmoDtX4a9jIfbOg8a_6YryRj46Z5EXsvJJUDBi426TteFiWZ52awTrsmXiE1e8pev9c-9jjV0IWKfT3PvFGVPj-5RKP7LvWriUtVGFBElGnJNLIhCDLagVI2ZU_lKa2jPFUQq2YA5F2KdnIGWKBpDHLcgbChC_YkwnUl13Nm9gbgsv_TWWh0JgsZuoFmZrHXaqZNHARVRHUL9vYU1; path=/; HttpOnly"
        }, {
          "name" : "X-SourceFiles",
          "value" : "=?UTF-8?B?RDpcVmlydHVhbE9wdGltaXplci1SZWZhY3RvcmluZ1xDcm9wTWV0cmljcy5Wby5BcGlcQ3JvcE1ldHJpY3MuVm8uQXBpXGFwaVxtb2JpbGVcdjFcZmllbGRz?="
        }, {
          "name" : "X-Powered-By",
          "value" : "ASP.NET"
        }, {
          "name" : "Date",
          "value" : "Thu, 11 Apr 2019 16:07:32 GMT"
        }, {
          "name" : "Content-Length",
          "value" : "56"
        } ],
        "content" : {
          "size" : 56,
          "mimeType" : "application/json; charset=utf-8",
          "text" : "{\"message\":\"The field name already exists in the farm.\"}",
          "comment" : ""
        },
        "redirectURL" : "",
        "headersSize" : 940,
        "bodySize" : 56,
        "comment" : ""
      },
      "cache" : { },
      "timings" : {
        "comment" : "",
        "ssl" : -1,
        "dns" : -1,
        "receive" : 1,
        "blocked" : -1,
        "connect" : -1,
        "wait" : 3267,
        "send" : 0
      },
      "serverIPAddress" : "127.0.0.1",
      "comment" : "",
      "_katalonRequestInformation" : {
        "name" : "63",
        "testObjectId" : "Object Repository/VoGrow/Field/FieldPost",
        "harId" : "f175d1ff-79ee-48bd-9b81-f773df7ca62d"
      },
      "time" : 3268
    } ],
    "comment" : ""
  }
}