{
  "log" : {
    "version" : "1.2",
    "creator" : {
      "name" : "BrowserMob Proxy",
      "version" : "2.1.5",
      "comment" : ""
    },
    "pages" : [ {
      "id" : "Page 0",
      "startedDateTime" : "2019-04-04T21:06:27.806Z",
      "title" : "Page 0",
      "pageTimings" : {
        "onLoad" : 3138,
        "comment" : ""
      },
      "comment" : ""
    } ],
    "entries" : [ {
      "pageref" : "Page 0",
      "startedDateTime" : "2019-04-04T21:06:27.808Z",
      "request" : {
        "method" : "PUT",
        "url" : "http://localhost:10520/WebAPI/api/mobile/v1/farms/6?",
        "httpVersion" : "HTTP/1.1",
        "cookies" : [ ],
        "headers" : [ {
          "name" : "User-Agent",
          "value" : "Katalon Studio"
        }, {
          "name" : "Content-Type",
          "value" : "application/json"
        }, {
          "name" : "Authorization",
          "value" : "Bearer eyJ0eXAiOiJKV1QiLCJhbGciOiJIUzI1NiJ9.eyJ1bmlxdWVfbmFtZSI6Implbm55Lm1hbGRvbmFkby50eDFAZ21haWwuY29tIiwicm9sZSI6InVzZXIiLCJzdWIiOiJqZW5ueS5tYWxkb25hZG8udHgxQGdtYWlsLmNvbSIsImlzcyI6IkNyb3BNZXRyaWNzIiwiYXVkIjoiYWxsIiwiZXhwIjoxNTU0NDE1ODg3LCJuYmYiOjE1NTQ0MTE5ODd9.Ao8qLimmEqJ0NSugOzYjOMQ72wXZPLdbIKQV3xgeUGU"
        }, {
          "name" : "Host",
          "value" : "localhost:10520"
        }, {
          "name" : "Accept",
          "value" : "text/html, image/gif, image/jpeg, *; q=.2, */*; q=.2"
        }, {
          "name" : "Proxy-Connection",
          "value" : "keep-alive"
        }, {
          "name" : "Content-Length",
          "value" : "22"
        } ],
        "queryString" : [ ],
        "postData" : {
          "mimeType" : "application/json",
          "text" : "{\"name\": \"1234567890\"}",
          "comment" : ""
        },
        "headersSize" : 591,
        "bodySize" : 22,
        "comment" : ""
      },
      "response" : {
        "status" : 400,
        "statusText" : "Bad Request",
        "httpVersion" : "HTTP/1.1",
        "cookies" : [ {
          "name" : ".ASPROLES",
          "value" : "L7B5yziUpYjlgTHNuXEPufwpzfscFbc8u0jcf6R33Kq_mN_oDcC5zX5kZTu5brrZH0thc9t5Tdgn2TejhmvHBw9moDuIJkVgehX8HVWyakH1KiSm0J3hW_lE7nUlxkzNlPmUPDaaDn_09hHyU_Y7jM9CVGKTXnah4J--WbU1bQF06O1w5aY-JIRuqABFyYSkCvMyeFxv_vb_ENDPdbdB1XgJ-peKbljdqet4jxr4GkSNhcv3GK-1BDlPPNM89Wse9hp-eQa7RTUevCVuncUA-IpWsrH5A--31JH2VveHdqQiWBoOxP1chRJY55KKSdat6GJ_IKPuDmA734p7k0dGSIWS6j4tIsyTaTLnEHEPed5pI1gppduZL-4PPKixINaD6D-Y-tLoqrTN2Zyl28ypNxdV00OtphkrYhgsdmsaz80SLefyazPvBDkLTwUxySKtmFCjF8SmqnHvYZosc5b7rOa2B1OLD8-yex8OqxyiOHhqDZCkCuCTuRSUhXHdI05UpPz9njv-v-Nb7sTSv2F5w1Q80u81",
          "path" : "/",
          "httpOnly" : true,
          "secure" : false,
          "comment" : ""
        } ],
        "headers" : [ {
          "name" : "Cache-Control",
          "value" : "private"
        }, {
          "name" : "Content-Type",
          "value" : "application/json; charset=utf-8"
        }, {
          "name" : "Server",
          "value" : "Microsoft-IIS/10.0"
        }, {
          "name" : "Set-Cookie",
          "value" : ".ASPROLES=L7B5yziUpYjlgTHNuXEPufwpzfscFbc8u0jcf6R33Kq_mN_oDcC5zX5kZTu5brrZH0thc9t5Tdgn2TejhmvHBw9moDuIJkVgehX8HVWyakH1KiSm0J3hW_lE7nUlxkzNlPmUPDaaDn_09hHyU_Y7jM9CVGKTXnah4J--WbU1bQF06O1w5aY-JIRuqABFyYSkCvMyeFxv_vb_ENDPdbdB1XgJ-peKbljdqet4jxr4GkSNhcv3GK-1BDlPPNM89Wse9hp-eQa7RTUevCVuncUA-IpWsrH5A--31JH2VveHdqQiWBoOxP1chRJY55KKSdat6GJ_IKPuDmA734p7k0dGSIWS6j4tIsyTaTLnEHEPed5pI1gppduZL-4PPKixINaD6D-Y-tLoqrTN2Zyl28ypNxdV00OtphkrYhgsdmsaz80SLefyazPvBDkLTwUxySKtmFCjF8SmqnHvYZosc5b7rOa2B1OLD8-yex8OqxyiOHhqDZCkCuCTuRSUhXHdI05UpPz9njv-v-Nb7sTSv2F5w1Q80u81; path=/; HttpOnly"
        }, {
          "name" : "X-SourceFiles",
          "value" : "=?UTF-8?B?RDpcVmlydHVhbE9wdGltaXplci1SZWZhY3RvcmluZ1xDcm9wTWV0cmljcy5Wby5BcGlcQ3JvcE1ldHJpY3MuVm8uQXBpXGFwaVxtb2JpbGVcdjFcZmFybXNcNg==?="
        }, {
          "name" : "X-Powered-By",
          "value" : "ASP.NET"
        }, {
          "name" : "Date",
          "value" : "Thu, 04 Apr 2019 21:06:30 GMT"
        }, {
          "name" : "Content-Length",
          "value" : "43"
        } ],
        "content" : {
          "size" : 43,
          "mimeType" : "application/json; charset=utf-8",
          "text" : "{\"message\":\"The farm name already exists.\"}",
          "comment" : ""
        },
        "redirectURL" : "",
        "headersSize" : 944,
        "bodySize" : 43,
        "comment" : ""
      },
      "cache" : { },
      "timings" : {
        "comment" : "",
        "dns" : -1,
        "connect" : -1,
        "blocked" : -1,
        "ssl" : -1,
        "receive" : 3,
        "send" : 0,
        "wait" : 3126
      },
      "serverIPAddress" : "127.0.0.1",
      "comment" : "",
      "_katalonRequestInformation" : {
        "name" : "34",
        "testObjectId" : "Object Repository/VoGrow/Farm/FarmPut",
        "harId" : "3384cab8-1fb3-4804-9ace-211eb7fbd518"
      },
      "time" : 3130
    } ],
    "comment" : ""
  }
}