{
  "log" : {
    "version" : "1.2",
    "creator" : {
      "name" : "BrowserMob Proxy",
      "version" : "2.1.5",
      "comment" : ""
    },
    "pages" : [ {
      "id" : "Page 0",
      "startedDateTime" : "2019-03-29T22:39:00.211Z",
      "title" : "Page 0",
      "pageTimings" : {
        "onLoad" : 1954,
        "comment" : ""
      },
      "comment" : ""
    } ],
    "entries" : [ {
      "pageref" : "Page 0",
      "startedDateTime" : "2019-03-29T22:39:00.212Z",
      "request" : {
        "method" : "POST",
        "url" : "http://localhost:10520/WebAPI/api/admin/v1/users/?",
        "httpVersion" : "HTTP/1.1",
        "cookies" : [ ],
        "headers" : [ {
          "name" : "User-Agent",
          "value" : "Katalon Studio"
        }, {
          "name" : "Content-Type",
          "value" : "application/x-www-form-urlencoded"
        }, {
          "name" : "Authorization",
          "value" : "Bearer eyJ0eXAiOiJKV1QiLCJhbGciOiJIUzI1NiJ9.eyJ1bmlxdWVfbmFtZSI6ImFkbWluIiwicm9sZSI6InVzZXIiLCJzdWIiOiJhZG1pbiIsImlzcyI6IkNyb3BNZXRyaWNzIiwiYXVkIjoiYWxsIiwiZXhwIjoxNTUzOTAzMDQwLCJuYmYiOjE1NTM4OTkxNDB9.Um66b6h9puSdoKl7_bR-toXqQBH2XssI1m7IDnpFT3M"
        }, {
          "name" : "Host",
          "value" : "localhost:10520"
        }, {
          "name" : "Accept",
          "value" : "text/html, image/gif, image/jpeg, *; q=.2, */*; q=.2"
        }, {
          "name" : "Proxy-Connection",
          "value" : "keep-alive"
        }, {
          "name" : "Content-Length",
          "value" : "301"
        } ],
        "queryString" : [ ],
        "postData" : {
          "mimeType" : "application/x-www-form-urlencoded",
          "params" : [ {
            "name" : "password",
            "value" : "cropmetrics",
            "comment" : ""
          }, {
            "name" : "email",
            "value" : "cropmetricsvo.roleall@gmail.com",
            "comment" : ""
          }, {
            "name" : "fullname",
            "value" : "test validation",
            "comment" : ""
          }, {
            "name" : "phone",
            "value" : "123",
            "comment" : ""
          }, {
            "name" : "dealer",
            "value" : "x",
            "comment" : ""
          }, {
            "name" : "addressLine1",
            "value" : "address line 1 test validation",
            "comment" : ""
          }, {
            "name" : "addressLine2",
            "value" : "address line 2 test validation",
            "comment" : ""
          }, {
            "name" : "town",
            "value" : "townValidation",
            "comment" : ""
          }, {
            "name" : "state",
            "value" : "stateValidation",
            "comment" : ""
          }, {
            "name" : "zip",
            "value" : "xx",
            "comment" : ""
          }, {
            "name" : "country",
            "value" : "xx",
            "comment" : ""
          }, {
            "name" : "roles",
            "value" : "Client,Agent,Administrator,FieldCrew",
            "comment" : ""
          } ],
          "comment" : ""
        },
        "headersSize" : 544,
        "bodySize" : 301,
        "comment" : ""
      },
      "response" : {
        "status" : 200,
        "statusText" : "OK",
        "httpVersion" : "HTTP/1.1",
        "cookies" : [ {
          "name" : ".ASPROLES",
          "value" : "buX3sCc9pJ4yAxXPILpj4CwGNVZkJVfxxszlGW4otRmbkGOLO3ibMMzWkcm3e6yFxtveJ6DIFBELYO2XrwahFaems1XuDIqbin5Q3v5UtN0fqkeSwHXRnhLzfKf_hIgZ0aY3Hq7Mx6GkcKlabqbblbkcgjaEGSVbAf-NjK-5CEaqRhZFUCujgpkrhEhMtcwH2MkszzyAac-evQznZomvtMl6mBT5RgtwS9UHJkr6414E_oNhvWGfoBCOX3S1rpBwqOYJD_ecHvWO4Lg0GCTuvWwE2a_vRmRg6bYcxSb9_m56uRiT-IlH5IoxD4f8PL_fqFKfVK_AbACI5d9dr2ERak11Zoub2WgA9_BTheALqBzB-mARpQqvsg4frzcKg_NPWblwvbw-ZCAUi9fyOp-oatn-u4fo4AW8TZoK5jB11HKPsaCm5PsaasfgfBzPXqF8EkjzyFCqD3SMgLkqwtuPotNLWoQ7thlWcbC2zA9Laxt7-86j0",
          "path" : "/",
          "httpOnly" : true,
          "secure" : false,
          "comment" : ""
        } ],
        "headers" : [ {
          "name" : "Cache-Control",
          "value" : "private"
        }, {
          "name" : "Content-Type",
          "value" : "application/json; charset=utf-8"
        }, {
          "name" : "Server",
          "value" : "Microsoft-IIS/10.0"
        }, {
          "name" : "Set-Cookie",
          "value" : ".ASPROLES=buX3sCc9pJ4yAxXPILpj4CwGNVZkJVfxxszlGW4otRmbkGOLO3ibMMzWkcm3e6yFxtveJ6DIFBELYO2XrwahFaems1XuDIqbin5Q3v5UtN0fqkeSwHXRnhLzfKf_hIgZ0aY3Hq7Mx6GkcKlabqbblbkcgjaEGSVbAf-NjK-5CEaqRhZFUCujgpkrhEhMtcwH2MkszzyAac-evQznZomvtMl6mBT5RgtwS9UHJkr6414E_oNhvWGfoBCOX3S1rpBwqOYJD_ecHvWO4Lg0GCTuvWwE2a_vRmRg6bYcxSb9_m56uRiT-IlH5IoxD4f8PL_fqFKfVK_AbACI5d9dr2ERak11Zoub2WgA9_BTheALqBzB-mARpQqvsg4frzcKg_NPWblwvbw-ZCAUi9fyOp-oatn-u4fo4AW8TZoK5jB11HKPsaCm5PsaasfgfBzPXqF8EkjzyFCqD3SMgLkqwtuPotNLWoQ7thlWcbC2zA9Laxt7-86j0; path=/; HttpOnly"
        }, {
          "name" : "X-SourceFiles",
          "value" : "=?UTF-8?B?RDpcVmlydHVhbE9wdGltaXplci1SZWZhY3RvcmluZ1xDcm9wTWV0cmljcy5Wby5BcGlcQ3JvcE1ldHJpY3MuVm8uQXBpXGFwaVxhZG1pblx2MVx1c2Vyc1w=?="
        }, {
          "name" : "X-Powered-By",
          "value" : "ASP.NET"
        }, {
          "name" : "Date",
          "value" : "Fri, 29 Mar 2019 22:39:02 GMT"
        }, {
          "name" : "Content-Length",
          "value" : "9"
        } ],
        "content" : {
          "size" : 9,
          "mimeType" : "application/json; charset=utf-8",
          "text" : "{\"id\":44}",
          "comment" : ""
        },
        "redirectURL" : "",
        "headersSize" : 887,
        "bodySize" : 9,
        "comment" : ""
      },
      "cache" : { },
      "timings" : {
        "comment" : "",
        "ssl" : -1,
        "wait" : 1950,
        "receive" : 0,
        "send" : 0,
        "connect" : -1,
        "dns" : -1,
        "blocked" : -1
      },
      "serverIPAddress" : "127.0.0.1",
      "comment" : "",
      "_katalonRequestInformation" : {
        "name" : "115",
        "testObjectId" : "Object Repository/VoPro/Account/api_admin_v1_users",
        "harId" : "1dc3a7df-d49f-4c07-801a-47991ae78187"
      },
      "time" : 1951
    } ],
    "comment" : ""
  }
}