{
  "log" : {
    "version" : "1.2",
    "creator" : {
      "name" : "BrowserMob Proxy",
      "version" : "2.1.5",
      "comment" : ""
    },
    "pages" : [ {
      "id" : "Page 0",
      "startedDateTime" : "2019-04-11T16:04:50.505Z",
      "title" : "Page 0",
      "pageTimings" : {
        "onLoad" : 3418,
        "comment" : ""
      },
      "comment" : ""
    } ],
    "entries" : [ {
      "pageref" : "Page 0",
      "startedDateTime" : "2019-04-11T16:04:50.512Z",
      "request" : {
        "method" : "PUT",
        "url" : "http://localhost:10520/WebAPI/api/mobile/v1/farms/1?",
        "httpVersion" : "HTTP/1.1",
        "cookies" : [ ],
        "headers" : [ {
          "name" : "User-Agent",
          "value" : "Katalon Studio"
        }, {
          "name" : "Content-Type",
          "value" : "application/json"
        }, {
          "name" : "Authorization",
          "value" : "Bearer eyJ0eXAiOiJKV1QiLCJhbGciOiJIUzI1NiJ9.eyJ1bmlxdWVfbmFtZSI6Implbm55Lm1hbGRvbmFkby50eDFAZ21haWwuY29tIiwicm9sZSI6InVzZXIiLCJzdWIiOiJqZW5ueS5tYWxkb25hZG8udHgxQGdtYWlsLmNvbSIsImlzcyI6IkNyb3BNZXRyaWNzIiwiYXVkIjoiYWxsIiwiZXhwIjoxNTU1MDAyNTkwLCJuYmYiOjE1NTQ5OTg2OTB9.ZOGH_3cBl9y7vdL59jvob1TP-xk-QnGDn0oic4wtDY0"
        }, {
          "name" : "Host",
          "value" : "localhost:10520"
        }, {
          "name" : "Accept",
          "value" : "text/html, image/gif, image/jpeg, *; q=.2, */*; q=.2"
        }, {
          "name" : "Proxy-Connection",
          "value" : "keep-alive"
        }, {
          "name" : "Content-Length",
          "value" : "80"
        } ],
        "queryString" : [ ],
        "postData" : {
          "mimeType" : "application/json",
          "text" : "{\"name\": \"Farm not updated into the grower does not assined the dealer account\"}",
          "comment" : ""
        },
        "headersSize" : 591,
        "bodySize" : 80,
        "comment" : ""
      },
      "response" : {
        "status" : 400,
        "statusText" : "Bad Request",
        "httpVersion" : "HTTP/1.1",
        "cookies" : [ {
          "name" : ".ASPROLES",
          "value" : "deYPcbwEOLM7HPX0BNUh30QbUARt2v1XTwZ76IuT2PEq4DZ2t7jiZLRa2pHmryb-VvtvgmI7AyZtchFh-MQaat1v6NDS2F0UNvtPDMN4pTd9ARje837W66o8jTilUT9lPkUiyXG88Ye_a7qQPSaSDfJULde9T29ovp_lSNKfoSzLrR9Yzqx9akwM0oGzIyeeLIJbm8lMrkiV5QKBktQlmjIMIUAJo7w_a1ukm6F0SWCo4lWCfZNHUBPi8klk5S6CMxxOskAQDHOFP-cKFdDIwTI2TgalYzmb4UlNtIoT7pNJYQi0qItdzd-qSQJc343XFjM7XBjS1lu6Tn7aasR6mDp6oTOymWOD3XMGMB04WbpG0QNMV3Ag0kDx-eu-tww_52ND1m55WnsHMTh-EZc8Iylsbue7zesjHvlsCk9JKcVjEdgewo1gAvglov57feYD68at-5-w3bHvtdGdum9bdHQ8jkWsIU_bKl6QUXd_WYe7QMAWQQ3Utgaa411WlZ83a_X9XYRhUYI00PgAs72bJA1b_601",
          "path" : "/",
          "httpOnly" : true,
          "secure" : false,
          "comment" : ""
        } ],
        "headers" : [ {
          "name" : "Cache-Control",
          "value" : "private"
        }, {
          "name" : "Content-Type",
          "value" : "application/json; charset=utf-8"
        }, {
          "name" : "Server",
          "value" : "Microsoft-IIS/10.0"
        }, {
          "name" : "Set-Cookie",
          "value" : ".ASPROLES=deYPcbwEOLM7HPX0BNUh30QbUARt2v1XTwZ76IuT2PEq4DZ2t7jiZLRa2pHmryb-VvtvgmI7AyZtchFh-MQaat1v6NDS2F0UNvtPDMN4pTd9ARje837W66o8jTilUT9lPkUiyXG88Ye_a7qQPSaSDfJULde9T29ovp_lSNKfoSzLrR9Yzqx9akwM0oGzIyeeLIJbm8lMrkiV5QKBktQlmjIMIUAJo7w_a1ukm6F0SWCo4lWCfZNHUBPi8klk5S6CMxxOskAQDHOFP-cKFdDIwTI2TgalYzmb4UlNtIoT7pNJYQi0qItdzd-qSQJc343XFjM7XBjS1lu6Tn7aasR6mDp6oTOymWOD3XMGMB04WbpG0QNMV3Ag0kDx-eu-tww_52ND1m55WnsHMTh-EZc8Iylsbue7zesjHvlsCk9JKcVjEdgewo1gAvglov57feYD68at-5-w3bHvtdGdum9bdHQ8jkWsIU_bKl6QUXd_WYe7QMAWQQ3Utgaa411WlZ83a_X9XYRhUYI00PgAs72bJA1b_601; path=/; HttpOnly"
        }, {
          "name" : "X-SourceFiles",
          "value" : "=?UTF-8?B?RDpcVmlydHVhbE9wdGltaXplci1SZWZhY3RvcmluZ1xDcm9wTWV0cmljcy5Wby5BcGlcQ3JvcE1ldHJpY3MuVm8uQXBpXGFwaVxtb2JpbGVcdjFcZmFybXNcMQ==?="
        }, {
          "name" : "X-Powered-By",
          "value" : "ASP.NET"
        }, {
          "name" : "Date",
          "value" : "Thu, 11 Apr 2019 16:04:53 GMT"
        }, {
          "name" : "Content-Length",
          "value" : "81"
        } ],
        "content" : {
          "size" : 81,
          "mimeType" : "application/json; charset=utf-8",
          "text" : "{\"message\":\"The modifier doesn't have permissions to modify the farm requested.\"}",
          "comment" : ""
        },
        "redirectURL" : "",
        "headersSize" : 944,
        "bodySize" : 81,
        "comment" : ""
      },
      "cache" : { },
      "timings" : {
        "comment" : "",
        "send" : 0,
        "receive" : 1,
        "dns" : -1,
        "wait" : 3401,
        "connect" : -1,
        "blocked" : -1,
        "ssl" : -1
      },
      "serverIPAddress" : "127.0.0.1",
      "comment" : "",
      "_katalonRequestInformation" : {
        "name" : "5",
        "testObjectId" : "Object Repository/VoGrow/Farm/FarmPut",
        "harId" : "bd396d60-23fa-41ec-89df-941a4a85c207"
      },
      "time" : 3403
    } ],
    "comment" : ""
  }
}