{
  "log" : {
    "version" : "1.2",
    "creator" : {
      "name" : "BrowserMob Proxy",
      "version" : "2.1.5",
      "comment" : ""
    },
    "pages" : [ {
      "id" : "Page 0",
      "startedDateTime" : "2019-04-11T16:42:46.236Z",
      "title" : "Page 0",
      "pageTimings" : {
        "onLoad" : 1341,
        "comment" : ""
      },
      "comment" : ""
    } ],
    "entries" : [ {
      "pageref" : "Page 0",
      "startedDateTime" : "2019-04-11T16:42:46.237Z",
      "request" : {
        "method" : "POST",
        "url" : "http://localhost:10520/WebAPI/api/mobile/v1/fields?",
        "httpVersion" : "HTTP/1.1",
        "cookies" : [ ],
        "headers" : [ {
          "name" : "User-Agent",
          "value" : "Katalon Studio"
        }, {
          "name" : "Content-Type",
          "value" : "application/json"
        }, {
          "name" : "Authorization",
          "value" : "Bearer eyJ0eXAiOiJKV1QiLCJhbGciOiJIUzI1NiJ9.eyJ1bmlxdWVfbmFtZSI6Implbm55Lm1hbGRvbmFkby50eDFAZ21haWwuY29tIiwicm9sZSI6InVzZXIiLCJzdWIiOiJqZW5ueS5tYWxkb25hZG8udHgxQGdtYWlsLmNvbSIsImlzcyI6IkNyb3BNZXRyaWNzIiwiYXVkIjoiYWxsIiwiZXhwIjoxNTU1MDA0ODY2LCJuYmYiOjE1NTUwMDA5NjZ9.CcbJVk5X7TimxCq73Sk_20ckM83gS37aJen0SK17Qxs"
        }, {
          "name" : "Host",
          "value" : "localhost:10520"
        }, {
          "name" : "Accept",
          "value" : "text/html, image/gif, image/jpeg, *; q=.2, */*; q=.2"
        }, {
          "name" : "Proxy-Connection",
          "value" : "keep-alive"
        }, {
          "name" : "Content-Length",
          "value" : "392"
        } ],
        "queryString" : [ ],
        "postData" : {
          "mimeType" : "application/json",
          "text" : "{\"field\":{\"farm_id\":4,\"name\":\"Field IN FARM ID 4\",\"boundary\":{\"boundaries\":[{\"boundary\":{\"coords\":[{\"x\":-101.49568751,\"y\":37.14976293},{\"x\":-101.50049403,\"y\":37.14647907},{\"x\":-101.50049403,\"y\":37.14264773},{\"x\":-101.49723246,\"y\":37.1411425},{\"x\":-101.49019435,\"y\":37.14223722},{\"x\":-101.48933604,\"y\":37.14620541},{\"x\":-101.49294093,\"y\":37.14866833},{\"x\":-101.49568751,\"y\":37.14976293}]}}]}}}",
          "comment" : ""
        },
        "headersSize" : 592,
        "bodySize" : 392,
        "comment" : ""
      },
      "response" : {
        "status" : 201,
        "statusText" : "Created",
        "httpVersion" : "HTTP/1.1",
        "cookies" : [ {
          "name" : ".ASPROLES",
          "value" : "3IuhBW8lplao0z-TOAFh4lxGdMZ1rYtA_xpom0IRlLcFqkWOBE17Bhf-3VlcZpzUYf8tXp2sko3Vs-j8WuCVwSxOsDxGo7faJAnV6R-MAFk-wUIZmngmAffTvOazq1t7tGir9m4wdsqlDlYs5kQsjCJAEVEQjhz2QTDe4MtfwtcLQb2KIhFXukdnxZXsXzZ8XGodegpvobEr6qaoKhVqYD5PQ8c1MKdq2Iq6sDcANvEcWQQDkBqiF4tQR1CfJqXnQVadS2FefzTWGqJdUkofCklCxKRTaKNYPAEwdmLvnmfo7gz4nuXyv8sH2BgLznCS9nndm4jpBmLx7QNCBl_okZJ8o_els_bcYa2QJfbVvCJVyM4AMbrotxI15K4ZlCqZ24k7DmYKO_gt-g1fLMiT_bv5CzJjnq72l0pVEaZuF9c3zKcdsPruBQ1KjIILYdjlQYEdyCCRxMx2_xHesFGKoyCeEfgNHSsg_wX8dDEdE7RA3A4cpKtOdXW1tYMnR6C6Qvq9uix5HI7vp4HHtGHNTcZuAj01",
          "path" : "/",
          "httpOnly" : true,
          "secure" : false,
          "comment" : ""
        } ],
        "headers" : [ {
          "name" : "Cache-Control",
          "value" : "private"
        }, {
          "name" : "Content-Type",
          "value" : "application/json; charset=utf-8"
        }, {
          "name" : "Location",
          "value" : "api/mobile/v1/fields/9"
        }, {
          "name" : "Server",
          "value" : "Microsoft-IIS/10.0"
        }, {
          "name" : "Set-Cookie",
          "value" : ".ASPROLES=3IuhBW8lplao0z-TOAFh4lxGdMZ1rYtA_xpom0IRlLcFqkWOBE17Bhf-3VlcZpzUYf8tXp2sko3Vs-j8WuCVwSxOsDxGo7faJAnV6R-MAFk-wUIZmngmAffTvOazq1t7tGir9m4wdsqlDlYs5kQsjCJAEVEQjhz2QTDe4MtfwtcLQb2KIhFXukdnxZXsXzZ8XGodegpvobEr6qaoKhVqYD5PQ8c1MKdq2Iq6sDcANvEcWQQDkBqiF4tQR1CfJqXnQVadS2FefzTWGqJdUkofCklCxKRTaKNYPAEwdmLvnmfo7gz4nuXyv8sH2BgLznCS9nndm4jpBmLx7QNCBl_okZJ8o_els_bcYa2QJfbVvCJVyM4AMbrotxI15K4ZlCqZ24k7DmYKO_gt-g1fLMiT_bv5CzJjnq72l0pVEaZuF9c3zKcdsPruBQ1KjIILYdjlQYEdyCCRxMx2_xHesFGKoyCeEfgNHSsg_wX8dDEdE7RA3A4cpKtOdXW1tYMnR6C6Qvq9uix5HI7vp4HHtGHNTcZuAj01; path=/; HttpOnly"
        }, {
          "name" : "X-SourceFiles",
          "value" : "=?UTF-8?B?RDpcVmlydHVhbE9wdGltaXplci1SZWZhY3RvcmluZ1xDcm9wTWV0cmljcy5Wby5BcGlcQ3JvcE1ldHJpY3MuVm8uQXBpXGFwaVxtb2JpbGVcdjFcZmllbGRz?="
        }, {
          "name" : "X-Powered-By",
          "value" : "ASP.NET"
        }, {
          "name" : "Date",
          "value" : "Thu, 11 Apr 2019 16:42:47 GMT"
        }, {
          "name" : "Content-Length",
          "value" : "412"
        } ],
        "content" : {
          "size" : 412,
          "mimeType" : "application/json; charset=utf-8",
          "text" : "{\"field\":{\"id\":9,\"farm_id\":4,\"name\":\"Field IN FARM ID 4\",\"boundary\":{\"boundaries\":[{\"boundary\":{\"coords\":[{\"x\":-101.49568751,\"y\":37.14976293},{\"x\":-101.49294093,\"y\":37.14866833},{\"x\":-101.48933604,\"y\":37.14620541},{\"x\":-101.49019435,\"y\":37.14223722},{\"x\":-101.49723246,\"y\":37.1411425},{\"x\":-101.50049403,\"y\":37.14264773},{\"x\":-101.50049403,\"y\":37.14647907},{\"x\":-101.49568751,\"y\":37.14976293}]},\"holes\":null}]}}}",
          "comment" : ""
        },
        "redirectURL" : "",
        "headersSize" : 971,
        "bodySize" : 412,
        "comment" : ""
      },
      "cache" : { },
      "timings" : {
        "comment" : "",
        "send" : 0,
        "wait" : 1337,
        "receive" : 0,
        "connect" : -1,
        "blocked" : -1,
        "dns" : -1,
        "ssl" : -1
      },
      "serverIPAddress" : "127.0.0.1",
      "comment" : "",
      "_katalonRequestInformation" : {
        "name" : "65",
        "testObjectId" : "Object Repository/VoGrow/Field/FieldPost",
        "harId" : "f052e02b-c3c7-4796-8afa-d5532920a890"
      },
      "time" : 1338
    } ],
    "comment" : ""
  }
}