{
  "log" : {
    "version" : "1.2",
    "creator" : {
      "name" : "BrowserMob Proxy",
      "version" : "2.1.5",
      "comment" : ""
    },
    "pages" : [ {
      "id" : "Page 0",
      "startedDateTime" : "2019-04-05T19:25:36.527Z",
      "title" : "Page 0",
      "pageTimings" : {
        "onLoad" : 4647,
        "comment" : ""
      },
      "comment" : ""
    } ],
    "entries" : [ {
      "pageref" : "Page 0",
      "startedDateTime" : "2019-04-05T19:25:36.529Z",
      "request" : {
        "method" : "PUT",
        "url" : "http://localhost:10520/WebAPI/api/mobile/v1/farms/7?",
        "httpVersion" : "HTTP/1.1",
        "cookies" : [ ],
        "headers" : [ {
          "name" : "User-Agent",
          "value" : "Katalon Studio"
        }, {
          "name" : "Content-Type",
          "value" : "application/json"
        }, {
          "name" : "Authorization",
          "value" : "Bearer eyJ0eXAiOiJKV1QiLCJhbGciOiJIUzI1NiJ9.eyJ1bmlxdWVfbmFtZSI6Implbm55Lm1hbGRvbmFkby50eDFAZ21haWwuY29tIiwicm9sZSI6InVzZXIiLCJzdWIiOiJqZW5ueS5tYWxkb25hZG8udHgxQGdtYWlsLmNvbSIsImlzcyI6IkNyb3BNZXRyaWNzIiwiYXVkIjoiYWxsIiwiZXhwIjoxNTU0NDk2MjM2LCJuYmYiOjE1NTQ0OTIzMzZ9.mfACNnYmNbJNR6WOo3xJ0W8sXf6FNP-rOkP_yYZ2XrU"
        }, {
          "name" : "Host",
          "value" : "localhost:10520"
        }, {
          "name" : "Accept",
          "value" : "text/html, image/gif, image/jpeg, *; q=.2, */*; q=.2"
        }, {
          "name" : "Proxy-Connection",
          "value" : "keep-alive"
        }, {
          "name" : "Content-Length",
          "value" : "12"
        } ],
        "queryString" : [ ],
        "postData" : {
          "mimeType" : "application/json",
          "text" : "{\"name\": \"\"}",
          "comment" : ""
        },
        "headersSize" : 591,
        "bodySize" : 12,
        "comment" : ""
      },
      "response" : {
        "status" : 400,
        "statusText" : "Bad Request",
        "httpVersion" : "HTTP/1.1",
        "cookies" : [ {
          "name" : ".ASPROLES",
          "value" : "0ahfHHRegF5CLUmvgqOWnRNc-TtBeMAestblLZ_d2pSd2CXnQHkcaTWcRAIL4p4mt0aNqggX-Z2WaeNRBl21onICI1OQ-EW7YYiUPjIKAuJAWB7Kquuk0nw-AqFGN6o4t-U3KnDk7NP5DHedDvUeaKPx_T_jlmoDyhThgH0Qi0Z7OvRbe9Z5yy_xJWhIFLuC5kWbsLeglfP9TAV5JSAmM56Bak7cD8CTl7NomgGJFz2eiCCYcbTh-6x1kSzwy6Hf_QZVr4xMw6Z0d6iA6NihvL2-rJhJ-1HB4N5EawhF6kRmEn095LaUlzLr78rt9HouSayBKDMK6CK4_s-lvB2wOnj0o2gB7FlrBedRdU3xpZ0veHcT0HoFLKs7UJfAKHlbWiXOODPm6-0AbNRbFUxfOj1EBrQprRu_mbQpnr8QlQ3Hfa-uByuIw9DVYGqb1u1bR3DsdBT0z3hYoukoBmwK19zsJ90uRjNIj5DDTVhg6YWkltdjm6ohneL8ng67OOoMA8iAAGeNhD-Aaru791BmVFb5duk1",
          "path" : "/",
          "httpOnly" : true,
          "secure" : false,
          "comment" : ""
        } ],
        "headers" : [ {
          "name" : "Cache-Control",
          "value" : "private"
        }, {
          "name" : "Content-Type",
          "value" : "application/json; charset=utf-8"
        }, {
          "name" : "Server",
          "value" : "Microsoft-IIS/10.0"
        }, {
          "name" : "Set-Cookie",
          "value" : ".ASPROLES=0ahfHHRegF5CLUmvgqOWnRNc-TtBeMAestblLZ_d2pSd2CXnQHkcaTWcRAIL4p4mt0aNqggX-Z2WaeNRBl21onICI1OQ-EW7YYiUPjIKAuJAWB7Kquuk0nw-AqFGN6o4t-U3KnDk7NP5DHedDvUeaKPx_T_jlmoDyhThgH0Qi0Z7OvRbe9Z5yy_xJWhIFLuC5kWbsLeglfP9TAV5JSAmM56Bak7cD8CTl7NomgGJFz2eiCCYcbTh-6x1kSzwy6Hf_QZVr4xMw6Z0d6iA6NihvL2-rJhJ-1HB4N5EawhF6kRmEn095LaUlzLr78rt9HouSayBKDMK6CK4_s-lvB2wOnj0o2gB7FlrBedRdU3xpZ0veHcT0HoFLKs7UJfAKHlbWiXOODPm6-0AbNRbFUxfOj1EBrQprRu_mbQpnr8QlQ3Hfa-uByuIw9DVYGqb1u1bR3DsdBT0z3hYoukoBmwK19zsJ90uRjNIj5DDTVhg6YWkltdjm6ohneL8ng67OOoMA8iAAGeNhD-Aaru791BmVFb5duk1; path=/; HttpOnly"
        }, {
          "name" : "X-SourceFiles",
          "value" : "=?UTF-8?B?RDpcVmlydHVhbE9wdGltaXplci1SZWZhY3RvcmluZ1xDcm9wTWV0cmljcy5Wby5BcGlcQ3JvcE1ldHJpY3MuVm8uQXBpXGFwaVxtb2JpbGVcdjFcZmFybXNcNw==?="
        }, {
          "name" : "X-Powered-By",
          "value" : "ASP.NET"
        }, {
          "name" : "Date",
          "value" : "Fri, 05 Apr 2019 19:25:41 GMT"
        }, {
          "name" : "Content-Length",
          "value" : "45"
        } ],
        "content" : {
          "size" : 45,
          "mimeType" : "application/json; charset=utf-8",
          "text" : "{\"message\":\"The farm name must be provided.\"}",
          "comment" : ""
        },
        "redirectURL" : "",
        "headersSize" : 944,
        "bodySize" : 45,
        "comment" : ""
      },
      "cache" : { },
      "timings" : {
        "comment" : "",
        "ssl" : -1,
        "receive" : 0,
        "send" : 0,
        "connect" : -1,
        "blocked" : -1,
        "wait" : 4640,
        "dns" : -1
      },
      "serverIPAddress" : "127.0.0.1",
      "comment" : "",
      "_katalonRequestInformation" : {
        "name" : "19",
        "testObjectId" : "Object Repository/VoGrow/Farm/FarmPut",
        "harId" : "5dc5e9c4-ced8-447f-9a34-fd62c86a6882"
      },
      "time" : 4642
    } ],
    "comment" : ""
  }
}