{
  "log" : {
    "version" : "1.2",
    "creator" : {
      "name" : "BrowserMob Proxy",
      "version" : "2.1.5",
      "comment" : ""
    },
    "pages" : [ {
      "id" : "Page 0",
      "startedDateTime" : "2019-03-27T19:53:41.702Z",
      "title" : "Page 0",
      "pageTimings" : {
        "onLoad" : 1353,
        "comment" : ""
      },
      "comment" : ""
    } ],
    "entries" : [ {
      "pageref" : "Page 0",
      "startedDateTime" : "2019-03-27T19:53:41.704Z",
      "request" : {
        "method" : "POST",
        "url" : "http://localhost:10520/WebAPI/api/Account/AdministrativeRegister/?",
        "httpVersion" : "HTTP/1.1",
        "cookies" : [ ],
        "headers" : [ {
          "name" : "User-Agent",
          "value" : "Katalon Studio"
        }, {
          "name" : "Content-Type",
          "value" : "application/x-www-form-urlencoded"
        }, {
          "name" : "Authorization",
          "value" : "Bearer eyJ0eXAiOiJKV1QiLCJhbGciOiJIUzI1NiJ9.eyJ1bmlxdWVfbmFtZSI6ImFkbWluIiwicm9sZSI6InVzZXIiLCJzdWIiOiJhZG1pbiIsImlzcyI6IkNyb3BNZXRyaWNzIiwiYXVkIjoiYWxsIiwiZXhwIjoxNTUzNzIwMzIxLCJuYmYiOjE1NTM3MTY0MjF9.c2lj5jp-GvcB-G9clg7g_ey_HGfsSxjiBfc0UR3Avyo"
        }, {
          "name" : "Host",
          "value" : "localhost:10520"
        }, {
          "name" : "Accept",
          "value" : "text/html, image/gif, image/jpeg, *; q=.2, */*; q=.2"
        }, {
          "name" : "Proxy-Connection",
          "value" : "keep-alive"
        }, {
          "name" : "Content-Length",
          "value" : "739"
        } ],
        "queryString" : [ ],
        "postData" : {
          "mimeType" : "application/x-www-form-urlencoded",
          "params" : [ {
            "name" : "username",
            "value" : "kuseraddressline2long",
            "comment" : ""
          }, {
            "name" : "password",
            "value" : "cropmetrics",
            "comment" : ""
          }, {
            "name" : "confirmPassword",
            "value" : "cropmetrics",
            "comment" : ""
          }, {
            "name" : "email",
            "value" : "cropmetricsvo@gmail.com",
            "comment" : ""
          }, {
            "name" : "fullname",
            "value" : "x",
            "comment" : ""
          }, {
            "name" : "phone",
            "value" : "1",
            "comment" : ""
          }, {
            "name" : "dealer",
            "value" : "xx",
            "comment" : ""
          }, {
            "name" : "addressLine1",
            "value" : "xx",
            "comment" : ""
          }, {
            "name" : "addressLine2",
            "value" : "16 API_ACNT_When_new_account_have_long_addressline2_attribute_Expected_status_code_20016 API_ACNT_When_new_account_have_long_addressline2_attribute_Expected_status_code_20016 API_ACNT_When_new_account_have_long_addressline2_attribute_Expected_status_code_20016 API_ACNT_When_new_account_have_long_addressline2_attribute_Expected_status_code_20016 API_ACNT_When_new_account_have_long_addressline2_attribute_Expected_status_code_200",
            "comment" : ""
          }, {
            "name" : "town",
            "value" : "townValidation",
            "comment" : ""
          }, {
            "name" : "state",
            "value" : "stateValidation",
            "comment" : ""
          }, {
            "name" : "zip",
            "value" : "zipValidation",
            "comment" : ""
          }, {
            "name" : "country",
            "value" : "countryValidation",
            "comment" : ""
          }, {
            "name" : "roles",
            "value" : "Client",
            "comment" : ""
          }, {
            "name" : "modifierUsername",
            "value" : "admin",
            "comment" : ""
          }, {
            "name" : "modifierUserId",
            "value" : "1",
            "comment" : ""
          } ],
          "comment" : ""
        },
        "headersSize" : 560,
        "bodySize" : 739,
        "comment" : ""
      },
      "response" : {
        "status" : 200,
        "statusText" : "OK",
        "httpVersion" : "HTTP/1.1",
        "cookies" : [ {
          "name" : ".ASPROLES",
          "value" : "Rm6x96tRMKJi28rMAzXBziFRJfjEQkPioLmTLatS_w-mhGsdKlbXrX7h-S73TFf5zUNNM4uOmZe_c7a9DrVSEhyEu2YcHECi6BGX5tDAUO9j0g1xK2xOEuB4uyDfprSCZBttFK6_Ra7M_Qf_7ScXBuEToDT7TZhbanrCMOxOFcEvMzbwz6-zxI110uyuZ3pUyStElG82DjHIW8VJ7PdXqPLjitIqVuSh7LBzcpoOdhs3VN2gakzMtvh0QPERQWENlzsGixQfJ7s6Wicth7vk-aPx8gWP-co90fXLnv-eXsG2tTyxTlDklcQfw0J6aSkkut2IpEpKK3DGvlJHuuUASDG2bvr6_HceWQXKwFBUmjk0FN9A4ZL9R2HL8LT422FGSpdo7VquSitb9izpr4ZgFHpgrfUDunVl28S9KMw5SycR81jX8F04DCUpiN4I5pDexEHWeRuLMvm-f03VB1nBx7CA36IU2cQadXHKPwaKT8KbZAkW0",
          "path" : "/",
          "httpOnly" : true,
          "secure" : false,
          "comment" : ""
        } ],
        "headers" : [ {
          "name" : "Cache-Control",
          "value" : "private"
        }, {
          "name" : "Content-Type",
          "value" : "application/json; charset=utf-8"
        }, {
          "name" : "Server",
          "value" : "Microsoft-IIS/10.0"
        }, {
          "name" : "Set-Cookie",
          "value" : ".ASPROLES=Rm6x96tRMKJi28rMAzXBziFRJfjEQkPioLmTLatS_w-mhGsdKlbXrX7h-S73TFf5zUNNM4uOmZe_c7a9DrVSEhyEu2YcHECi6BGX5tDAUO9j0g1xK2xOEuB4uyDfprSCZBttFK6_Ra7M_Qf_7ScXBuEToDT7TZhbanrCMOxOFcEvMzbwz6-zxI110uyuZ3pUyStElG82DjHIW8VJ7PdXqPLjitIqVuSh7LBzcpoOdhs3VN2gakzMtvh0QPERQWENlzsGixQfJ7s6Wicth7vk-aPx8gWP-co90fXLnv-eXsG2tTyxTlDklcQfw0J6aSkkut2IpEpKK3DGvlJHuuUASDG2bvr6_HceWQXKwFBUmjk0FN9A4ZL9R2HL8LT422FGSpdo7VquSitb9izpr4ZgFHpgrfUDunVl28S9KMw5SycR81jX8F04DCUpiN4I5pDexEHWeRuLMvm-f03VB1nBx7CA36IU2cQadXHKPwaKT8KbZAkW0; path=/; HttpOnly"
        }, {
          "name" : "X-SourceFiles",
          "value" : "=?UTF-8?B?RDpcVmlydHVhbE9wdGltaXplci1SZWZhY3RvcmluZ1xDcm9wTWV0cmljcy5Wby5BcGlcQ3JvcE1ldHJpY3MuVm8uQXBpXGFwaVxBY2NvdW50XEFkbWluaXN0cmF0aXZlUmVnaXN0ZXJc?="
        }, {
          "name" : "X-Powered-By",
          "value" : "ASP.NET"
        }, {
          "name" : "Date",
          "value" : "Wed, 27 Mar 2019 19:53:43 GMT"
        }, {
          "name" : "Content-Length",
          "value" : "9"
        } ],
        "content" : {
          "size" : 9,
          "mimeType" : "application/json; charset=utf-8",
          "text" : "{\"id\":23}",
          "comment" : ""
        },
        "redirectURL" : "",
        "headersSize" : 907,
        "bodySize" : 9,
        "comment" : ""
      },
      "cache" : { },
      "timings" : {
        "comment" : "",
        "ssl" : -1,
        "send" : 0,
        "receive" : 0,
        "wait" : 1344,
        "connect" : -1,
        "blocked" : -1,
        "dns" : -1
      },
      "serverIPAddress" : "127.0.0.1",
      "comment" : "",
      "_katalonRequestInformation" : {
        "name" : "57",
        "testObjectId" : "Object Repository/VoPro/Account/AdministrativeRegister",
        "harId" : "62df7487-0345-4430-b063-30af765c339b"
      },
      "time" : 1346
    } ],
    "comment" : ""
  }
}