{
  "log" : {
    "version" : "1.2",
    "creator" : {
      "name" : "BrowserMob Proxy",
      "version" : "2.1.5",
      "comment" : ""
    },
    "pages" : [ {
      "id" : "Page 0",
      "startedDateTime" : "2019-04-11T16:05:38.231Z",
      "title" : "Page 0",
      "pageTimings" : {
        "onLoad" : 96,
        "comment" : ""
      },
      "comment" : ""
    } ],
    "entries" : [ {
      "pageref" : "Page 0",
      "startedDateTime" : "2019-04-11T16:05:38.232Z",
      "request" : {
        "method" : "PUT",
        "url" : "http://localhost:10520/WebAPI/api/mobile/v1/farms/7?",
        "httpVersion" : "HTTP/1.1",
        "cookies" : [ ],
        "headers" : [ {
          "name" : "User-Agent",
          "value" : "Katalon Studio"
        }, {
          "name" : "Content-Type",
          "value" : "application/json"
        }, {
          "name" : "Authorization",
          "value" : "Bearer eyJ0eXAiOiJKV1QiLCJhbGciOiJIUzI1NiJ9.eyJ1bmlxdWVfbmFtZSI6Implbm55Lm1hbGRvbmFkby50eDFAZ21haWwuY29tIiwicm9sZSI6InVzZXIiLCJzdWIiOiJqZW5ueS5tYWxkb25hZG8udHgxQGdtYWlsLmNvbSIsImlzcyI6IkNyb3BNZXRyaWNzIiwiYXVkIjoiYWxsIiwiZXhwIjoxNTU1MDAyNjM4LCJuYmYiOjE1NTQ5OTg3Mzh9.YzaaW65WMdsdVu-Ij9BkKF5PGeDp7-rGRKrYA89j5Bo"
        }, {
          "name" : "Host",
          "value" : "localhost:10520"
        }, {
          "name" : "Accept",
          "value" : "text/html, image/gif, image/jpeg, *; q=.2, */*; q=.2"
        }, {
          "name" : "Proxy-Connection",
          "value" : "keep-alive"
        }, {
          "name" : "Content-Length",
          "value" : "22"
        } ],
        "queryString" : [ ],
        "postData" : {
          "mimeType" : "application/json",
          "text" : "{\"name\": \"1234567890\"}",
          "comment" : ""
        },
        "headersSize" : 591,
        "bodySize" : 22,
        "comment" : ""
      },
      "response" : {
        "status" : 200,
        "statusText" : "OK",
        "httpVersion" : "HTTP/1.1",
        "cookies" : [ {
          "name" : ".ASPROLES",
          "value" : "7qqwatc-YJs41rZTotOcichaOjBo0uR2weHGf-UPHozZ7RBUKuHTJfaCmWttv54axQItOYN_M2JfKFA3GThcA6XyvoljtaEXQ9_SPd7j7Kphub3CzlS8WX_HINq5KqLFRhvtKmbL2upN2_bpcLyOQqRthjbNqxLudP_hbmlFLGkRlMQfSf1So0cmGxYHsxJTnSirXKDaoA8xObCXgJgou-ILB9KR4rEwK_1u4di7vNNPYG4M9aeo-hZnL0Pcw6Rp3cEsKgOhvUPF8ppJAoo1aaZ6b3JO5-JdWlXtjWpeJRci9wLkoFzt4LgI7h3kklVbcekl4YQ08keHdPyOikD0LC40pWJg3yw54sRMwmYHM081S0n-bFtldB_esqoM3ZDOgvMOD-ypFweXUeg0zLZAq8IrAcOuq376s9kSkczQOKV1LDGAPGRC2c1s3Ga8PM2Dk5ju1IlDWaQiPiC6f78nh1WIiL7tB0rYoYhu5Nfuw3p7F11KI7JOSb3E6UzxQyX8djzoVonSVkNSskWaUp1QxbIxtE01",
          "path" : "/",
          "httpOnly" : true,
          "secure" : false,
          "comment" : ""
        } ],
        "headers" : [ {
          "name" : "Cache-Control",
          "value" : "private"
        }, {
          "name" : "Content-Type",
          "value" : "application/json; charset=utf-8"
        }, {
          "name" : "Server",
          "value" : "Microsoft-IIS/10.0"
        }, {
          "name" : "Set-Cookie",
          "value" : ".ASPROLES=7qqwatc-YJs41rZTotOcichaOjBo0uR2weHGf-UPHozZ7RBUKuHTJfaCmWttv54axQItOYN_M2JfKFA3GThcA6XyvoljtaEXQ9_SPd7j7Kphub3CzlS8WX_HINq5KqLFRhvtKmbL2upN2_bpcLyOQqRthjbNqxLudP_hbmlFLGkRlMQfSf1So0cmGxYHsxJTnSirXKDaoA8xObCXgJgou-ILB9KR4rEwK_1u4di7vNNPYG4M9aeo-hZnL0Pcw6Rp3cEsKgOhvUPF8ppJAoo1aaZ6b3JO5-JdWlXtjWpeJRci9wLkoFzt4LgI7h3kklVbcekl4YQ08keHdPyOikD0LC40pWJg3yw54sRMwmYHM081S0n-bFtldB_esqoM3ZDOgvMOD-ypFweXUeg0zLZAq8IrAcOuq376s9kSkczQOKV1LDGAPGRC2c1s3Ga8PM2Dk5ju1IlDWaQiPiC6f78nh1WIiL7tB0rYoYhu5Nfuw3p7F11KI7JOSb3E6UzxQyX8djzoVonSVkNSskWaUp1QxbIxtE01; path=/; HttpOnly"
        }, {
          "name" : "X-SourceFiles",
          "value" : "=?UTF-8?B?RDpcVmlydHVhbE9wdGltaXplci1SZWZhY3RvcmluZ1xDcm9wTWV0cmljcy5Wby5BcGlcQ3JvcE1ldHJpY3MuVm8uQXBpXGFwaVxtb2JpbGVcdjFcZmFybXNcNw==?="
        }, {
          "name" : "X-Powered-By",
          "value" : "ASP.NET"
        }, {
          "name" : "Date",
          "value" : "Thu, 11 Apr 2019 16:05:37 GMT"
        }, {
          "name" : "Content-Length",
          "value" : "40"
        } ],
        "content" : {
          "size" : 40,
          "mimeType" : "application/json; charset=utf-8",
          "text" : "{\"id\":7,\"name\":\"1234567890\",\"user_id\":3}",
          "comment" : ""
        },
        "redirectURL" : "",
        "headersSize" : 935,
        "bodySize" : 40,
        "comment" : ""
      },
      "cache" : { },
      "timings" : {
        "comment" : "",
        "send" : 0,
        "receive" : 0,
        "dns" : -1,
        "wait" : 93,
        "connect" : -1,
        "blocked" : -1,
        "ssl" : -1
      },
      "serverIPAddress" : "127.0.0.1",
      "comment" : "",
      "_katalonRequestInformation" : {
        "name" : "37",
        "testObjectId" : "Object Repository/VoGrow/Farm/FarmPut",
        "harId" : "785ccf32-3a4a-4c9b-ba38-f38094529e0b"
      },
      "time" : 94
    } ],
    "comment" : ""
  }
}