{
  "log" : {
    "version" : "1.2",
    "creator" : {
      "name" : "BrowserMob Proxy",
      "version" : "2.1.5",
      "comment" : ""
    },
    "pages" : [ {
      "id" : "Page 0",
      "startedDateTime" : "2019-03-29T22:38:03.174Z",
      "title" : "Page 0",
      "pageTimings" : {
        "onLoad" : 1820,
        "comment" : ""
      },
      "comment" : ""
    } ],
    "entries" : [ {
      "pageref" : "Page 0",
      "startedDateTime" : "2019-03-29T22:38:03.176Z",
      "request" : {
        "method" : "POST",
        "url" : "http://localhost:10520/WebAPI/api/admin/v1/users/?",
        "httpVersion" : "HTTP/1.1",
        "cookies" : [ ],
        "headers" : [ {
          "name" : "User-Agent",
          "value" : "Katalon Studio"
        }, {
          "name" : "Content-Type",
          "value" : "application/x-www-form-urlencoded"
        }, {
          "name" : "Authorization",
          "value" : "Bearer eyJ0eXAiOiJKV1QiLCJhbGciOiJIUzI1NiJ9.eyJ1bmlxdWVfbmFtZSI6ImFkbWluIiwicm9sZSI6InVzZXIiLCJzdWIiOiJhZG1pbiIsImlzcyI6IkNyb3BNZXRyaWNzIiwiYXVkIjoiYWxsIiwiZXhwIjoxNTUzOTAyOTgzLCJuYmYiOjE1NTM4OTkwODN9.Qm4VhluprF6Wf_K7nXFz0PHGnleIdWY6wg4_2j_CoWo"
        }, {
          "name" : "Host",
          "value" : "localhost:10520"
        }, {
          "name" : "Accept",
          "value" : "text/html, image/gif, image/jpeg, *; q=.2, */*; q=.2"
        }, {
          "name" : "Proxy-Connection",
          "value" : "keep-alive"
        }, {
          "name" : "Content-Length",
          "value" : "757"
        } ],
        "queryString" : [ ],
        "postData" : {
          "mimeType" : "application/x-www-form-urlencoded",
          "params" : [ {
            "name" : "password",
            "value" : "cropmetrics",
            "comment" : ""
          }, {
            "name" : "email",
            "value" : "cropmetricsvo.dealerlong@gmail.com",
            "comment" : ""
          }, {
            "name" : "fullname",
            "value" : "x",
            "comment" : ""
          }, {
            "name" : "phone",
            "value" : "1",
            "comment" : ""
          }, {
            "name" : "dealer",
            "value" : "12 API_ACNT_When_new_account_have_long_dealer_attribute_Expected_status_code_20012 API_ACNT_When_new_account_have_long_dealer_attribute_Expected_status_code_20012 API_ACNT_When_new_account_have_long_dealer_attribute_Expected_status_code_20012 API_ACNT_When_new_account_have_long_dealer_attribute_Expected_status_code_20012 API_ACNT_When_new_account_have_long_dealer_attribute_Expected_status_code_20012 API_ACNT_When_new_account_have_long_dealer_attribute_Expected_status_code_200",
            "comment" : ""
          }, {
            "name" : "addressLine1",
            "value" : "address line 1 test validation",
            "comment" : ""
          }, {
            "name" : "addressLine2",
            "value" : "address line 2 test validation",
            "comment" : ""
          }, {
            "name" : "town",
            "value" : "townValidation",
            "comment" : ""
          }, {
            "name" : "state",
            "value" : "stateValidation",
            "comment" : ""
          }, {
            "name" : "zip",
            "value" : "zipValidation",
            "comment" : ""
          }, {
            "name" : "country",
            "value" : "countryValidation",
            "comment" : ""
          }, {
            "name" : "roles",
            "value" : "Client",
            "comment" : ""
          } ],
          "comment" : ""
        },
        "headersSize" : 544,
        "bodySize" : 757,
        "comment" : ""
      },
      "response" : {
        "status" : 200,
        "statusText" : "OK",
        "httpVersion" : "HTTP/1.1",
        "cookies" : [ {
          "name" : ".ASPROLES",
          "value" : "IhEFWJPKqGlF2bXk-VvUE2Dgl4vW0LbKK6bK34oOOQ92w9qvbIfmwRHE_L0UJSNnTnsdozP7Igg7qCw0Smey8CzKKhFmI4dTgUqRPd7vgQxMJQgW46juJ1sJmDGiJ5dRpptWUV-RUByTZDfKu-o98V2-5z8rh_0dZWxGpG9dGn_NPzIcphTtwmh5O0LWFpgSstvP82mx0702jt4nqomIEZ0Gz5dHMbrj7fr_-feOmgS4cikuQ4EO_NUTpTJ6ImTSd7ruIkLDfUXZYUBMzZP0PdJeb0uuhKoDtX9cxf7t8weCtTmU-5qPM8Ln_0iHz0zXucDrnD2KX7MXAhcODUnspLVHaOeZSxchnDHbBuX-jKi3evXX_x9u2QJt31REPQYBisJ4MxIvo-0INr_mYqcWhyURYAQatHcZAkAHgTrtIrKomyKyQk7xpq1yjqOtultduyp4rIPI8nZWnpzf8G6eRngwvW1RMnkzokNmbEHNivKLosER0",
          "path" : "/",
          "httpOnly" : true,
          "secure" : false,
          "comment" : ""
        } ],
        "headers" : [ {
          "name" : "Cache-Control",
          "value" : "private"
        }, {
          "name" : "Content-Type",
          "value" : "application/json; charset=utf-8"
        }, {
          "name" : "Server",
          "value" : "Microsoft-IIS/10.0"
        }, {
          "name" : "Set-Cookie",
          "value" : ".ASPROLES=IhEFWJPKqGlF2bXk-VvUE2Dgl4vW0LbKK6bK34oOOQ92w9qvbIfmwRHE_L0UJSNnTnsdozP7Igg7qCw0Smey8CzKKhFmI4dTgUqRPd7vgQxMJQgW46juJ1sJmDGiJ5dRpptWUV-RUByTZDfKu-o98V2-5z8rh_0dZWxGpG9dGn_NPzIcphTtwmh5O0LWFpgSstvP82mx0702jt4nqomIEZ0Gz5dHMbrj7fr_-feOmgS4cikuQ4EO_NUTpTJ6ImTSd7ruIkLDfUXZYUBMzZP0PdJeb0uuhKoDtX9cxf7t8weCtTmU-5qPM8Ln_0iHz0zXucDrnD2KX7MXAhcODUnspLVHaOeZSxchnDHbBuX-jKi3evXX_x9u2QJt31REPQYBisJ4MxIvo-0INr_mYqcWhyURYAQatHcZAkAHgTrtIrKomyKyQk7xpq1yjqOtultduyp4rIPI8nZWnpzf8G6eRngwvW1RMnkzokNmbEHNivKLosER0; path=/; HttpOnly"
        }, {
          "name" : "X-SourceFiles",
          "value" : "=?UTF-8?B?RDpcVmlydHVhbE9wdGltaXplci1SZWZhY3RvcmluZ1xDcm9wTWV0cmljcy5Wby5BcGlcQ3JvcE1ldHJpY3MuVm8uQXBpXGFwaVxhZG1pblx2MVx1c2Vyc1w=?="
        }, {
          "name" : "X-Powered-By",
          "value" : "ASP.NET"
        }, {
          "name" : "Date",
          "value" : "Fri, 29 Mar 2019 22:38:04 GMT"
        }, {
          "name" : "Content-Length",
          "value" : "9"
        } ],
        "content" : {
          "size" : 9,
          "mimeType" : "application/json; charset=utf-8",
          "text" : "{\"id\":19}",
          "comment" : ""
        },
        "redirectURL" : "",
        "headersSize" : 887,
        "bodySize" : 9,
        "comment" : ""
      },
      "cache" : { },
      "timings" : {
        "comment" : "",
        "ssl" : -1,
        "wait" : 1814,
        "receive" : 0,
        "send" : 0,
        "connect" : -1,
        "dns" : -1,
        "blocked" : -1
      },
      "serverIPAddress" : "127.0.0.1",
      "comment" : "",
      "_katalonRequestInformation" : {
        "name" : "59",
        "testObjectId" : "Object Repository/VoPro/Account/api_admin_v1_users",
        "harId" : "f891d761-6d77-48d8-9db6-1cca7fb46a0a"
      },
      "time" : 1816
    } ],
    "comment" : ""
  }
}