{
  "log" : {
    "version" : "1.2",
    "creator" : {
      "name" : "BrowserMob Proxy",
      "version" : "2.1.5",
      "comment" : ""
    },
    "pages" : [ {
      "id" : "Page 0",
      "startedDateTime" : "2019-03-27T19:35:52.688Z",
      "title" : "Page 0",
      "pageTimings" : {
        "onLoad" : 25,
        "comment" : ""
      },
      "comment" : ""
    } ],
    "entries" : [ {
      "pageref" : "Page 0",
      "startedDateTime" : "2019-03-27T19:35:52.693Z",
      "request" : {
        "method" : "POST",
        "url" : "http://localhost:10520/WebAPI/api/Account/AdministrativeRegister/?",
        "httpVersion" : "HTTP/1.1",
        "cookies" : [ ],
        "headers" : [ {
          "name" : "User-Agent",
          "value" : "Katalon Studio"
        }, {
          "name" : "Content-Type",
          "value" : "application/x-www-form-urlencoded"
        }, {
          "name" : "Authorization",
          "value" : "Bearer eyJ0eXAiOiJKV1QiLCJhbGciOiJIUzI1NiJ9.eyJ1bmlxdWVfbmFtZSI6ImtjbGllbnQiLCJyb2xlIjoidXNlciIsInN1YiI6ImtjbGllbnQiLCJpc3MiOiJDcm9wTWV0cmljcyIsImF1ZCI6ImFsbCIsImV4cCI6MTU1MzcxOTI1MiwibmJmIjoxNTUzNzE1MzUyfQ.3ApWgYaU2WPrRSeP1V5fMX1RGbJmv_X30TOmlc0I_Tw"
        }, {
          "name" : "Host",
          "value" : "localhost:10520"
        }, {
          "name" : "Accept",
          "value" : "text/html, image/gif, image/jpeg, *; q=.2, */*; q=.2"
        }, {
          "name" : "Proxy-Connection",
          "value" : "keep-alive"
        }, {
          "name" : "Content-Length",
          "value" : "350"
        } ],
        "queryString" : [ ],
        "postData" : {
          "mimeType" : "application/x-www-form-urlencoded",
          "params" : [ {
            "name" : "username",
            "value" : "kclientbyclient",
            "comment" : ""
          }, {
            "name" : "password",
            "value" : "cropmetrics",
            "comment" : ""
          }, {
            "name" : "confirmPassword",
            "value" : "cropmetrics",
            "comment" : ""
          }, {
            "name" : "email",
            "value" : "cropmetricsvo@gmail.com",
            "comment" : ""
          }, {
            "name" : "fullname",
            "value" : "test validation",
            "comment" : ""
          }, {
            "name" : "phone",
            "value" : "123",
            "comment" : ""
          }, {
            "name" : "dealer",
            "value" : "x",
            "comment" : ""
          }, {
            "name" : "addressLine1",
            "value" : "address line 1 test validation",
            "comment" : ""
          }, {
            "name" : "addressLine2",
            "value" : "address line 2 test validation",
            "comment" : ""
          }, {
            "name" : "town",
            "value" : "townValidation",
            "comment" : ""
          }, {
            "name" : "state",
            "value" : "stateValidation",
            "comment" : ""
          }, {
            "name" : "zip",
            "value" : "xx",
            "comment" : ""
          }, {
            "name" : "country",
            "value" : "xx",
            "comment" : ""
          }, {
            "name" : "roles",
            "value" : "Client",
            "comment" : ""
          }, {
            "name" : "modifierUsername",
            "value" : "admin",
            "comment" : ""
          }, {
            "name" : "modifierUserId",
            "value" : "1",
            "comment" : ""
          } ],
          "comment" : ""
        },
        "headersSize" : 566,
        "bodySize" : 350,
        "comment" : ""
      },
      "response" : {
        "status" : 401,
        "statusText" : "Unauthorized",
        "httpVersion" : "HTTP/1.1",
        "cookies" : [ {
          "name" : ".ASPROLES",
          "value" : "4-EdUypfHccL6p3BT_OtTCUH5h7bp2HNcOf4dZODbCu1QkmRcGvqzwJznSP_IJfqNwi9-QGClLr4z7F7uT4etEJXvWpz7grRMbHZV_b-lB28CKMtMeVRQ86MSZCv-zS3EGu4atrowjPDsB66TK0NKHbX2_JNkEFpWvI84DFuYOzb2rlNDtbjR6jRWarxKKKBDA3byl4QMZ9YVT7XdchK2rmontngz87DIHM8rfkNd4INsYGROSuUEqIkqQlaQVYHmKHRMy8WzBnG3GvlHLxmHLoF_6HpKwQ0f_GbHlUnh_0hSghaRV6sqwfsSc9Z9AadbBErbu95Xv7Sf7r-k84s0XXDrcoohEy06SONdd0QsswKCGrn8nuHwLHWIeOZd3K5IV8a9SY906A9CC95VuxjbJZPO0Udpmy8Oz0RAjE2At5evx6vTiYU6Lo6n5hd2pXFJkE62LNoGoUUpf30Lr4yhaOSzh_EwMZUBAP59ff4DShAIuZr0",
          "path" : "/",
          "httpOnly" : true,
          "secure" : false,
          "comment" : ""
        } ],
        "headers" : [ {
          "name" : "Cache-Control",
          "value" : "private"
        }, {
          "name" : "Content-Type",
          "value" : "application/json; charset=utf-8"
        }, {
          "name" : "Server",
          "value" : "Microsoft-IIS/10.0"
        }, {
          "name" : "Set-Cookie",
          "value" : ".ASPROLES=4-EdUypfHccL6p3BT_OtTCUH5h7bp2HNcOf4dZODbCu1QkmRcGvqzwJznSP_IJfqNwi9-QGClLr4z7F7uT4etEJXvWpz7grRMbHZV_b-lB28CKMtMeVRQ86MSZCv-zS3EGu4atrowjPDsB66TK0NKHbX2_JNkEFpWvI84DFuYOzb2rlNDtbjR6jRWarxKKKBDA3byl4QMZ9YVT7XdchK2rmontngz87DIHM8rfkNd4INsYGROSuUEqIkqQlaQVYHmKHRMy8WzBnG3GvlHLxmHLoF_6HpKwQ0f_GbHlUnh_0hSghaRV6sqwfsSc9Z9AadbBErbu95Xv7Sf7r-k84s0XXDrcoohEy06SONdd0QsswKCGrn8nuHwLHWIeOZd3K5IV8a9SY906A9CC95VuxjbJZPO0Udpmy8Oz0RAjE2At5evx6vTiYU6Lo6n5hd2pXFJkE62LNoGoUUpf30Lr4yhaOSzh_EwMZUBAP59ff4DShAIuZr0; path=/; HttpOnly"
        }, {
          "name" : "X-SourceFiles",
          "value" : "=?UTF-8?B?RDpcVmlydHVhbE9wdGltaXplci1SZWZhY3RvcmluZ1xDcm9wTWV0cmljcy5Wby5BcGlcQ3JvcE1ldHJpY3MuVm8uQXBpXGFwaVxBY2NvdW50XEFkbWluaXN0cmF0aXZlUmVnaXN0ZXJc?="
        }, {
          "name" : "X-Powered-By",
          "value" : "ASP.NET"
        }, {
          "name" : "Date",
          "value" : "Wed, 27 Mar 2019 19:35:52 GMT"
        }, {
          "name" : "Content-Length",
          "value" : "61"
        } ],
        "content" : {
          "size" : 61,
          "mimeType" : "application/json; charset=utf-8",
          "text" : "{\"message\":\"Authorization has been denied for this request.\"}",
          "comment" : ""
        },
        "redirectURL" : "",
        "headersSize" : 918,
        "bodySize" : 61,
        "comment" : ""
      },
      "cache" : { },
      "timings" : {
        "comment" : "",
        "ssl" : -1,
        "dns" : -1,
        "receive" : 0,
        "blocked" : -1,
        "wait" : 15,
        "send" : 0,
        "connect" : -1
      },
      "serverIPAddress" : "127.0.0.1",
      "comment" : "",
      "_katalonRequestInformation" : {
        "name" : "115",
        "testObjectId" : "Object Repository/VoPro/Account/AdministrativeRegister",
        "harId" : "dbae2ab4-782a-415d-a784-98f495c8dd34"
      },
      "time" : 16
    } ],
    "comment" : ""
  }
}