{
  "log" : {
    "version" : "1.2",
    "creator" : {
      "name" : "BrowserMob Proxy",
      "version" : "2.1.5",
      "comment" : ""
    },
    "pages" : [ {
      "id" : "Page 0",
      "startedDateTime" : "2019-03-29T13:31:04.059Z",
      "title" : "Page 0",
      "pageTimings" : {
        "onLoad" : 42,
        "comment" : ""
      },
      "comment" : ""
    } ],
    "entries" : [ {
      "pageref" : "Page 0",
      "startedDateTime" : "2019-03-29T13:31:04.061Z",
      "request" : {
        "method" : "PUT",
        "url" : "http://localhost:10520/WebAPI/api/admin/v1/users/41?",
        "httpVersion" : "HTTP/1.1",
        "cookies" : [ ],
        "headers" : [ {
          "name" : "User-Agent",
          "value" : "Katalon Studio"
        }, {
          "name" : "Content-Type",
          "value" : "application/x-www-form-urlencoded"
        }, {
          "name" : "Authorization",
          "value" : "Bearer eyJ0eXAiOiJKV1QiLCJhbGciOiJIUzI1NiJ9.eyJ1bmlxdWVfbmFtZSI6ImFkbWluIiwicm9sZSI6InVzZXIiLCJzdWIiOiJhZG1pbiIsImlzcyI6IkNyb3BNZXRyaWNzIiwiYXVkIjoiYWxsIiwiZXhwIjoxNTUzODcwMTY0LCJuYmYiOjE1NTM4NjYyNjR9.JfTnZVnohHtJWm5r34TlB4FY6gvnP356EeJR74o5p3Q"
        }, {
          "name" : "Host",
          "value" : "localhost:10520"
        }, {
          "name" : "Accept",
          "value" : "text/html, image/gif, image/jpeg, *; q=.2, */*; q=.2"
        }, {
          "name" : "Proxy-Connection",
          "value" : "keep-alive"
        }, {
          "name" : "Content-Length",
          "value" : "292"
        } ],
        "queryString" : [ ],
        "postData" : {
          "mimeType" : "application/x-www-form-urlencoded",
          "params" : [ {
            "name" : "password",
            "value" : "cropmetrics",
            "comment" : ""
          }, {
            "name" : "email",
            "value" : "cropmetricsvo.roleclient@gmail.com",
            "comment" : ""
          }, {
            "name" : "fullname",
            "value" : "test validation",
            "comment" : ""
          }, {
            "name" : "phone",
            "value" : "123",
            "comment" : ""
          }, {
            "name" : "dealer",
            "value" : "x",
            "comment" : ""
          }, {
            "name" : "addressLine1",
            "value" : "address line 1 test validation",
            "comment" : ""
          }, {
            "name" : "addressLine2",
            "value" : "address line 2 test validation",
            "comment" : ""
          }, {
            "name" : "town",
            "value" : "townValidation",
            "comment" : ""
          }, {
            "name" : "state",
            "value" : "stateValidation",
            "comment" : ""
          }, {
            "name" : "zip",
            "value" : "xx",
            "comment" : ""
          }, {
            "name" : "country",
            "value" : "xx",
            "comment" : ""
          }, {
            "name" : "roles",
            "value" : "Administrator",
            "comment" : ""
          }, {
            "name" : "userProfileId",
            "value" : "41",
            "comment" : ""
          } ],
          "comment" : ""
        },
        "headersSize" : 545,
        "bodySize" : 292,
        "comment" : ""
      },
      "response" : {
        "status" : 400,
        "statusText" : "Bad Request",
        "httpVersion" : "HTTP/1.1",
        "cookies" : [ {
          "name" : ".ASPROLES",
          "value" : "QEcdjmCE0xDWlFxmczWgWCngTH0ajqe-k_mGlLCES-kyRTJ4Kuq_xzM6-aFwAQWz2lCLlkDRmIq13NGXeDSaJtwDsFbwEjrhmiaglIThUCSPszIVnq-eIGW58JOert4R73oBfJAhhDkeWuTQmof-MemwL2bfcMxKcgnhz3eAuk2ZaKsvnbnRCVKlo7jYV0IEqq67Go6XqBEnvinZb445oE4V251oOtz5A2nUq5vvtNK05-770UN9l7LZnfd95EcsFKFNXL4U2dmczS5quiwRo3OkLjZ5Jsjgm3UFsvzbZKN8f_vBiMXHQekujuXP3bguKo5QHmsa4x9iL_pjjl-GT5pDtDviiwCJ3A54xgBv1fyNEqmMh3CtzYs6OHeu1lejNqQhvHN-7IdIp2j671NIBDYtl7IAgfYDIqEsy5cYR-Ih3_bmEfbVNv8seoj7fV7lmHwDO23imGKn7_gmNExhEZ_a5hvVlyNpb8qUnG4JPae2l9ks0",
          "path" : "/",
          "httpOnly" : true,
          "secure" : false,
          "comment" : ""
        } ],
        "headers" : [ {
          "name" : "Cache-Control",
          "value" : "private"
        }, {
          "name" : "Content-Type",
          "value" : "application/json; charset=utf-8"
        }, {
          "name" : "Server",
          "value" : "Microsoft-IIS/10.0"
        }, {
          "name" : "Set-Cookie",
          "value" : ".ASPROLES=QEcdjmCE0xDWlFxmczWgWCngTH0ajqe-k_mGlLCES-kyRTJ4Kuq_xzM6-aFwAQWz2lCLlkDRmIq13NGXeDSaJtwDsFbwEjrhmiaglIThUCSPszIVnq-eIGW58JOert4R73oBfJAhhDkeWuTQmof-MemwL2bfcMxKcgnhz3eAuk2ZaKsvnbnRCVKlo7jYV0IEqq67Go6XqBEnvinZb445oE4V251oOtz5A2nUq5vvtNK05-770UN9l7LZnfd95EcsFKFNXL4U2dmczS5quiwRo3OkLjZ5Jsjgm3UFsvzbZKN8f_vBiMXHQekujuXP3bguKo5QHmsa4x9iL_pjjl-GT5pDtDviiwCJ3A54xgBv1fyNEqmMh3CtzYs6OHeu1lejNqQhvHN-7IdIp2j671NIBDYtl7IAgfYDIqEsy5cYR-Ih3_bmEfbVNv8seoj7fV7lmHwDO23imGKn7_gmNExhEZ_a5hvVlyNpb8qUnG4JPae2l9ks0; path=/; HttpOnly"
        }, {
          "name" : "X-SourceFiles",
          "value" : "=?UTF-8?B?RDpcVmlydHVhbE9wdGltaXplci1SZWZhY3RvcmluZ1xDcm9wTWV0cmljcy5Wby5BcGlcQ3JvcE1ldHJpY3MuVm8uQXBpXGFwaVxhZG1pblx2MVx1c2Vyc1w0MQ==?="
        }, {
          "name" : "X-Powered-By",
          "value" : "ASP.NET"
        }, {
          "name" : "Date",
          "value" : "Fri, 29 Mar 2019 13:31:04 GMT"
        }, {
          "name" : "Content-Length",
          "value" : "78"
        } ],
        "content" : {
          "size" : 78,
          "mimeType" : "application/json; charset=utf-8",
          "text" : "{\"message\":\"The request is invalid. The user profile id is not a valid user.\"}",
          "comment" : ""
        },
        "redirectURL" : "",
        "headersSize" : 901,
        "bodySize" : 78,
        "comment" : ""
      },
      "cache" : { },
      "timings" : {
        "comment" : "",
        "ssl" : -1,
        "send" : 0,
        "wait" : 36,
        "receive" : 0,
        "blocked" : -1,
        "connect" : -1,
        "dns" : -1
      },
      "serverIPAddress" : "127.0.0.1",
      "comment" : "",
      "_katalonRequestInformation" : {
        "name" : "79",
        "testObjectId" : "Object Repository/VoPro/Account/api_admin_v1_users_userprofileid",
        "harId" : "580aef65-ac52-436a-8286-fdac75ada4f2"
      },
      "time" : 37
    } ],
    "comment" : ""
  }
}