{
  "log" : {
    "version" : "1.2",
    "creator" : {
      "name" : "BrowserMob Proxy",
      "version" : "2.1.5",
      "comment" : ""
    },
    "pages" : [ {
      "id" : "Page 0",
      "startedDateTime" : "2019-04-11T16:06:59.919Z",
      "title" : "Page 0",
      "pageTimings" : {
        "onLoad" : 3254,
        "comment" : ""
      },
      "comment" : ""
    } ],
    "entries" : [ {
      "pageref" : "Page 0",
      "startedDateTime" : "2019-04-11T16:06:59.920Z",
      "request" : {
        "method" : "POST",
        "url" : "http://localhost:10520/WebAPI/api/mobile/v1/fields?",
        "httpVersion" : "HTTP/1.1",
        "cookies" : [ ],
        "headers" : [ {
          "name" : "User-Agent",
          "value" : "Katalon Studio"
        }, {
          "name" : "Content-Type",
          "value" : "application/json"
        }, {
          "name" : "Authorization",
          "value" : "Bearer eyJ0eXAiOiJKV1QiLCJhbGciOiJIUzI1NiJ9.eyJ1bmlxdWVfbmFtZSI6Implbm55Lm1hbGRvbmFkby50eDFAZ21haWwuY29tIiwicm9sZSI6InVzZXIiLCJzdWIiOiJqZW5ueS5tYWxkb25hZG8udHgxQGdtYWlsLmNvbSIsImlzcyI6IkNyb3BNZXRyaWNzIiwiYXVkIjoiYWxsIiwiZXhwIjoxNTU1MDAyNzE5LCJuYmYiOjE1NTQ5OTg4MTl9.gFbBOHbZU3-NFs024G1EAQz4he69lphoeoPkK66c9r8"
        }, {
          "name" : "Host",
          "value" : "localhost:10520"
        }, {
          "name" : "Accept",
          "value" : "text/html, image/gif, image/jpeg, *; q=.2, */*; q=.2"
        }, {
          "name" : "Proxy-Connection",
          "value" : "keep-alive"
        }, {
          "name" : "Content-Length",
          "value" : "378"
        } ],
        "queryString" : [ ],
        "postData" : {
          "mimeType" : "application/json",
          "text" : "{\"field\":{\"farm_id\":3,\"name\":\"    \",\"boundary\":{\"boundaries\":[{\"boundary\":{\"coords\":[{\"x\":-101.49568751,\"y\":37.14976293},{\"x\":-101.50049403,\"y\":37.14647907},{\"x\":-101.50049403,\"y\":37.14264773},{\"x\":-101.49723246,\"y\":37.1411425},{\"x\":-101.49019435,\"y\":37.14223722},{\"x\":-101.48933604,\"y\":37.14620541},{\"x\":-101.49294093,\"y\":37.14866833},{\"x\":-101.49568751,\"y\":37.14976293}]}}]}}}",
          "comment" : ""
        },
        "headersSize" : 592,
        "bodySize" : 378,
        "comment" : ""
      },
      "response" : {
        "status" : 400,
        "statusText" : "Bad Request",
        "httpVersion" : "HTTP/1.1",
        "cookies" : [ {
          "name" : ".ASPROLES",
          "value" : "DDu0_w5uho1evImzDmNHdLP-Gl0-uq55Kr6iQLnuE5wF-qfiU-SNy5Il2ZKVdCzWYIE3kVite5bc-Zj8r-hVkEyyu-3if59gK5QbjGqv6fginnNLYz31-3JsLYKCtH4BM6dr_TJg4W6OIv10JX2VImDHR7sLdhVhMBx5J1g79LAB4Hb8PBXibdpM_Hh1f_a9wsgdGy68VTfKsTZa-LmtHMTWVFvzXKoZMoifM4OaWZUYo0dtyMT91-JTgein6pa-dX1AckC-paMuWzZL3AMtZZfMy-QfdqRwpDHCO7I8Esu8eX9o6uYZVxinA2w93U1R3Di0xKzJKDHEAUi-WzhQcHKZF7F9OTqfvgjPAr7ikGUBIa0ilISnRh0EID4v-CP3CiNA99EAE0U4t0LCS1p2Bl7BTVq-SieBwEB2LhXB4Ia_N5cwzE_q6XpxSFg46Ux62lsm8CDVGA07Hl7kblZgK4em4owQ2yjg3eRE3T6hv6rth-6jP3HXNa3Kgdp_uOF4NAcBlLVU9gNE9ZTLEcERhdLyKZg1",
          "path" : "/",
          "httpOnly" : true,
          "secure" : false,
          "comment" : ""
        } ],
        "headers" : [ {
          "name" : "Cache-Control",
          "value" : "private"
        }, {
          "name" : "Content-Type",
          "value" : "application/json; charset=utf-8"
        }, {
          "name" : "Server",
          "value" : "Microsoft-IIS/10.0"
        }, {
          "name" : "Set-Cookie",
          "value" : ".ASPROLES=DDu0_w5uho1evImzDmNHdLP-Gl0-uq55Kr6iQLnuE5wF-qfiU-SNy5Il2ZKVdCzWYIE3kVite5bc-Zj8r-hVkEyyu-3if59gK5QbjGqv6fginnNLYz31-3JsLYKCtH4BM6dr_TJg4W6OIv10JX2VImDHR7sLdhVhMBx5J1g79LAB4Hb8PBXibdpM_Hh1f_a9wsgdGy68VTfKsTZa-LmtHMTWVFvzXKoZMoifM4OaWZUYo0dtyMT91-JTgein6pa-dX1AckC-paMuWzZL3AMtZZfMy-QfdqRwpDHCO7I8Esu8eX9o6uYZVxinA2w93U1R3Di0xKzJKDHEAUi-WzhQcHKZF7F9OTqfvgjPAr7ikGUBIa0ilISnRh0EID4v-CP3CiNA99EAE0U4t0LCS1p2Bl7BTVq-SieBwEB2LhXB4Ia_N5cwzE_q6XpxSFg46Ux62lsm8CDVGA07Hl7kblZgK4em4owQ2yjg3eRE3T6hv6rth-6jP3HXNa3Kgdp_uOF4NAcBlLVU9gNE9ZTLEcERhdLyKZg1; path=/; HttpOnly"
        }, {
          "name" : "X-SourceFiles",
          "value" : "=?UTF-8?B?RDpcVmlydHVhbE9wdGltaXplci1SZWZhY3RvcmluZ1xDcm9wTWV0cmljcy5Wby5BcGlcQ3JvcE1ldHJpY3MuVm8uQXBpXGFwaVxtb2JpbGVcdjFcZmllbGRz?="
        }, {
          "name" : "X-Powered-By",
          "value" : "ASP.NET"
        }, {
          "name" : "Date",
          "value" : "Thu, 11 Apr 2019 16:07:03 GMT"
        }, {
          "name" : "Content-Length",
          "value" : "40"
        } ],
        "content" : {
          "size" : 40,
          "mimeType" : "application/json; charset=utf-8",
          "text" : "{\"message\":\"The Name must be provided.\"}",
          "comment" : ""
        },
        "redirectURL" : "",
        "headersSize" : 940,
        "bodySize" : 40,
        "comment" : ""
      },
      "cache" : { },
      "timings" : {
        "comment" : "",
        "ssl" : -1,
        "dns" : -1,
        "receive" : 1,
        "blocked" : -1,
        "connect" : -1,
        "wait" : 3247,
        "send" : 0
      },
      "serverIPAddress" : "127.0.0.1",
      "comment" : "",
      "_katalonRequestInformation" : {
        "name" : "43",
        "testObjectId" : "Object Repository/VoGrow/Field/FieldPost",
        "harId" : "2e4927de-9d00-4998-99c3-7ab85649471b"
      },
      "time" : 3249
    } ],
    "comment" : ""
  }
}