{
  "log" : {
    "version" : "1.2",
    "creator" : {
      "name" : "BrowserMob Proxy",
      "version" : "2.1.5",
      "comment" : ""
    },
    "pages" : [ {
      "id" : "Page 0",
      "startedDateTime" : "2019-04-11T16:39:18.203Z",
      "title" : "Page 0",
      "pageTimings" : {
        "onLoad" : 3195,
        "comment" : ""
      },
      "comment" : ""
    } ],
    "entries" : [ {
      "pageref" : "Page 0",
      "startedDateTime" : "2019-04-11T16:39:18.204Z",
      "request" : {
        "method" : "POST",
        "url" : "http://localhost:10520/WebAPI/api/mobile/v1/farms/?",
        "httpVersion" : "HTTP/1.1",
        "cookies" : [ ],
        "headers" : [ {
          "name" : "User-Agent",
          "value" : "Katalon Studio"
        }, {
          "name" : "Content-Type",
          "value" : "application/json"
        }, {
          "name" : "Authorization",
          "value" : "Bearer eyJ0eXAiOiJKV1QiLCJhbGciOiJIUzI1NiJ9.eyJ1bmlxdWVfbmFtZSI6Implbm55Lm1hbGRvbmFkby50eDFAZ21haWwuY29tIiwicm9sZSI6InVzZXIiLCJzdWIiOiJqZW5ueS5tYWxkb25hZG8udHgxQGdtYWlsLmNvbSIsImlzcyI6IkNyb3BNZXRyaWNzIiwiYXVkIjoiYWxsIiwiZXhwIjoxNTU1MDA0NjU4LCJuYmYiOjE1NTUwMDA3NTh9.y9OzKEluHGPSzhivjJoIkYylyUupGJ5OYlFlehIqeuk"
        }, {
          "name" : "Host",
          "value" : "localhost:10520"
        }, {
          "name" : "Accept",
          "value" : "text/html, image/gif, image/jpeg, *; q=.2, */*; q=.2"
        }, {
          "name" : "Proxy-Connection",
          "value" : "keep-alive"
        }, {
          "name" : "Content-Length",
          "value" : "26"
        } ],
        "queryString" : [ ],
        "postData" : {
          "mimeType" : "application/json",
          "text" : "{\"name\": \"\", \"user_id\": 2}",
          "comment" : ""
        },
        "headersSize" : 591,
        "bodySize" : 26,
        "comment" : ""
      },
      "response" : {
        "status" : 400,
        "statusText" : "Bad Request",
        "httpVersion" : "HTTP/1.1",
        "cookies" : [ {
          "name" : ".ASPROLES",
          "value" : "oLmrUkJNrI5Zg67iMQE3i7AE7YHKZU5WiaNSdeijzOFntvt2Xy7D2WynOKNV_YpMV4gYxKomi5-8p--rqwcC_mYOdQ0V37Bo9Bc0whaeUJTfCbnyO6wCHRgSeWBsoDHOrhk-kmxdSFq2aJxJFqrKufmzoUbsKhQxdMMeEhDdCN7Ujf2pqlDRXilUQMSJCzqPmPevTVtoUfT8uoLYLK7XPHMyZ8UJrkzjO7h1DZkFMoaC0npHbFwr6PHR3gZBLDQN7RKqs0-fIgEWy99Q1WriydURbA4dxc6PUnoM7T5foJfVuHq2_uM2EDpeGs17je1WPMW45RWZv8sieE3FVvT5nEDgVAkTvW032ITPMbPqJz3tHXTQzxqttxLzZSZlvl-aq5VdP5chUgTsYX2OEoNvSrT2nBlr19tOhb50v_UyInehlJnBPl4LU-HH8adThxWGTWdQDx6IYexk_5G7roI9hV8eUH7wSj343WnN1p2rKqodu4OSpy-dHP3qIFdaP-VEzJmf_qZO3DzouQEmwu9C0wIeS-k1",
          "path" : "/",
          "httpOnly" : true,
          "secure" : false,
          "comment" : ""
        } ],
        "headers" : [ {
          "name" : "Cache-Control",
          "value" : "private"
        }, {
          "name" : "Content-Type",
          "value" : "application/json; charset=utf-8"
        }, {
          "name" : "Server",
          "value" : "Microsoft-IIS/10.0"
        }, {
          "name" : "Set-Cookie",
          "value" : ".ASPROLES=oLmrUkJNrI5Zg67iMQE3i7AE7YHKZU5WiaNSdeijzOFntvt2Xy7D2WynOKNV_YpMV4gYxKomi5-8p--rqwcC_mYOdQ0V37Bo9Bc0whaeUJTfCbnyO6wCHRgSeWBsoDHOrhk-kmxdSFq2aJxJFqrKufmzoUbsKhQxdMMeEhDdCN7Ujf2pqlDRXilUQMSJCzqPmPevTVtoUfT8uoLYLK7XPHMyZ8UJrkzjO7h1DZkFMoaC0npHbFwr6PHR3gZBLDQN7RKqs0-fIgEWy99Q1WriydURbA4dxc6PUnoM7T5foJfVuHq2_uM2EDpeGs17je1WPMW45RWZv8sieE3FVvT5nEDgVAkTvW032ITPMbPqJz3tHXTQzxqttxLzZSZlvl-aq5VdP5chUgTsYX2OEoNvSrT2nBlr19tOhb50v_UyInehlJnBPl4LU-HH8adThxWGTWdQDx6IYexk_5G7roI9hV8eUH7wSj343WnN1p2rKqodu4OSpy-dHP3qIFdaP-VEzJmf_qZO3DzouQEmwu9C0wIeS-k1; path=/; HttpOnly"
        }, {
          "name" : "X-SourceFiles",
          "value" : "=?UTF-8?B?RDpcVmlydHVhbE9wdGltaXplci1SZWZhY3RvcmluZ1xDcm9wTWV0cmljcy5Wby5BcGlcQ3JvcE1ldHJpY3MuVm8uQXBpXGFwaVxtb2JpbGVcdjFcZmFybXNc?="
        }, {
          "name" : "X-Powered-By",
          "value" : "ASP.NET"
        }, {
          "name" : "Date",
          "value" : "Thu, 11 Apr 2019 16:39:21 GMT"
        }, {
          "name" : "Content-Length",
          "value" : "45"
        } ],
        "content" : {
          "size" : 45,
          "mimeType" : "application/json; charset=utf-8",
          "text" : "{\"message\":\"The farm name must be provided.\"}",
          "comment" : ""
        },
        "redirectURL" : "",
        "headersSize" : 940,
        "bodySize" : 45,
        "comment" : ""
      },
      "cache" : { },
      "timings" : {
        "comment" : "",
        "ssl" : -1,
        "send" : 0,
        "wait" : 3189,
        "receive" : 0,
        "connect" : -1,
        "dns" : -1,
        "blocked" : -1
      },
      "serverIPAddress" : "127.0.0.1",
      "comment" : "",
      "_katalonRequestInformation" : {
        "name" : "19",
        "testObjectId" : "Object Repository/VoGrow/Farm/FarmPost",
        "harId" : "e5625918-6e5d-47c5-92dc-014824fe7958"
      },
      "time" : 3191
    } ],
    "comment" : ""
  }
}