{
  "log" : {
    "version" : "1.2",
    "creator" : {
      "name" : "BrowserMob Proxy",
      "version" : "2.1.5",
      "comment" : ""
    },
    "pages" : [ {
      "id" : "Page 0",
      "startedDateTime" : "2019-04-05T19:29:22.515Z",
      "title" : "Page 0",
      "pageTimings" : {
        "onLoad" : 36,
        "comment" : ""
      },
      "comment" : ""
    } ],
    "entries" : [ {
      "pageref" : "Page 0",
      "startedDateTime" : "2019-04-05T19:29:22.516Z",
      "request" : {
        "method" : "POST",
        "url" : "http://localhost:10520/WebAPI/api/mobile/v1/fields?",
        "httpVersion" : "HTTP/1.1",
        "cookies" : [ ],
        "headers" : [ {
          "name" : "User-Agent",
          "value" : "Katalon Studio"
        }, {
          "name" : "Content-Type",
          "value" : "application/json"
        }, {
          "name" : "Authorization",
          "value" : "Bearer eyJ0eXAiOiJKV1QiLCJhbGciOiJIUzI1NiJ9.eyJ1bmlxdWVfbmFtZSI6Implbm55Lm1hbGRvbmFkby50eDFAZ21haWwuY29tIiwicm9sZSI6InVzZXIiLCJzdWIiOiJqZW5ueS5tYWxkb25hZG8udHgxQGdtYWlsLmNvbSIsImlzcyI6IkNyb3BNZXRyaWNzIiwiYXVkIjoiYWxsIiwiZXhwIjoxNTU0NDk2NDYyLCJuYmYiOjE1NTQ0OTI1NjJ9.zQ4eRyzkysxXZWkwXob3WygpeW2mrRoadXOBxBsLSb4"
        }, {
          "name" : "Host",
          "value" : "localhost:10520"
        }, {
          "name" : "Accept",
          "value" : "text/html, image/gif, image/jpeg, *; q=.2, */*; q=.2"
        }, {
          "name" : "Proxy-Connection",
          "value" : "keep-alive"
        }, {
          "name" : "Content-Length",
          "value" : "405"
        } ],
        "queryString" : [ ],
        "postData" : {
          "mimeType" : "application/json",
          "text" : "{\"field\":{\"farm_id\":\"one\",\"name\":\"Field by agent not assigned\",\"boundary\":{\"boundaries\":[{\"boundary\":{\"coords\":[{\"x\":-101.49568751,\"y\":37.14976293},{\"x\":-101.50049403,\"y\":37.14647907},{\"x\":-101.50049403,\"y\":37.14264773},{\"x\":-101.49723246,\"y\":37.1411425},{\"x\":-101.49019435,\"y\":37.14223722},{\"x\":-101.48933604,\"y\":37.14620541},{\"x\":-101.49294093,\"y\":37.14866833},{\"x\":-101.49568751,\"y\":37.14976293}]}}]}}}",
          "comment" : ""
        },
        "headersSize" : 592,
        "bodySize" : 405,
        "comment" : ""
      },
      "response" : {
        "status" : 400,
        "statusText" : "Bad Request",
        "httpVersion" : "HTTP/1.1",
        "cookies" : [ {
          "name" : ".ASPROLES",
          "value" : "exl_omP-O26Y-cvWNVye-KYmqVtgFjFcN-tBVW-MOUBhcO_PFvTwyPVqg_ajdj6mQCZY_YGmLPgvJZGfpji3wstSUChJs7g1453nZIKaC-gtrAX1s0tETPhVUN5u2jCOSxDAy0hV5qaNhfhqlYC-343M09IOeqH1UgY8erBP8pKugRAyAcYBXuiBeUBzPfG3I8cWe7H1IbY8FyFcN4MA2fO113u9VXMFj2h_lQW7hR6mxowU38L7dRoya0-VhZSxt5RxONUyqWekzf2BKoI6G3RE7SXFHD9qSOv0iwGYweIS8iVtHbFSYPb0aVv_Q8nozGYYPIuJRvJOklL-OxKwMRbdPrk1MFJeYI2StPhudS7Hx6uQAesduWqhEzFY4SPVeNmgychZbtwrME_er7_aT5mKKA3yPEFeBKYkAACAbEwlgtqL2OfFde6-bSi715664Bfj0JhsJg9fkoVxh-TxKk5iwxBc9r8vX9FWFXjv5o9kYUqInNhC5DVK0cnCMuBGIdkpbZvTaJf8fp8_ZM4y5Rp_pq41",
          "path" : "/",
          "httpOnly" : true,
          "secure" : false,
          "comment" : ""
        } ],
        "headers" : [ {
          "name" : "Cache-Control",
          "value" : "private"
        }, {
          "name" : "Content-Type",
          "value" : "application/json; charset=utf-8"
        }, {
          "name" : "Server",
          "value" : "Microsoft-IIS/10.0"
        }, {
          "name" : "Set-Cookie",
          "value" : ".ASPROLES=exl_omP-O26Y-cvWNVye-KYmqVtgFjFcN-tBVW-MOUBhcO_PFvTwyPVqg_ajdj6mQCZY_YGmLPgvJZGfpji3wstSUChJs7g1453nZIKaC-gtrAX1s0tETPhVUN5u2jCOSxDAy0hV5qaNhfhqlYC-343M09IOeqH1UgY8erBP8pKugRAyAcYBXuiBeUBzPfG3I8cWe7H1IbY8FyFcN4MA2fO113u9VXMFj2h_lQW7hR6mxowU38L7dRoya0-VhZSxt5RxONUyqWekzf2BKoI6G3RE7SXFHD9qSOv0iwGYweIS8iVtHbFSYPb0aVv_Q8nozGYYPIuJRvJOklL-OxKwMRbdPrk1MFJeYI2StPhudS7Hx6uQAesduWqhEzFY4SPVeNmgychZbtwrME_er7_aT5mKKA3yPEFeBKYkAACAbEwlgtqL2OfFde6-bSi715664Bfj0JhsJg9fkoVxh-TxKk5iwxBc9r8vX9FWFXjv5o9kYUqInNhC5DVK0cnCMuBGIdkpbZvTaJf8fp8_ZM4y5Rp_pq41; path=/; HttpOnly"
        }, {
          "name" : "X-SourceFiles",
          "value" : "=?UTF-8?B?RDpcVmlydHVhbE9wdGltaXplci1SZWZhY3RvcmluZ1xDcm9wTWV0cmljcy5Wby5BcGlcQ3JvcE1ldHJpY3MuVm8uQXBpXGFwaVxtb2JpbGVcdjFcZmllbGRz?="
        }, {
          "name" : "X-Powered-By",
          "value" : "ASP.NET"
        }, {
          "name" : "Date",
          "value" : "Fri, 05 Apr 2019 19:29:21 GMT"
        }, {
          "name" : "Content-Length",
          "value" : "37"
        } ],
        "content" : {
          "size" : 37,
          "mimeType" : "application/json; charset=utf-8",
          "text" : "{\"message\":\"The request is invalid.\"}",
          "comment" : ""
        },
        "redirectURL" : "",
        "headersSize" : 940,
        "bodySize" : 37,
        "comment" : ""
      },
      "cache" : { },
      "timings" : {
        "comment" : "",
        "ssl" : -1,
        "connect" : -1,
        "blocked" : -1,
        "send" : 0,
        "dns" : -1,
        "receive" : 0,
        "wait" : 31
      },
      "serverIPAddress" : "127.0.0.1",
      "comment" : "",
      "_katalonRequestInformation" : {
        "name" : "15",
        "testObjectId" : "Object Repository/VoGrow/Field/FieldPost",
        "harId" : "dffc8478-bb2d-45da-a6b2-0b8f83793094"
      },
      "time" : 32
    } ],
    "comment" : ""
  }
}