{
  "log" : {
    "version" : "1.2",
    "creator" : {
      "name" : "BrowserMob Proxy",
      "version" : "2.1.5",
      "comment" : ""
    },
    "pages" : [ {
      "id" : "Page 0",
      "startedDateTime" : "2019-03-28T20:24:17.058Z",
      "title" : "Page 0",
      "pageTimings" : {
        "onLoad" : 1265,
        "comment" : ""
      },
      "comment" : ""
    } ],
    "entries" : [ {
      "pageref" : "Page 0",
      "startedDateTime" : "2019-03-28T20:24:17.059Z",
      "request" : {
        "method" : "POST",
        "url" : "http://localhost:10520/WebAPI/api/admin/v1/users/?",
        "httpVersion" : "HTTP/1.1",
        "cookies" : [ ],
        "headers" : [ {
          "name" : "User-Agent",
          "value" : "Katalon Studio"
        }, {
          "name" : "Content-Type",
          "value" : "application/x-www-form-urlencoded"
        }, {
          "name" : "Authorization",
          "value" : "Bearer eyJ0eXAiOiJKV1QiLCJhbGciOiJIUzI1NiJ9.eyJ1bmlxdWVfbmFtZSI6ImFkbWluIiwicm9sZSI6InVzZXIiLCJzdWIiOiJhZG1pbiIsImlzcyI6IkNyb3BNZXRyaWNzIiwiYXVkIjoiYWxsIiwiZXhwIjoxNTUzODA4NTU3LCJuYmYiOjE1NTM4MDQ2NTd9.BXd5DoiKsO2K9BzoiegLjNYQE5zOI68Hb4-ukMNI-T0"
        }, {
          "name" : "Host",
          "value" : "localhost:10520"
        }, {
          "name" : "Accept",
          "value" : "text/html, image/gif, image/jpeg, *; q=.2, */*; q=.2"
        }, {
          "name" : "Proxy-Connection",
          "value" : "keep-alive"
        }, {
          "name" : "Content-Length",
          "value" : "725"
        } ],
        "queryString" : [ ],
        "postData" : {
          "mimeType" : "application/x-www-form-urlencoded",
          "params" : [ {
            "name" : "password",
            "value" : "cropmetrics",
            "comment" : ""
          }, {
            "name" : "email",
            "value" : "cropmetricsvo.statelong@gmail.com",
            "comment" : ""
          }, {
            "name" : "fullname",
            "value" : "x",
            "comment" : ""
          }, {
            "name" : "phone",
            "value" : "1",
            "comment" : ""
          }, {
            "name" : "dealer",
            "value" : "xx",
            "comment" : ""
          }, {
            "name" : "addressLine1",
            "value" : "address line 1 test validation",
            "comment" : ""
          }, {
            "name" : "addressLine2",
            "value" : "address line 2 test validation",
            "comment" : ""
          }, {
            "name" : "town",
            "value" : "xx",
            "comment" : ""
          }, {
            "name" : "state",
            "value" : "20 API_ACNT_When_new_account_have_long_state_attribute_Expected_status_code_20020 API_ACNT_When_new_account_have_long_state_attribute_Expected_status_code_20020 API_ACNT_When_new_account_have_long_state_attribute_Expected_status_code_20020 API_ACNT_When_new_account_have_long_state_attribute_Expected_status_code_20020 API_ACNT_When_new_account_have_long_state_attribute_Expected_status_code_20020 API_ACNT_When_new_account_have_long_state_attribute_Expected_status_code_200",
            "comment" : ""
          }, {
            "name" : "zip",
            "value" : "zipValidation",
            "comment" : ""
          }, {
            "name" : "country",
            "value" : "countryValidation",
            "comment" : ""
          }, {
            "name" : "roles",
            "value" : "Client",
            "comment" : ""
          } ],
          "comment" : ""
        },
        "headersSize" : 544,
        "bodySize" : 725,
        "comment" : ""
      },
      "response" : {
        "status" : 200,
        "statusText" : "OK",
        "httpVersion" : "HTTP/1.1",
        "cookies" : [ {
          "name" : ".ASPROLES",
          "value" : "gAKo0OiKWPg0jVmPF205crsYXQ-22jZY7-N0TE9cKgEBdh8WqiMs0kMAr8uOVwQ8fV-c4xvZXHP3JwAlTL6--kDhSkA2EnNvS1Yox5M4GhrmCdS84qoK737XccYt4J9xeRUJIIxLDsLEu1bohLerDk-u4n_KI40whgx6qJ_8dJ8TJDk7Nq9p_B76n1UZpJcoBBuQv6tJR_-zWzo0IYeJfd85gBru55TPbKcJRGkP_URHotyvKECMjO1SfqQiY6AWBXixsy-SR2XeB9vX6ogqAXJbn4EThm8zPZXssf2ZCsYiPxPTDPYZ8zjiZVsv5hgAgMkoSFrPBoWEAbwbcgKZj_HGDiKqTPZ6TRlqtkxCVKwMjRHUTdp8U5MxYMUZR6hUlQbHvFmwXj0GLr4Xdslcox7NGR9Etu81aI1tDXmlx6kLJOtf5v-26ixLNgFwqTuAurjnmQZ_bgLZPOWinhmx404L15X8RArxPv3xRRJLfYbebLJ60",
          "path" : "/",
          "httpOnly" : true,
          "secure" : false,
          "comment" : ""
        } ],
        "headers" : [ {
          "name" : "Cache-Control",
          "value" : "private"
        }, {
          "name" : "Content-Type",
          "value" : "application/json; charset=utf-8"
        }, {
          "name" : "Server",
          "value" : "Microsoft-IIS/10.0"
        }, {
          "name" : "Set-Cookie",
          "value" : ".ASPROLES=gAKo0OiKWPg0jVmPF205crsYXQ-22jZY7-N0TE9cKgEBdh8WqiMs0kMAr8uOVwQ8fV-c4xvZXHP3JwAlTL6--kDhSkA2EnNvS1Yox5M4GhrmCdS84qoK737XccYt4J9xeRUJIIxLDsLEu1bohLerDk-u4n_KI40whgx6qJ_8dJ8TJDk7Nq9p_B76n1UZpJcoBBuQv6tJR_-zWzo0IYeJfd85gBru55TPbKcJRGkP_URHotyvKECMjO1SfqQiY6AWBXixsy-SR2XeB9vX6ogqAXJbn4EThm8zPZXssf2ZCsYiPxPTDPYZ8zjiZVsv5hgAgMkoSFrPBoWEAbwbcgKZj_HGDiKqTPZ6TRlqtkxCVKwMjRHUTdp8U5MxYMUZR6hUlQbHvFmwXj0GLr4Xdslcox7NGR9Etu81aI1tDXmlx6kLJOtf5v-26ixLNgFwqTuAurjnmQZ_bgLZPOWinhmx404L15X8RArxPv3xRRJLfYbebLJ60; path=/; HttpOnly"
        }, {
          "name" : "X-SourceFiles",
          "value" : "=?UTF-8?B?RDpcVmlydHVhbE9wdGltaXplci1SZWZhY3RvcmluZ1xDcm9wTWV0cmljcy5Wby5BcGlcQ3JvcE1ldHJpY3MuVm8uQXBpXGFwaVxhZG1pblx2MVx1c2Vyc1w=?="
        }, {
          "name" : "X-Powered-By",
          "value" : "ASP.NET"
        }, {
          "name" : "Date",
          "value" : "Thu, 28 Mar 2019 20:24:18 GMT"
        }, {
          "name" : "Content-Length",
          "value" : "9"
        } ],
        "content" : {
          "size" : 9,
          "mimeType" : "application/json; charset=utf-8",
          "text" : "{\"id\":27}",
          "comment" : ""
        },
        "redirectURL" : "",
        "headersSize" : 887,
        "bodySize" : 9,
        "comment" : ""
      },
      "cache" : { },
      "timings" : {
        "comment" : "",
        "wait" : 1261,
        "dns" : -1,
        "blocked" : -1,
        "connect" : -1,
        "receive" : 0,
        "send" : 0,
        "ssl" : -1
      },
      "serverIPAddress" : "127.0.0.1",
      "comment" : "",
      "_katalonRequestInformation" : {
        "name" : "71",
        "testObjectId" : "Object Repository/VoPro/Account/api_admin_v1_users",
        "harId" : "f54b6125-3248-4b6f-aed6-85b180d84524"
      },
      "time" : 1262
    } ],
    "comment" : ""
  }
}