Suite/Test/Step Name,Browser,Description,Tag,Start time,End time,Duration,Status
Auto_Restore_vo_probereadings_database_using_backup_file,,,,2019-08-28 10:15:46,2019-08-28 10:15:58,11.825s,PASSED
,,,,,,,
Test Cases/Databases/CreateDatabases/Functional/DB_Create_vo_probereadings_database,,,,2019-08-28 10:15:47,2019-08-28 10:15:53,6.160s,PASSED
server = server,,,,2019-08-28 10:15:47,2019-08-28 10:15:48,0.539s,PASSED
port = port,,,,2019-08-28 10:15:48,2019-08-28 10:15:48,0.002s,PASSED
user = userDb,,,,2019-08-28 10:15:48,2019-08-28 10:15:48,0.003s,PASSED
password = passwordDb,,,,2019-08-28 10:15:48,2019-08-28 10:15:48,0.003s,PASSED
pathPostgreSQL = pathPostgreSQLBin,,,,2019-08-28 10:15:48,2019-08-28 10:15:48,0.005s,PASSED
"database = ""vo_probeReadings""",,,,2019-08-28 10:15:48,2019-08-28 10:15:48,0.003s,PASSED
"command = String.format(""cd ""%s"" && createdb -h %s -p %d -U %s  %s"", pathPostgreSQL, server, port, user, database)",,,,2019-08-28 10:15:48,2019-08-28 10:15:48,0.002s,PASSED
"commandLine.cmd.cmdLine(command, password)",,,,2019-08-28 10:15:48,2019-08-28 10:15:53,5.093s,PASSED
"println(""The "" + database + "" database was created..."")",,,,2019-08-28 10:15:53,2019-08-28 10:15:53,0.005s,PASSED
,,,,,,,
Test Cases/Databases/DatabasesRestoreWithBakcupFiles/Functional/DB_Restore_vo_probereadings_with_backup_file,,,,2019-08-28 10:15:53,2019-08-28 10:15:58,5.293s,PASSED
server = server,,,,2019-08-28 10:15:53,2019-08-28 10:15:53,0.002s,PASSED
port = port,,,,2019-08-28 10:15:53,2019-08-28 10:15:53,0.001s,PASSED
user = userDb,,,,2019-08-28 10:15:53,2019-08-28 10:15:53,0.002s,PASSED
password = passwordDb,,,,2019-08-28 10:15:53,2019-08-28 10:15:53,0.002s,PASSED
pathPostgreSQL = pathPostgreSQLBin,,,,2019-08-28 10:15:53,2019-08-28 10:15:53,0.001s,PASSED
"database = ""vo_probeReadings""",,,,2019-08-28 10:15:53,2019-08-28 10:15:53,0.009s,PASSED
"pathDumpFile = Paths.get(pathDumpFiles, database + "".dump"")",,,,2019-08-28 10:15:53,2019-08-28 10:15:53,0.006s,PASSED
"cRestore = String.format(""cd ""%s"" && pg_restore -U %s -h %s -p %d -c -C -d %s -v ""%s"""", pathPostgreSQL, user, server, port, database, pathDumpFile)",,,,2019-08-28 10:15:53,2019-08-28 10:15:53,0.002s,PASSED
"commandLine.cmd.cmdLine(cRestore, password)",,,,2019-08-28 10:15:53,2019-08-28 10:15:58,5.035s,PASSED
"println(""The restore "" + database + "" database was completed..."")",,,,2019-08-28 10:15:58,2019-08-28 10:15:58,0.001s,PASSED
