Suite/Test/Step Name,Browser,Description,Tag,Start time,End time,Duration,Status
Auto_Restore_vo_loraproberawreadings_database_using_backup_file,,,,2019-08-20 09:19:10,2019-08-20 09:19:22,11.743s,PASSED
,,,,,,,
Test Cases/Databases/CreateDatabases/ProbeReadings/DB_Create_vo_loraproberawreadings_database,,,,2019-08-20 09:19:10,2019-08-20 09:19:16,5.959s,PASSED
server = server,,,,2019-08-20 09:19:11,2019-08-20 09:19:11,0.514s,PASSED
port = port,,,,2019-08-20 09:19:11,2019-08-20 09:19:11,0.001s,PASSED
user = userDb,,,,2019-08-20 09:19:11,2019-08-20 09:19:11,0.004s,PASSED
password = passwordDb,,,,2019-08-20 09:19:11,2019-08-20 09:19:11,0.002s,PASSED
pathPostgreSQL = pathPostgreSQLBin,,,,2019-08-20 09:19:11,2019-08-20 09:19:11,0.002s,PASSED
"database = ""vo_loraProbeRawReadings""",,,,2019-08-20 09:19:11,2019-08-20 09:19:11,0.001s,PASSED
"command = String.format(""cd ""%s"" && createdb -h %s -p %d -U %s  %s"", pathPostgreSQL, server, port, user, database)",,,,2019-08-20 09:19:11,2019-08-20 09:19:11,0.002s,PASSED
"commandLine.cmd.cmdLine(command, password)",,,,2019-08-20 09:19:11,2019-08-20 09:19:16,5.044s,PASSED
"println(""The "" + database + "" database was created..."")",,,,2019-08-20 09:19:16,2019-08-20 09:19:16,0.011s,PASSED
,,,,,,,
Test Cases/Databases/DatabasesRestoreWithBakcupFiles/ProbeReadings/DB_Restore_vo_loraproberawreadings_with_backup_file,,,,2019-08-20 09:19:16,2019-08-20 09:19:22,5.471s,PASSED
server = server,,,,2019-08-20 09:19:17,2019-08-20 09:19:17,0.004s,PASSED
port = port,,,,2019-08-20 09:19:17,2019-08-20 09:19:17,0.002s,PASSED
user = userDb,,,,2019-08-20 09:19:17,2019-08-20 09:19:17,0.004s,PASSED
password = passwordDb,,,,2019-08-20 09:19:17,2019-08-20 09:19:17,0.004s,PASSED
pathPostgreSQL = pathPostgreSQLBin,,,,2019-08-20 09:19:17,2019-08-20 09:19:17,0.003s,PASSED
"database = ""vo_loraProbeRawReadings""",,,,2019-08-20 09:19:17,2019-08-20 09:19:17,0.004s,PASSED
"pathDumpFile = ""C:\KatalonFiles\vo_loraProbeRawReadings.dump""",,,,2019-08-20 09:19:17,2019-08-20 09:19:17,0.004s,PASSED
"cRestore = String.format(""cd ""%s"" && pg_restore -U %s -h %s -p %d -c -C -d %s -v ""%s"""", pathPostgreSQL, user, server, port, database, pathDumpFile)",,,,2019-08-20 09:19:17,2019-08-20 09:19:17,0.005s,PASSED
"commandLine.cmd.cmdLine(cRestore, password)",,,,2019-08-20 09:19:17,2019-08-20 09:19:22,5.043s,PASSED
"println(""The restore vo_loraProbeRawReadings database was completed..."")",,,,2019-08-20 09:19:22,2019-08-20 09:19:22,0.001s,PASSED
