{
  "log" : {
    "version" : "1.2",
    "creator" : {
      "name" : "BrowserMob Proxy",
      "version" : "2.1.5",
      "comment" : ""
    },
    "pages" : [ {
      "id" : "Page 0",
      "startedDateTime" : "2019-04-24T20:55:07.849Z",
      "title" : "Page 0",
      "pageTimings" : {
        "onLoad" : 3968,
        "comment" : ""
      },
      "comment" : ""
    } ],
    "entries" : [ {
      "pageref" : "Page 0",
      "startedDateTime" : "2019-04-24T20:55:07.851Z",
      "request" : {
        "method" : "POST",
        "url" : "http://localhost:10520/WebAPI/api/mobile/v1/fields?",
        "httpVersion" : "HTTP/1.1",
        "cookies" : [ ],
        "headers" : [ {
          "name" : "User-Agent",
          "value" : "Katalon Studio"
        }, {
          "name" : "Content-Type",
          "value" : "application/json"
        }, {
          "name" : "Authorization",
          "value" : "Bearer eyJ0eXAiOiJKV1QiLCJhbGciOiJIUzI1NiJ9.eyJ1bmlxdWVfbmFtZSI6Implbm55Lm1hbGRvbmFkby50eDFAZ21haWwuY29tIiwicm9sZSI6InVzZXIiLCJzdWIiOiJqZW5ueS5tYWxkb25hZG8udHgxQGdtYWlsLmNvbSIsImlzcyI6IkNyb3BNZXRyaWNzIiwiYXVkIjoiYWxsIiwiZXhwIjoxNTU2MTQzMjA3LCJuYmYiOjE1NTYxMzkzMDd9.njNOIYexbURELH3oR5Uvg5loI_G_1wjc_XCkk5rU7yA"
        }, {
          "name" : "Host",
          "value" : "localhost:10520"
        }, {
          "name" : "Accept",
          "value" : "text/html, image/gif, image/jpeg, *; q=.2, */*; q=.2"
        }, {
          "name" : "Proxy-Connection",
          "value" : "keep-alive"
        }, {
          "name" : "Content-Length",
          "value" : "396"
        } ],
        "queryString" : [ ],
        "postData" : {
          "mimeType" : "application/json",
          "text" : "{\"field\":{\"farm_id\":3,\"name\":\"FieldNameWithOnlyChars\",\"boundary\":{\"boundaries\":[{\"boundary\":{\"coords\":[{\"x\":-101.49568751,\"y\":37.14976293},{\"x\":-101.50049403,\"y\":37.14647907},{\"x\":-101.50049403,\"y\":37.14264773},{\"x\":-101.49723246,\"y\":37.1411425},{\"x\":-101.49019435,\"y\":37.14223722},{\"x\":-101.48933604,\"y\":37.14620541},{\"x\":-101.49294093,\"y\":37.14866833},{\"x\":-101.49568751,\"y\":37.14976293}]}}]}}}",
          "comment" : ""
        },
        "headersSize" : 592,
        "bodySize" : 396,
        "comment" : ""
      },
      "response" : {
        "status" : 400,
        "statusText" : "Bad Request",
        "httpVersion" : "HTTP/1.1",
        "cookies" : [ {
          "name" : ".ASPROLES",
          "value" : "nTaRIMB-tzVrD7-XOkrRdB4Ditbi5BP6K1fHlr5eF-bi23sXoJpJXm3z5xpzLEv4GK-5Ux4mxThUtQGvTjdZWVDp4L67k_xDhMHYWHM_Y67EkzrcrgPYoGEysw7OOHE4QssQidYJaYD00ZDUJLlBb7yiesghufPObGZYOyw9cm-UjasXpPeoc4PH0eg_ueSs3IkuStwn5RmpemnVgH20LkXgiMS2G_grVrMcqjOWUoqh11zXbyVMN66LCYUz8f24ZpNymg7NNvnN4on_7gtCqIWXJVx8RbJUVKfjZXco_9l6T1bRoURKr-qrApc9wuVtFutzBQSLcO9m-c0B-q3NjzuP9VkJI3lg5mypxlSflDmpMKOhym-KKlLiJR31RqbvECKk80MqB62Hk2PcUCy2Ox6J96y3Wcu-fLLMV7r0HnE6xv6G8zmfFfPt5y1Q-yphG3MgAv0CMRxvWtM75im-IHrT96afNb7XYWViUliuRskG5wICzijuVMgjWyIL-8PsFzx2NPhgYohgi7QxSlZVmvlS0Nc1",
          "path" : "/",
          "httpOnly" : true,
          "secure" : false,
          "comment" : ""
        } ],
        "headers" : [ {
          "name" : "Cache-Control",
          "value" : "private"
        }, {
          "name" : "Content-Type",
          "value" : "application/json; charset=utf-8"
        }, {
          "name" : "Server",
          "value" : "Microsoft-IIS/10.0"
        }, {
          "name" : "Set-Cookie",
          "value" : ".ASPROLES=nTaRIMB-tzVrD7-XOkrRdB4Ditbi5BP6K1fHlr5eF-bi23sXoJpJXm3z5xpzLEv4GK-5Ux4mxThUtQGvTjdZWVDp4L67k_xDhMHYWHM_Y67EkzrcrgPYoGEysw7OOHE4QssQidYJaYD00ZDUJLlBb7yiesghufPObGZYOyw9cm-UjasXpPeoc4PH0eg_ueSs3IkuStwn5RmpemnVgH20LkXgiMS2G_grVrMcqjOWUoqh11zXbyVMN66LCYUz8f24ZpNymg7NNvnN4on_7gtCqIWXJVx8RbJUVKfjZXco_9l6T1bRoURKr-qrApc9wuVtFutzBQSLcO9m-c0B-q3NjzuP9VkJI3lg5mypxlSflDmpMKOhym-KKlLiJR31RqbvECKk80MqB62Hk2PcUCy2Ox6J96y3Wcu-fLLMV7r0HnE6xv6G8zmfFfPt5y1Q-yphG3MgAv0CMRxvWtM75im-IHrT96afNb7XYWViUliuRskG5wICzijuVMgjWyIL-8PsFzx2NPhgYohgi7QxSlZVmvlS0Nc1; path=/; HttpOnly"
        }, {
          "name" : "X-SourceFiles",
          "value" : "=?UTF-8?B?RDpcVmlydHVhbE9wdGltaXplci1SZWZhY3RvcmluZ1xDcm9wTWV0cmljcy5Wby5BcGlcQ3JvcE1ldHJpY3MuVm8uQXBpXGFwaVxtb2JpbGVcdjFcZmllbGRz?="
        }, {
          "name" : "X-Powered-By",
          "value" : "ASP.NET"
        }, {
          "name" : "Date",
          "value" : "Wed, 24 Apr 2019 20:55:11 GMT"
        }, {
          "name" : "Content-Length",
          "value" : "56"
        } ],
        "content" : {
          "size" : 56,
          "mimeType" : "application/json; charset=utf-8",
          "text" : "{\"message\":\"The field name already exists in the farm.\"}",
          "comment" : ""
        },
        "redirectURL" : "",
        "headersSize" : 940,
        "bodySize" : 56,
        "comment" : ""
      },
      "cache" : { },
      "timings" : {
        "comment" : "",
        "ssl" : -1,
        "wait" : 3960,
        "send" : 0,
        "receive" : 1,
        "blocked" : -1,
        "dns" : -1,
        "connect" : -1
      },
      "serverIPAddress" : "127.0.0.1",
      "comment" : "",
      "_katalonRequestInformation" : {
        "name" : "61",
        "testObjectId" : "Object Repository/VoGrow/Field/FieldPost",
        "harId" : "c70bb16a-b1a2-4523-b846-51e6a79447b4"
      },
      "time" : 3962
    } ],
    "comment" : ""
  }
}