{
  "log" : {
    "version" : "1.2",
    "creator" : {
      "name" : "BrowserMob Proxy",
      "version" : "2.1.5",
      "comment" : ""
    },
    "pages" : [ {
      "id" : "Page 0",
      "startedDateTime" : "2019-04-05T19:30:11.052Z",
      "title" : "Page 0",
      "pageTimings" : {
        "onLoad" : 34558,
        "comment" : ""
      },
      "comment" : ""
    } ],
    "entries" : [ {
      "pageref" : "Page 0",
      "startedDateTime" : "2019-04-05T19:30:11.053Z",
      "request" : {
        "method" : "POST",
        "url" : "http://localhost:10520/WebAPI/api/mobile/v1/fields?",
        "httpVersion" : "HTTP/1.1",
        "cookies" : [ ],
        "headers" : [ {
          "name" : "User-Agent",
          "value" : "Katalon Studio"
        }, {
          "name" : "Content-Type",
          "value" : "application/json"
        }, {
          "name" : "Authorization",
          "value" : "Bearer eyJ0eXAiOiJKV1QiLCJhbGciOiJIUzI1NiJ9.eyJ1bmlxdWVfbmFtZSI6Implbm55Lm1hbGRvbmFkby50eDFAZ21haWwuY29tIiwicm9sZSI6InVzZXIiLCJzdWIiOiJqZW5ueS5tYWxkb25hZG8udHgxQGdtYWlsLmNvbSIsImlzcyI6IkNyb3BNZXRyaWNzIiwiYXVkIjoiYWxsIiwiZXhwIjoxNTU0NDk2NTExLCJuYmYiOjE1NTQ0OTI2MTF9.HbgPEsicBo8a40lVa_3jDQccNntvRkKHyTI6_c-7Sf0"
        }, {
          "name" : "Host",
          "value" : "localhost:10520"
        }, {
          "name" : "Accept",
          "value" : "text/html, image/gif, image/jpeg, *; q=.2, */*; q=.2"
        }, {
          "name" : "Proxy-Connection",
          "value" : "keep-alive"
        }, {
          "name" : "Content-Length",
          "value" : "502"
        } ],
        "queryString" : [ ],
        "postData" : {
          "mimeType" : "application/json",
          "text" : "{\"field\":{\"farm_id\":3,\"name\":\"129 chars as field name API FIELD When new field has name attribute with 128 chars Expected status code 201 API FIELD When new f\",\"boundary\":{\"boundaries\":[{\"boundary\":{\"coords\":[{\"x\":-101.49568751,\"y\":37.14976293},{\"x\":-101.50049403,\"y\":37.14647907},{\"x\":-101.50049403,\"y\":37.14264773},{\"x\":-101.49723246,\"y\":37.1411425},{\"x\":-101.49019435,\"y\":37.14223722},{\"x\":-101.48933604,\"y\":37.14620541},{\"x\":-101.49294093,\"y\":37.14866833},{\"x\":-101.49568751,\"y\":37.14976293}]}}]}}}",
          "comment" : ""
        },
        "headersSize" : 592,
        "bodySize" : 502,
        "comment" : ""
      },
      "response" : {
        "status" : 201,
        "statusText" : "Created",
        "httpVersion" : "HTTP/1.1",
        "cookies" : [ {
          "name" : ".ASPROLES",
          "value" : "c8LmU6oRPPOihDT-H4YzN_7DNObychrBk_wmJhGj4h2mq3F9dG4dAoCpkdhkmKPHP8as0U6gD1v-ZDmva8UHC09D9wZDeMqI69nQ7zDMzHunLV2Dz59E_DDrcWpP8yYPQ-2t8_nCv9fdXrb6ufp_KlMAREzdHK4CHS1hoY1INP9W1rJls1A3is34cVGNrlQhgWiKUVtDU4wrCvGgXlHTnb-Hmhoi8eFhMB8siSxYbDnSgeKKwOf4GWQs76Mj58r1rnf9KO7fHTqj9200RxDsux9WK5G0R0JX04yjGVUa1FX2_pxRpBNC1Jdnso0_mVndktxHw72-BFsVKSxbnzndjjT4wAwG9nsPDmXenayQIcrHQTGx1BydlTZGFuu_sy-Do4D3pYo-JPXpIuUusNahcCA94PlwFQzN9o6XeZUROaFTf--4aAdIyXTbAG5i3RuDKmK3CnDUxMOiv2MSbLH4Dc5fCLgpYc_fvmTnxIVsyfd_tCeoKpRESJ7LsuHsXxu5OzNfJER-MGKfLFSD_QDNruLV5w81",
          "path" : "/",
          "httpOnly" : true,
          "secure" : false,
          "comment" : ""
        } ],
        "headers" : [ {
          "name" : "Cache-Control",
          "value" : "private"
        }, {
          "name" : "Content-Type",
          "value" : "application/json; charset=utf-8"
        }, {
          "name" : "Location",
          "value" : "api/mobile/v1/fields/4"
        }, {
          "name" : "Server",
          "value" : "Microsoft-IIS/10.0"
        }, {
          "name" : "Set-Cookie",
          "value" : ".ASPROLES=c8LmU6oRPPOihDT-H4YzN_7DNObychrBk_wmJhGj4h2mq3F9dG4dAoCpkdhkmKPHP8as0U6gD1v-ZDmva8UHC09D9wZDeMqI69nQ7zDMzHunLV2Dz59E_DDrcWpP8yYPQ-2t8_nCv9fdXrb6ufp_KlMAREzdHK4CHS1hoY1INP9W1rJls1A3is34cVGNrlQhgWiKUVtDU4wrCvGgXlHTnb-Hmhoi8eFhMB8siSxYbDnSgeKKwOf4GWQs76Mj58r1rnf9KO7fHTqj9200RxDsux9WK5G0R0JX04yjGVUa1FX2_pxRpBNC1Jdnso0_mVndktxHw72-BFsVKSxbnzndjjT4wAwG9nsPDmXenayQIcrHQTGx1BydlTZGFuu_sy-Do4D3pYo-JPXpIuUusNahcCA94PlwFQzN9o6XeZUROaFTf--4aAdIyXTbAG5i3RuDKmK3CnDUxMOiv2MSbLH4Dc5fCLgpYc_fvmTnxIVsyfd_tCeoKpRESJ7LsuHsXxu5OzNfJER-MGKfLFSD_QDNruLV5w81; path=/; HttpOnly"
        }, {
          "name" : "X-SourceFiles",
          "value" : "=?UTF-8?B?RDpcVmlydHVhbE9wdGltaXplci1SZWZhY3RvcmluZ1xDcm9wTWV0cmljcy5Wby5BcGlcQ3JvcE1ldHJpY3MuVm8uQXBpXGFwaVxtb2JpbGVcdjFcZmllbGRz?="
        }, {
          "name" : "X-Powered-By",
          "value" : "ASP.NET"
        }, {
          "name" : "Date",
          "value" : "Fri, 05 Apr 2019 19:30:45 GMT"
        }, {
          "name" : "Content-Length",
          "value" : "522"
        } ],
        "content" : {
          "size" : 522,
          "mimeType" : "application/json; charset=utf-8",
          "text" : "{\"field\":{\"id\":4,\"farm_id\":3,\"name\":\"129 chars as field name API FIELD When new field has name attribute with 128 chars Expected status code 201 API FIELD When new f\",\"boundary\":{\"boundaries\":[{\"boundary\":{\"coords\":[{\"x\":-101.49568751,\"y\":37.14976293},{\"x\":-101.49294093,\"y\":37.14866833},{\"x\":-101.48933604,\"y\":37.14620541},{\"x\":-101.49019435,\"y\":37.14223722},{\"x\":-101.49723246,\"y\":37.1411425},{\"x\":-101.50049403,\"y\":37.14264773},{\"x\":-101.50049403,\"y\":37.14647907},{\"x\":-101.49568751,\"y\":37.14976293}]},\"holes\":null}]}}}",
          "comment" : ""
        },
        "redirectURL" : "",
        "headersSize" : 971,
        "bodySize" : 522,
        "comment" : ""
      },
      "cache" : { },
      "timings" : {
        "comment" : "",
        "ssl" : -1,
        "connect" : -1,
        "blocked" : -1,
        "send" : 0,
        "dns" : -1,
        "receive" : 0,
        "wait" : 34553
      },
      "serverIPAddress" : "127.0.0.1",
      "comment" : "",
      "_katalonRequestInformation" : {
        "name" : "39",
        "testObjectId" : "Object Repository/VoGrow/Field/FieldPost",
        "harId" : "b274159f-5756-4138-bf37-fb28032ace14"
      },
      "time" : 34554
    } ],
    "comment" : ""
  }
}