{
  "log" : {
    "version" : "1.2",
    "creator" : {
      "name" : "BrowserMob Proxy",
      "version" : "2.1.5",
      "comment" : ""
    },
    "pages" : [ {
      "id" : "Page 0",
      "startedDateTime" : "2019-04-11T16:44:31.110Z",
      "title" : "Page 0",
      "pageTimings" : {
        "onLoad" : 63,
        "comment" : ""
      },
      "comment" : ""
    } ],
    "entries" : [ {
      "pageref" : "Page 0",
      "startedDateTime" : "2019-04-11T16:44:31.114Z",
      "request" : {
        "method" : "POST",
        "url" : "http://localhost:10520/WebAPI/token?",
        "httpVersion" : "HTTP/1.1",
        "cookies" : [ ],
        "headers" : [ {
          "name" : "User-Agent",
          "value" : "Katalon Studio"
        }, {
          "name" : "Content-Type",
          "value" : "application/x-www-form-urlencoded"
        }, {
          "name" : "Host",
          "value" : "localhost:10520"
        }, {
          "name" : "Accept",
          "value" : "text/html, image/gif, image/jpeg, *; q=.2, */*; q=.2"
        }, {
          "name" : "Proxy-Connection",
          "value" : "keep-alive"
        }, {
          "name" : "Content-Length",
          "value" : "78"
        } ],
        "queryString" : [ ],
        "postData" : {
          "mimeType" : "application/x-www-form-urlencoded",
          "params" : [ {
            "name" : "username",
            "value" : "admin",
            "comment" : ""
          }, {
            "name" : "password",
            "value" : "cropmetricsvo",
            "comment" : ""
          }, {
            "name" : "grant_type",
            "value" : "password",
            "comment" : ""
          }, {
            "name" : "client_id",
            "value" : "ngAuthApp2",
            "comment" : ""
          } ],
          "comment" : ""
        },
        "headersSize" : 268,
        "bodySize" : 78,
        "comment" : ""
      },
      "response" : {
        "status" : 500,
        "statusText" : "Internal Server Error",
        "httpVersion" : "HTTP/1.1",
        "cookies" : [ ],
        "headers" : [ {
          "name" : "Cache-Control",
          "value" : "private"
        }, {
          "name" : "Content-Type",
          "value" : "text/html; charset=utf-8"
        }, {
          "name" : "Server",
          "value" : "Microsoft-IIS/10.0"
        }, {
          "name" : "X-AspNet-Version",
          "value" : "4.0.30319"
        }, {
          "name" : "X-SourceFiles",
          "value" : "=?UTF-8?B?RDpcVmlydHVhbE9wdGltaXplci1SZWZhY3RvcmluZ1xDcm9wTWV0cmljcy5Wby5BcGlcQ3JvcE1ldHJpY3MuVm8uQXBpXHRva2Vu?="
        }, {
          "name" : "X-Powered-By",
          "value" : "ASP.NET"
        }, {
          "name" : "Date",
          "value" : "Thu, 11 Apr 2019 16:44:30 GMT"
        }, {
          "name" : "Content-Length",
          "value" : "12715"
        } ],
        "content" : {
          "size" : 12715,
          "mimeType" : "text/html; charset=utf-8",
          "text" : "<!DOCTYPE html>\r\n<html>\r\n    <head>\r\n        <title>53300: sorry, too many clients already</title>\r\n        <meta name=\"viewport\" content=\"width=device-width\" />\r\n        <style>\r\n         body {font-family:\"Verdana\";font-weight:normal;font-size: .7em;color:black;} \r\n         p {font-family:\"Verdana\";font-weight:normal;color:black;margin-top: -5px}\r\n         b {font-family:\"Verdana\";font-weight:bold;color:black;margin-top: -5px}\r\n         H1 { font-family:\"Verdana\";font-weight:normal;font-size:18pt;color:red }\r\n         H2 { font-family:\"Verdana\";font-weight:normal;font-size:14pt;color:maroon }\r\n         pre {font-family:\"Consolas\",\"Lucida Console\",Monospace;font-size:11pt;margin:0;padding:0.5em;line-height:14pt}\r\n         .marker {font-weight: bold; color: black;text-decoration: none;}\r\n         .version {color: gray;}\r\n         .error {margin-bottom: 10px;}\r\n         .expandable { text-decoration:underline; font-weight:bold; color:navy; cursor:hand; }\r\n         @media screen and (max-width: 639px) {\r\n          pre { width: 440px; overflow: auto; white-space: pre-wrap; word-wrap: break-word; }\r\n         }\r\n         @media screen and (max-width: 479px) {\r\n          pre { width: 280px; }\r\n         }\r\n        </style>\r\n    </head>\r\n\r\n    <body bgcolor=\"white\">\r\n\r\n            <span><H1>Server Error in '/WebAPI' Application.<hr width=100% size=1 color=silver></H1>\r\n\r\n            <h2> <i>53300: sorry, too many clients already</i> </h2></span>\r\n\r\n            <font face=\"Arial, Helvetica, Geneva, SunSans-Regular, sans-serif \">\r\n\r\n            <b> Description: </b>An unhandled exception occurred during the execution of the current web request. Please review the stack trace for more information about the error and where it originated in the code.\r\n\r\n            <br><br>\r\n\r\n            <b> Exception Details: </b>Npgsql.PostgresException: 53300: sorry, too many clients already<br><br>\r\n\r\n            <b>Source Error:</b> <br><br>\r\n\r\n            <table width=100% bgcolor=\"#ffffcc\">\r\n               <tr>\r\n                  <td>\r\n                      <code><pre>\r\n\r\nLine 70:             {\r\nLine 71:                 if (PgsqlConnection.State == ConnectionState.Closed)\r\n<font color=red>Line 72:                     PgsqlConnection.Open();\r\n</font>Line 73: \r\nLine 74:                 </pre></code>\r\n\r\n                  </td>\r\n               </tr>\r\n            </table>\r\n\r\n            <br>\r\n\r\n            <b> Source File: </b> D:\\VirtualOptimizer-Refactoring\\CropMetrics.Vo.Postgres\\PgDataConnection.cs<b> &nbsp;&nbsp; Line: </b> 72\r\n            <br><br>\r\n\r\n            <b>Stack Trace:</b> <br><br>\r\n\r\n            <table width=100% bgcolor=\"#ffffcc\">\r\n               <tr>\r\n                  <td>\r\n                      <code><pre>\r\n\r\n[PostgresException (0x80004005): 53300: sorry, too many clients already]\r\n   Npgsql.&lt;&lt;ReadMessage&gt;g__ReadMessageLong|0&gt;d.MoveNext() +815\r\n   System.Runtime.ExceptionServices.ExceptionDispatchInfo.Throw() +26\r\n   Npgsql.&lt;&lt;ReadMessage&gt;g__ReadMessageLong|0&gt;d.MoveNext() +2138\r\n   System.Runtime.CompilerServices.TaskAwaiter.ThrowForNonSuccess(Task task) +99\r\n   System.Runtime.CompilerServices.TaskAwaiter.HandleNonSuccessAndDebuggerNotification(Task task) +58\r\n   Npgsql.&lt;Authenticate&gt;d__0.MoveNext() +407\r\n   System.Runtime.CompilerServices.TaskAwaiter.ThrowForNonSuccess(Task task) +99\r\n   System.Runtime.CompilerServices.TaskAwaiter.HandleNonSuccessAndDebuggerNotification(Task task) +58\r\n   Npgsql.&lt;Open&gt;d__149.MoveNext() +2156\r\n   System.Runtime.CompilerServices.TaskAwaiter.ThrowForNonSuccess(Task task) +99\r\n   System.Runtime.CompilerServices.TaskAwaiter.HandleNonSuccessAndDebuggerNotification(Task task) +58\r\n   Npgsql.&lt;AllocateLong&gt;d__19.MoveNext() +908\r\n   System.Runtime.CompilerServices.TaskAwaiter.ThrowForNonSuccess(Task task) +99\r\n   System.Runtime.CompilerServices.TaskAwaiter.HandleNonSuccessAndDebuggerNotification(Task task) +58\r\n   System.Threading.Tasks.ValueTask`1.get_Result() +121\r\n   Npgsql.&lt;&lt;Open&gt;g__OpenLong|0&gt;d.MoveNext() +2737\r\n   System.Runtime.CompilerServices.TaskAwaiter.ThrowForNonSuccess(Task task) +99\r\n   System.Runtime.CompilerServices.TaskAwaiter.HandleNonSuccessAndDebuggerNotification(Task task) +58\r\n   Npgsql.NpgsqlConnection.Open() +56\r\n   CropMetrics.Vo.Postgres.PgConnection.GetDataSetQuery(String query, List`1 parameters, CommandType queryType, Int32 connectionTimeout) in D:\\VirtualOptimizer-Refactoring\\CropMetrics.Vo.Postgres\\PgDataConnection.cs:72\r\n   CropMetrics.Vo.Postgres.PgConnection.ExecuteQuery(String query, List`1 parameters, CommandType queryType, Int32 connectionTimeout) in D:\\VirtualOptimizer-Refactoring\\CropMetrics.Vo.Postgres\\PgDataConnection.cs:220\r\n   CropMetrics.Vo.Postgres.PgConnection.ExecuteQuery(String query, List`1 parameters) in D:\\VirtualOptimizer-Refactoring\\CropMetrics.Vo.Postgres\\PgDataConnection.cs:203\r\n   CropMetrics.Vo.DataAccess.DataAccess.ClientAppFromDb.FindById(String clientId) in D:\\VirtualOptimizer-Refactoring\\CropMetrics.Vo.DataAccess\\DataAccess\\ClientAppFromDb.cs:21\r\n   CropMetrics.Vo.Business.ClientAppManager.FindById(String clientId) in D:\\VirtualOptimizer-Refactoring\\CropMetrics.Vo.Business\\ClientAppManager.cs:18\r\n   CropMetrics.Vo.Api.AuthenticationManager.FindClient(String clientId) in D:\\VirtualOptimizer-Refactoring\\CropMetrics.Vo.Api\\CropMetrics.Vo.Api\\AuthenticationManager.cs:194\r\n   CropMetrics.Vo.Api.Providers.SimpleAuthorizationServerProvider.ValidateClientAuthentication(OAuthValidateClientAuthenticationContext context) in D:\\VirtualOptimizer-Refactoring\\CropMetrics.Vo.Api\\CropMetrics.Vo.Api\\Providers\\SimpleAuthorizationServerProvider.cs:51\r\n   Microsoft.Owin.Security.OAuth.&lt;InvokeTokenEndpointAsync&gt;d__22.MoveNext() +524\r\n   System.Runtime.CompilerServices.TaskAwaiter.ThrowForNonSuccess(Task task) +99\r\n   System.Runtime.CompilerServices.TaskAwaiter.HandleNonSuccessAndDebuggerNotification(Task task) +58\r\n   System.Runtime.CompilerServices.TaskAwaiter.ValidateEnd(Task task) +25\r\n   Microsoft.Owin.Security.OAuth.&lt;InvokeAsync&gt;d__0.MoveNext() +1103\r\n   System.Runtime.CompilerServices.TaskAwaiter.ThrowForNonSuccess(Task task) +99\r\n   System.Runtime.CompilerServices.TaskAwaiter.HandleNonSuccessAndDebuggerNotification(Task task) +58\r\n   Microsoft.Owin.Security.Infrastructure.&lt;Invoke&gt;d__0.MoveNext() +435\r\n   System.Runtime.CompilerServices.TaskAwaiter.ThrowForNonSuccess(Task task) +99\r\n   System.Runtime.CompilerServices.TaskAwaiter.HandleNonSuccessAndDebuggerNotification(Task task) +58\r\n   Microsoft.Owin.Cors.&lt;Invoke&gt;d__0.MoveNext() +800\r\n   Microsoft.Owin.Host.SystemWeb.IntegratedPipeline.StageAsyncResult.End(IAsyncResult ar) +69\r\n   Microsoft.Owin.Host.SystemWeb.IntegratedPipeline.IntegratedPipelineContext.EndFinalWork(IAsyncResult ar) +64\r\n   System.Web.AsyncEventExecutionStep.System.Web.HttpApplication.IExecutionStep.Execute() +483\r\n   System.Web.HttpApplication.ExecuteStepImpl(IExecutionStep step) +132\r\n   System.Web.HttpApplication.ExecuteStep(IExecutionStep step, Boolean&amp; completedSynchronously) +163\r\n</pre></code>\r\n\r\n                  </td>\r\n               </tr>\r\n            </table>\r\n\r\n            <br>\r\n\r\n            <hr width=100% size=1 color=silver>\r\n\r\n            <b>Version Information:</b>&nbsp;Microsoft .NET Framework Version:4.0.30319; ASP.NET Version:4.7.3282.0\r\n\r\n            </font>\r\n\r\n    </body>\r\n</html>\r\n<!-- \r\n[PostgresException]: 53300: sorry, too many clients already\r\n   at Npgsql.NpgsqlConnector.<>c__DisplayClass161_0.<<ReadMessage>g__ReadMessageLong|0>d.MoveNext()\r\n--- End of stack trace from previous location where exception was thrown ---\r\n   at System.Runtime.ExceptionServices.ExceptionDispatchInfo.Throw()\r\n   at Npgsql.NpgsqlConnector.<>c__DisplayClass161_0.<<ReadMessage>g__ReadMessageLong|0>d.MoveNext()\r\n--- End of stack trace from previous location where exception was thrown ---\r\n   at System.Runtime.CompilerServices.TaskAwaiter.ThrowForNonSuccess(Task task)\r\n   at System.Runtime.CompilerServices.TaskAwaiter.HandleNonSuccessAndDebuggerNotification(Task task)\r\n   at Npgsql.NpgsqlConnector.<Authenticate>d__0.MoveNext()\r\n--- End of stack trace from previous location where exception was thrown ---\r\n   at System.Runtime.CompilerServices.TaskAwaiter.ThrowForNonSuccess(Task task)\r\n   at System.Runtime.CompilerServices.TaskAwaiter.HandleNonSuccessAndDebuggerNotification(Task task)\r\n   at Npgsql.NpgsqlConnector.<Open>d__149.MoveNext()\r\n--- End of stack trace from previous location where exception was thrown ---\r\n   at System.Runtime.CompilerServices.TaskAwaiter.ThrowForNonSuccess(Task task)\r\n   at System.Runtime.CompilerServices.TaskAwaiter.HandleNonSuccessAndDebuggerNotification(Task task)\r\n   at Npgsql.ConnectorPool.<AllocateLong>d__19.MoveNext()\r\n--- End of stack trace from previous location where exception was thrown ---\r\n   at System.Runtime.CompilerServices.TaskAwaiter.ThrowForNonSuccess(Task task)\r\n   at System.Runtime.CompilerServices.TaskAwaiter.HandleNonSuccessAndDebuggerNotification(Task task)\r\n   at System.Threading.Tasks.ValueTask`1.get_Result()\r\n   at Npgsql.NpgsqlConnection.<>c__DisplayClass32_0.<<Open>g__OpenLong|0>d.MoveNext()\r\n--- End of stack trace from previous location where exception was thrown ---\r\n   at System.Runtime.CompilerServices.TaskAwaiter.ThrowForNonSuccess(Task task)\r\n   at System.Runtime.CompilerServices.TaskAwaiter.HandleNonSuccessAndDebuggerNotification(Task task)\r\n   at Npgsql.NpgsqlConnection.Open()\r\n   at CropMetrics.Vo.Postgres.PgConnection.GetDataSetQuery(String query, List`1 parameters, CommandType queryType, Int32 connectionTimeout) in D:\\VirtualOptimizer-Refactoring\\CropMetrics.Vo.Postgres\\PgDataConnection.cs:line 72\r\n   at CropMetrics.Vo.Postgres.PgConnection.ExecuteQuery(String query, List`1 parameters, CommandType queryType, Int32 connectionTimeout) in D:\\VirtualOptimizer-Refactoring\\CropMetrics.Vo.Postgres\\PgDataConnection.cs:line 220\r\n   at CropMetrics.Vo.Postgres.PgConnection.ExecuteQuery(String query, List`1 parameters) in D:\\VirtualOptimizer-Refactoring\\CropMetrics.Vo.Postgres\\PgDataConnection.cs:line 203\r\n   at CropMetrics.Vo.DataAccess.DataAccess.ClientAppFromDb.FindById(String clientId) in D:\\VirtualOptimizer-Refactoring\\CropMetrics.Vo.DataAccess\\DataAccess\\ClientAppFromDb.cs:line 21\r\n   at CropMetrics.Vo.Business.ClientAppManager.FindById(String clientId) in D:\\VirtualOptimizer-Refactoring\\CropMetrics.Vo.Business\\ClientAppManager.cs:line 18\r\n   at CropMetrics.Vo.Api.AuthenticationManager.FindClient(String clientId) in D:\\VirtualOptimizer-Refactoring\\CropMetrics.Vo.Api\\CropMetrics.Vo.Api\\AuthenticationManager.cs:line 194\r\n   at CropMetrics.Vo.Api.Providers.SimpleAuthorizationServerProvider.ValidateClientAuthentication(OAuthValidateClientAuthenticationContext context) in D:\\VirtualOptimizer-Refactoring\\CropMetrics.Vo.Api\\CropMetrics.Vo.Api\\Providers\\SimpleAuthorizationServerProvider.cs:line 51\r\n   at Microsoft.Owin.Security.OAuth.OAuthAuthorizationServerHandler.<InvokeTokenEndpointAsync>d__22.MoveNext()\r\n--- End of stack trace from previous location where exception was thrown ---\r\n   at System.Runtime.CompilerServices.TaskAwaiter.ThrowForNonSuccess(Task task)\r\n   at System.Runtime.CompilerServices.TaskAwaiter.HandleNonSuccessAndDebuggerNotification(Task task)\r\n   at System.Runtime.CompilerServices.TaskAwaiter.ValidateEnd(Task task)\r\n   at Microsoft.Owin.Security.OAuth.OAuthAuthorizationServerHandler.<InvokeAsync>d__0.MoveNext()\r\n--- End of stack trace from previous location where exception was thrown ---\r\n   at System.Runtime.CompilerServices.TaskAwaiter.ThrowForNonSuccess(Task task)\r\n   at System.Runtime.CompilerServices.TaskAwaiter.HandleNonSuccessAndDebuggerNotification(Task task)\r\n   at Microsoft.Owin.Security.Infrastructure.AuthenticationMiddleware`1.<Invoke>d__0.MoveNext()\r\n--- End of stack trace from previous location where exception was thrown ---\r\n   at System.Runtime.CompilerServices.TaskAwaiter.ThrowForNonSuccess(Task task)\r\n   at System.Runtime.CompilerServices.TaskAwaiter.HandleNonSuccessAndDebuggerNotification(Task task)\r\n   at Microsoft.Owin.Cors.CorsMiddleware.<Invoke>d__0.MoveNext()\r\n--- End of stack trace from previous location where exception was thrown ---\r\n   at Microsoft.Owin.Host.SystemWeb.IntegratedPipeline.StageAsyncResult.End(IAsyncResult ar)\r\n   at Microsoft.Owin.Host.SystemWeb.IntegratedPipeline.IntegratedPipelineContext.EndFinalWork(IAsyncResult ar)\r\n   at System.Web.HttpApplication.AsyncEventExecutionStep.System.Web.HttpApplication.IExecutionStep.Execute()\r\n   at System.Web.HttpApplication.ExecuteStepImpl(IExecutionStep step)\r\n   at System.Web.HttpApplication.ExecuteStep(IExecutionStep step, Boolean& completedSynchronously)\r\n-->",
          "comment" : ""
        },
        "redirectURL" : "",
        "headersSize" : 373,
        "bodySize" : 12715,
        "comment" : ""
      },
      "cache" : { },
      "timings" : {
        "comment" : "",
        "send" : 0,
        "wait" : 51,
        "receive" : 1,
        "dns" : 0,
        "connect" : 2,
        "blocked" : 0,
        "ssl" : -1
      },
      "serverIPAddress" : "127.0.0.1",
      "comment" : "",
      "_katalonRequestInformation" : {
        "name" : "6",
        "testObjectId" : "Object Repository/VoPro/Token",
        "harId" : "45b38a3c-4e92-44ed-8b7b-829a87e036d1"
      },
      "time" : 56
    } ],
    "comment" : ""
  }
}