{
  "log" : {
    "version" : "1.2",
    "creator" : {
      "name" : "BrowserMob Proxy",
      "version" : "2.1.5",
      "comment" : ""
    },
    "pages" : [ {
      "id" : "Page 0",
      "startedDateTime" : "2019-04-09T21:06:54.904Z",
      "title" : "Page 0",
      "pageTimings" : {
        "onLoad" : 24,
        "comment" : ""
      },
      "comment" : ""
    } ],
    "entries" : [ {
      "pageref" : "Page 0",
      "startedDateTime" : "2019-04-09T21:06:54.905Z",
      "request" : {
        "method" : "GET",
        "url" : "http://localhost:10520/WebAPI/api/mobile/v1/user?",
        "httpVersion" : "HTTP/1.1",
        "cookies" : [ ],
        "headers" : [ {
          "name" : "User-Agent",
          "value" : "Katalon Studio"
        }, {
          "name" : "Content-Type",
          "value" : "application/json"
        }, {
          "name" : "Authorization",
          "value" : "Bearer eyJ0eXAiOiJKV1QiLCJhbGciOiJIUzI1NiJ9.eyJ1bmlxdWVfbmFtZSI6ImFkbWluIiwicm9sZSI6InVzZXIiLCJzdWIiOiJhZG1pbiIsImlzcyI6IkNyb3BNZXRyaWNzIiwiYXVkIjoiYWxsIiwiZXhwIjoxNTU0ODQ3OTE0LCJuYmYiOjE1NTQ4NDQwMTR9.TIOrbi8M_6n8oY0_qVXGmpkxhGWRg6eUX-LSq67q-Xk"
        }, {
          "name" : "Host",
          "value" : "localhost:10520"
        }, {
          "name" : "Accept",
          "value" : "text/html, image/gif, image/jpeg, *; q=.2, */*; q=.2"
        }, {
          "name" : "Proxy-Connection",
          "value" : "keep-alive"
        } ],
        "queryString" : [ ],
        "headersSize" : 504,
        "bodySize" : 0,
        "comment" : ""
      },
      "response" : {
        "status" : 401,
        "statusText" : "Unauthorized",
        "httpVersion" : "HTTP/1.1",
        "cookies" : [ {
          "name" : ".ASPROLES",
          "value" : "NbBat-ntsMud9Iw3sxb4WdACFCKjPvPx1BXP0IMRtIlB-ABerE5dXL1L-iEDfNxT6CqUoFZXNN7CCwHmmIk1pc008ZVSVbtn5DbI3CHJw0HqGjH7fRosnGeeEBHW2SjuKeEICKwj4isvIsy5bkXcFIXgthy_RIwZC5ttYjXT7Ulh8wOvtwg6O5q3riTzhj_OJbL5O-RK_lhFA7iNPvXsAEhbc3wNARYujm1Ftmtt7vpMLTLvcrmqJHbW1jDSAihXWQJoUANSQlBRD1qXdqbHj-F5z53VnG-DcJsuj1Ira3X_w-_OLUkmUKA9k19rHDgog6qYfVF1EBeVP_H8WfCLLJrsX5LBzqknHpfnZaP2LEZZmHgefghWTAh6dhsqzJ50CCCP-ctmY6VkqAcZos28gm0mubRfpL20qJJE7nxYOJJ2an8C6dFEQCKAU09DYBYj7aATr3IF7ZB2HEWOLxH5vgESKBMmka3yXDfZ1bMaIlrYj69u0",
          "path" : "/",
          "httpOnly" : true,
          "secure" : false,
          "comment" : ""
        } ],
        "headers" : [ {
          "name" : "Cache-Control",
          "value" : "private"
        }, {
          "name" : "Content-Type",
          "value" : "application/json; charset=utf-8"
        }, {
          "name" : "Server",
          "value" : "Microsoft-IIS/10.0"
        }, {
          "name" : "Set-Cookie",
          "value" : ".ASPROLES=NbBat-ntsMud9Iw3sxb4WdACFCKjPvPx1BXP0IMRtIlB-ABerE5dXL1L-iEDfNxT6CqUoFZXNN7CCwHmmIk1pc008ZVSVbtn5DbI3CHJw0HqGjH7fRosnGeeEBHW2SjuKeEICKwj4isvIsy5bkXcFIXgthy_RIwZC5ttYjXT7Ulh8wOvtwg6O5q3riTzhj_OJbL5O-RK_lhFA7iNPvXsAEhbc3wNARYujm1Ftmtt7vpMLTLvcrmqJHbW1jDSAihXWQJoUANSQlBRD1qXdqbHj-F5z53VnG-DcJsuj1Ira3X_w-_OLUkmUKA9k19rHDgog6qYfVF1EBeVP_H8WfCLLJrsX5LBzqknHpfnZaP2LEZZmHgefghWTAh6dhsqzJ50CCCP-ctmY6VkqAcZos28gm0mubRfpL20qJJE7nxYOJJ2an8C6dFEQCKAU09DYBYj7aATr3IF7ZB2HEWOLxH5vgESKBMmka3yXDfZ1bMaIlrYj69u0; path=/; HttpOnly"
        }, {
          "name" : "X-SourceFiles",
          "value" : "=?UTF-8?B?RDpcVmlydHVhbE9wdGltaXplci1SZWZhY3RvcmluZ1xDcm9wTWV0cmljcy5Wby5BcGlcQ3JvcE1ldHJpY3MuVm8uQXBpXGFwaVxtb2JpbGVcdjFcdXNlcg==?="
        }, {
          "name" : "X-Powered-By",
          "value" : "ASP.NET"
        }, {
          "name" : "Date",
          "value" : "Tue, 09 Apr 2019 21:06:54 GMT"
        }, {
          "name" : "Content-Length",
          "value" : "61"
        } ],
        "content" : {
          "size" : 61,
          "mimeType" : "application/json; charset=utf-8",
          "text" : "{\"message\":\"Authorization has been denied for this request.\"}",
          "comment" : ""
        },
        "redirectURL" : "",
        "headersSize" : 898,
        "bodySize" : 61,
        "comment" : ""
      },
      "cache" : { },
      "timings" : {
        "comment" : "",
        "ssl" : -1,
        "receive" : 0,
        "blocked" : -1,
        "send" : 0,
        "wait" : 17,
        "dns" : -1,
        "connect" : -1
      },
      "serverIPAddress" : "127.0.0.1",
      "comment" : "",
      "_katalonRequestInformation" : {
        "name" : "13",
        "testObjectId" : "Object Repository/VoGrow/User/User",
        "harId" : "a9aae1a5-fded-4a7f-b06f-c244945f6e43"
      },
      "time" : 19
    } ],
    "comment" : ""
  }
}