{
  "log" : {
    "version" : "1.2",
    "creator" : {
      "name" : "BrowserMob Proxy",
      "version" : "2.1.5",
      "comment" : ""
    },
    "pages" : [ {
      "id" : "Page 0",
      "startedDateTime" : "2019-03-29T22:09:36.291Z",
      "title" : "Page 0",
      "pageTimings" : {
        "onLoad" : 1794,
        "comment" : ""
      },
      "comment" : ""
    } ],
    "entries" : [ {
      "pageref" : "Page 0",
      "startedDateTime" : "2019-03-29T22:09:36.292Z",
      "request" : {
        "method" : "POST",
        "url" : "http://localhost:10520/WebAPI/api/admin/v1/users/?",
        "httpVersion" : "HTTP/1.1",
        "cookies" : [ ],
        "headers" : [ {
          "name" : "User-Agent",
          "value" : "Katalon Studio"
        }, {
          "name" : "Content-Type",
          "value" : "application/x-www-form-urlencoded"
        }, {
          "name" : "Authorization",
          "value" : "Bearer eyJ0eXAiOiJKV1QiLCJhbGciOiJIUzI1NiJ9.eyJ1bmlxdWVfbmFtZSI6ImFkbWluIiwicm9sZSI6InVzZXIiLCJzdWIiOiJhZG1pbiIsImlzcyI6IkNyb3BNZXRyaWNzIiwiYXVkIjoiYWxsIiwiZXhwIjoxNTUzOTAxMjc2LCJuYmYiOjE1NTM4OTczNzZ9.plXQMXAKRfb2bw7LVsjM0re_8pMyjW6vxwUyF73u6EM"
        }, {
          "name" : "Host",
          "value" : "localhost:10520"
        }, {
          "name" : "Accept",
          "value" : "text/html, image/gif, image/jpeg, *; q=.2, */*; q=.2"
        }, {
          "name" : "Proxy-Connection",
          "value" : "keep-alive"
        }, {
          "name" : "Content-Length",
          "value" : "279"
        } ],
        "queryString" : [ ],
        "postData" : {
          "mimeType" : "application/x-www-form-urlencoded",
          "params" : [ {
            "name" : "password",
            "value" : "cropmetrics",
            "comment" : ""
          }, {
            "name" : "email",
            "value" : "cropmetricsvo.no.addressline1@gmail.com",
            "comment" : ""
          }, {
            "name" : "fullname",
            "value" : "test validation",
            "comment" : ""
          }, {
            "name" : "phone",
            "value" : "123",
            "comment" : ""
          }, {
            "name" : "dealer",
            "value" : "dealet test",
            "comment" : ""
          }, {
            "name" : "addressLine1",
            "value" : "",
            "comment" : ""
          }, {
            "name" : "addressLine2",
            "value" : "address line 2 test validation",
            "comment" : ""
          }, {
            "name" : "town",
            "value" : "townValidation",
            "comment" : ""
          }, {
            "name" : "state",
            "value" : "stateValidation",
            "comment" : ""
          }, {
            "name" : "zip",
            "value" : "zipValidation",
            "comment" : ""
          }, {
            "name" : "country",
            "value" : "countryValidation",
            "comment" : ""
          }, {
            "name" : "roles",
            "value" : "Client",
            "comment" : ""
          } ],
          "comment" : ""
        },
        "headersSize" : 544,
        "bodySize" : 279,
        "comment" : ""
      },
      "response" : {
        "status" : 200,
        "statusText" : "OK",
        "httpVersion" : "HTTP/1.1",
        "cookies" : [ {
          "name" : ".ASPROLES",
          "value" : "PYMZNOCtrS7un1o_MAVLBnyyITQBCUtE-9Cvn66pIXhYf6OCHvcstqeqDUdq0rIaq2DLgArtIsTcDfdKa05rJDs2U8NoE7y3WAQA3aSs6ewq9v8zKU2hw6IM2iVR1Vt9IdyO4ANvaV0mxqN1H5r41h2WFTW_X6tAI0EJJYgL0YbPg4why58oNkPbGxnPBkEigRWNNRRIUp1yH15lgjY_nX_D4P-voYInUHkbsJwGrO4ThAuSCPaNxB9BaJmdpWW8TxiBJa4X0FxSE0mHGURU1hP2UJfh7NAczNpzQsUgeutY5gZTEWt1_9vIcQEzDGDydI69Tx-adXnDrMy9-MLrzLNEdP0baPFgzReseAdmgthMk4Yz9opo9Fuupvlyh9iGW7B4S1Dkf--f54CBljusmgOEk0_Iq4Mc08F9uHIEK3FDeC2tFUJRkMpyqCAVXH_fxSO9zB5qsvakNuEoC77YQO1D7ctjVc-tZ2CEZ2qSlFQOyfZW0",
          "path" : "/",
          "httpOnly" : true,
          "secure" : false,
          "comment" : ""
        } ],
        "headers" : [ {
          "name" : "Cache-Control",
          "value" : "private"
        }, {
          "name" : "Content-Type",
          "value" : "application/json; charset=utf-8"
        }, {
          "name" : "Server",
          "value" : "Microsoft-IIS/10.0"
        }, {
          "name" : "Set-Cookie",
          "value" : ".ASPROLES=PYMZNOCtrS7un1o_MAVLBnyyITQBCUtE-9Cvn66pIXhYf6OCHvcstqeqDUdq0rIaq2DLgArtIsTcDfdKa05rJDs2U8NoE7y3WAQA3aSs6ewq9v8zKU2hw6IM2iVR1Vt9IdyO4ANvaV0mxqN1H5r41h2WFTW_X6tAI0EJJYgL0YbPg4why58oNkPbGxnPBkEigRWNNRRIUp1yH15lgjY_nX_D4P-voYInUHkbsJwGrO4ThAuSCPaNxB9BaJmdpWW8TxiBJa4X0FxSE0mHGURU1hP2UJfh7NAczNpzQsUgeutY5gZTEWt1_9vIcQEzDGDydI69Tx-adXnDrMy9-MLrzLNEdP0baPFgzReseAdmgthMk4Yz9opo9Fuupvlyh9iGW7B4S1Dkf--f54CBljusmgOEk0_Iq4Mc08F9uHIEK3FDeC2tFUJRkMpyqCAVXH_fxSO9zB5qsvakNuEoC77YQO1D7ctjVc-tZ2CEZ2qSlFQOyfZW0; path=/; HttpOnly"
        }, {
          "name" : "X-SourceFiles",
          "value" : "=?UTF-8?B?RDpcVmlydHVhbE9wdGltaXplci1SZWZhY3RvcmluZ1xDcm9wTWV0cmljcy5Wby5BcGlcQ3JvcE1ldHJpY3MuVm8uQXBpXGFwaVxhZG1pblx2MVx1c2Vyc1w=?="
        }, {
          "name" : "X-Powered-By",
          "value" : "ASP.NET"
        }, {
          "name" : "Date",
          "value" : "Fri, 29 Mar 2019 22:09:38 GMT"
        }, {
          "name" : "Content-Length",
          "value" : "8"
        } ],
        "content" : {
          "size" : 8,
          "mimeType" : "application/json; charset=utf-8",
          "text" : "{\"id\":7}",
          "comment" : ""
        },
        "redirectURL" : "",
        "headersSize" : 887,
        "bodySize" : 8,
        "comment" : ""
      },
      "cache" : { },
      "timings" : {
        "comment" : "",
        "ssl" : -1,
        "connect" : -1,
        "send" : 0,
        "receive" : 0,
        "wait" : 1788,
        "dns" : -1,
        "blocked" : -1
      },
      "serverIPAddress" : "127.0.0.1",
      "comment" : "",
      "_katalonRequestInformation" : {
        "name" : "19",
        "testObjectId" : "Object Repository/VoPro/Account/api_admin_v1_users",
        "harId" : "1dfb8c22-2a62-4bb3-978a-6ed9237e65ef"
      },
      "time" : 1790
    } ],
    "comment" : ""
  }
}