{
  "log" : {
    "version" : "1.2",
    "creator" : {
      "name" : "BrowserMob Proxy",
      "version" : "2.1.5",
      "comment" : ""
    },
    "pages" : [ {
      "id" : "Page 0",
      "startedDateTime" : "2019-04-01T13:39:23.788Z",
      "title" : "Page 0",
      "pageTimings" : {
        "onLoad" : 69,
        "comment" : ""
      },
      "comment" : ""
    } ],
    "entries" : [ {
      "pageref" : "Page 0",
      "startedDateTime" : "2019-04-01T13:39:23.789Z",
      "request" : {
        "method" : "POST",
        "url" : "http://localhost:10520/WebAPI/api/admin/v1/users/?",
        "httpVersion" : "HTTP/1.1",
        "cookies" : [ ],
        "headers" : [ {
          "name" : "User-Agent",
          "value" : "Katalon Studio"
        }, {
          "name" : "Content-Type",
          "value" : "application/x-www-form-urlencoded"
        }, {
          "name" : "Authorization",
          "value" : "Bearer eyJ0eXAiOiJKV1QiLCJhbGciOiJIUzI1NiJ9.eyJ1bmlxdWVfbmFtZSI6ImNyb3BtZXRyaWNzdm8uZmllbGRjcmV3QGdtYWlsLmNvbSIsInJvbGUiOiJ1c2VyIiwic3ViIjoiY3JvcG1ldHJpY3N2by5maWVsZGNyZXdAZ21haWwuY29tIiwiaXNzIjoiQ3JvcE1ldHJpY3MiLCJhdWQiOiJhbGwiLCJleHAiOjE1NTQxMjk4NjMsIm5iZiI6MTU1NDEyNTk2M30.5tSEvxwspOAh9Ec6E1RaYoESYfYtU4bmeSzvj7dML2s"
        }, {
          "name" : "Host",
          "value" : "localhost:10520"
        }, {
          "name" : "Accept",
          "value" : "text/html, image/gif, image/jpeg, *; q=.2, */*; q=.2"
        }, {
          "name" : "Proxy-Connection",
          "value" : "keep-alive"
        }, {
          "name" : "Content-Length",
          "value" : "275"
        } ],
        "queryString" : [ ],
        "postData" : {
          "mimeType" : "application/x-www-form-urlencoded",
          "params" : [ {
            "name" : "password",
            "value" : "cropmetrics",
            "comment" : ""
          }, {
            "name" : "email",
            "value" : "cropmetricsvo.clientByFieldCrew@gmail.com",
            "comment" : ""
          }, {
            "name" : "fullname",
            "value" : "test validation",
            "comment" : ""
          }, {
            "name" : "phone",
            "value" : "123",
            "comment" : ""
          }, {
            "name" : "dealer",
            "value" : "x",
            "comment" : ""
          }, {
            "name" : "addressLine1",
            "value" : "address line 1 test validation",
            "comment" : ""
          }, {
            "name" : "addressLine2",
            "value" : "address line 2 test validation",
            "comment" : ""
          }, {
            "name" : "town",
            "value" : "townValidation",
            "comment" : ""
          }, {
            "name" : "state",
            "value" : "stateValidation",
            "comment" : ""
          }, {
            "name" : "zip",
            "value" : "xx",
            "comment" : ""
          }, {
            "name" : "country",
            "value" : "xx",
            "comment" : ""
          }, {
            "name" : "roles",
            "value" : "Client",
            "comment" : ""
          } ],
          "comment" : ""
        },
        "headersSize" : 619,
        "bodySize" : 275,
        "comment" : ""
      },
      "response" : {
        "status" : 401,
        "statusText" : "Unauthorized",
        "httpVersion" : "HTTP/1.1",
        "cookies" : [ {
          "name" : ".ASPROLES",
          "value" : "vYEFAt9aBHLDTjuajQPU4yKGtRE9hCNpM9Ba7okAYxaN_n-b_Jdlj3U3xOrV8S7SQ-Tzx7-JDtzYXqAeJfnVsEsSJSPC6Cy8cIWHiLhqKWvYLSYXtrcRtYMSVpEWHranZn6poqewFBbrUA2MNEQi3vV-VbBlgC5-BPUc79_gxnxSMxxzRpZTqtpapYDJRU-8w8t9GnhmJ57VvahXGQ9krYhwdoDIngB9Zq9yCheijRG_u7UPqxNtZQ5Rd0u7YT6fUSUP0xzpl1BW-q18k5jC-b3KMGYqmpbisygqlqWnZmHYwGPeeONFIpIV7j-yOiWKYR5NWWXgGGEZpyK7JOxmgj4_Nu5OA37zzU7Nj_nJs1DKkRnNrw17-0o3sOK6ZG_s2CdKEQZOwCbV8zRO3Ryktg31bctlSonf6kSH2JsmQHQ8adgnWhj0FzPCvXieZWgHS9rvi4Yc3sW2eiwBha1PHgjIDzWPLhNizmdI_zVGiSrB57HKx5iHmeYh8tqKaXjXIH99DDtktKGG5HUoSfti4PkR2jE1",
          "path" : "/",
          "httpOnly" : true,
          "secure" : false,
          "comment" : ""
        } ],
        "headers" : [ {
          "name" : "Cache-Control",
          "value" : "private"
        }, {
          "name" : "Content-Type",
          "value" : "application/json; charset=utf-8"
        }, {
          "name" : "Server",
          "value" : "Microsoft-IIS/10.0"
        }, {
          "name" : "Set-Cookie",
          "value" : ".ASPROLES=vYEFAt9aBHLDTjuajQPU4yKGtRE9hCNpM9Ba7okAYxaN_n-b_Jdlj3U3xOrV8S7SQ-Tzx7-JDtzYXqAeJfnVsEsSJSPC6Cy8cIWHiLhqKWvYLSYXtrcRtYMSVpEWHranZn6poqewFBbrUA2MNEQi3vV-VbBlgC5-BPUc79_gxnxSMxxzRpZTqtpapYDJRU-8w8t9GnhmJ57VvahXGQ9krYhwdoDIngB9Zq9yCheijRG_u7UPqxNtZQ5Rd0u7YT6fUSUP0xzpl1BW-q18k5jC-b3KMGYqmpbisygqlqWnZmHYwGPeeONFIpIV7j-yOiWKYR5NWWXgGGEZpyK7JOxmgj4_Nu5OA37zzU7Nj_nJs1DKkRnNrw17-0o3sOK6ZG_s2CdKEQZOwCbV8zRO3Ryktg31bctlSonf6kSH2JsmQHQ8adgnWhj0FzPCvXieZWgHS9rvi4Yc3sW2eiwBha1PHgjIDzWPLhNizmdI_zVGiSrB57HKx5iHmeYh8tqKaXjXIH99DDtktKGG5HUoSfti4PkR2jE1; path=/; HttpOnly"
        }, {
          "name" : "X-SourceFiles",
          "value" : "=?UTF-8?B?RDpcVmlydHVhbE9wdGltaXplci1SZWZhY3RvcmluZ1xDcm9wTWV0cmljcy5Wby5BcGlcQ3JvcE1ldHJpY3MuVm8uQXBpXGFwaVxhZG1pblx2MVx1c2Vyc1w=?="
        }, {
          "name" : "X-Powered-By",
          "value" : "ASP.NET"
        }, {
          "name" : "Date",
          "value" : "Mon, 01 Apr 2019 13:39:23 GMT"
        }, {
          "name" : "Content-Length",
          "value" : "61"
        } ],
        "content" : {
          "size" : 61,
          "mimeType" : "application/json; charset=utf-8",
          "text" : "{\"message\":\"Authorization has been denied for this request.\"}",
          "comment" : ""
        },
        "redirectURL" : "",
        "headersSize" : 941,
        "bodySize" : 61,
        "comment" : ""
      },
      "cache" : { },
      "timings" : {
        "comment" : "",
        "blocked" : -1,
        "connect" : -1,
        "dns" : -1,
        "ssl" : -1,
        "send" : 0,
        "wait" : 64,
        "receive" : 0
      },
      "serverIPAddress" : "127.0.0.1",
      "comment" : "",
      "_katalonRequestInformation" : {
        "name" : "97",
        "testObjectId" : "Object Repository/VoPro/Account/api_admin_v1_users",
        "harId" : "7daa2db1-de10-431d-8e84-3e0e1446f0d0"
      },
      "time" : 65
    } ],
    "comment" : ""
  }
}