{
  "log" : {
    "version" : "1.2",
    "creator" : {
      "name" : "BrowserMob Proxy",
      "version" : "2.1.5",
      "comment" : ""
    },
    "pages" : [ {
      "id" : "Page 0",
      "startedDateTime" : "2019-03-29T22:32:00.254Z",
      "title" : "Page 0",
      "pageTimings" : {
        "onLoad" : 3185,
        "comment" : ""
      },
      "comment" : ""
    } ],
    "entries" : [ {
      "pageref" : "Page 0",
      "startedDateTime" : "2019-03-29T22:32:00.255Z",
      "request" : {
        "method" : "POST",
        "url" : "http://localhost:10520/WebAPI/api/admin/v1/users/?",
        "httpVersion" : "HTTP/1.1",
        "cookies" : [ ],
        "headers" : [ {
          "name" : "User-Agent",
          "value" : "Katalon Studio"
        }, {
          "name" : "Content-Type",
          "value" : "application/x-www-form-urlencoded"
        }, {
          "name" : "Authorization",
          "value" : "Bearer eyJ0eXAiOiJKV1QiLCJhbGciOiJIUzI1NiJ9.eyJ1bmlxdWVfbmFtZSI6ImFkbWluIiwicm9sZSI6InVzZXIiLCJzdWIiOiJhZG1pbiIsImlzcyI6IkNyb3BNZXRyaWNzIiwiYXVkIjoiYWxsIiwiZXhwIjoxNTUzOTAyNjIwLCJuYmYiOjE1NTM4OTg3MjB9.nJIR-WvS2waPvFTJ1LycxzB9DiD-B-vUvQioJJ4fj3g"
        }, {
          "name" : "Host",
          "value" : "localhost:10520"
        }, {
          "name" : "Accept",
          "value" : "text/html, image/gif, image/jpeg, *; q=.2, */*; q=.2"
        }, {
          "name" : "Proxy-Connection",
          "value" : "keep-alive"
        }, {
          "name" : "Content-Length",
          "value" : "270"
        } ],
        "queryString" : [ ],
        "postData" : {
          "mimeType" : "application/x-www-form-urlencoded",
          "params" : [ {
            "name" : "password",
            "value" : "cropmetrics",
            "comment" : ""
          }, {
            "name" : "email",
            "value" : "cropmetricsvo.fieldcrew@gmail.com",
            "comment" : ""
          }, {
            "name" : "fullname",
            "value" : "test validation",
            "comment" : ""
          }, {
            "name" : "phone",
            "value" : "123",
            "comment" : ""
          }, {
            "name" : "dealer",
            "value" : "x",
            "comment" : ""
          }, {
            "name" : "addressLine1",
            "value" : "address line 1 test validation",
            "comment" : ""
          }, {
            "name" : "addressLine2",
            "value" : "address line 2 test validation",
            "comment" : ""
          }, {
            "name" : "town",
            "value" : "townValidation",
            "comment" : ""
          }, {
            "name" : "state",
            "value" : "stateValidation",
            "comment" : ""
          }, {
            "name" : "zip",
            "value" : "xx",
            "comment" : ""
          }, {
            "name" : "country",
            "value" : "xx",
            "comment" : ""
          }, {
            "name" : "roles",
            "value" : "FieldCrew",
            "comment" : ""
          } ],
          "comment" : ""
        },
        "headersSize" : 544,
        "bodySize" : 270,
        "comment" : ""
      },
      "response" : {
        "status" : 400,
        "statusText" : "Bad Request",
        "httpVersion" : "HTTP/1.1",
        "cookies" : [ {
          "name" : ".ASPROLES",
          "value" : "5tMI6qtoHRYE1YlLEWSjIBsAonvoHyMGmn-49xV6z5OF2f3h2cR0qmW6amlmiHChmYnuxCMUCIdU0dP9SreMK7Udv8a0MI5947cnU6wPkdMBFAEvRuh0ENYsd30_eYC0CTJnLAJR9rKOsdUq2Xi7zGCIM2EYtY1DapuZIaIgUBWWgjuPlAnFVU5VnvxSem7ifWnWjBL0MrUKM6b08uGzBqigceMQYqDqjKps4FZ2s0knug6WqDnI07wgwldo3EPzYr96ElDh4Zk7qVPUyUqora1ctTzYahG8GNzj0FabugMHo1imIBoDxIF2q1K04xkCVFSdMJcMHpEWmwyMwvhO2oQ1TEYEKAkr3k8ZSnhgJ5N4RgJZBT545-fiPAhX224jG-dwKLCrljFFAFzgd9w-UGh8hIVoVKUzAi3X0Vr41iwCVp18jNan4q8VEO6WfPNJy73IttV6zejr5XZjSdHkRFCVy1lo4NJ9uCtKsmOq3RNg07Al0",
          "path" : "/",
          "httpOnly" : true,
          "secure" : false,
          "comment" : ""
        } ],
        "headers" : [ {
          "name" : "Cache-Control",
          "value" : "private"
        }, {
          "name" : "Content-Type",
          "value" : "application/json; charset=utf-8"
        }, {
          "name" : "Server",
          "value" : "Microsoft-IIS/10.0"
        }, {
          "name" : "Set-Cookie",
          "value" : ".ASPROLES=5tMI6qtoHRYE1YlLEWSjIBsAonvoHyMGmn-49xV6z5OF2f3h2cR0qmW6amlmiHChmYnuxCMUCIdU0dP9SreMK7Udv8a0MI5947cnU6wPkdMBFAEvRuh0ENYsd30_eYC0CTJnLAJR9rKOsdUq2Xi7zGCIM2EYtY1DapuZIaIgUBWWgjuPlAnFVU5VnvxSem7ifWnWjBL0MrUKM6b08uGzBqigceMQYqDqjKps4FZ2s0knug6WqDnI07wgwldo3EPzYr96ElDh4Zk7qVPUyUqora1ctTzYahG8GNzj0FabugMHo1imIBoDxIF2q1K04xkCVFSdMJcMHpEWmwyMwvhO2oQ1TEYEKAkr3k8ZSnhgJ5N4RgJZBT545-fiPAhX224jG-dwKLCrljFFAFzgd9w-UGh8hIVoVKUzAi3X0Vr41iwCVp18jNan4q8VEO6WfPNJy73IttV6zejr5XZjSdHkRFCVy1lo4NJ9uCtKsmOq3RNg07Al0; path=/; HttpOnly"
        }, {
          "name" : "X-SourceFiles",
          "value" : "=?UTF-8?B?RDpcVmlydHVhbE9wdGltaXplci1SZWZhY3RvcmluZ1xDcm9wTWV0cmljcy5Wby5BcGlcQ3JvcE1ldHJpY3MuVm8uQXBpXGFwaVxhZG1pblx2MVx1c2Vyc1w=?="
        }, {
          "name" : "X-Powered-By",
          "value" : "ASP.NET"
        }, {
          "name" : "Date",
          "value" : "Fri, 29 Mar 2019 22:32:03 GMT"
        }, {
          "name" : "Content-Length",
          "value" : "70"
        } ],
        "content" : {
          "size" : 70,
          "mimeType" : "application/json; charset=utf-8",
          "text" : "{\"message\":\"Name cropmetricsvo.fieldcrew@gmail.com is already taken.\"}",
          "comment" : ""
        },
        "redirectURL" : "",
        "headersSize" : 897,
        "bodySize" : 70,
        "comment" : ""
      },
      "cache" : { },
      "timings" : {
        "comment" : "",
        "ssl" : -1,
        "send" : 0,
        "wait" : 3181,
        "receive" : 0,
        "connect" : -1,
        "dns" : -1,
        "blocked" : -1
      },
      "serverIPAddress" : "127.0.0.1",
      "comment" : "",
      "_katalonRequestInformation" : {
        "name" : "95",
        "testObjectId" : "Object Repository/VoPro/Account/api_admin_v1_users",
        "harId" : "c5ff6e41-8e16-439f-bc44-e84cd94b0132"
      },
      "time" : 3182
    } ],
    "comment" : ""
  }
}