{
  "log" : {
    "version" : "1.2",
    "creator" : {
      "name" : "BrowserMob Proxy",
      "version" : "2.1.5",
      "comment" : ""
    },
    "pages" : [ {
      "id" : "Page 0",
      "startedDateTime" : "2019-03-29T13:16:58.537Z",
      "title" : "Page 0",
      "pageTimings" : {
        "onLoad" : 1395,
        "comment" : ""
      },
      "comment" : ""
    } ],
    "entries" : [ {
      "pageref" : "Page 0",
      "startedDateTime" : "2019-03-29T13:16:58.537Z",
      "request" : {
        "method" : "POST",
        "url" : "http://localhost:10520/WebAPI/api/admin/v1/users/?",
        "httpVersion" : "HTTP/1.1",
        "cookies" : [ ],
        "headers" : [ {
          "name" : "User-Agent",
          "value" : "Katalon Studio"
        }, {
          "name" : "Content-Type",
          "value" : "application/x-www-form-urlencoded"
        }, {
          "name" : "Authorization",
          "value" : "Bearer eyJ0eXAiOiJKV1QiLCJhbGciOiJIUzI1NiJ9.eyJ1bmlxdWVfbmFtZSI6ImFkbWluIiwicm9sZSI6InVzZXIiLCJzdWIiOiJhZG1pbiIsImlzcyI6IkNyb3BNZXRyaWNzIiwiYXVkIjoiYWxsIiwiZXhwIjoxNTUzODY5MzE4LCJuYmYiOjE1NTM4NjU0MTh9.8pOjSUJPezP4xS6kbbAaNDnMYLsHMTMRO9HnvlhcaqQ"
        }, {
          "name" : "Host",
          "value" : "localhost:10520"
        }, {
          "name" : "Accept",
          "value" : "text/html, image/gif, image/jpeg, *; q=.2, */*; q=.2"
        }, {
          "name" : "Proxy-Connection",
          "value" : "keep-alive"
        }, {
          "name" : "Content-Length",
          "value" : "306"
        } ],
        "queryString" : [ ],
        "postData" : {
          "mimeType" : "application/x-www-form-urlencoded",
          "params" : [ {
            "name" : "password",
            "value" : "cropmetrics",
            "comment" : ""
          }, {
            "name" : "email",
            "value" : "cropmetricsvo.zipsymbol@gmail.com",
            "comment" : ""
          }, {
            "name" : "fullname",
            "value" : "test validation",
            "comment" : ""
          }, {
            "name" : "phone",
            "value" : "123",
            "comment" : ""
          }, {
            "name" : "dealer",
            "value" : "x",
            "comment" : ""
          }, {
            "name" : "addressLine1",
            "value" : "address line 1 test validation",
            "comment" : ""
          }, {
            "name" : "addressLine2",
            "value" : "address line 12 test validation",
            "comment" : ""
          }, {
            "name" : "town",
            "value" : "townValidation",
            "comment" : ""
          }, {
            "name" : "state",
            "value" : "stateValidation",
            "comment" : ""
          }, {
            "name" : "zip",
            "value" : "!@#$%^&*(",
            "comment" : ""
          }, {
            "name" : "country",
            "value" : "countryValidation",
            "comment" : ""
          }, {
            "name" : "roles",
            "value" : "Client",
            "comment" : ""
          } ],
          "comment" : ""
        },
        "headersSize" : 544,
        "bodySize" : 306,
        "comment" : ""
      },
      "response" : {
        "status" : 200,
        "statusText" : "OK",
        "httpVersion" : "HTTP/1.1",
        "cookies" : [ {
          "name" : ".ASPROLES",
          "value" : "467yGBcpzLW6gwiVTzFFND1QyNolP-7o3A6odVeDwpwf7snFuT16EmKnKbKkkn-ufPrDZPjdvcfLyNIG99xD-4OHaZE2xB1M2-HVSoWjb50_-aGlc1zG7UYuFgm7cVbjOyMRQnYDO9HYyMokc-cfWSriU4P4bvBwvNx0wZ1bD0dhCM9c4VTIwf676qdK_naFtjZbQh7IrLUrSkJPj8ZwpZCkJHbBFy7AJ7qxpIFqTP6kHpbwLscjvd7lxsFj36zzjR3nrGKpXa-547XwepPW5MWYPhsAy1SvxkOS2ajSHn9Q2Nw5Sa3W1xr4n2whZU5FpxgG76JdMMicwPjI_S8eeHdbTuwxLW6FbftxXFrW7RLNESgYzocgRzTC_DuZo9Ah8Qw_gveX6Nfhqgpf6r9IMd_Dy1PZ-YAEzXdJwT5eJJ3_j6blCGeN3rOLn1BYFDoBKp61_WPJJoLsOq7H1bYOCmQdGRzeaWnAwN8IiR0peWLl_Bkl0",
          "path" : "/",
          "httpOnly" : true,
          "secure" : false,
          "comment" : ""
        } ],
        "headers" : [ {
          "name" : "Cache-Control",
          "value" : "private"
        }, {
          "name" : "Content-Type",
          "value" : "application/json; charset=utf-8"
        }, {
          "name" : "Server",
          "value" : "Microsoft-IIS/10.0"
        }, {
          "name" : "Set-Cookie",
          "value" : ".ASPROLES=467yGBcpzLW6gwiVTzFFND1QyNolP-7o3A6odVeDwpwf7snFuT16EmKnKbKkkn-ufPrDZPjdvcfLyNIG99xD-4OHaZE2xB1M2-HVSoWjb50_-aGlc1zG7UYuFgm7cVbjOyMRQnYDO9HYyMokc-cfWSriU4P4bvBwvNx0wZ1bD0dhCM9c4VTIwf676qdK_naFtjZbQh7IrLUrSkJPj8ZwpZCkJHbBFy7AJ7qxpIFqTP6kHpbwLscjvd7lxsFj36zzjR3nrGKpXa-547XwepPW5MWYPhsAy1SvxkOS2ajSHn9Q2Nw5Sa3W1xr4n2whZU5FpxgG76JdMMicwPjI_S8eeHdbTuwxLW6FbftxXFrW7RLNESgYzocgRzTC_DuZo9Ah8Qw_gveX6Nfhqgpf6r9IMd_Dy1PZ-YAEzXdJwT5eJJ3_j6blCGeN3rOLn1BYFDoBKp61_WPJJoLsOq7H1bYOCmQdGRzeaWnAwN8IiR0peWLl_Bkl0; path=/; HttpOnly"
        }, {
          "name" : "X-SourceFiles",
          "value" : "=?UTF-8?B?RDpcVmlydHVhbE9wdGltaXplci1SZWZhY3RvcmluZ1xDcm9wTWV0cmljcy5Wby5BcGlcQ3JvcE1ldHJpY3MuVm8uQXBpXGFwaVxhZG1pblx2MVx1c2Vyc1w=?="
        }, {
          "name" : "X-Powered-By",
          "value" : "ASP.NET"
        }, {
          "name" : "Date",
          "value" : "Fri, 29 Mar 2019 13:16:59 GMT"
        }, {
          "name" : "Content-Length",
          "value" : "9"
        } ],
        "content" : {
          "size" : 9,
          "mimeType" : "application/json; charset=utf-8",
          "text" : "{\"id\":25}",
          "comment" : ""
        },
        "redirectURL" : "",
        "headersSize" : 887,
        "bodySize" : 9,
        "comment" : ""
      },
      "cache" : { },
      "timings" : {
        "comment" : "",
        "ssl" : -1,
        "receive" : 0,
        "wait" : 1377,
        "send" : 0,
        "connect" : -1,
        "dns" : -1,
        "blocked" : -1
      },
      "serverIPAddress" : "127.0.0.1",
      "comment" : "",
      "_katalonRequestInformation" : {
        "name" : "87",
        "testObjectId" : "Object Repository/VoPro/Account/api_admin_v1_users",
        "harId" : "da816c4c-7680-4be1-bf51-e0e170100963"
      },
      "time" : 1378
    } ],
    "comment" : ""
  }
}