{
  "log" : {
    "version" : "1.2",
    "creator" : {
      "name" : "BrowserMob Proxy",
      "version" : "2.1.5",
      "comment" : ""
    },
    "pages" : [ {
      "id" : "Page 0",
      "startedDateTime" : "2019-03-27T19:35:22.282Z",
      "title" : "Page 0",
      "pageTimings" : {
        "onLoad" : 1320,
        "comment" : ""
      },
      "comment" : ""
    } ],
    "entries" : [ {
      "pageref" : "Page 0",
      "startedDateTime" : "2019-03-27T19:35:22.286Z",
      "request" : {
        "method" : "POST",
        "url" : "http://localhost:10520/WebAPI/api/Account/AdministrativeRegister/?",
        "httpVersion" : "HTTP/1.1",
        "cookies" : [ ],
        "headers" : [ {
          "name" : "User-Agent",
          "value" : "Katalon Studio"
        }, {
          "name" : "Content-Type",
          "value" : "application/x-www-form-urlencoded"
        }, {
          "name" : "Authorization",
          "value" : "Bearer eyJ0eXAiOiJKV1QiLCJhbGciOiJIUzI1NiJ9.eyJ1bmlxdWVfbmFtZSI6ImFkbWluIiwicm9sZSI6InVzZXIiLCJzdWIiOiJhZG1pbiIsImlzcyI6IkNyb3BNZXRyaWNzIiwiYXVkIjoiYWxsIiwiZXhwIjoxNTUzNzE5MjIyLCJuYmYiOjE1NTM3MTUzMjJ9.abKmPKhKHg0fLWvfWvcD8LCxLGIfqwQzhEO4KiDu7OY"
        }, {
          "name" : "Host",
          "value" : "localhost:10520"
        }, {
          "name" : "Accept",
          "value" : "text/html, image/gif, image/jpeg, *; q=.2, */*; q=.2"
        }, {
          "name" : "Proxy-Connection",
          "value" : "keep-alive"
        }, {
          "name" : "Content-Length",
          "value" : "368"
        } ],
        "queryString" : [ ],
        "postData" : {
          "mimeType" : "application/x-www-form-urlencoded",
          "params" : [ {
            "name" : "username",
            "value" : "kuserzipnumber",
            "comment" : ""
          }, {
            "name" : "password",
            "value" : "cropmetrics",
            "comment" : ""
          }, {
            "name" : "confirmPassword",
            "value" : "cropmetrics",
            "comment" : ""
          }, {
            "name" : "email",
            "value" : "cropmetricsvo@gmail.com",
            "comment" : ""
          }, {
            "name" : "fullname",
            "value" : "test validation",
            "comment" : ""
          }, {
            "name" : "phone",
            "value" : "123",
            "comment" : ""
          }, {
            "name" : "dealer",
            "value" : "x",
            "comment" : ""
          }, {
            "name" : "addressLine1",
            "value" : "address line 1 test validation",
            "comment" : ""
          }, {
            "name" : "addressLine2",
            "value" : "address line 2 test validation",
            "comment" : ""
          }, {
            "name" : "town",
            "value" : "townValidation",
            "comment" : ""
          }, {
            "name" : "state",
            "value" : "stateValidation",
            "comment" : ""
          }, {
            "name" : "zip",
            "value" : "123457",
            "comment" : ""
          }, {
            "name" : "country",
            "value" : "countryValidation",
            "comment" : ""
          }, {
            "name" : "roles",
            "value" : "Client",
            "comment" : ""
          }, {
            "name" : "modifierUsername",
            "value" : "admin",
            "comment" : ""
          }, {
            "name" : "modifierUserId",
            "value" : "1",
            "comment" : ""
          } ],
          "comment" : ""
        },
        "headersSize" : 560,
        "bodySize" : 368,
        "comment" : ""
      },
      "response" : {
        "status" : 200,
        "statusText" : "OK",
        "httpVersion" : "HTTP/1.1",
        "cookies" : [ {
          "name" : ".ASPROLES",
          "value" : "5u9btnenV3VGkudIHpXc3t2dm_HsKHhGMaWkg-WwG4mNZYY6M8Ni6Y8m_kMkm51IZ_3bqY5qto3nbM0b93ns9B8KEFNJWuK9NOu99Gks1jEecV_dCS36FnbYap7UQwNKVXXcRfV4DxBNlq4Omuw_2VJrsVTd8WYeDBByZyETFJV0hYSLwU8WnrIX5R7b6BB4ipIksoqsMU5EMDo2_gPXng6kA6dO2Xx-_6LsgGrmGwdTXFvUh_yHAmDUYRNweStA8qlEV6cy2Mi_4nEmhwqE9JBmBtCFBXLohETKdfbu9ws2w1F9DlC3C9DVmI5ANE5njnWruWdwLKhKS-XUTqXBda4BaLKADd3VTtnKcPoX2CaxP7L3q2UGoLdS79DozY74-cLB0HGFGLnDqdGCL76pWiNft4IUjeTRh6CEJs6F6WSgLXTB3J_LTT359fkpkZQzgiqaf_Uwh7mON1y50DqAY5Iad5qNulSnbp68C8WhmF_ZcqRi0",
          "path" : "/",
          "httpOnly" : true,
          "secure" : false,
          "comment" : ""
        } ],
        "headers" : [ {
          "name" : "Cache-Control",
          "value" : "private"
        }, {
          "name" : "Content-Type",
          "value" : "application/json; charset=utf-8"
        }, {
          "name" : "Server",
          "value" : "Microsoft-IIS/10.0"
        }, {
          "name" : "Set-Cookie",
          "value" : ".ASPROLES=5u9btnenV3VGkudIHpXc3t2dm_HsKHhGMaWkg-WwG4mNZYY6M8Ni6Y8m_kMkm51IZ_3bqY5qto3nbM0b93ns9B8KEFNJWuK9NOu99Gks1jEecV_dCS36FnbYap7UQwNKVXXcRfV4DxBNlq4Omuw_2VJrsVTd8WYeDBByZyETFJV0hYSLwU8WnrIX5R7b6BB4ipIksoqsMU5EMDo2_gPXng6kA6dO2Xx-_6LsgGrmGwdTXFvUh_yHAmDUYRNweStA8qlEV6cy2Mi_4nEmhwqE9JBmBtCFBXLohETKdfbu9ws2w1F9DlC3C9DVmI5ANE5njnWruWdwLKhKS-XUTqXBda4BaLKADd3VTtnKcPoX2CaxP7L3q2UGoLdS79DozY74-cLB0HGFGLnDqdGCL76pWiNft4IUjeTRh6CEJs6F6WSgLXTB3J_LTT359fkpkZQzgiqaf_Uwh7mON1y50DqAY5Iad5qNulSnbp68C8WhmF_ZcqRi0; path=/; HttpOnly"
        }, {
          "name" : "X-SourceFiles",
          "value" : "=?UTF-8?B?RDpcVmlydHVhbE9wdGltaXplci1SZWZhY3RvcmluZ1xDcm9wTWV0cmljcy5Wby5BcGlcQ3JvcE1ldHJpY3MuVm8uQXBpXGFwaVxBY2NvdW50XEFkbWluaXN0cmF0aXZlUmVnaXN0ZXJc?="
        }, {
          "name" : "X-Powered-By",
          "value" : "ASP.NET"
        }, {
          "name" : "Date",
          "value" : "Wed, 27 Mar 2019 19:35:23 GMT"
        }, {
          "name" : "Content-Length",
          "value" : "9"
        } ],
        "content" : {
          "size" : 9,
          "mimeType" : "application/json; charset=utf-8",
          "text" : "{\"id\":35}",
          "comment" : ""
        },
        "redirectURL" : "",
        "headersSize" : 907,
        "bodySize" : 9,
        "comment" : ""
      },
      "cache" : { },
      "timings" : {
        "comment" : "",
        "ssl" : -1,
        "dns" : -1,
        "receive" : 0,
        "blocked" : -1,
        "wait" : 1319,
        "send" : 0,
        "connect" : -1
      },
      "serverIPAddress" : "127.0.0.1",
      "comment" : "",
      "_katalonRequestInformation" : {
        "name" : "81",
        "testObjectId" : "Object Repository/VoPro/Account/AdministrativeRegister",
        "harId" : "6fd3afc4-83e9-46bf-860e-94d973030f03"
      },
      "time" : 1320
    } ],
    "comment" : ""
  }
}