{
  "log" : {
    "version" : "1.2",
    "creator" : {
      "name" : "BrowserMob Proxy",
      "version" : "2.1.5",
      "comment" : ""
    },
    "pages" : [ {
      "id" : "Page 0",
      "startedDateTime" : "2019-03-29T20:33:16.107Z",
      "title" : "Page 0",
      "pageTimings" : {
        "onLoad" : 3069,
        "comment" : ""
      },
      "comment" : ""
    } ],
    "entries" : [ {
      "pageref" : "Page 0",
      "startedDateTime" : "2019-03-29T20:33:16.108Z",
      "request" : {
        "method" : "PUT",
        "url" : "http://localhost:10520/WebAPI/api/admin/v1/users/14?",
        "httpVersion" : "HTTP/1.1",
        "cookies" : [ ],
        "headers" : [ {
          "name" : "User-Agent",
          "value" : "Katalon Studio"
        }, {
          "name" : "Content-Type",
          "value" : "application/x-www-form-urlencoded"
        }, {
          "name" : "Authorization",
          "value" : "Bearer eyJ0eXAiOiJKV1QiLCJhbGciOiJIUzI1NiJ9.eyJ1bmlxdWVfbmFtZSI6ImFkbWluIiwicm9sZSI6InVzZXIiLCJzdWIiOiJhZG1pbiIsImlzcyI6IkNyb3BNZXRyaWNzIiwiYXVkIjoiYWxsIiwiZXhwIjoxNTUzODk1NDk2LCJuYmYiOjE1NTM4OTE1OTZ9.SFDunxDx_NlRaNkQ4sLO2kD9DWk9DpE7aeBN2qBsaOc"
        }, {
          "name" : "Host",
          "value" : "localhost:10520"
        }, {
          "name" : "Accept",
          "value" : "text/html, image/gif, image/jpeg, *; q=.2, */*; q=.2"
        }, {
          "name" : "Proxy-Connection",
          "value" : "keep-alive"
        }, {
          "name" : "Content-Length",
          "value" : "275"
        } ],
        "queryString" : [ ],
        "postData" : {
          "mimeType" : "application/x-www-form-urlencoded",
          "params" : [ {
            "name" : "password",
            "value" : "cropmetrics",
            "comment" : ""
          }, {
            "name" : "email",
            "value" : "",
            "comment" : ""
          }, {
            "name" : "fullname",
            "value" : "test validation",
            "comment" : ""
          }, {
            "name" : "phone",
            "value" : "123",
            "comment" : ""
          }, {
            "name" : "dealer",
            "value" : "x",
            "comment" : ""
          }, {
            "name" : "addressLine1",
            "value" : "address line 1 test validation",
            "comment" : ""
          }, {
            "name" : "addressLine2",
            "value" : "address line 2 test validation",
            "comment" : ""
          }, {
            "name" : "town",
            "value" : "townValidation",
            "comment" : ""
          }, {
            "name" : "state",
            "value" : "stateValidation",
            "comment" : ""
          }, {
            "name" : "zip",
            "value" : "zipValidation",
            "comment" : ""
          }, {
            "name" : "country",
            "value" : "countryValidation",
            "comment" : ""
          }, {
            "name" : "roles",
            "value" : "Client",
            "comment" : ""
          }, {
            "name" : "userProfileId",
            "value" : "14",
            "comment" : ""
          } ],
          "comment" : ""
        },
        "headersSize" : 545,
        "bodySize" : 275,
        "comment" : ""
      },
      "response" : {
        "status" : 500,
        "statusText" : "Internal Server Error",
        "httpVersion" : "HTTP/1.1",
        "cookies" : [ {
          "name" : ".ASPROLES",
          "value" : "HggZ5eWAXFcCgXjj2JCS3EM4IUy7BbLSdxR7ZRwu5cKNOBWP9HfgFHPJgYjwOaERKg4tGayuqfAabgTFzcMr6kRo7vsFpGeRE7bOvvYeM6YyPaX_kDJoy-yekEt0yjpB2KsR7JXg30Kl8XYm8O-7iqVeswEMUYONotzXr52IYlKXXxFDghEy3P1TuffAy5zL1qC7Smnrs-frW7HDCV7FgCYtr3Y-MXlPzfxPN1PfwdcaNybylCERMD_TzF45i6wWEL8yoLJjzimMxK2i9h3tFqJXkBVMEgNJZnGUHKhrB2lCzfuM_YrO3YxfMozOnyc22-UAlf6IXYsCv5dfu1gNA1zbiWvvAlQrLQDCTFwMBmcW2xFFnPGrhLhDadmTnASZZKH0k2UIdlQTYS_gmmQwAy02lk6zuKv0UVfRX4QBgjQt-We4D3Lffa63AnOBRR1bsUq8ZfSnApzkdMPfHrUOtdFo0optNkD9SlG1Od5wxXg_FC2G0",
          "path" : "/",
          "httpOnly" : true,
          "secure" : false,
          "comment" : ""
        } ],
        "headers" : [ {
          "name" : "Cache-Control",
          "value" : "private"
        }, {
          "name" : "Content-Type",
          "value" : "application/json; charset=utf-8"
        }, {
          "name" : "Server",
          "value" : "Microsoft-IIS/10.0"
        }, {
          "name" : "Set-Cookie",
          "value" : ".ASPROLES=HggZ5eWAXFcCgXjj2JCS3EM4IUy7BbLSdxR7ZRwu5cKNOBWP9HfgFHPJgYjwOaERKg4tGayuqfAabgTFzcMr6kRo7vsFpGeRE7bOvvYeM6YyPaX_kDJoy-yekEt0yjpB2KsR7JXg30Kl8XYm8O-7iqVeswEMUYONotzXr52IYlKXXxFDghEy3P1TuffAy5zL1qC7Smnrs-frW7HDCV7FgCYtr3Y-MXlPzfxPN1PfwdcaNybylCERMD_TzF45i6wWEL8yoLJjzimMxK2i9h3tFqJXkBVMEgNJZnGUHKhrB2lCzfuM_YrO3YxfMozOnyc22-UAlf6IXYsCv5dfu1gNA1zbiWvvAlQrLQDCTFwMBmcW2xFFnPGrhLhDadmTnASZZKH0k2UIdlQTYS_gmmQwAy02lk6zuKv0UVfRX4QBgjQt-We4D3Lffa63AnOBRR1bsUq8ZfSnApzkdMPfHrUOtdFo0optNkD9SlG1Od5wxXg_FC2G0; path=/; HttpOnly"
        }, {
          "name" : "X-SourceFiles",
          "value" : "=?UTF-8?B?RDpcVmlydHVhbE9wdGltaXplci1SZWZhY3RvcmluZ1xDcm9wTWV0cmljcy5Wby5BcGlcQ3JvcE1ldHJpY3MuVm8uQXBpXGFwaVxhZG1pblx2MVx1c2Vyc1wxNA==?="
        }, {
          "name" : "X-Powered-By",
          "value" : "ASP.NET"
        }, {
          "name" : "Date",
          "value" : "Fri, 29 Mar 2019 20:33:19 GMT"
        }, {
          "name" : "Content-Length",
          "value" : "53"
        } ],
        "content" : {
          "size" : 53,
          "mimeType" : "application/json; charset=utf-8",
          "text" : "{\"message\":\"Internal server error in the processing\"}",
          "comment" : ""
        },
        "redirectURL" : "",
        "headersSize" : 911,
        "bodySize" : 53,
        "comment" : ""
      },
      "cache" : { },
      "timings" : {
        "comment" : "",
        "ssl" : -1,
        "send" : 0,
        "wait" : 3078,
        "connect" : -1,
        "blocked" : -1,
        "receive" : 0,
        "dns" : -1
      },
      "serverIPAddress" : "127.0.0.1",
      "comment" : "",
      "_katalonRequestInformation" : {
        "name" : "107",
        "testObjectId" : "Object Repository/VoPro/Account/api_admin_v1_users_userprofileid",
        "harId" : "03953b10-3785-4c00-b66f-31dc4d1879dc"
      },
      "time" : 3079
    } ],
    "comment" : ""
  }
}