{
  "log" : {
    "version" : "1.2",
    "creator" : {
      "name" : "BrowserMob Proxy",
      "version" : "2.1.5",
      "comment" : ""
    },
    "pages" : [ {
      "id" : "Page 0",
      "startedDateTime" : "2019-04-09T20:48:47.471Z",
      "title" : "Page 0",
      "pageTimings" : {
        "onLoad" : 3136,
        "comment" : ""
      },
      "comment" : ""
    } ],
    "entries" : [ {
      "pageref" : "Page 0",
      "startedDateTime" : "2019-04-09T20:48:47.473Z",
      "request" : {
        "method" : "PUT",
        "url" : "http://localhost:10520/WebAPI/api/mobile/v1/fields/1?",
        "httpVersion" : "HTTP/1.1",
        "cookies" : [ ],
        "headers" : [ {
          "name" : "User-Agent",
          "value" : "Katalon Studio"
        }, {
          "name" : "Content-Type",
          "value" : "application/json"
        }, {
          "name" : "Authorization",
          "value" : "Bearer eyJ0eXAiOiJKV1QiLCJhbGciOiJIUzI1NiJ9.eyJ1bmlxdWVfbmFtZSI6Implbm55Lm1hbGRvbmFkby50eDFAZ21haWwuY29tIiwicm9sZSI6InVzZXIiLCJzdWIiOiJqZW5ueS5tYWxkb25hZG8udHgxQGdtYWlsLmNvbSIsImlzcyI6IkNyb3BNZXRyaWNzIiwiYXVkIjoiYWxsIiwiZXhwIjoxNTU0ODQ2ODI3LCJuYmYiOjE1NTQ4NDI5Mjd9.H553h8SjmTnF9vi934aBSeb2KsSCXPfA_6o9AYM6SWs"
        }, {
          "name" : "Host",
          "value" : "localhost:10520"
        }, {
          "name" : "Accept",
          "value" : "text/html, image/gif, image/jpeg, *; q=.2, */*; q=.2"
        }, {
          "name" : "Proxy-Connection",
          "value" : "keep-alive"
        }, {
          "name" : "Content-Length",
          "value" : "397"
        } ],
        "queryString" : [ ],
        "postData" : {
          "mimeType" : "application/json",
          "text" : "{\"field\":{\"name\":\"Field updated by agent not assigned\",\"boundary\":{\"boundaries\":[{\"boundary\":{\"coords\":[{\"x\":-101.49568751,\"y\":37.14976293},{\"x\":-101.50049403,\"y\":37.14647907},{\"x\":-101.50049403,\"y\":37.14264773},{\"x\":-101.49723246,\"y\":37.1411425},{\"x\":-101.49019435,\"y\":37.14223722},{\"x\":-101.48933604,\"y\":37.14620541},{\"x\":-101.49294093,\"y\":37.14866833},{\"x\":-101.49568751,\"y\":37.14976293}]}}]}}}",
          "comment" : ""
        },
        "headersSize" : 593,
        "bodySize" : 397,
        "comment" : ""
      },
      "response" : {
        "status" : 400,
        "statusText" : "Bad Request",
        "httpVersion" : "HTTP/1.1",
        "cookies" : [ {
          "name" : ".ASPROLES",
          "value" : "IWaX4EjD1VtUdYIYvHFrj4G0ZMPYIdbdwHS9Nj9hMLG7T3iGbzkJCLWDcDa05489LrS4X20AFQPXbjgsXRMdw1oRqdqp-CgeELi5QhWGai_VQpUkKKQ5AkR8Rz4y3QrHGa1T2rL5jkmHe1YbnBoUgn7Xf-Gcb-4H4lLgKfMUWSUK24tA2AxfNBjGzDwreendyLs8vZbNj40aG1hPKrq61Bx__hjCXpFxuvB_LD7-NO_CbIwkw2-N4za_S-plbX1bj5OukBzpmqCqxPV36JaUfuOauyg6hsQ30CK-Avqze-qdpoLE4Gu1BzqHZ2qfv9hYWUscxoGiocOJD7HgKEVawdwTynml04jNGZduYSmCwdyx0Z2ywtNx1HRa0N05EW71T-QqK52dCXsWySiMN3BnaB5VpLSU-pVG6XnPOnroo3mZUdUp6vuFnTLnyW38meev28qycSgcLfePYKuhD8_Uul2aVUDdy6Hdbfv9QnZmR23_wkKqkF4hxri98_OT9OjVY73coWRoQopI8ZeUYnrsCht2gDw1",
          "path" : "/",
          "httpOnly" : true,
          "secure" : false,
          "comment" : ""
        } ],
        "headers" : [ {
          "name" : "Cache-Control",
          "value" : "private"
        }, {
          "name" : "Content-Type",
          "value" : "application/json; charset=utf-8"
        }, {
          "name" : "Server",
          "value" : "Microsoft-IIS/10.0"
        }, {
          "name" : "Set-Cookie",
          "value" : ".ASPROLES=IWaX4EjD1VtUdYIYvHFrj4G0ZMPYIdbdwHS9Nj9hMLG7T3iGbzkJCLWDcDa05489LrS4X20AFQPXbjgsXRMdw1oRqdqp-CgeELi5QhWGai_VQpUkKKQ5AkR8Rz4y3QrHGa1T2rL5jkmHe1YbnBoUgn7Xf-Gcb-4H4lLgKfMUWSUK24tA2AxfNBjGzDwreendyLs8vZbNj40aG1hPKrq61Bx__hjCXpFxuvB_LD7-NO_CbIwkw2-N4za_S-plbX1bj5OukBzpmqCqxPV36JaUfuOauyg6hsQ30CK-Avqze-qdpoLE4Gu1BzqHZ2qfv9hYWUscxoGiocOJD7HgKEVawdwTynml04jNGZduYSmCwdyx0Z2ywtNx1HRa0N05EW71T-QqK52dCXsWySiMN3BnaB5VpLSU-pVG6XnPOnroo3mZUdUp6vuFnTLnyW38meev28qycSgcLfePYKuhD8_Uul2aVUDdy6Hdbfv9QnZmR23_wkKqkF4hxri98_OT9OjVY73coWRoQopI8ZeUYnrsCht2gDw1; path=/; HttpOnly"
        }, {
          "name" : "X-SourceFiles",
          "value" : "=?UTF-8?B?RDpcVmlydHVhbE9wdGltaXplci1SZWZhY3RvcmluZ1xDcm9wTWV0cmljcy5Wby5BcGlcQ3JvcE1ldHJpY3MuVm8uQXBpXGFwaVxtb2JpbGVcdjFcZmllbGRzXDE=?="
        }, {
          "name" : "X-Powered-By",
          "value" : "ASP.NET"
        }, {
          "name" : "Date",
          "value" : "Tue, 09 Apr 2019 20:48:50 GMT"
        }, {
          "name" : "Content-Length",
          "value" : "82"
        } ],
        "content" : {
          "size" : 82,
          "mimeType" : "application/json; charset=utf-8",
          "text" : "{\"message\":\"The modifier doesn't have permissions to modify the field requested.\"}",
          "comment" : ""
        },
        "redirectURL" : "",
        "headersSize" : 944,
        "bodySize" : 82,
        "comment" : ""
      },
      "cache" : { },
      "timings" : {
        "comment" : "",
        "send" : 0,
        "wait" : 3119,
        "receive" : 1,
        "connect" : -1,
        "blocked" : -1,
        "dns" : -1,
        "ssl" : -1
      },
      "serverIPAddress" : "127.0.0.1",
      "comment" : "",
      "_katalonRequestInformation" : {
        "name" : "5",
        "testObjectId" : "Object Repository/VoGrow/Field/FieldPut",
        "harId" : "4edd9cee-25fd-4b33-b8d7-9d19a6d342b5"
      },
      "time" : 3122
    } ],
    "comment" : ""
  }
}