{
  "log" : {
    "version" : "1.2",
    "creator" : {
      "name" : "BrowserMob Proxy",
      "version" : "2.1.5",
      "comment" : ""
    },
    "pages" : [ {
      "id" : "Page 0",
      "startedDateTime" : "2019-03-29T16:38:32.956Z",
      "title" : "Page 0",
      "pageTimings" : {
        "onLoad" : 47,
        "comment" : ""
      },
      "comment" : ""
    } ],
    "entries" : [ {
      "pageref" : "Page 0",
      "startedDateTime" : "2019-03-29T16:38:32.956Z",
      "request" : {
        "method" : "POST",
        "url" : "http://localhost:10520/WebAPI/api/admin/v1/users/?",
        "httpVersion" : "HTTP/1.1",
        "cookies" : [ ],
        "headers" : [ {
          "name" : "User-Agent",
          "value" : "Katalon Studio"
        }, {
          "name" : "Content-Type",
          "value" : "application/x-www-form-urlencoded"
        }, {
          "name" : "Authorization",
          "value" : "Bearer eyJ0eXAiOiJKV1QiLCJhbGciOiJIUzI1NiJ9.eyJ1bmlxdWVfbmFtZSI6ImFkbWluIiwicm9sZSI6InVzZXIiLCJzdWIiOiJhZG1pbiIsImlzcyI6IkNyb3BNZXRyaWNzIiwiYXVkIjoiYWxsIiwiZXhwIjoxNTUzODgxNDEyLCJuYmYiOjE1NTM4Nzc1MTJ9.gPMDIqr0h9mKbdQtq7dq_bAaXWh4DElt--hBYgqK3Bs"
        }, {
          "name" : "Host",
          "value" : "localhost:10520"
        }, {
          "name" : "Accept",
          "value" : "text/html, image/gif, image/jpeg, *; q=.2, */*; q=.2"
        }, {
          "name" : "Proxy-Connection",
          "value" : "keep-alive"
        }, {
          "name" : "Content-Length",
          "value" : "327"
        } ],
        "queryString" : [ ],
        "postData" : {
          "mimeType" : "application/x-www-form-urlencoded",
          "params" : [ {
            "name" : "password",
            "value" : "morethan15characters",
            "comment" : ""
          }, {
            "name" : "email",
            "value" : "cropmetricsvo.longpass@gmail.com",
            "comment" : ""
          }, {
            "name" : "fullname",
            "value" : "test validation",
            "comment" : ""
          }, {
            "name" : "phone",
            "value" : "12323456",
            "comment" : ""
          }, {
            "name" : "dealer",
            "value" : "dealer test validation",
            "comment" : ""
          }, {
            "name" : "addressLine1",
            "value" : "address line 1 test validation",
            "comment" : ""
          }, {
            "name" : "addressLine2",
            "value" : "address line 2 test validation",
            "comment" : ""
          }, {
            "name" : "town",
            "value" : "townValidation",
            "comment" : ""
          }, {
            "name" : "state",
            "value" : "stateValidation",
            "comment" : ""
          }, {
            "name" : "zip",
            "value" : "zipValidation",
            "comment" : ""
          }, {
            "name" : "country",
            "value" : "countryValidation",
            "comment" : ""
          }, {
            "name" : "roles",
            "value" : "Client",
            "comment" : ""
          } ],
          "comment" : ""
        },
        "headersSize" : 544,
        "bodySize" : 327,
        "comment" : ""
      },
      "response" : {
        "status" : 400,
        "statusText" : "Bad Request",
        "httpVersion" : "HTTP/1.1",
        "cookies" : [ {
          "name" : ".ASPROLES",
          "value" : "TXbCsbY1QSdh3gZ-Ihs2mQxxL1m39FWBjfGv7KnuGbNYLbT8W157-j2QNyjo1HZ7zjJWHLrtz1lF2I6L8v-cTvyDjphm4wmFAHK2RqjjMA1ck7sPR2WLrUPBf7xUN2KRRhaCzFzZW072RNsJ9XRsBkMHegxNTTYULIl5xbKFeH8ic-SEuBm7cWYtrZ7ZftzgXVHU8MxyWiz26aQiMsUSbpfSWC4DpQLiw1tKsZEma24jDNb_zFmLfTtp-_tNHIEsxMFShb87CK7DjRw-eTFXgD0bbVgPixRFrJrRjgMC0GAbYUFwKMA0WnbxVd91bYMWZ0b1G6r6S9RkyJq74ef9hA2bfUQVk64j2aAdWyMy7EA0R7OqrZ_jvKoqqlvIDuNVbQQ91nSM4z4HOx3DTyZbgEAYXlCDU3HHKaOFSZqsel_cB6evTXT24GS5OlzZEYXkSBIJlZbl6J-EuRgnd4j62hQcs8s4w1VijnRbfRE3rBmefpIU0",
          "path" : "/",
          "httpOnly" : true,
          "secure" : false,
          "comment" : ""
        } ],
        "headers" : [ {
          "name" : "Cache-Control",
          "value" : "private"
        }, {
          "name" : "Content-Type",
          "value" : "application/json; charset=utf-8"
        }, {
          "name" : "Server",
          "value" : "Microsoft-IIS/10.0"
        }, {
          "name" : "Set-Cookie",
          "value" : ".ASPROLES=TXbCsbY1QSdh3gZ-Ihs2mQxxL1m39FWBjfGv7KnuGbNYLbT8W157-j2QNyjo1HZ7zjJWHLrtz1lF2I6L8v-cTvyDjphm4wmFAHK2RqjjMA1ck7sPR2WLrUPBf7xUN2KRRhaCzFzZW072RNsJ9XRsBkMHegxNTTYULIl5xbKFeH8ic-SEuBm7cWYtrZ7ZftzgXVHU8MxyWiz26aQiMsUSbpfSWC4DpQLiw1tKsZEma24jDNb_zFmLfTtp-_tNHIEsxMFShb87CK7DjRw-eTFXgD0bbVgPixRFrJrRjgMC0GAbYUFwKMA0WnbxVd91bYMWZ0b1G6r6S9RkyJq74ef9hA2bfUQVk64j2aAdWyMy7EA0R7OqrZ_jvKoqqlvIDuNVbQQ91nSM4z4HOx3DTyZbgEAYXlCDU3HHKaOFSZqsel_cB6evTXT24GS5OlzZEYXkSBIJlZbl6J-EuRgnd4j62hQcs8s4w1VijnRbfRE3rBmefpIU0; path=/; HttpOnly"
        }, {
          "name" : "X-SourceFiles",
          "value" : "=?UTF-8?B?RDpcVmlydHVhbE9wdGltaXplci1SZWZhY3RvcmluZ1xDcm9wTWV0cmljcy5Wby5BcGlcQ3JvcE1ldHJpY3MuVm8uQXBpXGFwaVxhZG1pblx2MVx1c2Vyc1w=?="
        }, {
          "name" : "X-Powered-By",
          "value" : "ASP.NET"
        }, {
          "name" : "Date",
          "value" : "Fri, 29 Mar 2019 16:38:32 GMT"
        }, {
          "name" : "Content-Length",
          "value" : "85"
        } ],
        "content" : {
          "size" : 85,
          "mimeType" : "application/json; charset=utf-8",
          "text" : "{\"message\":\"The request is invalid. The Password must contain as max 15 characters.\"}",
          "comment" : ""
        },
        "redirectURL" : "",
        "headersSize" : 897,
        "bodySize" : 85,
        "comment" : ""
      },
      "cache" : { },
      "timings" : {
        "comment" : "",
        "ssl" : -1,
        "wait" : 36,
        "connect" : -1,
        "send" : 0,
        "blocked" : -1,
        "receive" : 0,
        "dns" : -1
      },
      "serverIPAddress" : "127.0.0.1",
      "comment" : "",
      "_katalonRequestInformation" : {
        "name" : "35",
        "testObjectId" : "Object Repository/VoPro/Account/api_admin_v1_users",
        "harId" : "0c15f408-045a-435c-84ad-3da51792c867"
      },
      "time" : 37
    } ],
    "comment" : ""
  }
}