{
  "log" : {
    "version" : "1.2",
    "creator" : {
      "name" : "BrowserMob Proxy",
      "version" : "2.1.5",
      "comment" : ""
    },
    "pages" : [ {
      "id" : "Page 0",
      "startedDateTime" : "2019-03-28T19:43:23.014Z",
      "title" : "Page 0",
      "pageTimings" : {
        "onLoad" : 131,
        "comment" : ""
      },
      "comment" : ""
    } ],
    "entries" : [ {
      "pageref" : "Page 0",
      "startedDateTime" : "2019-03-28T19:43:23.017Z",
      "request" : {
        "method" : "DELETE",
        "url" : "http://localhost:10520/WebAPI/api/User/jenny.maldonado.tx@gmail.com/?",
        "httpVersion" : "HTTP/1.1",
        "cookies" : [ ],
        "headers" : [ {
          "name" : "User-Agent",
          "value" : "Katalon Studio"
        }, {
          "name" : "Authorization",
          "value" : "Bearer eyJ0eXAiOiJKV1QiLCJhbGciOiJIUzI1NiJ9.eyJ1bmlxdWVfbmFtZSI6ImFkbWluIiwicm9sZSI6InVzZXIiLCJzdWIiOiJhZG1pbiIsImlzcyI6IkNyb3BNZXRyaWNzIiwiYXVkIjoiYWxsIiwiZXhwIjoxNTUzODA2MTAyLCJuYmYiOjE1NTM4MDIyMDJ9.F4umzaw_prCeltcZEQWOO8h-r_JEbECATDGJSuouAbI"
        }, {
          "name" : "Content-Type",
          "value" : "application/x-www-form-urlencoded"
        }, {
          "name" : "Host",
          "value" : "localhost:10520"
        }, {
          "name" : "Accept",
          "value" : "text/html, image/gif, image/jpeg, *; q=.2, */*; q=.2"
        }, {
          "name" : "Proxy-Connection",
          "value" : "keep-alive"
        }, {
          "name" : "Content-Length",
          "value" : "0"
        } ],
        "queryString" : [ ],
        "headersSize" : 563,
        "bodySize" : 0,
        "comment" : ""
      },
      "response" : {
        "status" : 200,
        "statusText" : "OK",
        "httpVersion" : "HTTP/1.1",
        "cookies" : [ {
          "name" : ".ASPROLES",
          "value" : "UgTmN5lBPf70T6piT-a5L2nRBWt21oMDFLSz4S7BdCa46mn2x_o0pvIStoPuNGz7-efxsHOoUrp_OfaBMV0HjxQgHSjae6QvvdRgs8vEy-hBNAfsdH7EEhNiv5mOi3-6GKqy_OW_iY3MY723teD042akohnf-weWzbi5vJEVthidbi7KAhz3sN0bgieIMFHjf63Kbpv4DR5lRl2tWGC3cK8Pi46d7X8wGNnBV642MqtNXcq7ot7ORAzr_SDPNPGVEDWiwb0k8P1wqdGfcku_hRCDQ4ClE-OL3JLCZydN43_ghXv5ltkS76cZYztKjwYQpM47BULYeExZt2ggwpuQOqeWcOdlCLNSqGLInLgrhneWhMbHJPOAX5tHDZVOHUi6AS5iuKcXioTzgVQkLdAj2rKe11-HRjnTRgVYoRZnGxHCG6CkW68x47orZvexFC1vV-tCvdAGLLkqpYXLEOQnUSmaQDGihpV6OoCMxmTwp5LqKwBS0",
          "path" : "/",
          "httpOnly" : true,
          "secure" : false,
          "comment" : ""
        } ],
        "headers" : [ {
          "name" : "Cache-Control",
          "value" : "private"
        }, {
          "name" : "Server",
          "value" : "Microsoft-IIS/10.0"
        }, {
          "name" : "Set-Cookie",
          "value" : ".ASPROLES=UgTmN5lBPf70T6piT-a5L2nRBWt21oMDFLSz4S7BdCa46mn2x_o0pvIStoPuNGz7-efxsHOoUrp_OfaBMV0HjxQgHSjae6QvvdRgs8vEy-hBNAfsdH7EEhNiv5mOi3-6GKqy_OW_iY3MY723teD042akohnf-weWzbi5vJEVthidbi7KAhz3sN0bgieIMFHjf63Kbpv4DR5lRl2tWGC3cK8Pi46d7X8wGNnBV642MqtNXcq7ot7ORAzr_SDPNPGVEDWiwb0k8P1wqdGfcku_hRCDQ4ClE-OL3JLCZydN43_ghXv5ltkS76cZYztKjwYQpM47BULYeExZt2ggwpuQOqeWcOdlCLNSqGLInLgrhneWhMbHJPOAX5tHDZVOHUi6AS5iuKcXioTzgVQkLdAj2rKe11-HRjnTRgVYoRZnGxHCG6CkW68x47orZvexFC1vV-tCvdAGLLkqpYXLEOQnUSmaQDGihpV6OoCMxmTwp5LqKwBS0; path=/; HttpOnly"
        }, {
          "name" : "X-SourceFiles",
          "value" : "=?UTF-8?B?RDpcVmlydHVhbE9wdGltaXplci1SZWZhY3RvcmluZ1xDcm9wTWV0cmljcy5Wby5BcGlcQ3JvcE1ldHJpY3MuVm8uQXBpXGFwaVxVc2VyXGplbm55Lm1hbGRvbmFkby50eEBnbWFpbC5jb21c?="
        }, {
          "name" : "X-Powered-By",
          "value" : "ASP.NET"
        }, {
          "name" : "Date",
          "value" : "Thu, 28 Mar 2019 19:43:22 GMT"
        }, {
          "name" : "Content-Length",
          "value" : "0"
        } ],
        "content" : {
          "size" : 0,
          "mimeType" : "",
          "comment" : ""
        },
        "redirectURL" : "",
        "headersSize" : 864,
        "bodySize" : -1,
        "comment" : ""
      },
      "cache" : { },
      "timings" : {
        "comment" : "",
        "ssl" : -1,
        "send" : 0,
        "wait" : 122,
        "receive" : 0,
        "dns" : -1,
        "blocked" : -1,
        "connect" : -1
      },
      "serverIPAddress" : "127.0.0.1",
      "comment" : "",
      "_katalonRequestInformation" : {
        "name" : "3",
        "testObjectId" : "Object Repository/VoPro/User/DeleteUser",
        "harId" : "5c8ae7dd-e803-4293-a9fb-ca3b1ed2f0e2"
      },
      "time" : 122
    } ],
    "comment" : ""
  }
}