{
  "log" : {
    "version" : "1.2",
    "creator" : {
      "name" : "BrowserMob Proxy",
      "version" : "2.1.5",
      "comment" : ""
    },
    "pages" : [ {
      "id" : "Page 0",
      "startedDateTime" : "2019-03-29T22:27:42.394Z",
      "title" : "Page 0",
      "pageTimings" : {
        "onLoad" : 55,
        "comment" : ""
      },
      "comment" : ""
    } ],
    "entries" : [ {
      "pageref" : "Page 0",
      "startedDateTime" : "2019-03-29T22:27:42.396Z",
      "request" : {
        "method" : "POST",
        "url" : "http://localhost:10520/WebAPI/api/admin/v1/users/?",
        "httpVersion" : "HTTP/1.1",
        "cookies" : [ ],
        "headers" : [ {
          "name" : "User-Agent",
          "value" : "Katalon Studio"
        }, {
          "name" : "Content-Type",
          "value" : "application/x-www-form-urlencoded"
        }, {
          "name" : "Authorization",
          "value" : "Bearer eyJ0eXAiOiJKV1QiLCJhbGciOiJIUzI1NiJ9.eyJ1bmlxdWVfbmFtZSI6ImNyb3BtZXRyaWNzdm8uY2xpZW50QGdtYWlsLmNvbSIsInJvbGUiOiJ1c2VyIiwic3ViIjoiY3JvcG1ldHJpY3N2by5jbGllbnRAZ21haWwuY29tIiwiaXNzIjoiQ3JvcE1ldHJpY3MiLCJhdWQiOiJhbGwiLCJleHAiOjE1NTM5MDIzNjIsIm5iZiI6MTU1Mzg5ODQ2Mn0.frMb6dfMA3mbErxy2Onrmc_QlNPQwenkIRW6pC87RK0"
        }, {
          "name" : "Host",
          "value" : "localhost:10520"
        }, {
          "name" : "Accept",
          "value" : "text/html, image/gif, image/jpeg, *; q=.2, */*; q=.2"
        }, {
          "name" : "Proxy-Connection",
          "value" : "keep-alive"
        }, {
          "name" : "Content-Length",
          "value" : "272"
        } ],
        "queryString" : [ ],
        "postData" : {
          "mimeType" : "application/x-www-form-urlencoded",
          "params" : [ {
            "name" : "password",
            "value" : "cropmetrics",
            "comment" : ""
          }, {
            "name" : "email",
            "value" : "cropmetricsvo.clientbyclient@gmail.com",
            "comment" : ""
          }, {
            "name" : "fullname",
            "value" : "test validation",
            "comment" : ""
          }, {
            "name" : "phone",
            "value" : "123",
            "comment" : ""
          }, {
            "name" : "dealer",
            "value" : "x",
            "comment" : ""
          }, {
            "name" : "addressLine1",
            "value" : "address line 1 test validation",
            "comment" : ""
          }, {
            "name" : "addressLine2",
            "value" : "address line 2 test validation",
            "comment" : ""
          }, {
            "name" : "town",
            "value" : "townValidation",
            "comment" : ""
          }, {
            "name" : "state",
            "value" : "stateValidation",
            "comment" : ""
          }, {
            "name" : "zip",
            "value" : "xx",
            "comment" : ""
          }, {
            "name" : "country",
            "value" : "xx",
            "comment" : ""
          }, {
            "name" : "roles",
            "value" : "Client",
            "comment" : ""
          } ],
          "comment" : ""
        },
        "headersSize" : 611,
        "bodySize" : 272,
        "comment" : ""
      },
      "response" : {
        "status" : 401,
        "statusText" : "Unauthorized",
        "httpVersion" : "HTTP/1.1",
        "cookies" : [ {
          "name" : ".ASPROLES",
          "value" : "j_yYNCcSyA5BDXryNp8dELlRrCrli3j2PzQPD-q0C6gkf-_vbxTMQYEw7Ir9xYtCrJ7djiM3nIO0yxACTGL7sw19sKAEZRvEkUfloXwMTqxqsx5ED1YHPiuImw-Vq0kTXi36bdHC9NyUpvCFaNacvXURH3sR74FspswRGXYjKnZcNvVNLBlEN3e9yYlV2SxXm7TodfoQimEzSma3N4AQDukvz_cieyH5vfHxth8DIk4_fXYXpKknC1BwNeVfGsyH1SyoC4ogdUDJC_eA-BSpgUz9CzeadkVAIrFT3mC52iMgusPbc6EEMfbnN_EO1Tqq65J8KErhZkmTVbMkG27ldXxIfL6F43LJjE9ZH5JYYP7BeCRBucZSmQBUTGOJ6REm3CBW9zHA-175pKDVLe1JMeGOXlLj2dsu0Ut4rZGenhVGiDfye_RlxvyuEqtki-X57u6SmsmikQI3oVmFUEyDiGHIfWp1-bVEX1eAPGszrp3aNUhtwue3bZJEf1b6js6fak-4Bg2",
          "path" : "/",
          "httpOnly" : true,
          "secure" : false,
          "comment" : ""
        } ],
        "headers" : [ {
          "name" : "Cache-Control",
          "value" : "private"
        }, {
          "name" : "Content-Type",
          "value" : "application/json; charset=utf-8"
        }, {
          "name" : "Server",
          "value" : "Microsoft-IIS/10.0"
        }, {
          "name" : "Set-Cookie",
          "value" : ".ASPROLES=j_yYNCcSyA5BDXryNp8dELlRrCrli3j2PzQPD-q0C6gkf-_vbxTMQYEw7Ir9xYtCrJ7djiM3nIO0yxACTGL7sw19sKAEZRvEkUfloXwMTqxqsx5ED1YHPiuImw-Vq0kTXi36bdHC9NyUpvCFaNacvXURH3sR74FspswRGXYjKnZcNvVNLBlEN3e9yYlV2SxXm7TodfoQimEzSma3N4AQDukvz_cieyH5vfHxth8DIk4_fXYXpKknC1BwNeVfGsyH1SyoC4ogdUDJC_eA-BSpgUz9CzeadkVAIrFT3mC52iMgusPbc6EEMfbnN_EO1Tqq65J8KErhZkmTVbMkG27ldXxIfL6F43LJjE9ZH5JYYP7BeCRBucZSmQBUTGOJ6REm3CBW9zHA-175pKDVLe1JMeGOXlLj2dsu0Ut4rZGenhVGiDfye_RlxvyuEqtki-X57u6SmsmikQI3oVmFUEyDiGHIfWp1-bVEX1eAPGszrp3aNUhtwue3bZJEf1b6js6fak-4Bg2; path=/; HttpOnly"
        }, {
          "name" : "X-SourceFiles",
          "value" : "=?UTF-8?B?RDpcVmlydHVhbE9wdGltaXplci1SZWZhY3RvcmluZ1xDcm9wTWV0cmljcy5Wby5BcGlcQ3JvcE1ldHJpY3MuVm8uQXBpXGFwaVxhZG1pblx2MVx1c2Vyc1w=?="
        }, {
          "name" : "X-Powered-By",
          "value" : "ASP.NET"
        }, {
          "name" : "Date",
          "value" : "Fri, 29 Mar 2019 22:27:42 GMT"
        }, {
          "name" : "Content-Length",
          "value" : "61"
        } ],
        "content" : {
          "size" : 61,
          "mimeType" : "application/json; charset=utf-8",
          "text" : "{\"message\":\"Authorization has been denied for this request.\"}",
          "comment" : ""
        },
        "redirectURL" : "",
        "headersSize" : 920,
        "bodySize" : 61,
        "comment" : ""
      },
      "cache" : { },
      "timings" : {
        "comment" : "",
        "ssl" : -1,
        "wait" : 27,
        "send" : 0,
        "receive" : 0,
        "dns" : -1,
        "connect" : -1,
        "blocked" : -1
      },
      "serverIPAddress" : "127.0.0.1",
      "comment" : "",
      "_katalonRequestInformation" : {
        "name" : "119",
        "testObjectId" : "Object Repository/VoPro/Account/api_admin_v1_users",
        "harId" : "fb2f975d-a262-4481-9a60-7c488e12669e"
      },
      "time" : 28
    } ],
    "comment" : ""
  }
}