{
  "log" : {
    "version" : "1.2",
    "creator" : {
      "name" : "BrowserMob Proxy",
      "version" : "2.1.5",
      "comment" : ""
    },
    "pages" : [ {
      "id" : "Page 0",
      "startedDateTime" : "2019-04-11T16:39:30.054Z",
      "title" : "Page 0",
      "pageTimings" : {
        "onLoad" : 98,
        "comment" : ""
      },
      "comment" : ""
    } ],
    "entries" : [ {
      "pageref" : "Page 0",
      "startedDateTime" : "2019-04-11T16:39:30.055Z",
      "request" : {
        "method" : "POST",
        "url" : "http://localhost:10520/WebAPI/api/mobile/v1/farms/?",
        "httpVersion" : "HTTP/1.1",
        "cookies" : [ ],
        "headers" : [ {
          "name" : "User-Agent",
          "value" : "Katalon Studio"
        }, {
          "name" : "Content-Type",
          "value" : "application/json"
        }, {
          "name" : "Authorization",
          "value" : "Bearer eyJ0eXAiOiJKV1QiLCJhbGciOiJIUzI1NiJ9.eyJ1bmlxdWVfbmFtZSI6Implbm55Lm1hbGRvbmFkby50eDFAZ21haWwuY29tIiwicm9sZSI6InVzZXIiLCJzdWIiOiJqZW5ueS5tYWxkb25hZG8udHgxQGdtYWlsLmNvbSIsImlzcyI6IkNyb3BNZXRyaWNzIiwiYXVkIjoiYWxsIiwiZXhwIjoxNTU1MDA0NjcwLCJuYmYiOjE1NTUwMDA3NzB9.M18ChsIP79iWrMxnzzifRHetPDQ_ciqpNEyv3rFFZZ8"
        }, {
          "name" : "Host",
          "value" : "localhost:10520"
        }, {
          "name" : "Accept",
          "value" : "text/html, image/gif, image/jpeg, *; q=.2, */*; q=.2"
        }, {
          "name" : "Proxy-Connection",
          "value" : "keep-alive"
        }, {
          "name" : "Content-Length",
          "value" : "47"
        } ],
        "queryString" : [ ],
        "postData" : {
          "mimeType" : "application/json",
          "text" : "{\"name\": \"FarmNameWithOnlychars\", \"user_id\": 2}",
          "comment" : ""
        },
        "headersSize" : 591,
        "bodySize" : 47,
        "comment" : ""
      },
      "response" : {
        "status" : 201,
        "statusText" : "Created",
        "httpVersion" : "HTTP/1.1",
        "cookies" : [ {
          "name" : ".ASPROLES",
          "value" : "WPQHpPlhFmo6phgxidYbq6-eFBkHOC2I6D1qoXny0jTz4LAWBpFqekIHauOVLg-C2v_RVaxbas-yXflRWUnKNpInA-EDwmEsxxN8kdzpyO9WIpLp542SXGKO_GJayfY005z2QZiPIeq1zqHkM8OnC020GY-nWe0EdumMPWja5L4RtxyBzJMqeRFqDfAuSG9S_5LwccfjgkP_bT8hmTqBKe0JM_FydALsKHaS-FvT1KhJW35pNMF1cH1I0DT4Of3zemggr4nXhwQl10zZ0kc99xYQrCM890XqVoNIpJuEHraB07rDQDMIKF72LpQyMz3r4nazhzYdPLW01pYDvpqedkkYtcW0f3sLv2XBxewzukY1sulvwp172cp4gOBpOCJfBRVAkc-6m6xb628JY4k7RXF5k00t6K_3OFVEYMAS1GDvdRAbjc4-YgXMnRwMafC7ZcPaAAt4rLZpGv1f6PWeOPkFe78Om99WmKT8Y-2n8b4buth32Sn_AOmEO222INOEUjtdpjM81ZDvN3EScVuEhCRki3s1",
          "path" : "/",
          "httpOnly" : true,
          "secure" : false,
          "comment" : ""
        } ],
        "headers" : [ {
          "name" : "Cache-Control",
          "value" : "private"
        }, {
          "name" : "Content-Type",
          "value" : "application/json; charset=utf-8"
        }, {
          "name" : "Location",
          "value" : "api/mobile/v1/farms/6"
        }, {
          "name" : "Server",
          "value" : "Microsoft-IIS/10.0"
        }, {
          "name" : "Set-Cookie",
          "value" : ".ASPROLES=WPQHpPlhFmo6phgxidYbq6-eFBkHOC2I6D1qoXny0jTz4LAWBpFqekIHauOVLg-C2v_RVaxbas-yXflRWUnKNpInA-EDwmEsxxN8kdzpyO9WIpLp542SXGKO_GJayfY005z2QZiPIeq1zqHkM8OnC020GY-nWe0EdumMPWja5L4RtxyBzJMqeRFqDfAuSG9S_5LwccfjgkP_bT8hmTqBKe0JM_FydALsKHaS-FvT1KhJW35pNMF1cH1I0DT4Of3zemggr4nXhwQl10zZ0kc99xYQrCM890XqVoNIpJuEHraB07rDQDMIKF72LpQyMz3r4nazhzYdPLW01pYDvpqedkkYtcW0f3sLv2XBxewzukY1sulvwp172cp4gOBpOCJfBRVAkc-6m6xb628JY4k7RXF5k00t6K_3OFVEYMAS1GDvdRAbjc4-YgXMnRwMafC7ZcPaAAt4rLZpGv1f6PWeOPkFe78Om99WmKT8Y-2n8b4buth32Sn_AOmEO222INOEUjtdpjM81ZDvN3EScVuEhCRki3s1; path=/; HttpOnly"
        }, {
          "name" : "X-SourceFiles",
          "value" : "=?UTF-8?B?RDpcVmlydHVhbE9wdGltaXplci1SZWZhY3RvcmluZ1xDcm9wTWV0cmljcy5Wby5BcGlcQ3JvcE1ldHJpY3MuVm8uQXBpXGFwaVxtb2JpbGVcdjFcZmFybXNc?="
        }, {
          "name" : "X-Powered-By",
          "value" : "ASP.NET"
        }, {
          "name" : "Date",
          "value" : "Thu, 11 Apr 2019 16:39:30 GMT"
        }, {
          "name" : "Content-Length",
          "value" : "51"
        } ],
        "content" : {
          "size" : 51,
          "mimeType" : "application/json; charset=utf-8",
          "text" : "{\"id\":6,\"name\":\"FarmNameWithOnlychars\",\"user_id\":2}",
          "comment" : ""
        },
        "redirectURL" : "",
        "headersSize" : 969,
        "bodySize" : 51,
        "comment" : ""
      },
      "cache" : { },
      "timings" : {
        "comment" : "",
        "ssl" : -1,
        "send" : 0,
        "wait" : 93,
        "receive" : 0,
        "connect" : -1,
        "dns" : -1,
        "blocked" : -1
      },
      "serverIPAddress" : "127.0.0.1",
      "comment" : "",
      "_katalonRequestInformation" : {
        "name" : "29",
        "testObjectId" : "Object Repository/VoGrow/Farm/FarmPost",
        "harId" : "1f938ccb-0b9f-42a1-bd50-307b734e4c42"
      },
      "time" : 95
    } ],
    "comment" : ""
  }
}