{
  "log" : {
    "version" : "1.2",
    "creator" : {
      "name" : "BrowserMob Proxy",
      "version" : "2.1.5",
      "comment" : ""
    },
    "pages" : [ {
      "id" : "Page 0",
      "startedDateTime" : "2019-03-29T21:45:55.995Z",
      "title" : "Page 0",
      "pageTimings" : {
        "onLoad" : 2341,
        "comment" : ""
      },
      "comment" : ""
    } ],
    "entries" : [ {
      "pageref" : "Page 0",
      "startedDateTime" : "2019-03-29T21:45:55.997Z",
      "request" : {
        "method" : "POST",
        "url" : "http://localhost:10520/WebAPI/api/admin/v1/users/?",
        "httpVersion" : "HTTP/1.1",
        "cookies" : [ ],
        "headers" : [ {
          "name" : "User-Agent",
          "value" : "Katalon Studio"
        }, {
          "name" : "Content-Type",
          "value" : "application/x-www-form-urlencoded"
        }, {
          "name" : "Authorization",
          "value" : "Bearer eyJ0eXAiOiJKV1QiLCJhbGciOiJIUzI1NiJ9.eyJ1bmlxdWVfbmFtZSI6ImFkbWluIiwicm9sZSI6InVzZXIiLCJzdWIiOiJhZG1pbiIsImlzcyI6IkNyb3BNZXRyaWNzIiwiYXVkIjoiYWxsIiwiZXhwIjoxNTUzODk5ODU1LCJuYmYiOjE1NTM4OTU5NTV9.-k-VxSOmC2xtraUB7-Ip_dMfTY9Ka_2tGhooU4QeNMs"
        }, {
          "name" : "Host",
          "value" : "localhost:10520"
        }, {
          "name" : "Accept",
          "value" : "text/html, image/gif, image/jpeg, *; q=.2, */*; q=.2"
        }, {
          "name" : "Proxy-Connection",
          "value" : "keep-alive"
        }, {
          "name" : "Content-Length",
          "value" : "297"
        } ],
        "queryString" : [ ],
        "postData" : {
          "mimeType" : "application/x-www-form-urlencoded",
          "params" : [ {
            "name" : "password",
            "value" : "cropmetrics",
            "comment" : ""
          }, {
            "name" : "email",
            "value" : "cropmetricsvo.countrysymbonls@gmail.com",
            "comment" : ""
          }, {
            "name" : "fullname",
            "value" : "test validation",
            "comment" : ""
          }, {
            "name" : "phone",
            "value" : "123",
            "comment" : ""
          }, {
            "name" : "dealer",
            "value" : "x",
            "comment" : ""
          }, {
            "name" : "addressLine1",
            "value" : "address line 1 test validation",
            "comment" : ""
          }, {
            "name" : "addressLine2",
            "value" : "address line 2 test validation",
            "comment" : ""
          }, {
            "name" : "town",
            "value" : "townValidation",
            "comment" : ""
          }, {
            "name" : "state",
            "value" : "stateValidation",
            "comment" : ""
          }, {
            "name" : "zip",
            "value" : "123457",
            "comment" : ""
          }, {
            "name" : "country",
            "value" : "!@#$%^&*",
            "comment" : ""
          }, {
            "name" : "roles",
            "value" : "Client",
            "comment" : ""
          } ],
          "comment" : ""
        },
        "headersSize" : 544,
        "bodySize" : 297,
        "comment" : ""
      },
      "response" : {
        "status" : 200,
        "statusText" : "OK",
        "httpVersion" : "HTTP/1.1",
        "cookies" : [ {
          "name" : ".ASPROLES",
          "value" : "95YOeyKl11pIWUWG_WAqeobwCHbqreqecryyc-8ayr3RbYwRuHZTgFdBI70p4bB7n4dw1GGZvpKrSsdcit5GlH5FNnphf6agDLpVQesln1YeQKEI-3k46kYffm8NIP2UvkWEAnSQdX-gFnHxOkZ8V-gvcEof3iXthz1QdyKs3uag6eQnMNeIq5yTva1H_zU1BplYYvm1mmCbJRVHJt7hHzD6NWrO_ea0L2kDwcy5K2consI_yxImYLeaHJs7UELMgeMse49_UmmDBwBg0EcI2YhawSOWOBnAxbWr-u2Z8LJmSZQw0q359hIOeRSyO7JXZCLX9loWx0NrXllK7oVBeRGrk0Pd17QHItdQFqSfGVgW3UVNgXTjak3MJVE52qT1dHbWJWs5aKxLuNe6Pp5LCU_kvgBsofbYYmMBWyOojjZB-vz-a07xeIB4ceT0yZmLXs_1ido0kwdiCuFbWczLQssg31uILHAiD53807hCIRWJQIE50",
          "path" : "/",
          "httpOnly" : true,
          "secure" : false,
          "comment" : ""
        } ],
        "headers" : [ {
          "name" : "Cache-Control",
          "value" : "private"
        }, {
          "name" : "Content-Type",
          "value" : "application/json; charset=utf-8"
        }, {
          "name" : "Server",
          "value" : "Microsoft-IIS/10.0"
        }, {
          "name" : "Set-Cookie",
          "value" : ".ASPROLES=95YOeyKl11pIWUWG_WAqeobwCHbqreqecryyc-8ayr3RbYwRuHZTgFdBI70p4bB7n4dw1GGZvpKrSsdcit5GlH5FNnphf6agDLpVQesln1YeQKEI-3k46kYffm8NIP2UvkWEAnSQdX-gFnHxOkZ8V-gvcEof3iXthz1QdyKs3uag6eQnMNeIq5yTva1H_zU1BplYYvm1mmCbJRVHJt7hHzD6NWrO_ea0L2kDwcy5K2consI_yxImYLeaHJs7UELMgeMse49_UmmDBwBg0EcI2YhawSOWOBnAxbWr-u2Z8LJmSZQw0q359hIOeRSyO7JXZCLX9loWx0NrXllK7oVBeRGrk0Pd17QHItdQFqSfGVgW3UVNgXTjak3MJVE52qT1dHbWJWs5aKxLuNe6Pp5LCU_kvgBsofbYYmMBWyOojjZB-vz-a07xeIB4ceT0yZmLXs_1ido0kwdiCuFbWczLQssg31uILHAiD53807hCIRWJQIE50; path=/; HttpOnly"
        }, {
          "name" : "X-SourceFiles",
          "value" : "=?UTF-8?B?RDpcVmlydHVhbE9wdGltaXplci1SZWZhY3RvcmluZ1xDcm9wTWV0cmljcy5Wby5BcGlcQ3JvcE1ldHJpY3MuVm8uQXBpXGFwaVxhZG1pblx2MVx1c2Vyc1w=?="
        }, {
          "name" : "X-Powered-By",
          "value" : "ASP.NET"
        }, {
          "name" : "Date",
          "value" : "Fri, 29 Mar 2019 21:45:58 GMT"
        }, {
          "name" : "Content-Length",
          "value" : "9"
        } ],
        "content" : {
          "size" : 9,
          "mimeType" : "application/json; charset=utf-8",
          "text" : "{\"id\":38}",
          "comment" : ""
        },
        "redirectURL" : "",
        "headersSize" : 887,
        "bodySize" : 9,
        "comment" : ""
      },
      "cache" : { },
      "timings" : {
        "comment" : "",
        "send" : 0,
        "wait" : 2337,
        "receive" : 0,
        "blocked" : -1,
        "dns" : -1,
        "connect" : -1,
        "ssl" : -1
      },
      "serverIPAddress" : "127.0.0.1",
      "comment" : "",
      "_katalonRequestInformation" : {
        "name" : "97",
        "testObjectId" : "Object Repository/VoPro/Account/api_admin_v1_users",
        "harId" : "6831b7e5-7016-4c52-bd25-5be2dbb38f97"
      },
      "time" : 2338
    } ],
    "comment" : ""
  }
}