{
  "log" : {
    "version" : "1.2",
    "creator" : {
      "name" : "BrowserMob Proxy",
      "version" : "2.1.5",
      "comment" : ""
    },
    "pages" : [ {
      "id" : "Page 0",
      "startedDateTime" : "2019-03-29T22:37:38.371Z",
      "title" : "Page 0",
      "pageTimings" : {
        "onLoad" : 1784,
        "comment" : ""
      },
      "comment" : ""
    } ],
    "entries" : [ {
      "pageref" : "Page 0",
      "startedDateTime" : "2019-03-29T22:37:38.372Z",
      "request" : {
        "method" : "POST",
        "url" : "http://localhost:10520/WebAPI/api/admin/v1/users/?",
        "httpVersion" : "HTTP/1.1",
        "cookies" : [ ],
        "headers" : [ {
          "name" : "User-Agent",
          "value" : "Katalon Studio"
        }, {
          "name" : "Content-Type",
          "value" : "application/x-www-form-urlencoded"
        }, {
          "name" : "Authorization",
          "value" : "Bearer eyJ0eXAiOiJKV1QiLCJhbGciOiJIUzI1NiJ9.eyJ1bmlxdWVfbmFtZSI6ImFkbWluIiwicm9sZSI6InVzZXIiLCJzdWIiOiJhZG1pbiIsImlzcyI6IkNyb3BNZXRyaWNzIiwiYXVkIjoiYWxsIiwiZXhwIjoxNTUzOTAyOTU4LCJuYmYiOjE1NTM4OTkwNTh9.WgS7pnj_gQzBey42XDlLQWn-PxChmu03N6O9mGaeBGU"
        }, {
          "name" : "Host",
          "value" : "localhost:10520"
        }, {
          "name" : "Accept",
          "value" : "text/html, image/gif, image/jpeg, *; q=.2, */*; q=.2"
        }, {
          "name" : "Proxy-Connection",
          "value" : "keep-alive"
        }, {
          "name" : "Content-Length",
          "value" : "315"
        } ],
        "queryString" : [ ],
        "postData" : {
          "mimeType" : "application/x-www-form-urlencoded",
          "params" : [ {
            "name" : "password",
            "value" : "cropmetrics",
            "comment" : ""
          }, {
            "name" : "email",
            "value" : "cropmetricsvo.nozip@gmail.com",
            "comment" : ""
          }, {
            "name" : "fullname",
            "value" : "test validation",
            "comment" : ""
          }, {
            "name" : "phone",
            "value" : "phone test validation",
            "comment" : ""
          }, {
            "name" : "dealer",
            "value" : "dealer test validation",
            "comment" : ""
          }, {
            "name" : "addressLine1",
            "value" : "address line 1 test validation",
            "comment" : ""
          }, {
            "name" : "addressLine2",
            "value" : "address line 2 test validation",
            "comment" : ""
          }, {
            "name" : "town",
            "value" : "townValidation",
            "comment" : ""
          }, {
            "name" : "state",
            "value" : "stateValidation",
            "comment" : ""
          }, {
            "name" : "zip",
            "value" : "",
            "comment" : ""
          }, {
            "name" : "country",
            "value" : "countryValidation",
            "comment" : ""
          }, {
            "name" : "roles",
            "value" : "Client",
            "comment" : ""
          } ],
          "comment" : ""
        },
        "headersSize" : 544,
        "bodySize" : 315,
        "comment" : ""
      },
      "response" : {
        "status" : 200,
        "statusText" : "OK",
        "httpVersion" : "HTTP/1.1",
        "cookies" : [ {
          "name" : ".ASPROLES",
          "value" : "HQw9fjYnmgfSE3Us1oaNVlY1LZzx6EIOPcyxED0wGxgTRgrwj-Q5EK7oNOfTT6Uw1qlE9Fz1eGnPHHP9Fsrgdyu1ud1owYgTXSWve1ZQ273Y2qc5Ieocz0UcHotjskupa3yBUnPS0-IWS4H4bPlu_PZffS17l7_8x62Yvt4Y331MbjAzVQd-gKZD9Qdd3drQuAL35TKAamWFi3-AW_ZHu61SzzEd0wMZRN5PcbJLsmtEtaXrYaYEwnlFsmWg9pgJsvhCbuTw_AJiozYdIitkxgbmZNZytssli7lzn3JNZ-aFzZORmr4IX-bvFsZkRFmtdPnQ6zzk3upFzkck0DfZVCfQ5vKmlaaep0NwKvbld2S9qxc9HnEDUx_O1csuf1hKJQtD64668Lc48snIYOLKs7Waqo-cmL1-b-48NR60ZOn5khCqhvld4O3wmDmgCQPwkgCBycT7mKHwt3B8dpdHr3iJxPTS8GSbBgBpLeKS2fshQ9AR0",
          "path" : "/",
          "httpOnly" : true,
          "secure" : false,
          "comment" : ""
        } ],
        "headers" : [ {
          "name" : "Cache-Control",
          "value" : "private"
        }, {
          "name" : "Content-Type",
          "value" : "application/json; charset=utf-8"
        }, {
          "name" : "Server",
          "value" : "Microsoft-IIS/10.0"
        }, {
          "name" : "Set-Cookie",
          "value" : ".ASPROLES=HQw9fjYnmgfSE3Us1oaNVlY1LZzx6EIOPcyxED0wGxgTRgrwj-Q5EK7oNOfTT6Uw1qlE9Fz1eGnPHHP9Fsrgdyu1ud1owYgTXSWve1ZQ273Y2qc5Ieocz0UcHotjskupa3yBUnPS0-IWS4H4bPlu_PZffS17l7_8x62Yvt4Y331MbjAzVQd-gKZD9Qdd3drQuAL35TKAamWFi3-AW_ZHu61SzzEd0wMZRN5PcbJLsmtEtaXrYaYEwnlFsmWg9pgJsvhCbuTw_AJiozYdIitkxgbmZNZytssli7lzn3JNZ-aFzZORmr4IX-bvFsZkRFmtdPnQ6zzk3upFzkck0DfZVCfQ5vKmlaaep0NwKvbld2S9qxc9HnEDUx_O1csuf1hKJQtD64668Lc48snIYOLKs7Waqo-cmL1-b-48NR60ZOn5khCqhvld4O3wmDmgCQPwkgCBycT7mKHwt3B8dpdHr3iJxPTS8GSbBgBpLeKS2fshQ9AR0; path=/; HttpOnly"
        }, {
          "name" : "X-SourceFiles",
          "value" : "=?UTF-8?B?RDpcVmlydHVhbE9wdGltaXplci1SZWZhY3RvcmluZ1xDcm9wTWV0cmljcy5Wby5BcGlcQ3JvcE1ldHJpY3MuVm8uQXBpXGFwaVxhZG1pblx2MVx1c2Vyc1w=?="
        }, {
          "name" : "X-Powered-By",
          "value" : "ASP.NET"
        }, {
          "name" : "Date",
          "value" : "Fri, 29 Mar 2019 22:37:40 GMT"
        }, {
          "name" : "Content-Length",
          "value" : "9"
        } ],
        "content" : {
          "size" : 9,
          "mimeType" : "application/json; charset=utf-8",
          "text" : "{\"id\":11}",
          "comment" : ""
        },
        "redirectURL" : "",
        "headersSize" : 887,
        "bodySize" : 9,
        "comment" : ""
      },
      "cache" : { },
      "timings" : {
        "comment" : "",
        "ssl" : -1,
        "wait" : 1778,
        "receive" : 0,
        "send" : 0,
        "connect" : -1,
        "dns" : -1,
        "blocked" : -1
      },
      "serverIPAddress" : "127.0.0.1",
      "comment" : "",
      "_katalonRequestInformation" : {
        "name" : "27",
        "testObjectId" : "Object Repository/VoPro/Account/api_admin_v1_users",
        "harId" : "06534a28-9d15-4317-b536-a60b6ac26620"
      },
      "time" : 1779
    } ],
    "comment" : ""
  }
}