{
  "log" : {
    "version" : "1.2",
    "creator" : {
      "name" : "BrowserMob Proxy",
      "version" : "2.1.5",
      "comment" : ""
    },
    "pages" : [ {
      "id" : "Page 0",
      "startedDateTime" : "2019-03-29T22:09:25.191Z",
      "title" : "Page 0",
      "pageTimings" : {
        "onLoad" : 39,
        "comment" : ""
      },
      "comment" : ""
    } ],
    "entries" : [ {
      "pageref" : "Page 0",
      "startedDateTime" : "2019-03-29T22:09:25.193Z",
      "request" : {
        "method" : "DELETE",
        "url" : "http://localhost:10520/WebAPI/api/User/jenny.maldonado.tx@gmail.com/?",
        "httpVersion" : "HTTP/1.1",
        "cookies" : [ ],
        "headers" : [ {
          "name" : "User-Agent",
          "value" : "Katalon Studio"
        }, {
          "name" : "Authorization",
          "value" : "Bearer eyJ0eXAiOiJKV1QiLCJhbGciOiJIUzI1NiJ9.eyJ1bmlxdWVfbmFtZSI6ImFkbWluIiwicm9sZSI6InVzZXIiLCJzdWIiOiJhZG1pbiIsImlzcyI6IkNyb3BNZXRyaWNzIiwiYXVkIjoiYWxsIiwiZXhwIjoxNTUzOTAxMjY1LCJuYmYiOjE1NTM4OTczNjV9.XlgS8_sdL6TsvPCKO_-FxefwmD4HUKNwNUVxcAS_YYs"
        }, {
          "name" : "Content-Type",
          "value" : "application/x-www-form-urlencoded"
        }, {
          "name" : "Host",
          "value" : "localhost:10520"
        }, {
          "name" : "Accept",
          "value" : "text/html, image/gif, image/jpeg, *; q=.2, */*; q=.2"
        }, {
          "name" : "Proxy-Connection",
          "value" : "keep-alive"
        }, {
          "name" : "Content-Length",
          "value" : "0"
        } ],
        "queryString" : [ ],
        "headersSize" : 563,
        "bodySize" : 0,
        "comment" : ""
      },
      "response" : {
        "status" : 200,
        "statusText" : "OK",
        "httpVersion" : "HTTP/1.1",
        "cookies" : [ {
          "name" : ".ASPROLES",
          "value" : "58HqFW1YLGHKD6OEXLyhPZUf1devqJcv3f3MTPxGIeRGYa1m3Qjky_o5DyW0wpLbB0jy7wr_GQPY_yZp7mgIimmcBLsAI8O-Ao3WoLu7gAJ0en2oNaEj9kg9AMGKcONbouOvCsbB2h3Gb0R_6m21oradp8JLVQymgKOs_pQyR4_vjUxP26FQ3GNZjxwZFMOB9rwAAzdOix388zONYanCSR_7Jp_dfDxtVuQ6KejnMeZGwsBExP87JkXOWH8wi9L1CLyTrr2eauwMUGjWtghG8ORdN7SaSau90YIm7xhhXyNCxJn2HC8tbk2-C6Xl6vBGQOaP4hgllrTj_N-whbmqbhUSzMJmH4IW4HYFuXAjSHyReUAHMfAlJGGqG4-cnMl697Y79xypi1gKczw7T8BokUpUf7-SrqNFLvg06SMtCVuvA0CNSleTTse5zwAub1qMUc6YZSHe2lCkFX85NzVA71Uve8HXci8ih1_Lz-MwswhVjMWM0",
          "path" : "/",
          "httpOnly" : true,
          "secure" : false,
          "comment" : ""
        } ],
        "headers" : [ {
          "name" : "Cache-Control",
          "value" : "private"
        }, {
          "name" : "Server",
          "value" : "Microsoft-IIS/10.0"
        }, {
          "name" : "Set-Cookie",
          "value" : ".ASPROLES=58HqFW1YLGHKD6OEXLyhPZUf1devqJcv3f3MTPxGIeRGYa1m3Qjky_o5DyW0wpLbB0jy7wr_GQPY_yZp7mgIimmcBLsAI8O-Ao3WoLu7gAJ0en2oNaEj9kg9AMGKcONbouOvCsbB2h3Gb0R_6m21oradp8JLVQymgKOs_pQyR4_vjUxP26FQ3GNZjxwZFMOB9rwAAzdOix388zONYanCSR_7Jp_dfDxtVuQ6KejnMeZGwsBExP87JkXOWH8wi9L1CLyTrr2eauwMUGjWtghG8ORdN7SaSau90YIm7xhhXyNCxJn2HC8tbk2-C6Xl6vBGQOaP4hgllrTj_N-whbmqbhUSzMJmH4IW4HYFuXAjSHyReUAHMfAlJGGqG4-cnMl697Y79xypi1gKczw7T8BokUpUf7-SrqNFLvg06SMtCVuvA0CNSleTTse5zwAub1qMUc6YZSHe2lCkFX85NzVA71Uve8HXci8ih1_Lz-MwswhVjMWM0; path=/; HttpOnly"
        }, {
          "name" : "X-SourceFiles",
          "value" : "=?UTF-8?B?RDpcVmlydHVhbE9wdGltaXplci1SZWZhY3RvcmluZ1xDcm9wTWV0cmljcy5Wby5BcGlcQ3JvcE1ldHJpY3MuVm8uQXBpXGFwaVxVc2VyXGplbm55Lm1hbGRvbmFkby50eEBnbWFpbC5jb21c?="
        }, {
          "name" : "X-Powered-By",
          "value" : "ASP.NET"
        }, {
          "name" : "Date",
          "value" : "Fri, 29 Mar 2019 22:09:25 GMT"
        }, {
          "name" : "Content-Length",
          "value" : "0"
        } ],
        "content" : {
          "size" : 0,
          "mimeType" : "",
          "comment" : ""
        },
        "redirectURL" : "",
        "headersSize" : 864,
        "bodySize" : -1,
        "comment" : ""
      },
      "cache" : { },
      "timings" : {
        "comment" : "",
        "ssl" : -1,
        "connect" : -1,
        "send" : 0,
        "receive" : 0,
        "wait" : 32,
        "dns" : -1,
        "blocked" : -1
      },
      "serverIPAddress" : "127.0.0.1",
      "comment" : "",
      "_katalonRequestInformation" : {
        "name" : "3",
        "testObjectId" : "Object Repository/VoPro/User/DeleteUser",
        "harId" : "a2a3ac23-65ba-485f-bade-f62f482890b3"
      },
      "time" : 32
    } ],
    "comment" : ""
  }
}