{
  "log" : {
    "version" : "1.2",
    "creator" : {
      "name" : "BrowserMob Proxy",
      "version" : "2.1.5",
      "comment" : ""
    },
    "pages" : [ {
      "id" : "Page 0",
      "startedDateTime" : "2019-04-04T18:52:36.271Z",
      "title" : "Page 0",
      "pageTimings" : {
        "onLoad" : 37,
        "comment" : ""
      },
      "comment" : ""
    } ],
    "entries" : [ {
      "pageref" : "Page 0",
      "startedDateTime" : "2019-04-04T18:52:36.276Z",
      "request" : {
        "method" : "POST",
        "url" : "http://localhost:10520/WebAPI/api/mobile/v1/farms/?",
        "httpVersion" : "HTTP/1.1",
        "cookies" : [ ],
        "headers" : [ {
          "name" : "User-Agent",
          "value" : "Katalon Studio"
        }, {
          "name" : "Content-Type",
          "value" : "application/json"
        }, {
          "name" : "Authorization",
          "value" : "Bearer eyJ0eXAiOiJKV1QiLCJhbGciOiJIUzI1NiJ9.eyJ1bmlxdWVfbmFtZSI6Implbm55Lm1hbGRvbmFkby50eDFAZ21haWwuY29tIiwicm9sZSI6InVzZXIiLCJzdWIiOiJqZW5ueS5tYWxkb25hZG8udHgxQGdtYWlsLmNvbSIsImlzcyI6IkNyb3BNZXRyaWNzIiwiYXVkIjoiYWxsIiwiZXhwIjoxNTU0NDA3ODU2LCJuYmYiOjE1NTQ0MDM5NTZ9.PEPIIcx4yj7IFGj_Cm1dEUBpiASXCEg37ZrPv8m39VQ"
        }, {
          "name" : "Host",
          "value" : "localhost:10520"
        }, {
          "name" : "Accept",
          "value" : "text/html, image/gif, image/jpeg, *; q=.2, */*; q=.2"
        }, {
          "name" : "Proxy-Connection",
          "value" : "keep-alive"
        }, {
          "name" : "Content-Length",
          "value" : "60"
        } ],
        "queryString" : [ ],
        "postData" : {
          "mimeType" : "application/json",
          "text" : "{\"name\": \"New Farm with userID as spaces\", \"user_id\": \"   \"}",
          "comment" : ""
        },
        "headersSize" : 591,
        "bodySize" : 60,
        "comment" : ""
      },
      "response" : {
        "status" : 400,
        "statusText" : "Bad Request",
        "httpVersion" : "HTTP/1.1",
        "cookies" : [ {
          "name" : ".ASPROLES",
          "value" : "1RXzbZN0av5w6HIedAc0PJ2BGHRYS2_vpfy9858OFeCKPINc_U7Crcw0LR5et5NLRpJcpGMYjikQZs8b7Nl45JjFqvXLtr9U6ZKOuX0VroFw_YxzN6OmeSWZXCVMBlAAKDtNmO7wGPwIx_2hiNgIpl6w6Cs5kX9kL354eumgyhgBAOUHE9VjMOLRj_vo2p-tHOVy25hnglScBSZIlZtzZGLiB1gnzUYBKkU7GG-a0U5UPzQJZDniLTqAjhZrKFHxJWrc6EKgr0MHtE_nJ0cqtpgPv1gCTnvXHQQuX4l6eyGO9Q0wa17U9dFh7EdKvvzzM1Ngfi1Y-T2zO6xTdYC5xihgaWnMy1HM7aYp8Yy8tCZ5bJhTef7UDtMNxs1xhtHBLWv2rG-yCQbEbPz1BNiuIV0EzxKkD-AoTAdP13m6hTtOOrsM8-d5iTLYHsQb3fkykgOgi7ed1ZIi4S9JXrBkmKrpfyTXfMWA1BlWA7Jauvi6O8JluMX-do3rJPGBelTY2e5YU_mIngylCvlGafal1vureI01",
          "path" : "/",
          "httpOnly" : true,
          "secure" : false,
          "comment" : ""
        } ],
        "headers" : [ {
          "name" : "Cache-Control",
          "value" : "private"
        }, {
          "name" : "Content-Type",
          "value" : "application/json; charset=utf-8"
        }, {
          "name" : "Server",
          "value" : "Microsoft-IIS/10.0"
        }, {
          "name" : "Set-Cookie",
          "value" : ".ASPROLES=1RXzbZN0av5w6HIedAc0PJ2BGHRYS2_vpfy9858OFeCKPINc_U7Crcw0LR5et5NLRpJcpGMYjikQZs8b7Nl45JjFqvXLtr9U6ZKOuX0VroFw_YxzN6OmeSWZXCVMBlAAKDtNmO7wGPwIx_2hiNgIpl6w6Cs5kX9kL354eumgyhgBAOUHE9VjMOLRj_vo2p-tHOVy25hnglScBSZIlZtzZGLiB1gnzUYBKkU7GG-a0U5UPzQJZDniLTqAjhZrKFHxJWrc6EKgr0MHtE_nJ0cqtpgPv1gCTnvXHQQuX4l6eyGO9Q0wa17U9dFh7EdKvvzzM1Ngfi1Y-T2zO6xTdYC5xihgaWnMy1HM7aYp8Yy8tCZ5bJhTef7UDtMNxs1xhtHBLWv2rG-yCQbEbPz1BNiuIV0EzxKkD-AoTAdP13m6hTtOOrsM8-d5iTLYHsQb3fkykgOgi7ed1ZIi4S9JXrBkmKrpfyTXfMWA1BlWA7Jauvi6O8JluMX-do3rJPGBelTY2e5YU_mIngylCvlGafal1vureI01; path=/; HttpOnly"
        }, {
          "name" : "X-SourceFiles",
          "value" : "=?UTF-8?B?RDpcVmlydHVhbE9wdGltaXplci1SZWZhY3RvcmluZ1xDcm9wTWV0cmljcy5Wby5BcGlcQ3JvcE1ldHJpY3MuVm8uQXBpXGFwaVxtb2JpbGVcdjFcZmFybXNc?="
        }, {
          "name" : "X-Powered-By",
          "value" : "ASP.NET"
        }, {
          "name" : "Date",
          "value" : "Thu, 04 Apr 2019 18:52:36 GMT"
        }, {
          "name" : "Content-Length",
          "value" : "37"
        } ],
        "content" : {
          "size" : 37,
          "mimeType" : "application/json; charset=utf-8",
          "text" : "{\"message\":\"The request is invalid.\"}",
          "comment" : ""
        },
        "redirectURL" : "",
        "headersSize" : 940,
        "bodySize" : 37,
        "comment" : ""
      },
      "cache" : { },
      "timings" : {
        "comment" : "",
        "receive" : 0,
        "wait" : 29,
        "send" : 0,
        "blocked" : -1,
        "connect" : -1,
        "dns" : -1,
        "ssl" : -1
      },
      "serverIPAddress" : "127.0.0.1",
      "comment" : "",
      "_katalonRequestInformation" : {
        "name" : "45",
        "testObjectId" : "Object Repository/VoGrow/Farm/FarmPost",
        "harId" : "0afb5efe-ed17-4fa0-8f38-3e235e04db2d"
      },
      "time" : 30
    } ],
    "comment" : ""
  }
}