{
  "log" : {
    "version" : "1.2",
    "creator" : {
      "name" : "BrowserMob Proxy",
      "version" : "2.1.5",
      "comment" : ""
    },
    "pages" : [ {
      "id" : "Page 0",
      "startedDateTime" : "2019-04-24T20:26:42.089Z",
      "title" : "Page 0",
      "pageTimings" : {
        "onLoad" : 3166,
        "comment" : ""
      },
      "comment" : ""
    } ],
    "entries" : [ {
      "pageref" : "Page 0",
      "startedDateTime" : "2019-04-24T20:26:42.091Z",
      "request" : {
        "method" : "PUT",
        "url" : "http://localhost:10520/WebAPI/api/mobile/v1/farms/7?",
        "httpVersion" : "HTTP/1.1",
        "cookies" : [ ],
        "headers" : [ {
          "name" : "User-Agent",
          "value" : "Katalon Studio"
        }, {
          "name" : "Content-Type",
          "value" : "application/json"
        }, {
          "name" : "Authorization",
          "value" : "Bearer eyJ0eXAiOiJKV1QiLCJhbGciOiJIUzI1NiJ9.eyJ1bmlxdWVfbmFtZSI6Implbm55Lm1hbGRvbmFkby50eDFAZ21haWwuY29tIiwicm9sZSI6InVzZXIiLCJzdWIiOiJqZW5ueS5tYWxkb25hZG8udHgxQGdtYWlsLmNvbSIsImlzcyI6IkNyb3BNZXRyaWNzIiwiYXVkIjoiYWxsIiwiZXhwIjoxNTU2MTQxNTAxLCJuYmYiOjE1NTYxMzc2MDF9.aYuY3X8uhhbCxyI-UjfGB8Ily__zS1ZNwZvmvx1mQrM"
        }, {
          "name" : "Host",
          "value" : "localhost:10520"
        }, {
          "name" : "Accept",
          "value" : "text/html, image/gif, image/jpeg, *; q=.2, */*; q=.2"
        }, {
          "name" : "Proxy-Connection",
          "value" : "keep-alive"
        }, {
          "name" : "Content-Length",
          "value" : "12"
        } ],
        "queryString" : [ ],
        "postData" : {
          "mimeType" : "application/json",
          "text" : "{\"name\": \"\"}",
          "comment" : ""
        },
        "headersSize" : 591,
        "bodySize" : 12,
        "comment" : ""
      },
      "response" : {
        "status" : 400,
        "statusText" : "Bad Request",
        "httpVersion" : "HTTP/1.1",
        "cookies" : [ {
          "name" : ".ASPROLES",
          "value" : "rQDn1RZ52jnKsQbc-cVtrMf8xCbhdt-MvzULVrFAxRa82JGqmU0rp6dzxDuwQj7VvYBtk6rHZXS7-fVPvrIVpGbrJJrRdbnpotxBePVXigQcSu03rkDjV__J1V9Uo9HRPkWIRi5INoR-I57TPHFFCugzcRcV3Af0yRTNnVYFkAu65pi_kBAUuHxAGhBLzaDyVdhjdywEGSM8uDRFdoaiP7eOcXhXugORp4hmnk14WEPoOel2lDQ7TQissfRx9NbiqLvcojs-uWpHq1AFaoSkqA-F2BvZrHTz-XU-aWs2DU3IlTN-hiQ2x3BZ93R34wkmERS6J5gWevBb5dpuURG5tU1cvn60coS2mM5WVHM8a-C3a6nJHga1aecAdUitkohIFcl4EO_jQCTBtHpOtP3wtfBYBl6XYQnz-jZWOoDr7ipPq5H3X2pAka8a8_MEdJVFQxni-GaPmQRr1gPw18YdrSU4D8NuJJLRW8rIHgukqu8RtwRPLScLiXGaw5dc5o0_jWz3PGgyRgHLQu7SvO51gzng9UE1",
          "path" : "/",
          "httpOnly" : true,
          "secure" : false,
          "comment" : ""
        } ],
        "headers" : [ {
          "name" : "Cache-Control",
          "value" : "private"
        }, {
          "name" : "Content-Type",
          "value" : "application/json; charset=utf-8"
        }, {
          "name" : "Server",
          "value" : "Microsoft-IIS/10.0"
        }, {
          "name" : "Set-Cookie",
          "value" : ".ASPROLES=rQDn1RZ52jnKsQbc-cVtrMf8xCbhdt-MvzULVrFAxRa82JGqmU0rp6dzxDuwQj7VvYBtk6rHZXS7-fVPvrIVpGbrJJrRdbnpotxBePVXigQcSu03rkDjV__J1V9Uo9HRPkWIRi5INoR-I57TPHFFCugzcRcV3Af0yRTNnVYFkAu65pi_kBAUuHxAGhBLzaDyVdhjdywEGSM8uDRFdoaiP7eOcXhXugORp4hmnk14WEPoOel2lDQ7TQissfRx9NbiqLvcojs-uWpHq1AFaoSkqA-F2BvZrHTz-XU-aWs2DU3IlTN-hiQ2x3BZ93R34wkmERS6J5gWevBb5dpuURG5tU1cvn60coS2mM5WVHM8a-C3a6nJHga1aecAdUitkohIFcl4EO_jQCTBtHpOtP3wtfBYBl6XYQnz-jZWOoDr7ipPq5H3X2pAka8a8_MEdJVFQxni-GaPmQRr1gPw18YdrSU4D8NuJJLRW8rIHgukqu8RtwRPLScLiXGaw5dc5o0_jWz3PGgyRgHLQu7SvO51gzng9UE1; path=/; HttpOnly"
        }, {
          "name" : "X-SourceFiles",
          "value" : "=?UTF-8?B?RDpcVmlydHVhbE9wdGltaXplci1SZWZhY3RvcmluZ1xDcm9wTWV0cmljcy5Wby5BcGlcQ3JvcE1ldHJpY3MuVm8uQXBpXGFwaVxtb2JpbGVcdjFcZmFybXNcNw==?="
        }, {
          "name" : "X-Powered-By",
          "value" : "ASP.NET"
        }, {
          "name" : "Date",
          "value" : "Wed, 24 Apr 2019 20:26:45 GMT"
        }, {
          "name" : "Content-Length",
          "value" : "45"
        } ],
        "content" : {
          "size" : 45,
          "mimeType" : "application/json; charset=utf-8",
          "text" : "{\"message\":\"The farm name must be provided.\"}",
          "comment" : ""
        },
        "redirectURL" : "",
        "headersSize" : 944,
        "bodySize" : 45,
        "comment" : ""
      },
      "cache" : { },
      "timings" : {
        "comment" : "",
        "connect" : -1,
        "wait" : 3160,
        "send" : 0,
        "receive" : 1,
        "dns" : -1,
        "blocked" : -1,
        "ssl" : -1
      },
      "serverIPAddress" : "127.0.0.1",
      "comment" : "",
      "_katalonRequestInformation" : {
        "name" : "21",
        "testObjectId" : "Object Repository/VoGrow/Farm/FarmPut",
        "harId" : "15cd5071-80b1-4cff-82e2-ac7670fe0853"
      },
      "time" : 3161
    } ],
    "comment" : ""
  }
}