{
  "log" : {
    "version" : "1.2",
    "creator" : {
      "name" : "BrowserMob Proxy",
      "version" : "2.1.5",
      "comment" : ""
    },
    "pages" : [ {
      "id" : "Page 0",
      "startedDateTime" : "2019-04-11T16:07:57.632Z",
      "title" : "Page 0",
      "pageTimings" : {
        "onLoad" : 102,
        "comment" : ""
      },
      "comment" : ""
    } ],
    "entries" : [ {
      "pageref" : "Page 0",
      "startedDateTime" : "2019-04-11T16:07:57.634Z",
      "request" : {
        "method" : "POST",
        "url" : "http://localhost:10520/WebAPI/api/mobile/v1/fields?",
        "httpVersion" : "HTTP/1.1",
        "cookies" : [ ],
        "headers" : [ {
          "name" : "User-Agent",
          "value" : "Katalon Studio"
        }, {
          "name" : "Content-Type",
          "value" : "application/json"
        }, {
          "name" : "Authorization",
          "value" : "Bearer eyJ0eXAiOiJKV1QiLCJhbGciOiJIUzI1NiJ9.eyJ1bmlxdWVfbmFtZSI6Implbm55Lm1hbGRvbmFkby50eDFAZ21haWwuY29tIiwicm9sZSI6InVzZXIiLCJzdWIiOiJqZW5ueS5tYWxkb25hZG8udHgxQGdtYWlsLmNvbSIsImlzcyI6IkNyb3BNZXRyaWNzIiwiYXVkIjoiYWxsIiwiZXhwIjoxNTU1MDAyNzc3LCJuYmYiOjE1NTQ5OTg4Nzd9.GaFKC4mIRztt6sP_ruQ492vhcpd2twmM_yDgbnrPd2A"
        }, {
          "name" : "Host",
          "value" : "localhost:10520"
        }, {
          "name" : "Accept",
          "value" : "text/html, image/gif, image/jpeg, *; q=.2, */*; q=.2"
        }, {
          "name" : "Proxy-Connection",
          "value" : "keep-alive"
        }, {
          "name" : "Content-Length",
          "value" : "94"
        } ],
        "queryString" : [ ],
        "postData" : {
          "mimeType" : "application/json",
          "text" : "{\"field\":{\"farm_id\":7,\"name\":\"Field whit empty boundary\",\"boundary\":{\"boundaries\":[\"     \"]}}}",
          "comment" : ""
        },
        "headersSize" : 591,
        "bodySize" : 94,
        "comment" : ""
      },
      "response" : {
        "status" : 400,
        "statusText" : "Bad Request",
        "httpVersion" : "HTTP/1.1",
        "cookies" : [ {
          "name" : ".ASPROLES",
          "value" : "pVNSvR6CzWB6jya0AthraBARWSBVgmVLhlA53XrVNxqSb1iCKb6FXt-8m54hDHvnWbvMnhNNbjl-tTpGzup2ihoef0gyazLSKJKvjYWr5owcpeFmnv1Y1c4LkC0BWnPipQ6vb5iYDzLr-I4prFYgxb8nMKsGyYH3DXiBiu2MEJ86SERxxJXlzlvoYiTIbj9JZUFXEat1YT9ilBoGLAplOY6RTswZozYuHN_qkndVg7zr_glZEDSLxA5DGtYi6bofAioveK2gYLGMh0uzzTGaLKxgDyYQLedCZcJ7On9xaqOxgjpqwFWeiUAI-JyrkDp0Q-Q0L6o928v0PP95Nd4F99R2pHCAlzGis8qnbmv_ODJwwoYDHrfs8pGYCHugskckj4TilPPQo1sY48X7mhzJdrO8YKt0Zg1N1quxDgXWFOvc2oqfhUg_QZqD37ORCk6dlrpM-gH4NUIUoyWIATMJEuicHpUTQRjgPaEG1xJ0wv094llMjS8HuEv3wSHmSy2c4h2UBGTJUVhkrt65e-UF4FwNN-g1",
          "path" : "/",
          "httpOnly" : true,
          "secure" : false,
          "comment" : ""
        } ],
        "headers" : [ {
          "name" : "Cache-Control",
          "value" : "private"
        }, {
          "name" : "Content-Type",
          "value" : "application/json; charset=utf-8"
        }, {
          "name" : "Server",
          "value" : "Microsoft-IIS/10.0"
        }, {
          "name" : "Set-Cookie",
          "value" : ".ASPROLES=pVNSvR6CzWB6jya0AthraBARWSBVgmVLhlA53XrVNxqSb1iCKb6FXt-8m54hDHvnWbvMnhNNbjl-tTpGzup2ihoef0gyazLSKJKvjYWr5owcpeFmnv1Y1c4LkC0BWnPipQ6vb5iYDzLr-I4prFYgxb8nMKsGyYH3DXiBiu2MEJ86SERxxJXlzlvoYiTIbj9JZUFXEat1YT9ilBoGLAplOY6RTswZozYuHN_qkndVg7zr_glZEDSLxA5DGtYi6bofAioveK2gYLGMh0uzzTGaLKxgDyYQLedCZcJ7On9xaqOxgjpqwFWeiUAI-JyrkDp0Q-Q0L6o928v0PP95Nd4F99R2pHCAlzGis8qnbmv_ODJwwoYDHrfs8pGYCHugskckj4TilPPQo1sY48X7mhzJdrO8YKt0Zg1N1quxDgXWFOvc2oqfhUg_QZqD37ORCk6dlrpM-gH4NUIUoyWIATMJEuicHpUTQRjgPaEG1xJ0wv094llMjS8HuEv3wSHmSy2c4h2UBGTJUVhkrt65e-UF4FwNN-g1; path=/; HttpOnly"
        }, {
          "name" : "X-SourceFiles",
          "value" : "=?UTF-8?B?RDpcVmlydHVhbE9wdGltaXplci1SZWZhY3RvcmluZ1xDcm9wTWV0cmljcy5Wby5BcGlcQ3JvcE1ldHJpY3MuVm8uQXBpXGFwaVxtb2JpbGVcdjFcZmllbGRz?="
        }, {
          "name" : "X-Powered-By",
          "value" : "ASP.NET"
        }, {
          "name" : "Date",
          "value" : "Thu, 11 Apr 2019 16:07:56 GMT"
        }, {
          "name" : "Content-Length",
          "value" : "37"
        } ],
        "content" : {
          "size" : 37,
          "mimeType" : "application/json; charset=utf-8",
          "text" : "{\"message\":\"The request is invalid.\"}",
          "comment" : ""
        },
        "redirectURL" : "",
        "headersSize" : 940,
        "bodySize" : 37,
        "comment" : ""
      },
      "cache" : { },
      "timings" : {
        "comment" : "",
        "ssl" : -1,
        "dns" : -1,
        "receive" : 0,
        "blocked" : -1,
        "connect" : -1,
        "wait" : 97,
        "send" : 0
      },
      "serverIPAddress" : "127.0.0.1",
      "comment" : "",
      "_katalonRequestInformation" : {
        "name" : "82",
        "testObjectId" : "Object Repository/VoGrow/Field/FieldPost",
        "harId" : "80e841bc-0f9a-45f3-a848-c7ae57ce9335"
      },
      "time" : 98
    } ],
    "comment" : ""
  }
}