{
  "log" : {
    "version" : "1.2",
    "creator" : {
      "name" : "BrowserMob Proxy",
      "version" : "2.1.5",
      "comment" : ""
    },
    "pages" : [ {
      "id" : "Page 0",
      "startedDateTime" : "2019-03-28T20:41:50.038Z",
      "title" : "Page 0",
      "pageTimings" : {
        "onLoad" : 5349,
        "comment" : ""
      },
      "comment" : ""
    } ],
    "entries" : [ {
      "pageref" : "Page 0",
      "startedDateTime" : "2019-03-28T20:41:50.039Z",
      "request" : {
        "method" : "POST",
        "url" : "http://localhost:10520/WebAPI/api/admin/v1/users/?",
        "httpVersion" : "HTTP/1.1",
        "cookies" : [ ],
        "headers" : [ {
          "name" : "User-Agent",
          "value" : "Katalon Studio"
        }, {
          "name" : "Content-Type",
          "value" : "application/x-www-form-urlencoded"
        }, {
          "name" : "Authorization",
          "value" : "Bearer eyJ0eXAiOiJKV1QiLCJhbGciOiJIUzI1NiJ9.eyJ1bmlxdWVfbmFtZSI6ImFkbWluIiwicm9sZSI6InVzZXIiLCJzdWIiOiJhZG1pbiIsImlzcyI6IkNyb3BNZXRyaWNzIiwiYXVkIjoiYWxsIiwiZXhwIjoxNTUzODA5NjA5LCJuYmYiOjE1NTM4MDU3MDl9.Kfoc28eAh_1-hbfj_s9trwEdlb1yNZjx0TlBXo6q60s"
        }, {
          "name" : "Host",
          "value" : "localhost:10520"
        }, {
          "name" : "Accept",
          "value" : "text/html, image/gif, image/jpeg, *; q=.2, */*; q=.2"
        }, {
          "name" : "Proxy-Connection",
          "value" : "keep-alive"
        }, {
          "name" : "Content-Length",
          "value" : "315"
        } ],
        "queryString" : [ ],
        "postData" : {
          "mimeType" : "application/x-www-form-urlencoded",
          "params" : [ {
            "name" : "password",
            "value" : "      ",
            "comment" : ""
          }, {
            "name" : "email",
            "value" : "cropmetricsvo.passonly6spaces@gmail.com",
            "comment" : ""
          }, {
            "name" : "fullname",
            "value" : "test validation",
            "comment" : ""
          }, {
            "name" : "phone",
            "value" : "123",
            "comment" : ""
          }, {
            "name" : "dealer",
            "value" : "dealer test validation",
            "comment" : ""
          }, {
            "name" : "addressLine1",
            "value" : "address line 1 test validation",
            "comment" : ""
          }, {
            "name" : "addressLine2",
            "value" : "address line 1 test validation",
            "comment" : ""
          }, {
            "name" : "town",
            "value" : "townValidation",
            "comment" : ""
          }, {
            "name" : "state",
            "value" : "stateValidation",
            "comment" : ""
          }, {
            "name" : "zip",
            "value" : "zipValidation",
            "comment" : ""
          }, {
            "name" : "country",
            "value" : "countryValidation",
            "comment" : ""
          }, {
            "name" : "roles",
            "value" : "Client",
            "comment" : ""
          } ],
          "comment" : ""
        },
        "headersSize" : 544,
        "bodySize" : 315,
        "comment" : ""
      },
      "response" : {
        "status" : 500,
        "statusText" : "Internal Server Error",
        "httpVersion" : "HTTP/1.1",
        "cookies" : [ {
          "name" : ".ASPROLES",
          "value" : "-rLnDWYDkBKc70cT4HHz63P3KWSzw4OcvOQdxIHhKUT_clZwkjN9aS-kGS2O8xBMRQhs0ECtMVK3_Mb_FCTGp2aBqHcwq58dJe71aWTHOmdp2V4x0Ist862YkDEwbbSOHj9Xycc5FH5hc1oIEQ4teplofq6jeGdDR-jJNF4AMd7df6mWN2nCcXQDRqLdYyuaTG-qJvEM2t2jQUtIqK3z7QAXgYEAJofpt0xrO5umLPB6xVlZ2v7px4XmOkwTEysGNeHP_S9ocBInZTgIIXUD5xFEGAKaZGJfOo2GRYkWelHlfbLPj6sbvqUcJqeaSDPk1Ph0gdv5oFGHIkRZe2aInX1L8SMuNy7m5zdVDM8EGPAyaNH-IyfH78-zki3kw9Tbwa4SpWT3WKqNqfc8nTC52ywEIgaxnfgxO1fzENPTz1u4HGpdUOdGEQvCUTgqr2IpVcv-jN6Gx3NPc6JRR7szKTVfE_9E88cDND_p1X-YZzN8aJYl0",
          "path" : "/",
          "httpOnly" : true,
          "secure" : false,
          "comment" : ""
        } ],
        "headers" : [ {
          "name" : "Cache-Control",
          "value" : "private"
        }, {
          "name" : "Content-Type",
          "value" : "application/json; charset=utf-8"
        }, {
          "name" : "Server",
          "value" : "Microsoft-IIS/10.0"
        }, {
          "name" : "Set-Cookie",
          "value" : ".ASPROLES=-rLnDWYDkBKc70cT4HHz63P3KWSzw4OcvOQdxIHhKUT_clZwkjN9aS-kGS2O8xBMRQhs0ECtMVK3_Mb_FCTGp2aBqHcwq58dJe71aWTHOmdp2V4x0Ist862YkDEwbbSOHj9Xycc5FH5hc1oIEQ4teplofq6jeGdDR-jJNF4AMd7df6mWN2nCcXQDRqLdYyuaTG-qJvEM2t2jQUtIqK3z7QAXgYEAJofpt0xrO5umLPB6xVlZ2v7px4XmOkwTEysGNeHP_S9ocBInZTgIIXUD5xFEGAKaZGJfOo2GRYkWelHlfbLPj6sbvqUcJqeaSDPk1Ph0gdv5oFGHIkRZe2aInX1L8SMuNy7m5zdVDM8EGPAyaNH-IyfH78-zki3kw9Tbwa4SpWT3WKqNqfc8nTC52ywEIgaxnfgxO1fzENPTz1u4HGpdUOdGEQvCUTgqr2IpVcv-jN6Gx3NPc6JRR7szKTVfE_9E88cDND_p1X-YZzN8aJYl0; path=/; HttpOnly"
        }, {
          "name" : "X-SourceFiles",
          "value" : "=?UTF-8?B?RDpcVmlydHVhbE9wdGltaXplci1SZWZhY3RvcmluZ1xDcm9wTWV0cmljcy5Wby5BcGlcQ3JvcE1ldHJpY3MuVm8uQXBpXGFwaVxhZG1pblx2MVx1c2Vyc1w=?="
        }, {
          "name" : "X-Powered-By",
          "value" : "ASP.NET"
        }, {
          "name" : "Date",
          "value" : "Thu, 28 Mar 2019 20:41:55 GMT"
        }, {
          "name" : "Content-Length",
          "value" : "53"
        } ],
        "content" : {
          "size" : 53,
          "mimeType" : "application/json; charset=utf-8",
          "text" : "{\"message\":\"Internal server error in the processing\"}",
          "comment" : ""
        },
        "redirectURL" : "",
        "headersSize" : 907,
        "bodySize" : 53,
        "comment" : ""
      },
      "cache" : { },
      "timings" : {
        "comment" : "",
        "ssl" : -1,
        "send" : 0,
        "receive" : 0,
        "wait" : 5344,
        "connect" : -1,
        "blocked" : -1,
        "dns" : -1
      },
      "serverIPAddress" : "127.0.0.1",
      "comment" : "",
      "_katalonRequestInformation" : {
        "name" : "41",
        "testObjectId" : "Object Repository/VoPro/Account/api_admin_v1_users",
        "harId" : "63836b8d-c315-46e2-b116-b145db6fbcf9"
      },
      "time" : 5345
    } ],
    "comment" : ""
  }
}