{
  "log" : {
    "version" : "1.2",
    "creator" : {
      "name" : "BrowserMob Proxy",
      "version" : "2.1.5",
      "comment" : ""
    },
    "pages" : [ {
      "id" : "Page 0",
      "startedDateTime" : "2019-04-24T20:53:55.763Z",
      "title" : "Page 0",
      "pageTimings" : {
        "onLoad" : 128,
        "comment" : ""
      },
      "comment" : ""
    } ],
    "entries" : [ {
      "pageref" : "Page 0",
      "startedDateTime" : "2019-04-24T20:53:55.765Z",
      "request" : {
        "method" : "POST",
        "url" : "http://localhost:10520/WebAPI/api/mobile/v1/fields?",
        "httpVersion" : "HTTP/1.1",
        "cookies" : [ ],
        "headers" : [ {
          "name" : "User-Agent",
          "value" : "Katalon Studio"
        }, {
          "name" : "Content-Type",
          "value" : "application/json"
        }, {
          "name" : "Authorization",
          "value" : "Bearer eyJ0eXAiOiJKV1QiLCJhbGciOiJIUzI1NiJ9.eyJ1bmlxdWVfbmFtZSI6Implbm55Lm1hbGRvbmFkby50eDFAZ21haWwuY29tIiwicm9sZSI6InVzZXIiLCJzdWIiOiJqZW5ueS5tYWxkb25hZG8udHgxQGdtYWlsLmNvbSIsImlzcyI6IkNyb3BNZXRyaWNzIiwiYXVkIjoiYWxsIiwiZXhwIjoxNTU2MTQzMTM1LCJuYmYiOjE1NTYxMzkyMzV9.S7R1TJByy8hqe_wYU1aIKbgW4lTywumQ3IVuuqaS4ec"
        }, {
          "name" : "Host",
          "value" : "localhost:10520"
        }, {
          "name" : "Accept",
          "value" : "text/html, image/gif, image/jpeg, *; q=.2, */*; q=.2"
        }, {
          "name" : "Proxy-Connection",
          "value" : "keep-alive"
        }, {
          "name" : "Content-Length",
          "value" : "405"
        } ],
        "queryString" : [ ],
        "postData" : {
          "mimeType" : "application/json",
          "text" : "{\"field\":{\"farm_id\":\"one\",\"name\":\"Field by agent not assigned\",\"boundary\":{\"boundaries\":[{\"boundary\":{\"coords\":[{\"x\":-101.49568751,\"y\":37.14976293},{\"x\":-101.50049403,\"y\":37.14647907},{\"x\":-101.50049403,\"y\":37.14264773},{\"x\":-101.49723246,\"y\":37.1411425},{\"x\":-101.49019435,\"y\":37.14223722},{\"x\":-101.48933604,\"y\":37.14620541},{\"x\":-101.49294093,\"y\":37.14866833},{\"x\":-101.49568751,\"y\":37.14976293}]}}]}}}",
          "comment" : ""
        },
        "headersSize" : 592,
        "bodySize" : 405,
        "comment" : ""
      },
      "response" : {
        "status" : 400,
        "statusText" : "Bad Request",
        "httpVersion" : "HTTP/1.1",
        "cookies" : [ {
          "name" : ".ASPROLES",
          "value" : "1aWfLWo8Kl-c-Cj54zzIPIheS8mozTCz7bxEaw2_DkGH7QXi2i37yb8v4NTMd0LMS4C9ugKcsrHSn8cxhKx3VYc8JiF-Qrzs1H9aTR_bmU3MJM0kM9MSOU0SoAE0B4mWmAU7UOTfal7hBMdlWVL5ccgSS06zxAbUN9UwhGa5quiYVyayPaC6ovo3qB6Si0AOWoj89aXM2_hAAk8a3LS2_rLxNgF6_DFqxA66xPXFOcWPWUY0K5VANyaBNeOYIllgnQLu7CeHK-rHvGWs434HPqOAwRQSAiK_LMcatfUCVR0ArJrYOCzLf9V1QM4cxpSPukYwJ-DOIrM8AqeoJUcJVT5H5kByMlcm_EXS9OTTkI5f93RKcS45UmawqliG5vm_inyYdrvk5miiaoHZ0fEUYVLI-Ak7oUEaxXHr2uyiYW5G2Zu24fkvbZrUZoi7zjDUifQ6LErPmVnmShKrfx000DDSMpBJPmu85vM4KFEHNZ1IlQD3DYuJwZ1HNYnNtb06R2o3OTeNl_pESDJdVcqZSCzbWoE1",
          "path" : "/",
          "httpOnly" : true,
          "secure" : false,
          "comment" : ""
        } ],
        "headers" : [ {
          "name" : "Cache-Control",
          "value" : "private"
        }, {
          "name" : "Content-Type",
          "value" : "application/json; charset=utf-8"
        }, {
          "name" : "Server",
          "value" : "Microsoft-IIS/10.0"
        }, {
          "name" : "Set-Cookie",
          "value" : ".ASPROLES=1aWfLWo8Kl-c-Cj54zzIPIheS8mozTCz7bxEaw2_DkGH7QXi2i37yb8v4NTMd0LMS4C9ugKcsrHSn8cxhKx3VYc8JiF-Qrzs1H9aTR_bmU3MJM0kM9MSOU0SoAE0B4mWmAU7UOTfal7hBMdlWVL5ccgSS06zxAbUN9UwhGa5quiYVyayPaC6ovo3qB6Si0AOWoj89aXM2_hAAk8a3LS2_rLxNgF6_DFqxA66xPXFOcWPWUY0K5VANyaBNeOYIllgnQLu7CeHK-rHvGWs434HPqOAwRQSAiK_LMcatfUCVR0ArJrYOCzLf9V1QM4cxpSPukYwJ-DOIrM8AqeoJUcJVT5H5kByMlcm_EXS9OTTkI5f93RKcS45UmawqliG5vm_inyYdrvk5miiaoHZ0fEUYVLI-Ak7oUEaxXHr2uyiYW5G2Zu24fkvbZrUZoi7zjDUifQ6LErPmVnmShKrfx000DDSMpBJPmu85vM4KFEHNZ1IlQD3DYuJwZ1HNYnNtb06R2o3OTeNl_pESDJdVcqZSCzbWoE1; path=/; HttpOnly"
        }, {
          "name" : "X-SourceFiles",
          "value" : "=?UTF-8?B?RDpcVmlydHVhbE9wdGltaXplci1SZWZhY3RvcmluZ1xDcm9wTWV0cmljcy5Wby5BcGlcQ3JvcE1ldHJpY3MuVm8uQXBpXGFwaVxtb2JpbGVcdjFcZmllbGRz?="
        }, {
          "name" : "X-Powered-By",
          "value" : "ASP.NET"
        }, {
          "name" : "Date",
          "value" : "Wed, 24 Apr 2019 20:53:55 GMT"
        }, {
          "name" : "Content-Length",
          "value" : "37"
        } ],
        "content" : {
          "size" : 37,
          "mimeType" : "application/json; charset=utf-8",
          "text" : "{\"message\":\"The request is invalid.\"}",
          "comment" : ""
        },
        "redirectURL" : "",
        "headersSize" : 940,
        "bodySize" : 37,
        "comment" : ""
      },
      "cache" : { },
      "timings" : {
        "comment" : "",
        "ssl" : -1,
        "wait" : 119,
        "send" : 2,
        "receive" : 0,
        "blocked" : -1,
        "dns" : -1,
        "connect" : -1
      },
      "serverIPAddress" : "127.0.0.1",
      "comment" : "",
      "_katalonRequestInformation" : {
        "name" : "15",
        "testObjectId" : "Object Repository/VoGrow/Field/FieldPost",
        "harId" : "55c7814f-6747-4993-904e-37384a02224d"
      },
      "time" : 123
    } ],
    "comment" : ""
  }
}