{
  "log" : {
    "version" : "1.2",
    "creator" : {
      "name" : "BrowserMob Proxy",
      "version" : "2.1.5",
      "comment" : ""
    },
    "pages" : [ {
      "id" : "Page 0",
      "startedDateTime" : "2019-04-04T21:05:00.495Z",
      "title" : "Page 0",
      "pageTimings" : {
        "onLoad" : 72,
        "comment" : ""
      },
      "comment" : ""
    } ],
    "entries" : [ {
      "pageref" : "Page 0",
      "startedDateTime" : "2019-04-04T21:05:00.496Z",
      "request" : {
        "method" : "POST",
        "url" : "http://localhost:10520/WebAPI/api/mobile/v1/farms/?",
        "httpVersion" : "HTTP/1.1",
        "cookies" : [ ],
        "headers" : [ {
          "name" : "User-Agent",
          "value" : "Katalon Studio"
        }, {
          "name" : "Content-Type",
          "value" : "application/json"
        }, {
          "name" : "Authorization",
          "value" : "Bearer eyJ0eXAiOiJKV1QiLCJhbGciOiJIUzI1NiJ9.eyJ1bmlxdWVfbmFtZSI6Implbm55Lm1hbGRvbmFkby50eDFAZ21haWwuY29tIiwicm9sZSI6InVzZXIiLCJzdWIiOiJqZW5ueS5tYWxkb25hZG8udHgxQGdtYWlsLmNvbSIsImlzcyI6IkNyb3BNZXRyaWNzIiwiYXVkIjoiYWxsIiwiZXhwIjoxNTU0NDE1ODAwLCJuYmYiOjE1NTQ0MTE5MDB9.4C0W7m-l1yqH2uMO4If7Tl0db47X1MsIdG4AwP3__h4"
        }, {
          "name" : "Host",
          "value" : "localhost:10520"
        }, {
          "name" : "Accept",
          "value" : "text/html, image/gif, image/jpeg, *; q=.2, */*; q=.2"
        }, {
          "name" : "Proxy-Connection",
          "value" : "keep-alive"
        }, {
          "name" : "Content-Length",
          "value" : "62"
        } ],
        "queryString" : [ ],
        "postData" : {
          "mimeType" : "application/json",
          "text" : "{\"name\": \"New Farm with userID with spaces\", \"user_id\": \"   \"}",
          "comment" : ""
        },
        "headersSize" : 591,
        "bodySize" : 62,
        "comment" : ""
      },
      "response" : {
        "status" : 400,
        "statusText" : "Bad Request",
        "httpVersion" : "HTTP/1.1",
        "cookies" : [ {
          "name" : ".ASPROLES",
          "value" : "T80L9ONlYO38L4bs1w6A2RhJwlKeqM1piKWEG0cuQDFKNOmFHpCHsDzeCkgvJJdRxb-nDbg99zC6NjOG4BFCRRrxsFJx-mqlX48zE-iEmETU4PcD1GuTwqglkzH5L23J879C_94es9YVu2soOFeum2v2gqim-oBWzowT96WGfCpGHgoJ2jwn4vwIHaZr2OeMg_hyuwYmgrzI1CDCQmM5V3CeymeKuIIPR4X5mTn0se9O01o3C_Ca53lCapTPpvitURzI9LfTvq71x4bgW4Trg300v_Ko2tBOFBgXlxsyOvCXkGFBRPwrsVqETbqnYVz67d6ntN0cNQwa583sXwlOyYWEV8jyXSZdxycwVVQs4rcm0PF9jUTt0G_c0_27zNQJC7fonAQ7_DAMySNtIaHKdlMNwJ3unr_Y7FzZjI9uKgQHrLGvr8zS-bCxO8AJd1XgpSE4umzoX_cKY0WoutSbTdLbHrRSxJygAZDCMTRpLFL_RoFMj58T_5979SPnLaIV91fmNgnRC9iqv-inntd-lvLTDy41",
          "path" : "/",
          "httpOnly" : true,
          "secure" : false,
          "comment" : ""
        } ],
        "headers" : [ {
          "name" : "Cache-Control",
          "value" : "private"
        }, {
          "name" : "Content-Type",
          "value" : "application/json; charset=utf-8"
        }, {
          "name" : "Server",
          "value" : "Microsoft-IIS/10.0"
        }, {
          "name" : "Set-Cookie",
          "value" : ".ASPROLES=T80L9ONlYO38L4bs1w6A2RhJwlKeqM1piKWEG0cuQDFKNOmFHpCHsDzeCkgvJJdRxb-nDbg99zC6NjOG4BFCRRrxsFJx-mqlX48zE-iEmETU4PcD1GuTwqglkzH5L23J879C_94es9YVu2soOFeum2v2gqim-oBWzowT96WGfCpGHgoJ2jwn4vwIHaZr2OeMg_hyuwYmgrzI1CDCQmM5V3CeymeKuIIPR4X5mTn0se9O01o3C_Ca53lCapTPpvitURzI9LfTvq71x4bgW4Trg300v_Ko2tBOFBgXlxsyOvCXkGFBRPwrsVqETbqnYVz67d6ntN0cNQwa583sXwlOyYWEV8jyXSZdxycwVVQs4rcm0PF9jUTt0G_c0_27zNQJC7fonAQ7_DAMySNtIaHKdlMNwJ3unr_Y7FzZjI9uKgQHrLGvr8zS-bCxO8AJd1XgpSE4umzoX_cKY0WoutSbTdLbHrRSxJygAZDCMTRpLFL_RoFMj58T_5979SPnLaIV91fmNgnRC9iqv-inntd-lvLTDy41; path=/; HttpOnly"
        }, {
          "name" : "X-SourceFiles",
          "value" : "=?UTF-8?B?RDpcVmlydHVhbE9wdGltaXplci1SZWZhY3RvcmluZ1xDcm9wTWV0cmljcy5Wby5BcGlcQ3JvcE1ldHJpY3MuVm8uQXBpXGFwaVxtb2JpbGVcdjFcZmFybXNc?="
        }, {
          "name" : "X-Powered-By",
          "value" : "ASP.NET"
        }, {
          "name" : "Date",
          "value" : "Thu, 04 Apr 2019 21:05:00 GMT"
        }, {
          "name" : "Content-Length",
          "value" : "37"
        } ],
        "content" : {
          "size" : 37,
          "mimeType" : "application/json; charset=utf-8",
          "text" : "{\"message\":\"The request is invalid.\"}",
          "comment" : ""
        },
        "redirectURL" : "",
        "headersSize" : 940,
        "bodySize" : 37,
        "comment" : ""
      },
      "cache" : { },
      "timings" : {
        "comment" : "",
        "dns" : -1,
        "receive" : 0,
        "blocked" : -1,
        "send" : 0,
        "wait" : 68,
        "connect" : -1,
        "ssl" : -1
      },
      "serverIPAddress" : "127.0.0.1",
      "comment" : "",
      "_katalonRequestInformation" : {
        "name" : "47",
        "testObjectId" : "Object Repository/VoGrow/Farm/FarmPost",
        "harId" : "851650e9-3ebe-42cd-a408-bfcb0d9c3651"
      },
      "time" : 69
    } ],
    "comment" : ""
  }
}