{
  "log" : {
    "version" : "1.2",
    "creator" : {
      "name" : "BrowserMob Proxy",
      "version" : "2.1.5",
      "comment" : ""
    },
    "pages" : [ {
      "id" : "Page 0",
      "startedDateTime" : "2019-04-05T19:36:50.391Z",
      "title" : "Page 0",
      "pageTimings" : {
        "onLoad" : 5607,
        "comment" : ""
      },
      "comment" : ""
    } ],
    "entries" : [ {
      "pageref" : "Page 0",
      "startedDateTime" : "2019-04-05T19:36:50.392Z",
      "request" : {
        "method" : "POST",
        "url" : "http://localhost:10520/WebAPI/api/mobile/v1/fields?",
        "httpVersion" : "HTTP/1.1",
        "cookies" : [ ],
        "headers" : [ {
          "name" : "User-Agent",
          "value" : "Katalon Studio"
        }, {
          "name" : "Content-Type",
          "value" : "application/json"
        }, {
          "name" : "Authorization",
          "value" : "Bearer eyJ0eXAiOiJKV1QiLCJhbGciOiJIUzI1NiJ9.eyJ1bmlxdWVfbmFtZSI6Implbm55Lm1hbGRvbmFkby50eDFAZ21haWwuY29tIiwicm9sZSI6InVzZXIiLCJzdWIiOiJqZW5ueS5tYWxkb25hZG8udHgxQGdtYWlsLmNvbSIsImlzcyI6IkNyb3BNZXRyaWNzIiwiYXVkIjoiYWxsIiwiZXhwIjoxNTU0NDk2OTEwLCJuYmYiOjE1NTQ0OTMwMTB9.y8F1KAFyrIDPs4-0dP-ql0ikRRAr9qGumIJAAf3OQ3E"
        }, {
          "name" : "Host",
          "value" : "localhost:10520"
        }, {
          "name" : "Accept",
          "value" : "text/html, image/gif, image/jpeg, *; q=.2, */*; q=.2"
        }, {
          "name" : "Proxy-Connection",
          "value" : "keep-alive"
        }, {
          "name" : "Content-Length",
          "value" : "413"
        } ],
        "queryString" : [ ],
        "postData" : {
          "mimeType" : "application/json",
          "text" : "{\"field\":{\"farm_id\":7,\"name\":\"Field whit invalid xy value on boundary\",\"boundary\":{\"boundaries\":[{\"boundary\":{\"coords\":[{\"x\":-301.49568751,\"y\":37.14976293},{\"x\":-101.50049403,\"y\":37.14647907},{\"x\":-101.50049403,\"y\":37.14264773},{\"x\":-101.49723246,\"y\":37.1411425},{\"x\":-101.49019435,\"y\":37.14223722},{\"x\":-101.48933604,\"y\":37.14620541},{\"x\":-101.49294093,\"y\":37.14866833},{\"x\":-101.49568751,\"y\":37.14976293}]}}]}}}",
          "comment" : ""
        },
        "headersSize" : 592,
        "bodySize" : 413,
        "comment" : ""
      },
      "response" : {
        "status" : 400,
        "statusText" : "Bad Request",
        "httpVersion" : "HTTP/1.1",
        "cookies" : [ {
          "name" : ".ASPROLES",
          "value" : "BhwvjZet6Sh7PMiSY0MZjBcJuzvsy8Pgi30FO6ee8ZxAKTaUjeBDyUvSa_XuS9GDCvtOXFMgECDhHG_18lObBDHfZQ7DjzVMYeaJRvpQDmJKrmNIc40Gg-6gAXlwu97avgf8-_Zj4148bvWVMh2LhQfXISTVZ5qtsFaxXn5MTQ-CT-UuzWEk1eEJ-COchHg28QEG0LnXSW97pegGh6dEM8hP0fRT7MUkAdvio5wvj5Zbq8cb5E11csVCZhEYOoKzFSU7DuKKpvS01xPR1cwRE7FGukAgWJCt9bzS7vnWMmu9nycK1el1In4TUVwlJYZVKpNO8RTqSayA-61RrRoRzGnQOlIfwZ8fkzyXFxRu0ZhTwn36Ded1prohpNZPjjZpDwu4uwk6ihxuGc8JW3wmbUar23T2rsmtfkl1SLloA2DpPWgnTabI1G30dwqMsicGOzezN3DO6dlrWKD7SnpI7VtpytJ7ICzVffe7ju35oVzi5BPpbihyr6LN-_NwgYw-lhmacH4tfalJLG4sHAKOBruDJxU1",
          "path" : "/",
          "httpOnly" : true,
          "secure" : false,
          "comment" : ""
        } ],
        "headers" : [ {
          "name" : "Cache-Control",
          "value" : "private"
        }, {
          "name" : "Content-Type",
          "value" : "application/json; charset=utf-8"
        }, {
          "name" : "Server",
          "value" : "Microsoft-IIS/10.0"
        }, {
          "name" : "Set-Cookie",
          "value" : ".ASPROLES=BhwvjZet6Sh7PMiSY0MZjBcJuzvsy8Pgi30FO6ee8ZxAKTaUjeBDyUvSa_XuS9GDCvtOXFMgECDhHG_18lObBDHfZQ7DjzVMYeaJRvpQDmJKrmNIc40Gg-6gAXlwu97avgf8-_Zj4148bvWVMh2LhQfXISTVZ5qtsFaxXn5MTQ-CT-UuzWEk1eEJ-COchHg28QEG0LnXSW97pegGh6dEM8hP0fRT7MUkAdvio5wvj5Zbq8cb5E11csVCZhEYOoKzFSU7DuKKpvS01xPR1cwRE7FGukAgWJCt9bzS7vnWMmu9nycK1el1In4TUVwlJYZVKpNO8RTqSayA-61RrRoRzGnQOlIfwZ8fkzyXFxRu0ZhTwn36Ded1prohpNZPjjZpDwu4uwk6ihxuGc8JW3wmbUar23T2rsmtfkl1SLloA2DpPWgnTabI1G30dwqMsicGOzezN3DO6dlrWKD7SnpI7VtpytJ7ICzVffe7ju35oVzi5BPpbihyr6LN-_NwgYw-lhmacH4tfalJLG4sHAKOBruDJxU1; path=/; HttpOnly"
        }, {
          "name" : "X-SourceFiles",
          "value" : "=?UTF-8?B?RDpcVmlydHVhbE9wdGltaXplci1SZWZhY3RvcmluZ1xDcm9wTWV0cmljcy5Wby5BcGlcQ3JvcE1ldHJpY3MuVm8uQXBpXGFwaVxtb2JpbGVcdjFcZmllbGRz?="
        }, {
          "name" : "X-Powered-By",
          "value" : "ASP.NET"
        }, {
          "name" : "Date",
          "value" : "Fri, 05 Apr 2019 19:36:55 GMT"
        }, {
          "name" : "Content-Length",
          "value" : "119"
        } ],
        "content" : {
          "size" : 119,
          "mimeType" : "application/json; charset=utf-8",
          "text" : "{\"message\":\"The Boundary is not valid. IllegalArgumentException: Points of LinearRing do not form a closed linestring\"}",
          "comment" : ""
        },
        "redirectURL" : "",
        "headersSize" : 941,
        "bodySize" : 119,
        "comment" : ""
      },
      "cache" : { },
      "timings" : {
        "comment" : "",
        "ssl" : -1,
        "connect" : -1,
        "blocked" : -1,
        "send" : 0,
        "dns" : -1,
        "receive" : 0,
        "wait" : 5602
      },
      "serverIPAddress" : "127.0.0.1",
      "comment" : "",
      "_katalonRequestInformation" : {
        "name" : "92",
        "testObjectId" : "Object Repository/VoGrow/Field/FieldPost",
        "harId" : "af6a16a0-819d-476c-b323-576270b841a7"
      },
      "time" : 5603
    } ],
    "comment" : ""
  }
}