{
  "log" : {
    "version" : "1.2",
    "creator" : {
      "name" : "BrowserMob Proxy",
      "version" : "2.1.5",
      "comment" : ""
    },
    "pages" : [ {
      "id" : "Page 0",
      "startedDateTime" : "2019-04-09T09:42:25.825Z",
      "title" : "Page 0",
      "pageTimings" : {
        "onLoad" : 4509,
        "comment" : ""
      },
      "comment" : ""
    } ],
    "entries" : [ {
      "pageref" : "Page 0",
      "startedDateTime" : "2019-04-09T09:42:25.825Z",
      "request" : {
        "method" : "POST",
        "url" : "http://localhost:10520/WebAPI/api/mobile/v1/fields?",
        "httpVersion" : "HTTP/1.1",
        "cookies" : [ ],
        "headers" : [ {
          "name" : "User-Agent",
          "value" : "Katalon Studio"
        }, {
          "name" : "Content-Type",
          "value" : "application/json"
        }, {
          "name" : "Authorization",
          "value" : "Bearer eyJ0eXAiOiJKV1QiLCJhbGciOiJIUzI1NiJ9.eyJ1bmlxdWVfbmFtZSI6Implbm55Lm1hbGRvbmFkby50eDFAZ21haWwuY29tIiwicm9sZSI6InVzZXIiLCJzdWIiOiJqZW5ueS5tYWxkb25hZG8udHgxQGdtYWlsLmNvbSIsImlzcyI6IkNyb3BNZXRyaWNzIiwiYXVkIjoiYWxsIiwiZXhwIjoxNTU0ODA2ODQ1LCJuYmYiOjE1NTQ4MDI5NDV9.3b8_F-8uA9J3pYtuwnRUZ6ppe5lnmnYPu70Q-uGOyKU"
        }, {
          "name" : "Host",
          "value" : "localhost:10520"
        }, {
          "name" : "Accept",
          "value" : "text/html, image/gif, image/jpeg, *; q=.2, */*; q=.2"
        }, {
          "name" : "Proxy-Connection",
          "value" : "keep-alive"
        }, {
          "name" : "Content-Length",
          "value" : "413"
        } ],
        "queryString" : [ ],
        "postData" : {
          "mimeType" : "application/json",
          "text" : "{\"field\":{\"farm_id\":7,\"name\":\"Field whit invalid y value on boundary\",\"boundary\":{\"boundaries\":[{\"boundary\":{\"coords\":[{\"x\":-101.49568751,\"y\":137.14976293},{\"x\":-101.50049403,\"y\":37.14647907},{\"x\":-101.50049403,\"y\":37.14264773},{\"x\":-101.49723246,\"y\":37.1411425},{\"x\":-101.49019435,\"y\":37.14223722},{\"x\":-101.48933604,\"y\":37.14620541},{\"x\":-101.49294093,\"y\":37.14866833},{\"x\":-101.49568751,\"y\":37.14976293}]}}]}}}",
          "comment" : ""
        },
        "headersSize" : 592,
        "bodySize" : 413,
        "comment" : ""
      },
      "response" : {
        "status" : 400,
        "statusText" : "Bad Request",
        "httpVersion" : "HTTP/1.1",
        "cookies" : [ {
          "name" : ".ASPROLES",
          "value" : "CI717sM6aW342tQDzLTGbSFlL4ucyUkVzSTbHPdCecudxJYHs1vH6poNC3SbWgFjOxmbxxj4IrTHNxE-cMEV8vgu8AdyCrFzXixZ0U7bxSSKsILDqsp7KHXNvqWXv0iHnqu7rHJ9KwCHuVZ5GotY_FdoHSp-IpAd-iXM60PCbPSVQoWn_i1YYrlGzXn6dJ7eV3QuSrrc_wntUoGQJ955bioOKSumLtmArkezBQ0N0AymSJdceEILW5LOSem6pe4akbWlymjFwkhuPzD7eACiTMRILKpk_rIoaWo2wOY7AqXf0KcO0dDLbi6sMyy_ITYkJzLZ_6ld7z__wx29m7UW59OGkYdclobrlFeMUQyE2gYo89U8HPcBtz37BGESqrZDuIXi3iAn2oxigsRDUa5iA_rCxrjAs-o8GaQ5lTRiyrrpWlLbM6l-E3Wpgz3_Dzp7hOVNmBXe2v7UjigIt4rcAlwwinZuVXK9_fFbfF2knbng2hW8KadTUuILVQOJN_lk5II5Mj5fzCiF3Sie9kf2U1ZiT6I1",
          "path" : "/",
          "httpOnly" : true,
          "secure" : false,
          "comment" : ""
        } ],
        "headers" : [ {
          "name" : "Cache-Control",
          "value" : "private"
        }, {
          "name" : "Content-Type",
          "value" : "application/json; charset=utf-8"
        }, {
          "name" : "Server",
          "value" : "Microsoft-IIS/10.0"
        }, {
          "name" : "Set-Cookie",
          "value" : ".ASPROLES=CI717sM6aW342tQDzLTGbSFlL4ucyUkVzSTbHPdCecudxJYHs1vH6poNC3SbWgFjOxmbxxj4IrTHNxE-cMEV8vgu8AdyCrFzXixZ0U7bxSSKsILDqsp7KHXNvqWXv0iHnqu7rHJ9KwCHuVZ5GotY_FdoHSp-IpAd-iXM60PCbPSVQoWn_i1YYrlGzXn6dJ7eV3QuSrrc_wntUoGQJ955bioOKSumLtmArkezBQ0N0AymSJdceEILW5LOSem6pe4akbWlymjFwkhuPzD7eACiTMRILKpk_rIoaWo2wOY7AqXf0KcO0dDLbi6sMyy_ITYkJzLZ_6ld7z__wx29m7UW59OGkYdclobrlFeMUQyE2gYo89U8HPcBtz37BGESqrZDuIXi3iAn2oxigsRDUa5iA_rCxrjAs-o8GaQ5lTRiyrrpWlLbM6l-E3Wpgz3_Dzp7hOVNmBXe2v7UjigIt4rcAlwwinZuVXK9_fFbfF2knbng2hW8KadTUuILVQOJN_lk5II5Mj5fzCiF3Sie9kf2U1ZiT6I1; path=/; HttpOnly"
        }, {
          "name" : "X-SourceFiles",
          "value" : "=?UTF-8?B?RDpcVmlydHVhbE9wdGltaXplci1SZWZhY3RvcmluZ1xDcm9wTWV0cmljcy5Wby5BcGlcQ3JvcE1ldHJpY3MuVm8uQXBpXGFwaVxtb2JpbGVcdjFcZmllbGRz?="
        }, {
          "name" : "X-Powered-By",
          "value" : "ASP.NET"
        }, {
          "name" : "Date",
          "value" : "Tue, 09 Apr 2019 09:42:30 GMT"
        }, {
          "name" : "Content-Length",
          "value" : "119"
        } ],
        "content" : {
          "size" : 119,
          "mimeType" : "application/json; charset=utf-8",
          "text" : "{\"message\":\"The Boundary is not valid. IllegalArgumentException: Points of LinearRing do not form a closed linestring\"}",
          "comment" : ""
        },
        "redirectURL" : "",
        "headersSize" : 941,
        "bodySize" : 119,
        "comment" : ""
      },
      "cache" : { },
      "timings" : {
        "comment" : "",
        "ssl" : -1,
        "receive" : 0,
        "wait" : 4496,
        "connect" : -1,
        "blocked" : -1,
        "dns" : -1,
        "send" : 0
      },
      "serverIPAddress" : "127.0.0.1",
      "comment" : "",
      "_katalonRequestInformation" : {
        "name" : "92",
        "testObjectId" : "Object Repository/VoGrow/Field/FieldPost",
        "harId" : "f38345cb-d208-4864-9e8f-aaa840e41172"
      },
      "time" : 4498
    } ],
    "comment" : ""
  }
}