{
  "log" : {
    "version" : "1.2",
    "creator" : {
      "name" : "BrowserMob Proxy",
      "version" : "2.1.5",
      "comment" : ""
    },
    "pages" : [ {
      "id" : "Page 0",
      "startedDateTime" : "2019-04-11T16:07:46.368Z",
      "title" : "Page 0",
      "pageTimings" : {
        "onLoad" : 3984,
        "comment" : ""
      },
      "comment" : ""
    } ],
    "entries" : [ {
      "pageref" : "Page 0",
      "startedDateTime" : "2019-04-11T16:07:46.369Z",
      "request" : {
        "method" : "POST",
        "url" : "http://localhost:10520/WebAPI/api/mobile/v1/fields?",
        "httpVersion" : "HTTP/1.1",
        "cookies" : [ ],
        "headers" : [ {
          "name" : "User-Agent",
          "value" : "Katalon Studio"
        }, {
          "name" : "Content-Type",
          "value" : "application/json"
        }, {
          "name" : "Authorization",
          "value" : "Bearer eyJ0eXAiOiJKV1QiLCJhbGciOiJIUzI1NiJ9.eyJ1bmlxdWVfbmFtZSI6Implbm55Lm1hbGRvbmFkby50eDFAZ21haWwuY29tIiwicm9sZSI6InVzZXIiLCJzdWIiOiJqZW5ueS5tYWxkb25hZG8udHgxQGdtYWlsLmNvbSIsImlzcyI6IkNyb3BNZXRyaWNzIiwiYXVkIjoiYWxsIiwiZXhwIjoxNTU1MDAyNzY2LCJuYmYiOjE1NTQ5OTg4NjZ9.KGqynKqDU2eemGFKBFgOo9Bv3cvvVV1eEXvcgKnFCsU"
        }, {
          "name" : "Host",
          "value" : "localhost:10520"
        }, {
          "name" : "Accept",
          "value" : "text/html, image/gif, image/jpeg, *; q=.2, */*; q=.2"
        }, {
          "name" : "Proxy-Connection",
          "value" : "keep-alive"
        }, {
          "name" : "Content-Length",
          "value" : "87"
        } ],
        "queryString" : [ ],
        "postData" : {
          "mimeType" : "application/json",
          "text" : "{\"field\":{\"farm_id\":7,\"name\":\"Field whit empty boundary\",\"boundary\":{\"boundaries\":[]}}}",
          "comment" : ""
        },
        "headersSize" : 591,
        "bodySize" : 87,
        "comment" : ""
      },
      "response" : {
        "status" : 400,
        "statusText" : "Bad Request",
        "httpVersion" : "HTTP/1.1",
        "cookies" : [ {
          "name" : ".ASPROLES",
          "value" : "D37G2v8qIb6i5Kzh2eIFqHTKlV1kxXxYii6-Zn4znkRWj7DQj7XBskzzVBP7cf69OI2pfIXaXQAxG076i3o_JVPJTCBKUAjQP5H9EvsjonqWfnz39RVTQzonIyWA7Xa34QeoUk7S4cFNPie5BoLXWqjdzSPi21eCCMPuP_-qiudmxP5qitWK2CwlkhLocIWavn0Dm8JIFvR4AiHdFYCyKURnaZFc5M7K_nA8ib2XMT2wNris_edCfabwVC6Q50Ze7077R20vChauPWeoDCUh8STIBQvcMFtH9o6e-_qdqS91zfxgtS_y0OYJz2yZf4K6D516ZP8kApSnzHTOHF4MTGueL_E7tyMB2z1DEGhfDlevj27mb7IsehjcYLpEEbGQwlaXZUlKeXrh1B0zFMLHASBG41QpeQA2CbAiRSiXPeE5cHvYKsqM_ZsuzsHCnXKXjeWLRiKY5TpDU6x4Znzjc_UciAUlhHw0CTgikpjuPwzJPtu4Mbj8UOMEqwuWykc-xJW8D1Z9CDuJhF3Zvbqbm3L6Dxw1",
          "path" : "/",
          "httpOnly" : true,
          "secure" : false,
          "comment" : ""
        } ],
        "headers" : [ {
          "name" : "Cache-Control",
          "value" : "private"
        }, {
          "name" : "Content-Type",
          "value" : "application/json; charset=utf-8"
        }, {
          "name" : "Server",
          "value" : "Microsoft-IIS/10.0"
        }, {
          "name" : "Set-Cookie",
          "value" : ".ASPROLES=D37G2v8qIb6i5Kzh2eIFqHTKlV1kxXxYii6-Zn4znkRWj7DQj7XBskzzVBP7cf69OI2pfIXaXQAxG076i3o_JVPJTCBKUAjQP5H9EvsjonqWfnz39RVTQzonIyWA7Xa34QeoUk7S4cFNPie5BoLXWqjdzSPi21eCCMPuP_-qiudmxP5qitWK2CwlkhLocIWavn0Dm8JIFvR4AiHdFYCyKURnaZFc5M7K_nA8ib2XMT2wNris_edCfabwVC6Q50Ze7077R20vChauPWeoDCUh8STIBQvcMFtH9o6e-_qdqS91zfxgtS_y0OYJz2yZf4K6D516ZP8kApSnzHTOHF4MTGueL_E7tyMB2z1DEGhfDlevj27mb7IsehjcYLpEEbGQwlaXZUlKeXrh1B0zFMLHASBG41QpeQA2CbAiRSiXPeE5cHvYKsqM_ZsuzsHCnXKXjeWLRiKY5TpDU6x4Znzjc_UciAUlhHw0CTgikpjuPwzJPtu4Mbj8UOMEqwuWykc-xJW8D1Z9CDuJhF3Zvbqbm3L6Dxw1; path=/; HttpOnly"
        }, {
          "name" : "X-SourceFiles",
          "value" : "=?UTF-8?B?RDpcVmlydHVhbE9wdGltaXplci1SZWZhY3RvcmluZ1xDcm9wTWV0cmljcy5Wby5BcGlcQ3JvcE1ldHJpY3MuVm8uQXBpXGFwaVxtb2JpbGVcdjFcZmllbGRz?="
        }, {
          "name" : "X-Powered-By",
          "value" : "ASP.NET"
        }, {
          "name" : "Date",
          "value" : "Thu, 11 Apr 2019 16:07:50 GMT"
        }, {
          "name" : "Content-Length",
          "value" : "56"
        } ],
        "content" : {
          "size" : 56,
          "mimeType" : "application/json; charset=utf-8",
          "text" : "{\"message\":\"The Boundary must be a non empty geometry.\"}",
          "comment" : ""
        },
        "redirectURL" : "",
        "headersSize" : 940,
        "bodySize" : 56,
        "comment" : ""
      },
      "cache" : { },
      "timings" : {
        "comment" : "",
        "ssl" : -1,
        "dns" : -1,
        "receive" : 0,
        "blocked" : -1,
        "connect" : -1,
        "wait" : 3980,
        "send" : 0
      },
      "serverIPAddress" : "127.0.0.1",
      "comment" : "",
      "_katalonRequestInformation" : {
        "name" : "74",
        "testObjectId" : "Object Repository/VoGrow/Field/FieldPost",
        "harId" : "34629ead-1887-4bfa-8c7a-6c33a4983d23"
      },
      "time" : 3981
    } ],
    "comment" : ""
  }
}