{
  "log" : {
    "version" : "1.2",
    "creator" : {
      "name" : "BrowserMob Proxy",
      "version" : "2.1.5",
      "comment" : ""
    },
    "pages" : [ {
      "id" : "Page 0",
      "startedDateTime" : "2019-04-24T20:34:42.806Z",
      "title" : "Page 0",
      "pageTimings" : {
        "onLoad" : 26,
        "comment" : ""
      },
      "comment" : ""
    } ],
    "entries" : [ {
      "pageref" : "Page 0",
      "startedDateTime" : "2019-04-24T20:34:42.808Z",
      "request" : {
        "method" : "GET",
        "url" : "http://localhost:10520/WebAPI/api/mobile/v1/user?",
        "httpVersion" : "HTTP/1.1",
        "cookies" : [ ],
        "headers" : [ {
          "name" : "User-Agent",
          "value" : "Katalon Studio"
        }, {
          "name" : "Content-Type",
          "value" : "application/json"
        }, {
          "name" : "Authorization",
          "value" : "Bearer eyJ0eXAiOiJKV1QiLCJhbGciOiJIUzI1NiJ9.eyJ1bmlxdWVfbmFtZSI6ImFkbWluIiwicm9sZSI6InVzZXIiLCJzdWIiOiJhZG1pbiIsImlzcyI6IkNyb3BNZXRyaWNzIiwiYXVkIjoiYWxsIiwiZXhwIjoxNTU2MTQxOTgyLCJuYmYiOjE1NTYxMzgwODJ9.iIqy8mUSVZKCe2g8ny_JrPRtQlYH1uCpL9bAjwGBN10"
        }, {
          "name" : "Host",
          "value" : "localhost:10520"
        }, {
          "name" : "Accept",
          "value" : "text/html, image/gif, image/jpeg, *; q=.2, */*; q=.2"
        }, {
          "name" : "Proxy-Connection",
          "value" : "keep-alive"
        } ],
        "queryString" : [ ],
        "headersSize" : 504,
        "bodySize" : 0,
        "comment" : ""
      },
      "response" : {
        "status" : 401,
        "statusText" : "Unauthorized",
        "httpVersion" : "HTTP/1.1",
        "cookies" : [ {
          "name" : ".ASPROLES",
          "value" : "LH5xp_6p_hS5dHe8Nh66XSctSFlFhA3iCB49Z2dkZrUCtKiuLJP-44bZ0619q99bbJC2W7aWcSN2gAC5iPhNtAXieiO4eTAORBHwdP9q2lGT6KpuKPGLMO_1ImtB_tdnpPhNvqYWxstAhGUyrxImRhJ4dEzMqO_qhVKdt4cdM-d_dIBquBfdhyuNS0bqr4PYOVQC6cQVOkE_bPkWJ6WvhoK_UWHfkwtqZaqTtoWwyBwO1qhGPrp0dFkROwymL6vbuHknVezipbZe7ijhQIEXe8Svlx4XxbPA7fiM9WXxSGTOypltwEwMu9YtV13UflXn0HpeS85jWuzH5l_NlR5KesFLgayk5aRnekyo0s40L_Z91FINCYwGgLOR_XiRnPBYSDKCL3f43Ij6aSv9Cn-tdHtZOakccZUuxXUYB_GH2ZdrAlZPU3WGBb3itVZZ3c1NbJ8SXZ3Ha763suNjyIvuB8KrNyDHADI11N0RbkTDCUnQ-TwS0",
          "path" : "/",
          "httpOnly" : true,
          "secure" : false,
          "comment" : ""
        } ],
        "headers" : [ {
          "name" : "Cache-Control",
          "value" : "private"
        }, {
          "name" : "Content-Type",
          "value" : "application/json; charset=utf-8"
        }, {
          "name" : "Server",
          "value" : "Microsoft-IIS/10.0"
        }, {
          "name" : "Set-Cookie",
          "value" : ".ASPROLES=LH5xp_6p_hS5dHe8Nh66XSctSFlFhA3iCB49Z2dkZrUCtKiuLJP-44bZ0619q99bbJC2W7aWcSN2gAC5iPhNtAXieiO4eTAORBHwdP9q2lGT6KpuKPGLMO_1ImtB_tdnpPhNvqYWxstAhGUyrxImRhJ4dEzMqO_qhVKdt4cdM-d_dIBquBfdhyuNS0bqr4PYOVQC6cQVOkE_bPkWJ6WvhoK_UWHfkwtqZaqTtoWwyBwO1qhGPrp0dFkROwymL6vbuHknVezipbZe7ijhQIEXe8Svlx4XxbPA7fiM9WXxSGTOypltwEwMu9YtV13UflXn0HpeS85jWuzH5l_NlR5KesFLgayk5aRnekyo0s40L_Z91FINCYwGgLOR_XiRnPBYSDKCL3f43Ij6aSv9Cn-tdHtZOakccZUuxXUYB_GH2ZdrAlZPU3WGBb3itVZZ3c1NbJ8SXZ3Ha763suNjyIvuB8KrNyDHADI11N0RbkTDCUnQ-TwS0; path=/; HttpOnly"
        }, {
          "name" : "X-SourceFiles",
          "value" : "=?UTF-8?B?RDpcVmlydHVhbE9wdGltaXplci1SZWZhY3RvcmluZ1xDcm9wTWV0cmljcy5Wby5BcGlcQ3JvcE1ldHJpY3MuVm8uQXBpXGFwaVxtb2JpbGVcdjFcdXNlcg==?="
        }, {
          "name" : "X-Powered-By",
          "value" : "ASP.NET"
        }, {
          "name" : "Date",
          "value" : "Wed, 24 Apr 2019 20:34:42 GMT"
        }, {
          "name" : "Content-Length",
          "value" : "61"
        } ],
        "content" : {
          "size" : 61,
          "mimeType" : "application/json; charset=utf-8",
          "text" : "{\"message\":\"Authorization has been denied for this request.\"}",
          "comment" : ""
        },
        "redirectURL" : "",
        "headersSize" : 898,
        "bodySize" : 61,
        "comment" : ""
      },
      "cache" : { },
      "timings" : {
        "comment" : "",
        "send" : 0,
        "wait" : 20,
        "receive" : 1,
        "connect" : -1,
        "ssl" : -1,
        "dns" : -1,
        "blocked" : -1
      },
      "serverIPAddress" : "127.0.0.1",
      "comment" : "",
      "_katalonRequestInformation" : {
        "name" : "13",
        "testObjectId" : "Object Repository/VoGrow/User/User",
        "harId" : "cf27288b-8fc7-415b-8a19-7fee2415ab65"
      },
      "time" : 21
    } ],
    "comment" : ""
  }
}