{
  "log" : {
    "version" : "1.2",
    "creator" : {
      "name" : "BrowserMob Proxy",
      "version" : "2.1.5",
      "comment" : ""
    },
    "pages" : [ {
      "id" : "Page 0",
      "startedDateTime" : "2019-04-05T19:29:21.976Z",
      "title" : "Page 0",
      "pageTimings" : {
        "onLoad" : 20,
        "comment" : ""
      },
      "comment" : ""
    } ],
    "entries" : [ {
      "pageref" : "Page 0",
      "startedDateTime" : "2019-04-05T19:29:21.977Z",
      "request" : {
        "method" : "POST",
        "url" : "http://localhost:10520/WebAPI/api/mobile/v1/fields?",
        "httpVersion" : "HTTP/1.1",
        "cookies" : [ ],
        "headers" : [ {
          "name" : "User-Agent",
          "value" : "Katalon Studio"
        }, {
          "name" : "Content-Type",
          "value" : "application/json"
        }, {
          "name" : "Authorization",
          "value" : "Bearer eyJ0eXAiOiJKV1QiLCJhbGciOiJIUzI1NiJ9.eyJ1bmlxdWVfbmFtZSI6Implbm55Lm1hbGRvbmFkby50eDFAZ21haWwuY29tIiwicm9sZSI6InVzZXIiLCJzdWIiOiJqZW5ueS5tYWxkb25hZG8udHgxQGdtYWlsLmNvbSIsImlzcyI6IkNyb3BNZXRyaWNzIiwiYXVkIjoiYWxsIiwiZXhwIjoxNTU0NDk2NDYxLCJuYmYiOjE1NTQ0OTI1NjF9.CjAl4nH5NLXMcrgqfKHKFO4VAqwm9yI4zUiVsPJxMqs"
        }, {
          "name" : "Host",
          "value" : "localhost:10520"
        }, {
          "name" : "Accept",
          "value" : "text/html, image/gif, image/jpeg, *; q=.2, */*; q=.2"
        }, {
          "name" : "Proxy-Connection",
          "value" : "keep-alive"
        }, {
          "name" : "Content-Length",
          "value" : "400"
        } ],
        "queryString" : [ ],
        "postData" : {
          "mimeType" : "application/json",
          "text" : "{\"field\":{\"farm_id\":,\"name\":\"Field by agent not assigned\",\"boundary\":{\"boundaries\":[{\"boundary\":{\"coords\":[{\"x\":-101.49568751,\"y\":37.14976293},{\"x\":-101.50049403,\"y\":37.14647907},{\"x\":-101.50049403,\"y\":37.14264773},{\"x\":-101.49723246,\"y\":37.1411425},{\"x\":-101.49019435,\"y\":37.14223722},{\"x\":-101.48933604,\"y\":37.14620541},{\"x\":-101.49294093,\"y\":37.14866833},{\"x\":-101.49568751,\"y\":37.14976293}]}}]}}}",
          "comment" : ""
        },
        "headersSize" : 592,
        "bodySize" : 400,
        "comment" : ""
      },
      "response" : {
        "status" : 400,
        "statusText" : "Bad Request",
        "httpVersion" : "HTTP/1.1",
        "cookies" : [ {
          "name" : ".ASPROLES",
          "value" : "hQnPp2ICw8YTGin79scmNgUEOI-7QvWCACaOIRoDZFMaQVyF_3M02iwhcW_najnfjhHFK6nwiwB4d2taZivv-PJz13jk79qxu5xaVyWx56VB5fb2rsGumpKnhYBnYjYMu_PXruHQ_ItArUYL2RfCcCYQoO-dxtheioNCQEcEMSsbDJifAr0BJeLN_ZC3nXHN7BUtffhu_McSn7GQwaKRgRlmhfu74YpzNCrALX7zfbw3Tb95Tu47Tq8tHrQzEAGhwqyhXq6Yr-fbeIIbMDOBLyEF0LJiKiu-03iaJGpjuruzFoCkmUSqUMSVLnEM_nLmph6kkMDudGucKM6aYaEFSab5w5SyG0cYtC_ARW71Ow8mYmDCduK70-MXusRBQVW7DPLasWwPFEHtnD0hGalQAxlXl-0g6aS8f-wNC133aZiE_SPUCjNvvrNi_DdMpGOsXOqsGbIDVrWSb4BI-KahO0_SlSCMaD7llfu0TkqsgotNA1H-KcMEbTV6vZ-ZleXqrt_zT_vCGT3sOnIyzs_XHrUzgLw1",
          "path" : "/",
          "httpOnly" : true,
          "secure" : false,
          "comment" : ""
        } ],
        "headers" : [ {
          "name" : "Cache-Control",
          "value" : "private"
        }, {
          "name" : "Content-Type",
          "value" : "application/json; charset=utf-8"
        }, {
          "name" : "Server",
          "value" : "Microsoft-IIS/10.0"
        }, {
          "name" : "Set-Cookie",
          "value" : ".ASPROLES=hQnPp2ICw8YTGin79scmNgUEOI-7QvWCACaOIRoDZFMaQVyF_3M02iwhcW_najnfjhHFK6nwiwB4d2taZivv-PJz13jk79qxu5xaVyWx56VB5fb2rsGumpKnhYBnYjYMu_PXruHQ_ItArUYL2RfCcCYQoO-dxtheioNCQEcEMSsbDJifAr0BJeLN_ZC3nXHN7BUtffhu_McSn7GQwaKRgRlmhfu74YpzNCrALX7zfbw3Tb95Tu47Tq8tHrQzEAGhwqyhXq6Yr-fbeIIbMDOBLyEF0LJiKiu-03iaJGpjuruzFoCkmUSqUMSVLnEM_nLmph6kkMDudGucKM6aYaEFSab5w5SyG0cYtC_ARW71Ow8mYmDCduK70-MXusRBQVW7DPLasWwPFEHtnD0hGalQAxlXl-0g6aS8f-wNC133aZiE_SPUCjNvvrNi_DdMpGOsXOqsGbIDVrWSb4BI-KahO0_SlSCMaD7llfu0TkqsgotNA1H-KcMEbTV6vZ-ZleXqrt_zT_vCGT3sOnIyzs_XHrUzgLw1; path=/; HttpOnly"
        }, {
          "name" : "X-SourceFiles",
          "value" : "=?UTF-8?B?RDpcVmlydHVhbE9wdGltaXplci1SZWZhY3RvcmluZ1xDcm9wTWV0cmljcy5Wby5BcGlcQ3JvcE1ldHJpY3MuVm8uQXBpXGFwaVxtb2JpbGVcdjFcZmllbGRz?="
        }, {
          "name" : "X-Powered-By",
          "value" : "ASP.NET"
        }, {
          "name" : "Date",
          "value" : "Fri, 05 Apr 2019 19:29:21 GMT"
        }, {
          "name" : "Content-Length",
          "value" : "37"
        } ],
        "content" : {
          "size" : 37,
          "mimeType" : "application/json; charset=utf-8",
          "text" : "{\"message\":\"The request is invalid.\"}",
          "comment" : ""
        },
        "redirectURL" : "",
        "headersSize" : 940,
        "bodySize" : 37,
        "comment" : ""
      },
      "cache" : { },
      "timings" : {
        "comment" : "",
        "ssl" : -1,
        "connect" : -1,
        "blocked" : -1,
        "send" : 0,
        "dns" : -1,
        "receive" : 0,
        "wait" : 15
      },
      "serverIPAddress" : "127.0.0.1",
      "comment" : "",
      "_katalonRequestInformation" : {
        "name" : "13",
        "testObjectId" : "Object Repository/VoGrow/Field/FieldPost",
        "harId" : "4432cb0e-4616-40c3-8f14-a50a4016591b"
      },
      "time" : 16
    } ],
    "comment" : ""
  }
}