{
  "log" : {
    "version" : "1.2",
    "creator" : {
      "name" : "BrowserMob Proxy",
      "version" : "2.1.5",
      "comment" : ""
    },
    "pages" : [ {
      "id" : "Page 0",
      "startedDateTime" : "2019-03-29T13:16:23.892Z",
      "title" : "Page 0",
      "pageTimings" : {
        "onLoad" : 2400,
        "comment" : ""
      },
      "comment" : ""
    } ],
    "entries" : [ {
      "pageref" : "Page 0",
      "startedDateTime" : "2019-03-29T13:16:23.893Z",
      "request" : {
        "method" : "POST",
        "url" : "http://localhost:10520/WebAPI/api/admin/v1/users/?",
        "httpVersion" : "HTTP/1.1",
        "cookies" : [ ],
        "headers" : [ {
          "name" : "User-Agent",
          "value" : "Katalon Studio"
        }, {
          "name" : "Content-Type",
          "value" : "application/x-www-form-urlencoded"
        }, {
          "name" : "Authorization",
          "value" : "Bearer eyJ0eXAiOiJKV1QiLCJhbGciOiJIUzI1NiJ9.eyJ1bmlxdWVfbmFtZSI6ImFkbWluIiwicm9sZSI6InVzZXIiLCJzdWIiOiJhZG1pbiIsImlzcyI6IkNyb3BNZXRyaWNzIiwiYXVkIjoiYWxsIiwiZXhwIjoxNTUzODY5MjgzLCJuYmYiOjE1NTM4NjUzODN9.GFMMEMqDzyOKJPdmzBVD7gXglL5B5YSXXazVjtLso_M"
        }, {
          "name" : "Host",
          "value" : "localhost:10520"
        }, {
          "name" : "Accept",
          "value" : "text/html, image/gif, image/jpeg, *; q=.2, */*; q=.2"
        }, {
          "name" : "Proxy-Connection",
          "value" : "keep-alive"
        }, {
          "name" : "Content-Length",
          "value" : "315"
        } ],
        "queryString" : [ ],
        "postData" : {
          "mimeType" : "application/x-www-form-urlencoded",
          "params" : [ {
            "name" : "password",
            "value" : "cropmetrics",
            "comment" : ""
          }, {
            "name" : "email",
            "value" : "cropmetricsvo.pass6chars@gmail.com",
            "comment" : ""
          }, {
            "name" : "fullname",
            "value" : "test validation",
            "comment" : ""
          }, {
            "name" : "phone",
            "value" : "123",
            "comment" : ""
          }, {
            "name" : "dealer",
            "value" : "dealer test validation",
            "comment" : ""
          }, {
            "name" : "addressLine1",
            "value" : "address line 1 test validation",
            "comment" : ""
          }, {
            "name" : "addressLine2",
            "value" : "address line 1 test validation",
            "comment" : ""
          }, {
            "name" : "town",
            "value" : "townValidation",
            "comment" : ""
          }, {
            "name" : "state",
            "value" : "stateValidation",
            "comment" : ""
          }, {
            "name" : "zip",
            "value" : "zipValidation",
            "comment" : ""
          }, {
            "name" : "country",
            "value" : "countryValidation",
            "comment" : ""
          }, {
            "name" : "roles",
            "value" : "Client",
            "comment" : ""
          } ],
          "comment" : ""
        },
        "headersSize" : 544,
        "bodySize" : 315,
        "comment" : ""
      },
      "response" : {
        "status" : 400,
        "statusText" : "Bad Request",
        "httpVersion" : "HTTP/1.1",
        "cookies" : [ {
          "name" : ".ASPROLES",
          "value" : "bBknPHhQy4d2K8Io_637yFbsu49cgRbqicgoG_LIay-14FOUXAm8d0L_my-bvy7Qid9ZB1pJ0pTYisx7LOn8N8OLRxIFDV5CyoEH_0d4eEZtBb1ggMcH2U9SKVcJVMeXd95RIY-rJYUnVdnzVddycXkXxFNNuxhJudoL-Ynqs2wgJtkVxYvVv2OkxL0zPgNgnorv8auqrkgjqCACqV9HZ3s4ftkFi2GZBr2Wdupm9W4hZTH5gFm-4bnvTLO5uQeV-R9NSDMwHlnE0dm70CcVlMi-R670SL-Jrn7hJ5EI7zPw4ICrdAFk_p92pQVoqadB5YaH8BlPHU9QVJA14DxWwpTjP-kMTn8Foj9B1EVuEJoBq0i3Nu9DgSHLUMzOmjtNKKxaYqw0tVLgCa20G4s_qm_SZc_WLv2Li85dm2X7QPTkEqr_xncsg-vqEYJz3kHky52KGNk-ygG_-9xJPb7L_q5s9Ttc2CC5fOw8YRJtLsCY5AjI0",
          "path" : "/",
          "httpOnly" : true,
          "secure" : false,
          "comment" : ""
        } ],
        "headers" : [ {
          "name" : "Cache-Control",
          "value" : "private"
        }, {
          "name" : "Content-Type",
          "value" : "application/json; charset=utf-8"
        }, {
          "name" : "Server",
          "value" : "Microsoft-IIS/10.0"
        }, {
          "name" : "Set-Cookie",
          "value" : ".ASPROLES=bBknPHhQy4d2K8Io_637yFbsu49cgRbqicgoG_LIay-14FOUXAm8d0L_my-bvy7Qid9ZB1pJ0pTYisx7LOn8N8OLRxIFDV5CyoEH_0d4eEZtBb1ggMcH2U9SKVcJVMeXd95RIY-rJYUnVdnzVddycXkXxFNNuxhJudoL-Ynqs2wgJtkVxYvVv2OkxL0zPgNgnorv8auqrkgjqCACqV9HZ3s4ftkFi2GZBr2Wdupm9W4hZTH5gFm-4bnvTLO5uQeV-R9NSDMwHlnE0dm70CcVlMi-R670SL-Jrn7hJ5EI7zPw4ICrdAFk_p92pQVoqadB5YaH8BlPHU9QVJA14DxWwpTjP-kMTn8Foj9B1EVuEJoBq0i3Nu9DgSHLUMzOmjtNKKxaYqw0tVLgCa20G4s_qm_SZc_WLv2Li85dm2X7QPTkEqr_xncsg-vqEYJz3kHky52KGNk-ygG_-9xJPb7L_q5s9Ttc2CC5fOw8YRJtLsCY5AjI0; path=/; HttpOnly"
        }, {
          "name" : "X-SourceFiles",
          "value" : "=?UTF-8?B?RDpcVmlydHVhbE9wdGltaXplci1SZWZhY3RvcmluZ1xDcm9wTWV0cmljcy5Wby5BcGlcQ3JvcE1ldHJpY3MuVm8uQXBpXGFwaVxhZG1pblx2MVx1c2Vyc1w=?="
        }, {
          "name" : "X-Powered-By",
          "value" : "ASP.NET"
        }, {
          "name" : "Date",
          "value" : "Fri, 29 Mar 2019 13:16:26 GMT"
        }, {
          "name" : "Content-Length",
          "value" : "71"
        } ],
        "content" : {
          "size" : 71,
          "mimeType" : "application/json; charset=utf-8",
          "text" : "{\"message\":\"Name cropmetricsvo.pass6chars@gmail.com is already taken.\"}",
          "comment" : ""
        },
        "redirectURL" : "",
        "headersSize" : 897,
        "bodySize" : 71,
        "comment" : ""
      },
      "cache" : { },
      "timings" : {
        "comment" : "",
        "ssl" : -1,
        "receive" : 0,
        "wait" : 2395,
        "send" : 0,
        "connect" : -1,
        "dns" : -1,
        "blocked" : -1
      },
      "serverIPAddress" : "127.0.0.1",
      "comment" : "",
      "_katalonRequestInformation" : {
        "name" : "47",
        "testObjectId" : "Object Repository/VoPro/Account/api_admin_v1_users",
        "harId" : "0c3686f6-b402-47bd-9a86-88963d438b03"
      },
      "time" : 2396
    } ],
    "comment" : ""
  }
}