{
  "log" : {
    "version" : "1.2",
    "creator" : {
      "name" : "BrowserMob Proxy",
      "version" : "2.1.5",
      "comment" : ""
    },
    "pages" : [ {
      "id" : "Page 0",
      "startedDateTime" : "2019-04-01T13:34:08.986Z",
      "title" : "Page 0",
      "pageTimings" : {
        "onLoad" : 6716,
        "comment" : ""
      },
      "comment" : ""
    } ],
    "entries" : [ {
      "pageref" : "Page 0",
      "startedDateTime" : "2019-04-01T13:34:08.988Z",
      "request" : {
        "method" : "POST",
        "url" : "http://localhost:10520/WebAPI/api/admin/v1/users/?",
        "httpVersion" : "HTTP/1.1",
        "cookies" : [ ],
        "headers" : [ {
          "name" : "User-Agent",
          "value" : "Katalon Studio"
        }, {
          "name" : "Content-Type",
          "value" : "application/x-www-form-urlencoded"
        }, {
          "name" : "Authorization",
          "value" : "Bearer eyJ0eXAiOiJKV1QiLCJhbGciOiJIUzI1NiJ9.eyJ1bmlxdWVfbmFtZSI6ImFkbWluIiwicm9sZSI6InVzZXIiLCJzdWIiOiJhZG1pbiIsImlzcyI6IkNyb3BNZXRyaWNzIiwiYXVkIjoiYWxsIiwiZXhwIjoxNTU0MTI5NTQ4LCJuYmYiOjE1NTQxMjU2NDh9.tv3T37knUFqW2XmzFx1kRQD2jvQftOQyxOnxp7xL3S0"
        }, {
          "name" : "Host",
          "value" : "localhost:10520"
        }, {
          "name" : "Accept",
          "value" : "text/html, image/gif, image/jpeg, *; q=.2, */*; q=.2"
        }, {
          "name" : "Proxy-Connection",
          "value" : "keep-alive"
        }, {
          "name" : "Content-Length",
          "value" : "172"
        } ],
        "queryString" : [ ],
        "postData" : {
          "mimeType" : "application/x-www-form-urlencoded",
          "params" : [ {
            "name" : "password",
            "value" : "cropmetrics",
            "comment" : ""
          }, {
            "name" : "email",
            "value" : "jenny.maldonado.tx@gmail.com",
            "comment" : ""
          }, {
            "name" : "fullname",
            "value" : "account status",
            "comment" : ""
          }, {
            "name" : "phone",
            "value" : "x",
            "comment" : ""
          }, {
            "name" : "dealer",
            "value" : "x",
            "comment" : ""
          }, {
            "name" : "addressLine1",
            "value" : "x",
            "comment" : ""
          }, {
            "name" : "addressLine2",
            "value" : "x",
            "comment" : ""
          }, {
            "name" : "town",
            "value" : "x",
            "comment" : ""
          }, {
            "name" : "state",
            "value" : "x",
            "comment" : ""
          }, {
            "name" : "zip",
            "value" : "x",
            "comment" : ""
          }, {
            "name" : "country",
            "value" : "x",
            "comment" : ""
          }, {
            "name" : "roles",
            "value" : "Client",
            "comment" : ""
          } ],
          "comment" : ""
        },
        "headersSize" : 544,
        "bodySize" : 172,
        "comment" : ""
      },
      "response" : {
        "status" : 200,
        "statusText" : "OK",
        "httpVersion" : "HTTP/1.1",
        "cookies" : [ {
          "name" : ".ASPROLES",
          "value" : "FEVNHLT9Nyx-Q576JNq5hw7EVuVCi82sRo_RsdqyfphpeUewteCWxK0EUUTg-3g1NKpc9WzRnokORhWyLnHDyaeOiHd96ASyBp2yX0D2qI4pGYPxkRzLfYkRze24-3EB-uJtoDvv3vEkIhyiy75cN222Uo_s1BTcC-c85ikYeqhmNOjVhC_xBWFdud4JPv6YFwo4ojllrONZSwzbEYsjpQwul6xw25Gg-MhHjQGqF5-U7WgP0HFS2D75S5TWWZQsqyPPxaYc3lYD3bii-YcT0jcSj1VMYmNhcEM1xHZzXNpjBb_KVDm3I_EsAelEGv46CY-UcwcJ2RshJznAk6e_4edGfnMe8O1GUClVDh6CzkpDKCX2a-4OCknmM76ZyZeuuLkWjAlOyVOoy1EIpDDjkNeT7G8VjRMCJvondYO7Vdt47b4-QsF4XwjKRAuSg1geempb6Zr6Z57guwqg4f3ykczEoUw54ap7gUrUzJUqH5X5Krnz0",
          "path" : "/",
          "httpOnly" : true,
          "secure" : false,
          "comment" : ""
        } ],
        "headers" : [ {
          "name" : "Cache-Control",
          "value" : "private"
        }, {
          "name" : "Content-Type",
          "value" : "application/json; charset=utf-8"
        }, {
          "name" : "Server",
          "value" : "Microsoft-IIS/10.0"
        }, {
          "name" : "Set-Cookie",
          "value" : ".ASPROLES=FEVNHLT9Nyx-Q576JNq5hw7EVuVCi82sRo_RsdqyfphpeUewteCWxK0EUUTg-3g1NKpc9WzRnokORhWyLnHDyaeOiHd96ASyBp2yX0D2qI4pGYPxkRzLfYkRze24-3EB-uJtoDvv3vEkIhyiy75cN222Uo_s1BTcC-c85ikYeqhmNOjVhC_xBWFdud4JPv6YFwo4ojllrONZSwzbEYsjpQwul6xw25Gg-MhHjQGqF5-U7WgP0HFS2D75S5TWWZQsqyPPxaYc3lYD3bii-YcT0jcSj1VMYmNhcEM1xHZzXNpjBb_KVDm3I_EsAelEGv46CY-UcwcJ2RshJznAk6e_4edGfnMe8O1GUClVDh6CzkpDKCX2a-4OCknmM76ZyZeuuLkWjAlOyVOoy1EIpDDjkNeT7G8VjRMCJvondYO7Vdt47b4-QsF4XwjKRAuSg1geempb6Zr6Z57guwqg4f3ykczEoUw54ap7gUrUzJUqH5X5Krnz0; path=/; HttpOnly"
        }, {
          "name" : "X-SourceFiles",
          "value" : "=?UTF-8?B?RDpcVmlydHVhbE9wdGltaXplci1SZWZhY3RvcmluZ1xDcm9wTWV0cmljcy5Wby5BcGlcQ3JvcE1ldHJpY3MuVm8uQXBpXGFwaVxhZG1pblx2MVx1c2Vyc1w=?="
        }, {
          "name" : "X-Powered-By",
          "value" : "ASP.NET"
        }, {
          "name" : "Date",
          "value" : "Mon, 01 Apr 2019 13:34:15 GMT"
        }, {
          "name" : "Content-Length",
          "value" : "8"
        } ],
        "content" : {
          "size" : 8,
          "mimeType" : "application/json; charset=utf-8",
          "text" : "{\"id\":2}",
          "comment" : ""
        },
        "redirectURL" : "",
        "headersSize" : 887,
        "bodySize" : 8,
        "comment" : ""
      },
      "cache" : { },
      "timings" : {
        "comment" : "",
        "ssl" : -1,
        "wait" : 6674,
        "receive" : 32,
        "send" : 4,
        "dns" : -1,
        "blocked" : -1,
        "connect" : -1
      },
      "serverIPAddress" : "127.0.0.1",
      "comment" : "",
      "_katalonRequestInformation" : {
        "name" : "1",
        "testObjectId" : "Object Repository/VoPro/Account/api_admin_v1_users",
        "harId" : "9c1eb0b2-52d5-4df3-bdf2-5b0ecdef20e4"
      },
      "time" : 6712
    } ],
    "comment" : ""
  }
}