{
  "log" : {
    "version" : "1.2",
    "creator" : {
      "name" : "BrowserMob Proxy",
      "version" : "2.1.5",
      "comment" : ""
    },
    "pages" : [ {
      "id" : "Page 0",
      "startedDateTime" : "2019-03-28T19:25:04.942Z",
      "title" : "Page 0",
      "pageTimings" : {
        "onLoad" : 109,
        "comment" : ""
      },
      "comment" : ""
    } ],
    "entries" : [ {
      "pageref" : "Page 0",
      "startedDateTime" : "2019-03-28T19:25:04.944Z",
      "request" : {
        "method" : "POST",
        "url" : "http://localhost:10520/WebAPI/api/admin/v1/users/?",
        "httpVersion" : "HTTP/1.1",
        "cookies" : [ ],
        "headers" : [ {
          "name" : "User-Agent",
          "value" : "Katalon Studio"
        }, {
          "name" : "Content-Type",
          "value" : "application/x-www-form-urlencoded"
        }, {
          "name" : "Authorization",
          "value" : "Bearer eyJ0eXAiOiJKV1QiLCJhbGciOiJIUzI1NiJ9.eyJ1bmlxdWVfbmFtZSI6ImFkbWluIiwicm9sZSI6InVzZXIiLCJzdWIiOiJhZG1pbiIsImlzcyI6IkNyb3BNZXRyaWNzIiwiYXVkIjoiYWxsIiwiZXhwIjoxNTUzODA1MDA0LCJuYmYiOjE1NTM4MDExMDR9.ZCh37EGydqYKnH-wA6I44QIukoX38tYxnMeWlAdUB_w"
        }, {
          "name" : "Host",
          "value" : "localhost:10520"
        }, {
          "name" : "Accept",
          "value" : "text/html, image/gif, image/jpeg, *; q=.2, */*; q=.2"
        }, {
          "name" : "Proxy-Connection",
          "value" : "keep-alive"
        }, {
          "name" : "Content-Length",
          "value" : "271"
        } ],
        "queryString" : [ ],
        "postData" : {
          "mimeType" : "application/x-www-form-urlencoded",
          "params" : [ {
            "name" : "password",
            "value" : "cropmetrics",
            "comment" : ""
          }, {
            "name" : "email",
            "value" : "cropmetricsvo.roleinvalid@gmail.com",
            "comment" : ""
          }, {
            "name" : "fullname",
            "value" : "test validation",
            "comment" : ""
          }, {
            "name" : "phone",
            "value" : "123",
            "comment" : ""
          }, {
            "name" : "dealer",
            "value" : "x",
            "comment" : ""
          }, {
            "name" : "addressLine1",
            "value" : "address line 1 test validation",
            "comment" : ""
          }, {
            "name" : "addressLine2",
            "value" : "address line 2 test validation",
            "comment" : ""
          }, {
            "name" : "town",
            "value" : "townValidation",
            "comment" : ""
          }, {
            "name" : "state",
            "value" : "stateValidation",
            "comment" : ""
          }, {
            "name" : "zip",
            "value" : "xx",
            "comment" : ""
          }, {
            "name" : "country",
            "value" : "xx",
            "comment" : ""
          }, {
            "name" : "roles",
            "value" : "Clientes",
            "comment" : ""
          } ],
          "comment" : ""
        },
        "headersSize" : 544,
        "bodySize" : 271,
        "comment" : ""
      },
      "response" : {
        "status" : 400,
        "statusText" : "Bad Request",
        "httpVersion" : "HTTP/1.1",
        "cookies" : [ {
          "name" : ".ASPROLES",
          "value" : "xxImKOqUZaDW8LfELT_Jfi46bq-QXkWjEUIXtyg9IugT3_JIa5EQ-XM15nvPAGv7sqY4uUhf6eXvIOod1zRJxFObpHx7DoFkoeAS9ME85DFaiYbXeFwCK8chCQPH5VSxkUqvNOFMoM6jRzP0RdATImY-1VrQYdR83UCQvv6B7QBlNEKdps3Fko8n5iOW_WEnqNNTtfu_cu38RVyxvKxNoPMoaubmTNLVaBp1zgcatlE6cahDGuPyMNTnLoRarTOthNHo6EMp5ddGZkpNJe3PD0miFZb6LNrqURjuygJO4vlQDUNe2g6nFBmq-a-7yww347-qlZoEQqcEY1VlAS_E90UjMt5ZpnizfrnsaohBRbfeMZ_lJsdFLooT2e35y4r11fKebbsQbS4TgpSySb8Q59YS8xbdu-V4korKe3QgEyU9HOu16jW9fbXEUNsmivZyXPQso5Xunw48EUaaNU3UCRL_46EJYPwpytOhYnbEziURgeRv0",
          "path" : "/",
          "httpOnly" : true,
          "secure" : false,
          "comment" : ""
        } ],
        "headers" : [ {
          "name" : "Cache-Control",
          "value" : "private"
        }, {
          "name" : "Content-Type",
          "value" : "application/json; charset=utf-8"
        }, {
          "name" : "Server",
          "value" : "Microsoft-IIS/10.0"
        }, {
          "name" : "Set-Cookie",
          "value" : ".ASPROLES=xxImKOqUZaDW8LfELT_Jfi46bq-QXkWjEUIXtyg9IugT3_JIa5EQ-XM15nvPAGv7sqY4uUhf6eXvIOod1zRJxFObpHx7DoFkoeAS9ME85DFaiYbXeFwCK8chCQPH5VSxkUqvNOFMoM6jRzP0RdATImY-1VrQYdR83UCQvv6B7QBlNEKdps3Fko8n5iOW_WEnqNNTtfu_cu38RVyxvKxNoPMoaubmTNLVaBp1zgcatlE6cahDGuPyMNTnLoRarTOthNHo6EMp5ddGZkpNJe3PD0miFZb6LNrqURjuygJO4vlQDUNe2g6nFBmq-a-7yww347-qlZoEQqcEY1VlAS_E90UjMt5ZpnizfrnsaohBRbfeMZ_lJsdFLooT2e35y4r11fKebbsQbS4TgpSySb8Q59YS8xbdu-V4korKe3QgEyU9HOu16jW9fbXEUNsmivZyXPQso5Xunw48EUaaNU3UCRL_46EJYPwpytOhYnbEziURgeRv0; path=/; HttpOnly"
        }, {
          "name" : "X-SourceFiles",
          "value" : "=?UTF-8?B?RDpcVmlydHVhbE9wdGltaXplci1SZWZhY3RvcmluZ1xDcm9wTWV0cmljcy5Wby5BcGlcQ3JvcE1ldHJpY3MuVm8uQXBpXGFwaVxhZG1pblx2MVx1c2Vyc1w=?="
        }, {
          "name" : "X-Powered-By",
          "value" : "ASP.NET"
        }, {
          "name" : "Date",
          "value" : "Thu, 28 Mar 2019 19:25:04 GMT"
        }, {
          "name" : "Content-Length",
          "value" : "93"
        } ],
        "content" : {
          "size" : 93,
          "mimeType" : "application/json; charset=utf-8",
          "text" : "{\"message\":\"The request is invalid. The role  Clientes requested to assign is not a valid..\"}",
          "comment" : ""
        },
        "redirectURL" : "",
        "headersSize" : 897,
        "bodySize" : 93,
        "comment" : ""
      },
      "cache" : { },
      "timings" : {
        "comment" : "",
        "ssl" : -1,
        "wait" : 104,
        "receive" : 0,
        "send" : 0,
        "connect" : -1,
        "blocked" : -1,
        "dns" : -1
      },
      "serverIPAddress" : "127.0.0.1",
      "comment" : "",
      "_katalonRequestInformation" : {
        "name" : "95",
        "testObjectId" : "Object Repository/VoPro/Account/api_admin_v1_users",
        "harId" : "260eb021-b83d-455f-ba68-6b5316a6fdd4"
      },
      "time" : 105
    } ],
    "comment" : ""
  }
}