{
  "log" : {
    "version" : "1.2",
    "creator" : {
      "name" : "BrowserMob Proxy",
      "version" : "2.1.5",
      "comment" : ""
    },
    "pages" : [ {
      "id" : "Page 0",
      "startedDateTime" : "2019-03-29T14:36:58.248Z",
      "title" : "Page 0",
      "pageTimings" : {
        "onLoad" : 1508,
        "comment" : ""
      },
      "comment" : ""
    } ],
    "entries" : [ {
      "pageref" : "Page 0",
      "startedDateTime" : "2019-03-29T14:36:58.250Z",
      "request" : {
        "method" : "PUT",
        "url" : "http://localhost:10520/WebAPI/api/admin/v1/users/23?",
        "httpVersion" : "HTTP/1.1",
        "cookies" : [ ],
        "headers" : [ {
          "name" : "User-Agent",
          "value" : "Katalon Studio"
        }, {
          "name" : "Content-Type",
          "value" : "application/x-www-form-urlencoded"
        }, {
          "name" : "Authorization",
          "value" : "Bearer eyJ0eXAiOiJKV1QiLCJhbGciOiJIUzI1NiJ9.eyJ1bmlxdWVfbmFtZSI6ImFkbWluIiwicm9sZSI6InVzZXIiLCJzdWIiOiJhZG1pbiIsImlzcyI6IkNyb3BNZXRyaWNzIiwiYXVkIjoiYWxsIiwiZXhwIjoxNTUzODc0MTE4LCJuYmYiOjE1NTM4NzAyMTh9.rYpELaaiRcyLQqWiISYpPeqqDmPXEBNlHS4SFV1fyyk"
        }, {
          "name" : "Host",
          "value" : "localhost:10520"
        }, {
          "name" : "Accept",
          "value" : "text/html, image/gif, image/jpeg, *; q=.2, */*; q=.2"
        }, {
          "name" : "Proxy-Connection",
          "value" : "keep-alive"
        }, {
          "name" : "Content-Length",
          "value" : "290"
        } ],
        "queryString" : [ ],
        "postData" : {
          "mimeType" : "application/x-www-form-urlencoded",
          "params" : [ {
            "name" : "password",
            "value" : "cropmetrics",
            "comment" : ""
          }, {
            "name" : "email",
            "value" : "cropmetricsvo.addressline1symbols@gmail.com",
            "comment" : ""
          }, {
            "name" : "fullname",
            "value" : "x",
            "comment" : ""
          }, {
            "name" : "phone",
            "value" : "1",
            "comment" : ""
          }, {
            "name" : "dealer",
            "value" : "xx",
            "comment" : ""
          }, {
            "name" : "addressLine1",
            "value" : "!!!!!",
            "comment" : ""
          }, {
            "name" : "addressLine2",
            "value" : "address line 2 test validation",
            "comment" : ""
          }, {
            "name" : "town",
            "value" : "townValidation",
            "comment" : ""
          }, {
            "name" : "state",
            "value" : "stateValidation",
            "comment" : ""
          }, {
            "name" : "zip",
            "value" : "zipValidation",
            "comment" : ""
          }, {
            "name" : "country",
            "value" : "countryValidation",
            "comment" : ""
          }, {
            "name" : "roles",
            "value" : "Client",
            "comment" : ""
          }, {
            "name" : "userProfileId",
            "value" : "23",
            "comment" : ""
          } ],
          "comment" : ""
        },
        "headersSize" : 545,
        "bodySize" : 290,
        "comment" : ""
      },
      "response" : {
        "status" : 200,
        "statusText" : "OK",
        "httpVersion" : "HTTP/1.1",
        "cookies" : [ {
          "name" : ".ASPROLES",
          "value" : "ony6pZ8slAbNeEIiAK9ChUB-xvDQ8azBO2nDGrxZ3sRgFsdHbb7q6DMXzjOgyy45Fwkqzx-3vqGmDozfBB4Nv0dMGFoH7amf1j4dvh6Z9v1pz-WuZT4RL66ZFNo-YRA3AOJ-AFS5aSVPgnb6IdEYohW5PnI55pgO1mzTK4CM7X2k2HC88eHuHWxFFEEpc8Q4gZPKXxNm9RiaLK44b79Ge5CxMObwf6smerfs0KGke0AYExzAPU6kVO5SFTw2QgGCVWPkoYXqmcUsR0mqnMC_kGghg5UH7H3C6ahQgHWErv-d4koIHIWmb0wFxMhT3FX59QItv83snSAxvTA3KaHaSqU2UQjDTXW4jTjfZwTJZcnGUVs7kBZauUTUTVwbq5_WHXUI030HoaRYebOSEtRkn4-taOPgfpQ0etzS83tT1VSQYfQs2LNVXF5NUEvZ64CaEyZXY-IQaHy-K2XfnHyGQxRAH77SGwcygfuRm89eUNiEx_km0",
          "path" : "/",
          "httpOnly" : true,
          "secure" : false,
          "comment" : ""
        } ],
        "headers" : [ {
          "name" : "Cache-Control",
          "value" : "private"
        }, {
          "name" : "Server",
          "value" : "Microsoft-IIS/10.0"
        }, {
          "name" : "Set-Cookie",
          "value" : ".ASPROLES=ony6pZ8slAbNeEIiAK9ChUB-xvDQ8azBO2nDGrxZ3sRgFsdHbb7q6DMXzjOgyy45Fwkqzx-3vqGmDozfBB4Nv0dMGFoH7amf1j4dvh6Z9v1pz-WuZT4RL66ZFNo-YRA3AOJ-AFS5aSVPgnb6IdEYohW5PnI55pgO1mzTK4CM7X2k2HC88eHuHWxFFEEpc8Q4gZPKXxNm9RiaLK44b79Ge5CxMObwf6smerfs0KGke0AYExzAPU6kVO5SFTw2QgGCVWPkoYXqmcUsR0mqnMC_kGghg5UH7H3C6ahQgHWErv-d4koIHIWmb0wFxMhT3FX59QItv83snSAxvTA3KaHaSqU2UQjDTXW4jTjfZwTJZcnGUVs7kBZauUTUTVwbq5_WHXUI030HoaRYebOSEtRkn4-taOPgfpQ0etzS83tT1VSQYfQs2LNVXF5NUEvZ64CaEyZXY-IQaHy-K2XfnHyGQxRAH77SGwcygfuRm89eUNiEx_km0; path=/; HttpOnly"
        }, {
          "name" : "X-SourceFiles",
          "value" : "=?UTF-8?B?RDpcVmlydHVhbE9wdGltaXplci1SZWZhY3RvcmluZ1xDcm9wTWV0cmljcy5Wby5BcGlcQ3JvcE1ldHJpY3MuVm8uQXBpXGFwaVxhZG1pblx2MVx1c2Vyc1wyMw==?="
        }, {
          "name" : "X-Powered-By",
          "value" : "ASP.NET"
        }, {
          "name" : "Date",
          "value" : "Fri, 29 Mar 2019 14:36:59 GMT"
        }, {
          "name" : "Content-Length",
          "value" : "0"
        } ],
        "content" : {
          "size" : 0,
          "mimeType" : "",
          "text" : "",
          "encoding" : "base64",
          "comment" : ""
        },
        "redirectURL" : "",
        "headersSize" : 844,
        "bodySize" : 0,
        "comment" : ""
      },
      "cache" : { },
      "timings" : {
        "comment" : "",
        "ssl" : -1,
        "send" : 0,
        "connect" : -1,
        "blocked" : -1,
        "dns" : -1,
        "wait" : 1503,
        "receive" : 0
      },
      "serverIPAddress" : "127.0.0.1",
      "comment" : "",
      "_katalonRequestInformation" : {
        "name" : "35",
        "testObjectId" : "Object Repository/VoPro/Account/api_admin_v1_users_userprofileid",
        "harId" : "a157ebc0-7a31-48fd-9086-6992cf5ff7c4"
      },
      "time" : 1504
    } ],
    "comment" : ""
  }
}