{
  "log" : {
    "version" : "1.2",
    "creator" : {
      "name" : "BrowserMob Proxy",
      "version" : "2.1.5",
      "comment" : ""
    },
    "pages" : [ {
      "id" : "Page 0",
      "startedDateTime" : "2019-03-29T21:44:34.605Z",
      "title" : "Page 0",
      "pageTimings" : {
        "onLoad" : 1839,
        "comment" : ""
      },
      "comment" : ""
    } ],
    "entries" : [ {
      "pageref" : "Page 0",
      "startedDateTime" : "2019-03-29T21:44:34.606Z",
      "request" : {
        "method" : "POST",
        "url" : "http://localhost:10520/WebAPI/api/admin/v1/users/?",
        "httpVersion" : "HTTP/1.1",
        "cookies" : [ ],
        "headers" : [ {
          "name" : "User-Agent",
          "value" : "Katalon Studio"
        }, {
          "name" : "Content-Type",
          "value" : "application/x-www-form-urlencoded"
        }, {
          "name" : "Authorization",
          "value" : "Bearer eyJ0eXAiOiJKV1QiLCJhbGciOiJIUzI1NiJ9.eyJ1bmlxdWVfbmFtZSI6ImFkbWluIiwicm9sZSI6InVzZXIiLCJzdWIiOiJhZG1pbiIsImlzcyI6IkNyb3BNZXRyaWNzIiwiYXVkIjoiYWxsIiwiZXhwIjoxNTUzODk5Nzc0LCJuYmYiOjE1NTM4OTU4NzR9.ZorMK_5ZWNu469iYX1wxcdc9GVSx2vZZDHFovsBf1fQ"
        }, {
          "name" : "Host",
          "value" : "localhost:10520"
        }, {
          "name" : "Accept",
          "value" : "text/html, image/gif, image/jpeg, *; q=.2, */*; q=.2"
        }, {
          "name" : "Proxy-Connection",
          "value" : "keep-alive"
        }, {
          "name" : "Content-Length",
          "value" : "326"
        } ],
        "queryString" : [ ],
        "postData" : {
          "mimeType" : "application/x-www-form-urlencoded",
          "params" : [ {
            "name" : "password",
            "value" : "cropmetrics",
            "comment" : ""
          }, {
            "name" : "email",
            "value" : "cropmetricsvo.phone.space@gmail.com",
            "comment" : ""
          }, {
            "name" : "fullname",
            "value" : "test validation",
            "comment" : ""
          }, {
            "name" : "phone",
            "value" : "one five nine",
            "comment" : ""
          }, {
            "name" : "dealer",
            "value" : "dealer test validation",
            "comment" : ""
          }, {
            "name" : "addressLine1",
            "value" : "address line 1 test validation",
            "comment" : ""
          }, {
            "name" : "addressLine2",
            "value" : "address line 1 test validation",
            "comment" : ""
          }, {
            "name" : "town",
            "value" : "townValidation",
            "comment" : ""
          }, {
            "name" : "state",
            "value" : "stateValidation",
            "comment" : ""
          }, {
            "name" : "zip",
            "value" : "zipValidation",
            "comment" : ""
          }, {
            "name" : "country",
            "value" : "countryValidation",
            "comment" : ""
          }, {
            "name" : "roles",
            "value" : "Client",
            "comment" : ""
          } ],
          "comment" : ""
        },
        "headersSize" : 544,
        "bodySize" : 326,
        "comment" : ""
      },
      "response" : {
        "status" : 200,
        "statusText" : "OK",
        "httpVersion" : "HTTP/1.1",
        "cookies" : [ {
          "name" : ".ASPROLES",
          "value" : "mX6_M5FMuj-8TtjOpHTsZ3-sfg1gqZVqx3nPg1WnT6Ows9DBeRgOX6cfQBw_ZQmShVSnU5ADtU9BFSe8HQtY2Llpdcuu3wDJSqyWN2EaW45s-mk9MDdn3IKx3i2hI6mqQZ-isjhSwUXuvi_wYtnGbVBSQ4CTeibkyeCCWgBQVZ3PfOSeze1mPqZgVyOETk4Jb2Psd566xWKynmw1_JSPMBBVxpG62bj02Jl6MMKjTw4ZJjxFmcG3uGkl8t-hJnMuMUqpZtediyp8GXF3W1wrS7PBmtaVDM5qC0dL7NwKfxB0ve_vQChrZFHFGYrlKScgdPpW7PXhG1djSKzGhboQUWQgAah_jtp3ns51YZ3EiLDCPQ2ESmiGbcULP_aLuGHyDYxTIXL3U5nbJ-pk6GE8rrbMp8cfii6oWmpsQUHlqbeWa0v0LYzEuC9ofuSUZf8EhA_LUZlOF2ZqPUXEQfrbo3rbna9FImloTMlcr7FyxzIr0ql60",
          "path" : "/",
          "httpOnly" : true,
          "secure" : false,
          "comment" : ""
        } ],
        "headers" : [ {
          "name" : "Cache-Control",
          "value" : "private"
        }, {
          "name" : "Content-Type",
          "value" : "application/json; charset=utf-8"
        }, {
          "name" : "Server",
          "value" : "Microsoft-IIS/10.0"
        }, {
          "name" : "Set-Cookie",
          "value" : ".ASPROLES=mX6_M5FMuj-8TtjOpHTsZ3-sfg1gqZVqx3nPg1WnT6Ows9DBeRgOX6cfQBw_ZQmShVSnU5ADtU9BFSe8HQtY2Llpdcuu3wDJSqyWN2EaW45s-mk9MDdn3IKx3i2hI6mqQZ-isjhSwUXuvi_wYtnGbVBSQ4CTeibkyeCCWgBQVZ3PfOSeze1mPqZgVyOETk4Jb2Psd566xWKynmw1_JSPMBBVxpG62bj02Jl6MMKjTw4ZJjxFmcG3uGkl8t-hJnMuMUqpZtediyp8GXF3W1wrS7PBmtaVDM5qC0dL7NwKfxB0ve_vQChrZFHFGYrlKScgdPpW7PXhG1djSKzGhboQUWQgAah_jtp3ns51YZ3EiLDCPQ2ESmiGbcULP_aLuGHyDYxTIXL3U5nbJ-pk6GE8rrbMp8cfii6oWmpsQUHlqbeWa0v0LYzEuC9ofuSUZf8EhA_LUZlOF2ZqPUXEQfrbo3rbna9FImloTMlcr7FyxzIr0ql60; path=/; HttpOnly"
        }, {
          "name" : "X-SourceFiles",
          "value" : "=?UTF-8?B?RDpcVmlydHVhbE9wdGltaXplci1SZWZhY3RvcmluZ1xDcm9wTWV0cmljcy5Wby5BcGlcQ3JvcE1ldHJpY3MuVm8uQXBpXGFwaVxhZG1pblx2MVx1c2Vyc1w=?="
        }, {
          "name" : "X-Powered-By",
          "value" : "ASP.NET"
        }, {
          "name" : "Date",
          "value" : "Fri, 29 Mar 2019 21:44:36 GMT"
        }, {
          "name" : "Content-Length",
          "value" : "8"
        } ],
        "content" : {
          "size" : 8,
          "mimeType" : "application/json; charset=utf-8",
          "text" : "{\"id\":5}",
          "comment" : ""
        },
        "redirectURL" : "",
        "headersSize" : 887,
        "bodySize" : 8,
        "comment" : ""
      },
      "cache" : { },
      "timings" : {
        "comment" : "",
        "send" : 0,
        "wait" : 1833,
        "receive" : 0,
        "blocked" : -1,
        "dns" : -1,
        "connect" : -1,
        "ssl" : -1
      },
      "serverIPAddress" : "127.0.0.1",
      "comment" : "",
      "_katalonRequestInformation" : {
        "name" : "15",
        "testObjectId" : "Object Repository/VoPro/Account/api_admin_v1_users",
        "harId" : "022c4c94-36f6-4f1a-a6bc-98fcf57b4255"
      },
      "time" : 1834
    } ],
    "comment" : ""
  }
}