{
  "log" : {
    "version" : "1.2",
    "creator" : {
      "name" : "BrowserMob Proxy",
      "version" : "2.1.5",
      "comment" : ""
    },
    "pages" : [ {
      "id" : "Page 0",
      "startedDateTime" : "2019-03-28T21:19:38.943Z",
      "title" : "Page 0",
      "pageTimings" : {
        "onLoad" : 26,
        "comment" : ""
      },
      "comment" : ""
    } ],
    "entries" : [ {
      "pageref" : "Page 0",
      "startedDateTime" : "2019-03-28T21:19:38.944Z",
      "request" : {
        "method" : "POST",
        "url" : "http://localhost:10520/WebAPI/api/admin/v1/users/?",
        "httpVersion" : "HTTP/1.1",
        "cookies" : [ ],
        "headers" : [ {
          "name" : "User-Agent",
          "value" : "Katalon Studio"
        }, {
          "name" : "Content-Type",
          "value" : "application/x-www-form-urlencoded"
        }, {
          "name" : "Authorization",
          "value" : "Bearer eyJ0eXAiOiJKV1QiLCJhbGciOiJIUzI1NiJ9.eyJ1bmlxdWVfbmFtZSI6ImFkbWluIiwicm9sZSI6InVzZXIiLCJzdWIiOiJhZG1pbiIsImlzcyI6IkNyb3BNZXRyaWNzIiwiYXVkIjoiYWxsIiwiZXhwIjoxNTUzODExODc4LCJuYmYiOjE1NTM4MDc5Nzh9.L2ygcvZQvrjJvYD2CbbheLQqBCl_hXl0pSD_FD6DUe0"
        }, {
          "name" : "Host",
          "value" : "localhost:10520"
        }, {
          "name" : "Accept",
          "value" : "text/html, image/gif, image/jpeg, *; q=.2, */*; q=.2"
        }, {
          "name" : "Proxy-Connection",
          "value" : "keep-alive"
        }, {
          "name" : "Content-Length",
          "value" : "280"
        } ],
        "queryString" : [ ],
        "postData" : {
          "mimeType" : "application/x-www-form-urlencoded",
          "params" : [ {
            "name" : "password",
            "value" : "cropmetrics",
            "comment" : ""
          }, {
            "name" : "email",
            "value" : "!@#$%^&*",
            "comment" : ""
          }, {
            "name" : "fullname",
            "value" : "test validation",
            "comment" : ""
          }, {
            "name" : "phone",
            "value" : "123",
            "comment" : ""
          }, {
            "name" : "dealer",
            "value" : "x",
            "comment" : ""
          }, {
            "name" : "addressLine1",
            "value" : "address line 1 test validation",
            "comment" : ""
          }, {
            "name" : "addressLine2",
            "value" : "address line 1 test validation",
            "comment" : ""
          }, {
            "name" : "town",
            "value" : "townValidation",
            "comment" : ""
          }, {
            "name" : "state",
            "value" : "stateValidation",
            "comment" : ""
          }, {
            "name" : "zip",
            "value" : "zipValidation",
            "comment" : ""
          }, {
            "name" : "country",
            "value" : "countryValidation",
            "comment" : ""
          }, {
            "name" : "roles",
            "value" : "Client",
            "comment" : ""
          } ],
          "comment" : ""
        },
        "headersSize" : 544,
        "bodySize" : 280,
        "comment" : ""
      },
      "response" : {
        "status" : 400,
        "statusText" : "Bad Request",
        "httpVersion" : "HTTP/1.1",
        "cookies" : [ {
          "name" : ".ASPROLES",
          "value" : "Nz4vehaYIopj5B3cr5NHezAiLTtq-VI0LLOWDNzcBuHdQOgPwat5O3HRioL2GdpQ-SBzlk_nRRo9ZK1z5akY9O842grwBKMFjhwFRt3e7LpM5M6yMPvD2TtU4rxswhdfyhQ8XeCGEnKcJeExU7hzG1IKC-hsgzr7RJ4-0z0ZKQLEUkuq1EvFWrdtL18nqSGLgmhCorgtN9OXuton6CW6yOaZpcyiJskXhtVQLMxqNNSJKYYC9xzO3OJDKWycXgpEezqzoI3MMzBdFDu1dWSYgCFMQ4zuD6GnM34SbVJUvajn7NgllAAXJyKQN3T2S5BZMyUhlK7POV0YBjcorAhLzP1FbGpjgpITp8NpGSMDGPAs8LwM-P8O8Szky0loTVkGSlQ1DqUpKM1r9WNVrNOJuWyVainBNo92Vx69WXU9hDT0Y0Xkd6wWIhlNQWbhc3FxRuEn0KTiSaIhPqBRbfIjYis9wL4L6Cp6X1LiMzrp8h2m2yMj0",
          "path" : "/",
          "httpOnly" : true,
          "secure" : false,
          "comment" : ""
        } ],
        "headers" : [ {
          "name" : "Cache-Control",
          "value" : "private"
        }, {
          "name" : "Content-Type",
          "value" : "application/json; charset=utf-8"
        }, {
          "name" : "Server",
          "value" : "Microsoft-IIS/10.0"
        }, {
          "name" : "Set-Cookie",
          "value" : ".ASPROLES=Nz4vehaYIopj5B3cr5NHezAiLTtq-VI0LLOWDNzcBuHdQOgPwat5O3HRioL2GdpQ-SBzlk_nRRo9ZK1z5akY9O842grwBKMFjhwFRt3e7LpM5M6yMPvD2TtU4rxswhdfyhQ8XeCGEnKcJeExU7hzG1IKC-hsgzr7RJ4-0z0ZKQLEUkuq1EvFWrdtL18nqSGLgmhCorgtN9OXuton6CW6yOaZpcyiJskXhtVQLMxqNNSJKYYC9xzO3OJDKWycXgpEezqzoI3MMzBdFDu1dWSYgCFMQ4zuD6GnM34SbVJUvajn7NgllAAXJyKQN3T2S5BZMyUhlK7POV0YBjcorAhLzP1FbGpjgpITp8NpGSMDGPAs8LwM-P8O8Szky0loTVkGSlQ1DqUpKM1r9WNVrNOJuWyVainBNo92Vx69WXU9hDT0Y0Xkd6wWIhlNQWbhc3FxRuEn0KTiSaIhPqBRbfIjYis9wL4L6Cp6X1LiMzrp8h2m2yMj0; path=/; HttpOnly"
        }, {
          "name" : "X-SourceFiles",
          "value" : "=?UTF-8?B?RDpcVmlydHVhbE9wdGltaXplci1SZWZhY3RvcmluZ1xDcm9wTWV0cmljcy5Wby5BcGlcQ3JvcE1ldHJpY3MuVm8uQXBpXGFwaVxhZG1pblx2MVx1c2Vyc1w=?="
        }, {
          "name" : "X-Powered-By",
          "value" : "ASP.NET"
        }, {
          "name" : "Date",
          "value" : "Thu, 28 Mar 2019 21:19:38 GMT"
        }, {
          "name" : "Content-Length",
          "value" : "95"
        } ],
        "content" : {
          "size" : 95,
          "mimeType" : "application/json; charset=utf-8",
          "text" : "{\"message\":\"The request is invalid. The Email provided is not a valid email address. !@#$%^&*\"}",
          "comment" : ""
        },
        "redirectURL" : "",
        "headersSize" : 897,
        "bodySize" : 95,
        "comment" : ""
      },
      "cache" : { },
      "timings" : {
        "comment" : "",
        "connect" : -1,
        "send" : 0,
        "receive" : 1,
        "dns" : -1,
        "blocked" : -1,
        "wait" : 22,
        "ssl" : -1
      },
      "serverIPAddress" : "127.0.0.1",
      "comment" : "",
      "_katalonRequestInformation" : {
        "name" : "53",
        "testObjectId" : "Object Repository/VoPro/Account/api_admin_v1_users",
        "harId" : "25903755-6362-4791-840c-cd38fe42cc5d"
      },
      "time" : 24
    } ],
    "comment" : ""
  }
}