{
  "log" : {
    "version" : "1.2",
    "creator" : {
      "name" : "BrowserMob Proxy",
      "version" : "2.1.5",
      "comment" : ""
    },
    "pages" : [ {
      "id" : "Page 0",
      "startedDateTime" : "2019-04-04T21:06:01.415Z",
      "title" : "Page 0",
      "pageTimings" : {
        "onLoad" : 3203,
        "comment" : ""
      },
      "comment" : ""
    } ],
    "entries" : [ {
      "pageref" : "Page 0",
      "startedDateTime" : "2019-04-04T21:06:01.416Z",
      "request" : {
        "method" : "PUT",
        "url" : "http://localhost:10520/WebAPI/api/mobile/v1/farms/7?",
        "httpVersion" : "HTTP/1.1",
        "cookies" : [ ],
        "headers" : [ {
          "name" : "User-Agent",
          "value" : "Katalon Studio"
        }, {
          "name" : "Content-Type",
          "value" : "application/json"
        }, {
          "name" : "Authorization",
          "value" : "Bearer eyJ0eXAiOiJKV1QiLCJhbGciOiJIUzI1NiJ9.eyJ1bmlxdWVfbmFtZSI6Implbm55Lm1hbGRvbmFkby50eDFAZ21haWwuY29tIiwicm9sZSI6InVzZXIiLCJzdWIiOiJqZW5ueS5tYWxkb25hZG8udHgxQGdtYWlsLmNvbSIsImlzcyI6IkNyb3BNZXRyaWNzIiwiYXVkIjoiYWxsIiwiZXhwIjoxNTU0NDE1ODYxLCJuYmYiOjE1NTQ0MTE5NjF9.qtNQfSFKNAihiGE8Tp7f-Hm2SLvKyGnyZiQWJwDEPoQ"
        }, {
          "name" : "Host",
          "value" : "localhost:10520"
        }, {
          "name" : "Accept",
          "value" : "text/html, image/gif, image/jpeg, *; q=.2, */*; q=.2"
        }, {
          "name" : "Proxy-Connection",
          "value" : "keep-alive"
        }, {
          "name" : "Content-Length",
          "value" : "16"
        } ],
        "queryString" : [ ],
        "postData" : {
          "mimeType" : "application/json",
          "text" : "{\"name\": \"    \"}",
          "comment" : ""
        },
        "headersSize" : 591,
        "bodySize" : 16,
        "comment" : ""
      },
      "response" : {
        "status" : 400,
        "statusText" : "Bad Request",
        "httpVersion" : "HTTP/1.1",
        "cookies" : [ {
          "name" : ".ASPROLES",
          "value" : "7mN3cNZYS392dG5BLF5d8-2TNxqmuLB9q4OY_Yg8esNOxM2LnK2NXSy1HHl90su0O1A2k7gR1QwdcnVhDZTk6p9_u5-uwInAtY4Z1DtuLdtHSMCMjM6k7DX7j946QdzZzUIfCbocnnD5jCdio-gRjls8ji-sbME8CHKWoHW514rgR0UyXd0VffKTQN0yhdCya_fm9pMgNJX3pX2BshtkSGG1DLQpMaIZXicRr7oIYP3ZVKFRr9iZyZs67DS5BLvO4MXVk1Nb52K4bVdeBj5xb36R4uR4G1qENVlDC8cLdSvJbWvk6QLTJE0VzQog5lQxS3JP7VSg0tnvmtl2C-3ToZahGz0hEyma3E1M3dsxwTrJgepjJOND01FHdUf_fQPNBBJdhVhp41hIWfcQMJZb7QloFxTTKNV4YtNCZeBy4wpC3dF2Scda8aH3OCHSziTZe0IcVQEl6pzASSRrkQ3hCL5rez3a4XjFKE-s1ZVUs1y5kWuHw4qA0IY4u-5QQSTMrnD3tz57KZQ9Phd9T4E_nBdSFy41",
          "path" : "/",
          "httpOnly" : true,
          "secure" : false,
          "comment" : ""
        } ],
        "headers" : [ {
          "name" : "Cache-Control",
          "value" : "private"
        }, {
          "name" : "Content-Type",
          "value" : "application/json; charset=utf-8"
        }, {
          "name" : "Server",
          "value" : "Microsoft-IIS/10.0"
        }, {
          "name" : "Set-Cookie",
          "value" : ".ASPROLES=7mN3cNZYS392dG5BLF5d8-2TNxqmuLB9q4OY_Yg8esNOxM2LnK2NXSy1HHl90su0O1A2k7gR1QwdcnVhDZTk6p9_u5-uwInAtY4Z1DtuLdtHSMCMjM6k7DX7j946QdzZzUIfCbocnnD5jCdio-gRjls8ji-sbME8CHKWoHW514rgR0UyXd0VffKTQN0yhdCya_fm9pMgNJX3pX2BshtkSGG1DLQpMaIZXicRr7oIYP3ZVKFRr9iZyZs67DS5BLvO4MXVk1Nb52K4bVdeBj5xb36R4uR4G1qENVlDC8cLdSvJbWvk6QLTJE0VzQog5lQxS3JP7VSg0tnvmtl2C-3ToZahGz0hEyma3E1M3dsxwTrJgepjJOND01FHdUf_fQPNBBJdhVhp41hIWfcQMJZb7QloFxTTKNV4YtNCZeBy4wpC3dF2Scda8aH3OCHSziTZe0IcVQEl6pzASSRrkQ3hCL5rez3a4XjFKE-s1ZVUs1y5kWuHw4qA0IY4u-5QQSTMrnD3tz57KZQ9Phd9T4E_nBdSFy41; path=/; HttpOnly"
        }, {
          "name" : "X-SourceFiles",
          "value" : "=?UTF-8?B?RDpcVmlydHVhbE9wdGltaXplci1SZWZhY3RvcmluZ1xDcm9wTWV0cmljcy5Wby5BcGlcQ3JvcE1ldHJpY3MuVm8uQXBpXGFwaVxtb2JpbGVcdjFcZmFybXNcNw==?="
        }, {
          "name" : "X-Powered-By",
          "value" : "ASP.NET"
        }, {
          "name" : "Date",
          "value" : "Thu, 04 Apr 2019 21:06:04 GMT"
        }, {
          "name" : "Content-Length",
          "value" : "45"
        } ],
        "content" : {
          "size" : 45,
          "mimeType" : "application/json; charset=utf-8",
          "text" : "{\"message\":\"The farm name must be provided.\"}",
          "comment" : ""
        },
        "redirectURL" : "",
        "headersSize" : 944,
        "bodySize" : 45,
        "comment" : ""
      },
      "cache" : { },
      "timings" : {
        "comment" : "",
        "dns" : -1,
        "connect" : -1,
        "blocked" : -1,
        "ssl" : -1,
        "receive" : 1,
        "send" : 0,
        "wait" : 3197
      },
      "serverIPAddress" : "127.0.0.1",
      "comment" : "",
      "_katalonRequestInformation" : {
        "name" : "14",
        "testObjectId" : "Object Repository/VoGrow/Farm/FarmPut",
        "harId" : "02bfc1a9-b5ce-40ce-9036-f23929369a5b"
      },
      "time" : 3199
    } ],
    "comment" : ""
  }
}