{
  "log" : {
    "version" : "1.2",
    "creator" : {
      "name" : "BrowserMob Proxy",
      "version" : "2.1.5",
      "comment" : ""
    },
    "pages" : [ {
      "id" : "Page 0",
      "startedDateTime" : "2019-04-09T09:29:03.226Z",
      "title" : "Page 0",
      "pageTimings" : {
        "onLoad" : 5204,
        "comment" : ""
      },
      "comment" : ""
    } ],
    "entries" : [ {
      "pageref" : "Page 0",
      "startedDateTime" : "2019-04-09T09:29:03.226Z",
      "request" : {
        "method" : "POST",
        "url" : "http://localhost:10520/WebAPI/api/mobile/v1/farms/?",
        "httpVersion" : "HTTP/1.1",
        "cookies" : [ ],
        "headers" : [ {
          "name" : "User-Agent",
          "value" : "Katalon Studio"
        }, {
          "name" : "Content-Type",
          "value" : "application/json"
        }, {
          "name" : "Authorization",
          "value" : "Bearer eyJ0eXAiOiJKV1QiLCJhbGciOiJIUzI1NiJ9.eyJ1bmlxdWVfbmFtZSI6Implbm55Lm1hbGRvbmFkby50eDFAZ21haWwuY29tIiwicm9sZSI6InVzZXIiLCJzdWIiOiJqZW5ueS5tYWxkb25hZG8udHgxQGdtYWlsLmNvbSIsImlzcyI6IkNyb3BNZXRyaWNzIiwiYXVkIjoiYWxsIiwiZXhwIjoxNTU0ODA2MDQzLCJuYmYiOjE1NTQ4MDIxNDN9.aJBxfPbUN_A-fbKj75b-nWaWhjSJXMv6AqFVLvEW4W8"
        }, {
          "name" : "Host",
          "value" : "localhost:10520"
        }, {
          "name" : "Accept",
          "value" : "text/html, image/gif, image/jpeg, *; q=.2, */*; q=.2"
        }, {
          "name" : "Proxy-Connection",
          "value" : "keep-alive"
        }, {
          "name" : "Content-Length",
          "value" : "26"
        } ],
        "queryString" : [ ],
        "postData" : {
          "mimeType" : "application/json",
          "text" : "{\"name\": \"\", \"user_id\": 2}",
          "comment" : ""
        },
        "headersSize" : 591,
        "bodySize" : 26,
        "comment" : ""
      },
      "response" : {
        "status" : 400,
        "statusText" : "Bad Request",
        "httpVersion" : "HTTP/1.1",
        "cookies" : [ {
          "name" : ".ASPROLES",
          "value" : "DENd_yztysjpFTe2fBolhsd3nTrsyjePXa_kwiN6fllEgSoBaTM1-eKdeC6z3a4g1wpkElqCNokopF-KGc9P2EpiBIMOpJukcXF3CzpE-YiTC-VW6VtQlL-T7Jc8d-6X8FHeLPWqcMiQHtzQqLYWCEmaYXZnFfhj-s7EyT-XfkI2N_1i7LakJwUUBoiJPcqDJH4fWpcXYbssEhHXyBQWU-h8x7rZPXvgb6Hk7QVQEpc56P7hRCgpuj4CaUNKbHofcSrFvyzSRHWnF2yi90ma39dYXX2huqjiq4pdMSwq0rb7K2tndEH11DDw1qeX238PpLyPAV0WWiEJvztzUAfU463i66TAHOlNEc88nOSWDfY4-LaaGEdKMt35ZTngVl7eQKrxkBVas6n3cQ9eMX7GPZhIUbWCnPflVkyAck1cChAZ4IPRucL4Q8JwPykmdUrCVxxNFY-GzzwPQXLi7ZUs0cypjw89iScD6cYnBnTy7GW9qCtP2i-jgKxzaPekwd32iwke4CtbFU0cd2EV8dAwAIl9IRU1",
          "path" : "/",
          "httpOnly" : true,
          "secure" : false,
          "comment" : ""
        } ],
        "headers" : [ {
          "name" : "Cache-Control",
          "value" : "private"
        }, {
          "name" : "Content-Type",
          "value" : "application/json; charset=utf-8"
        }, {
          "name" : "Server",
          "value" : "Microsoft-IIS/10.0"
        }, {
          "name" : "Set-Cookie",
          "value" : ".ASPROLES=DENd_yztysjpFTe2fBolhsd3nTrsyjePXa_kwiN6fllEgSoBaTM1-eKdeC6z3a4g1wpkElqCNokopF-KGc9P2EpiBIMOpJukcXF3CzpE-YiTC-VW6VtQlL-T7Jc8d-6X8FHeLPWqcMiQHtzQqLYWCEmaYXZnFfhj-s7EyT-XfkI2N_1i7LakJwUUBoiJPcqDJH4fWpcXYbssEhHXyBQWU-h8x7rZPXvgb6Hk7QVQEpc56P7hRCgpuj4CaUNKbHofcSrFvyzSRHWnF2yi90ma39dYXX2huqjiq4pdMSwq0rb7K2tndEH11DDw1qeX238PpLyPAV0WWiEJvztzUAfU463i66TAHOlNEc88nOSWDfY4-LaaGEdKMt35ZTngVl7eQKrxkBVas6n3cQ9eMX7GPZhIUbWCnPflVkyAck1cChAZ4IPRucL4Q8JwPykmdUrCVxxNFY-GzzwPQXLi7ZUs0cypjw89iScD6cYnBnTy7GW9qCtP2i-jgKxzaPekwd32iwke4CtbFU0cd2EV8dAwAIl9IRU1; path=/; HttpOnly"
        }, {
          "name" : "X-SourceFiles",
          "value" : "=?UTF-8?B?RDpcVmlydHVhbE9wdGltaXplci1SZWZhY3RvcmluZ1xDcm9wTWV0cmljcy5Wby5BcGlcQ3JvcE1ldHJpY3MuVm8uQXBpXGFwaVxtb2JpbGVcdjFcZmFybXNc?="
        }, {
          "name" : "X-Powered-By",
          "value" : "ASP.NET"
        }, {
          "name" : "Date",
          "value" : "Tue, 09 Apr 2019 09:29:08 GMT"
        }, {
          "name" : "Content-Length",
          "value" : "45"
        } ],
        "content" : {
          "size" : 45,
          "mimeType" : "application/json; charset=utf-8",
          "text" : "{\"message\":\"The farm name must be provided.\"}",
          "comment" : ""
        },
        "redirectURL" : "",
        "headersSize" : 940,
        "bodySize" : 45,
        "comment" : ""
      },
      "cache" : { },
      "timings" : {
        "comment" : "",
        "ssl" : -1,
        "dns" : -1,
        "send" : 1,
        "wait" : 5196,
        "receive" : 0,
        "connect" : -1,
        "blocked" : -1
      },
      "serverIPAddress" : "127.0.0.1",
      "comment" : "",
      "_katalonRequestInformation" : {
        "name" : "17",
        "testObjectId" : "Object Repository/VoGrow/Farm/FarmPost",
        "harId" : "0009a0f2-0b03-47eb-ac87-93658f4fe409"
      },
      "time" : 5198
    } ],
    "comment" : ""
  }
}