{
  "log" : {
    "version" : "1.2",
    "creator" : {
      "name" : "BrowserMob Proxy",
      "version" : "2.1.5",
      "comment" : ""
    },
    "pages" : [ {
      "id" : "Page 0",
      "startedDateTime" : "2019-03-29T22:10:04.772Z",
      "title" : "Page 0",
      "pageTimings" : {
        "onLoad" : 35,
        "comment" : ""
      },
      "comment" : ""
    } ],
    "entries" : [ {
      "pageref" : "Page 0",
      "startedDateTime" : "2019-03-29T22:10:04.773Z",
      "request" : {
        "method" : "POST",
        "url" : "http://localhost:10520/WebAPI/api/admin/v1/users/?",
        "httpVersion" : "HTTP/1.1",
        "cookies" : [ ],
        "headers" : [ {
          "name" : "User-Agent",
          "value" : "Katalon Studio"
        }, {
          "name" : "Content-Type",
          "value" : "application/x-www-form-urlencoded"
        }, {
          "name" : "Authorization",
          "value" : "Bearer eyJ0eXAiOiJKV1QiLCJhbGciOiJIUzI1NiJ9.eyJ1bmlxdWVfbmFtZSI6ImFkbWluIiwicm9sZSI6InVzZXIiLCJzdWIiOiJhZG1pbiIsImlzcyI6IkNyb3BNZXRyaWNzIiwiYXVkIjoiYWxsIiwiZXhwIjoxNTUzOTAxMzA0LCJuYmYiOjE1NTM4OTc0MDR9._jtyFVXaMmyxwtOcmQF8JG5J8wgeJyjZC6pEW-GyjXI"
        }, {
          "name" : "Host",
          "value" : "localhost:10520"
        }, {
          "name" : "Accept",
          "value" : "text/html, image/gif, image/jpeg, *; q=.2, */*; q=.2"
        }, {
          "name" : "Proxy-Connection",
          "value" : "keep-alive"
        }, {
          "name" : "Content-Length",
          "value" : "280"
        } ],
        "queryString" : [ ],
        "postData" : {
          "mimeType" : "application/x-www-form-urlencoded",
          "params" : [ {
            "name" : "password",
            "value" : "cropmetrics",
            "comment" : ""
          }, {
            "name" : "email",
            "value" : "!@#$%^&*",
            "comment" : ""
          }, {
            "name" : "fullname",
            "value" : "test validation",
            "comment" : ""
          }, {
            "name" : "phone",
            "value" : "123",
            "comment" : ""
          }, {
            "name" : "dealer",
            "value" : "x",
            "comment" : ""
          }, {
            "name" : "addressLine1",
            "value" : "address line 1 test validation",
            "comment" : ""
          }, {
            "name" : "addressLine2",
            "value" : "address line 1 test validation",
            "comment" : ""
          }, {
            "name" : "town",
            "value" : "townValidation",
            "comment" : ""
          }, {
            "name" : "state",
            "value" : "stateValidation",
            "comment" : ""
          }, {
            "name" : "zip",
            "value" : "zipValidation",
            "comment" : ""
          }, {
            "name" : "country",
            "value" : "countryValidation",
            "comment" : ""
          }, {
            "name" : "roles",
            "value" : "Client",
            "comment" : ""
          } ],
          "comment" : ""
        },
        "headersSize" : 544,
        "bodySize" : 280,
        "comment" : ""
      },
      "response" : {
        "status" : 400,
        "statusText" : "Bad Request",
        "httpVersion" : "HTTP/1.1",
        "cookies" : [ {
          "name" : ".ASPROLES",
          "value" : "5Yf4bLAOhjHq6JW76it0VoIVjHjosMwFBdvocPKNwxEjyRqfRhe3x9RXf2N0KAKx6PcqiveAJVXLA9Ex3ehh_sfPQhSjfWnumytbKzSGi8ux8FU8taODYkF0rRfwwrmEa2cvu_-h0rDE3eIUf7joz2u1dVyoKhOSvZ8BTLwLeE4n7BovgiHJdVvt5wMUne1G0FYDoLmDJl6myAn00fvsYY3oTiT7cMy1shpaQctBE40ut7QJWegInkBkOVwPc6RQ4-JHb4PoJNjJt4gZIfAhUOn2iQfFz1czhFRhrGk1x2M1m8x9juWKxCpFtgnTM_Wr8ou-i1AB2KgsxYC9jsCE-shBr2G2YW7YH5BNCuZ4-tezkHaW1qpI9YwINi4ZyTajEYSmctOkH615AmFeRrJDJWNxGT67zT_fGxXlDKVHv6I7YZgKoQ4uNnxLkHF8nvL2kO9XR6iXnkBXNQn0eOR31j5jO39tfcgUoQwglkf_ZjT1YdR20",
          "path" : "/",
          "httpOnly" : true,
          "secure" : false,
          "comment" : ""
        } ],
        "headers" : [ {
          "name" : "Cache-Control",
          "value" : "private"
        }, {
          "name" : "Content-Type",
          "value" : "application/json; charset=utf-8"
        }, {
          "name" : "Server",
          "value" : "Microsoft-IIS/10.0"
        }, {
          "name" : "Set-Cookie",
          "value" : ".ASPROLES=5Yf4bLAOhjHq6JW76it0VoIVjHjosMwFBdvocPKNwxEjyRqfRhe3x9RXf2N0KAKx6PcqiveAJVXLA9Ex3ehh_sfPQhSjfWnumytbKzSGi8ux8FU8taODYkF0rRfwwrmEa2cvu_-h0rDE3eIUf7joz2u1dVyoKhOSvZ8BTLwLeE4n7BovgiHJdVvt5wMUne1G0FYDoLmDJl6myAn00fvsYY3oTiT7cMy1shpaQctBE40ut7QJWegInkBkOVwPc6RQ4-JHb4PoJNjJt4gZIfAhUOn2iQfFz1czhFRhrGk1x2M1m8x9juWKxCpFtgnTM_Wr8ou-i1AB2KgsxYC9jsCE-shBr2G2YW7YH5BNCuZ4-tezkHaW1qpI9YwINi4ZyTajEYSmctOkH615AmFeRrJDJWNxGT67zT_fGxXlDKVHv6I7YZgKoQ4uNnxLkHF8nvL2kO9XR6iXnkBXNQn0eOR31j5jO39tfcgUoQwglkf_ZjT1YdR20; path=/; HttpOnly"
        }, {
          "name" : "X-SourceFiles",
          "value" : "=?UTF-8?B?RDpcVmlydHVhbE9wdGltaXplci1SZWZhY3RvcmluZ1xDcm9wTWV0cmljcy5Wby5BcGlcQ3JvcE1ldHJpY3MuVm8uQXBpXGFwaVxhZG1pblx2MVx1c2Vyc1w=?="
        }, {
          "name" : "X-Powered-By",
          "value" : "ASP.NET"
        }, {
          "name" : "Date",
          "value" : "Fri, 29 Mar 2019 22:10:04 GMT"
        }, {
          "name" : "Content-Length",
          "value" : "95"
        } ],
        "content" : {
          "size" : 95,
          "mimeType" : "application/json; charset=utf-8",
          "text" : "{\"message\":\"The request is invalid. The Email provided is not a valid email address. !@#$%^&*\"}",
          "comment" : ""
        },
        "redirectURL" : "",
        "headersSize" : 897,
        "bodySize" : 95,
        "comment" : ""
      },
      "cache" : { },
      "timings" : {
        "comment" : "",
        "ssl" : -1,
        "connect" : -1,
        "send" : 0,
        "receive" : 0,
        "wait" : 31,
        "dns" : -1,
        "blocked" : -1
      },
      "serverIPAddress" : "127.0.0.1",
      "comment" : "",
      "_katalonRequestInformation" : {
        "name" : "53",
        "testObjectId" : "Object Repository/VoPro/Account/api_admin_v1_users",
        "harId" : "416799e8-b8ca-45b2-a446-9dfc887bfa80"
      },
      "time" : 32
    } ],
    "comment" : ""
  }
}