Suite/Test/Step Name,Browser,Description,Start time,End time,Duration,Status
Auto_Put_Farm,,,2019-04-05 15:24:37,2019-04-05 15:26:30,1m - 52.468s,PASSED
,,,,,,
Test Cases/VoGrow/API/Farm/Put/1 API_FARM_When_farm_is_updated_as_grower_Expected_status_code_200,,,2019-04-05 15:24:38,2019-04-05 15:24:43,5.163s,PASSED
"name = ""Farm 10 katalon Updated""",,,2019-04-05 15:24:39,2019-04-05 15:24:39,0.002s,PASSED
"farmId = ""1""",,,2019-04-05 15:24:39,2019-04-05 15:24:39,0.001s,PASSED
"tokenUserName = ""jenny.maldonado.tx2@gmail.com""",,,2019-04-05 15:24:39,2019-04-05 15:24:39,0.004s,PASSED
"tokenPassword = ""cropmetrics""",,,2019-04-05 15:24:39,2019-04-05 15:24:39,0.005s,PASSED
"responseToken = sendRequest(findTestObject(""VoPro/Token"", [""usernameToken"":tokenUserName, ""passwordToken"":tokenPassword]))",,,2019-04-05 15:24:39,2019-04-05 15:24:42,3.521s,PASSED
slurper = new groovy.json.JsonSlurper(),,,2019-04-05 15:24:42,2019-04-05 15:24:42,0.024s,PASSED
tokenResult = slurper.parseText(responseToken.getResponseBodyContent()),,,2019-04-05 15:24:42,2019-04-05 15:24:42,0.022s,PASSED
accessToken = access_token,,,2019-04-05 15:24:42,2019-04-05 15:24:42,0.010s,PASSED
"println("".. Current access token generated for admin user : "" + accessToken)",,,2019-04-05 15:24:42,2019-04-05 15:24:42,0.012s,PASSED
"requestFarmPut = findTestObject(""VoGrow/Farm/FarmPut"", [""access_token"":accessToken, ""farmId"":farmId])",,,2019-04-05 15:24:42,2019-04-05 15:24:42,0.064s,PASSED
"bodyRequest = ""{""name"": """" + name + """"}""",,,2019-04-05 15:24:42,2019-04-05 15:24:42,0.004s,PASSED
try,,,2019-04-05 15:24:42,2019-04-05 15:24:43,0.006s,PASSED
responseFarm = sendRequest(requestFarmPut),,,2019-04-05 15:24:43,2019-04-05 15:24:43,0.130s,PASSED
"verifyResponseStatusCode(responseFarm, 200)",,,2019-04-05 15:24:43,2019-04-05 15:24:43,0.013s,PASSED
slurper1 = new groovy.json.JsonSlurper(),,,2019-04-05 15:24:43,2019-04-05 15:24:43,0.001s,PASSED
FarmPutResult = slurper1.parseText(responseFarm.getResponseBodyContent()),,,2019-04-05 15:24:43,2019-04-05 15:24:43,0.001s,PASSED
farmId = id,,,2019-04-05 15:24:43,2019-04-05 15:24:43,0.288s,PASSED
userId = user_id,,,2019-04-05 15:24:43,2019-04-05 15:24:43,0.001s,PASSED
"println(""The Farm updated has the next id:  "" + id)",,,2019-04-05 15:24:43,2019-04-05 15:24:43,0.001s,PASSED
"println(""The Farm updated has the next name:  "" + name)",,,2019-04-05 15:24:43,2019-04-05 15:24:43,0.001s,PASSED
"println(""The Farm updated has the user id:  "" + user_id)",,,2019-04-05 15:24:43,2019-04-05 15:24:43,0.001s,PASSED
"verifyElementPropertyValue(responseFarm, ""id"", farmId)",,,2019-04-05 15:24:43,2019-04-05 15:24:43,0.104s,PASSED
,,,,,,
Test Cases/VoGrow/API/Farm/Put/2 API_FARM_When_farm_is_updated_as_grower_Expected_new_farm_is_updated_in_database,,,2019-04-05 15:24:43,2019-04-05 15:24:44,1.170s,PASSED
"connectionCmDatabase.CmConnection.connectDB(""localhost"", ""virtualoptimizer"", ""5432"", ""postgres"", ""admin"")",,,2019-04-05 15:24:43,2019-04-05 15:24:44,0.666s,PASSED
"println(""Farm id updated is : "" + farmId)",,,2019-04-05 15:24:44,2019-04-05 15:24:44,0.001s,PASSED
"query = ""select id, name, userprofile_id from cropmetrics.farm where id ="" + farmId",,,2019-04-05 15:24:44,2019-04-05 15:24:44,0.000s,PASSED
queryResult = connectionCmDatabase.CmConnection.executeQuery(query),,,2019-04-05 15:24:44,2019-04-05 15:24:44,0.065s,PASSED
while (queryResult.next()),,,2019-04-05 15:24:44,2019-04-05 15:24:44,0.029s,PASSED
"query1 = ""select farm_id, currentfarmserviceleveltype_id, onexpirefarmserviceleveltype_id from cropmetrics.farmsubscription where currentfarmserviceleveltype_id = 0 and  onexpirefarmserviceleveltype_id = 0 and farm_id ="" + farmId",,,2019-04-05 15:24:44,2019-04-05 15:24:44,0.005s,PASSED
queryResult1 = connectionCmDatabase.CmConnection.executeQuery(query1),,,2019-04-05 15:24:44,2019-04-05 15:24:44,0.003s,PASSED
while (queryResult1.next()),,,2019-04-05 15:24:44,2019-04-05 15:24:44,0.011s,PASSED
,,,,,,
Test Cases/VoGrow/API/Farm/Put/4 API_FARM_When_farm_is_updated_as_dealer_for_one_of_the_grower_assigned_Expected_status_code_201,,,2019-04-05 15:24:44,2019-04-05 15:24:45,0.624s,PASSED
"name = ""Farm 2 updated by dealer""",,,2019-04-05 15:24:45,2019-04-05 15:24:45,0.001s,PASSED
"farmId = ""2""",,,2019-04-05 15:24:45,2019-04-05 15:24:45,0.000s,PASSED
"tokenUserName = ""jenny.maldonado.tx1@gmail.com""",,,2019-04-05 15:24:45,2019-04-05 15:24:45,0.000s,PASSED
"tokenPassword = ""cropmetrics""",,,2019-04-05 15:24:45,2019-04-05 15:24:45,0.001s,PASSED
"responseToken = sendRequest(findTestObject(""VoPro/Token"", [""usernameToken"":tokenUserName, ""passwordToken"":tokenPassword]))",,,2019-04-05 15:24:45,2019-04-05 15:24:45,0.144s,PASSED
slurper = new groovy.json.JsonSlurper(),,,2019-04-05 15:24:45,2019-04-05 15:24:45,0.001s,PASSED
tokenResult = slurper.parseText(responseToken.getResponseBodyContent()),,,2019-04-05 15:24:45,2019-04-05 15:24:45,0.001s,PASSED
accessToken = access_token,,,2019-04-05 15:24:45,2019-04-05 15:24:45,0.001s,PASSED
"println("".. Current access token generated for dealer account : "" + accessToken)",,,2019-04-05 15:24:45,2019-04-05 15:24:45,0.001s,PASSED
"requestFarmPut = findTestObject(""VoGrow/Farm/FarmPut"", [""access_token"":accessToken, ""farmId"":farmId])",,,2019-04-05 15:24:45,2019-04-05 15:24:45,0.005s,PASSED
"bodyRequest = ""{""name"": """" + name + """"}""",,,2019-04-05 15:24:45,2019-04-05 15:24:45,0.000s,PASSED
try,,,2019-04-05 15:24:45,2019-04-05 15:24:45,0.001s,PASSED
responseFarm = sendRequest(requestFarmPut),,,2019-04-05 15:24:45,2019-04-05 15:24:45,0.051s,PASSED
"verifyResponseStatusCode(responseFarm, 200)",,,2019-04-05 15:24:45,2019-04-05 15:24:45,0.003s,PASSED
slurper1 = new groovy.json.JsonSlurper(),,,2019-04-05 15:24:45,2019-04-05 15:24:45,0.001s,PASSED
FarmPutResult = slurper1.parseText(responseFarm.getResponseBodyContent()),,,2019-04-05 15:24:45,2019-04-05 15:24:45,0.001s,PASSED
farmId = id,,,2019-04-05 15:24:45,2019-04-05 15:24:45,0.001s,PASSED
userId = user_id,,,2019-04-05 15:24:45,2019-04-05 15:24:45,0.001s,PASSED
"println(""The Farm updated has the next id:  "" + id)",,,2019-04-05 15:24:45,2019-04-05 15:24:45,0.002s,PASSED
"println(""The Farm updated has the next name:  "" + name)",,,2019-04-05 15:24:45,2019-04-05 15:24:45,0.000s,PASSED
"println(""New Farm updated has the user id:  "" + user_id)",,,2019-04-05 15:24:45,2019-04-05 15:24:45,0.001s,PASSED
"verifyElementPropertyValue(responseFarm, ""id"", farmId)",,,2019-04-05 15:24:45,2019-04-05 15:24:45,0.014s,PASSED
,,,,,,
Test Cases/VoGrow/API/Farm/Put/4.1 API_FARM_When_farm_updated_as_dealer_for_grower_not_assigned_Expected_status_code_400,,,2019-04-05 15:24:45,2019-04-05 15:24:59,13.646s,PASSED
"name = ""Farm not updated into the grower does not assined the dealer account""",,,2019-04-05 15:24:45,2019-04-05 15:24:45,0.001s,PASSED
"farmId = ""1""",,,2019-04-05 15:24:45,2019-04-05 15:24:45,0.001s,PASSED
"tokenUserName = ""jenny.maldonado.tx1@gmail.com""",,,2019-04-05 15:24:45,2019-04-05 15:24:45,0.002s,PASSED
"tokenPassword = ""cropmetrics""",,,2019-04-05 15:24:45,2019-04-05 15:24:45,0.001s,PASSED
"responseToken = sendRequest(findTestObject(""VoPro/Token"", [""usernameToken"":tokenUserName, ""passwordToken"":tokenPassword]))",,,2019-04-05 15:24:45,2019-04-05 15:24:45,0.173s,PASSED
slurper = new groovy.json.JsonSlurper(),,,2019-04-05 15:24:45,2019-04-05 15:24:45,0.001s,PASSED
tokenResult = slurper.parseText(responseToken.getResponseBodyContent()),,,2019-04-05 15:24:45,2019-04-05 15:24:45,0.001s,PASSED
accessToken = access_token,,,2019-04-05 15:24:45,2019-04-05 15:24:45,0.001s,PASSED
"println("".. Current access token generated for admin user : "" + accessToken)",,,2019-04-05 15:24:45,2019-04-05 15:24:45,0.001s,PASSED
"requestFarmPut = findTestObject(""VoGrow/Farm/FarmPut"", [""access_token"":accessToken, ""farmId"":farmId])",,,2019-04-05 15:24:45,2019-04-05 15:24:45,0.004s,PASSED
"bodyRequest = ""{""name"": """" + name + """"}""",,,2019-04-05 15:24:45,2019-04-05 15:24:45,0.001s,PASSED
try,,,2019-04-05 15:24:45,2019-04-05 15:24:45,0.002s,PASSED
responseFarm = sendRequest(requestFarmPut),,,2019-04-05 15:24:45,2019-04-05 15:24:59,13.156s,PASSED
"verifyResponseStatusCode(responseFarm, 400)",,,2019-04-05 15:24:59,2019-04-05 15:24:59,0.002s,PASSED
,,,,,,
Test Cases/VoGrow/API/Farm/Put/4.2 API_FARM_When_farm_updated_as_dealer_for_grower_not_assigned_Expected_properly_error_message_is_displayed,,,2019-04-05 15:24:59,2019-04-05 15:25:07,8.520s,PASSED
"name = ""Farm not updated into the grower does not assined the dealer account""",,,2019-04-05 15:24:59,2019-04-05 15:24:59,0.001s,PASSED
"farmId = ""1""",,,2019-04-05 15:24:59,2019-04-05 15:24:59,0.001s,PASSED
"tokenUserName = ""jenny.maldonado.tx1@gmail.com""",,,2019-04-05 15:24:59,2019-04-05 15:24:59,0.000s,PASSED
"tokenPassword = ""cropmetrics""",,,2019-04-05 15:24:59,2019-04-05 15:24:59,0.000s,PASSED
"responseToken = sendRequest(findTestObject(""VoPro/Token"", [""usernameToken"":tokenUserName, ""passwordToken"":tokenPassword]))",,,2019-04-05 15:24:59,2019-04-05 15:24:59,0.143s,PASSED
slurper = new groovy.json.JsonSlurper(),,,2019-04-05 15:24:59,2019-04-05 15:24:59,0.001s,PASSED
tokenResult = slurper.parseText(responseToken.getResponseBodyContent()),,,2019-04-05 15:24:59,2019-04-05 15:24:59,0.001s,PASSED
accessToken = access_token,,,2019-04-05 15:24:59,2019-04-05 15:24:59,0.001s,PASSED
"println("".. Current access token generated for admin user : "" + accessToken)",,,2019-04-05 15:24:59,2019-04-05 15:24:59,0.001s,PASSED
"requestFarmPut = findTestObject(""VoGrow/Farm/FarmPut"", [""access_token"":accessToken, ""farmId"":farmId])",,,2019-04-05 15:24:59,2019-04-05 15:24:59,0.005s,PASSED
"bodyRequest = ""{""name"": """" + name + """"}""",,,2019-04-05 15:24:59,2019-04-05 15:24:59,0.001s,PASSED
try,,,2019-04-05 15:24:59,2019-04-05 15:24:59,0.002s,PASSED
responseFarm = sendRequest(requestFarmPut),,,2019-04-05 15:24:59,2019-04-05 15:25:07,7.990s,PASSED
slurper1 = new groovy.json.JsonSlurper(),,,2019-04-05 15:25:07,2019-04-05 15:25:07,0.000s,PASSED
FarmPutResult = slurper1.parseText(responseFarm.getResponseBodyContent()),,,2019-04-05 15:25:07,2019-04-05 15:25:07,0.000s,PASSED
messageResponse = message,,,2019-04-05 15:25:07,2019-04-05 15:25:07,0.000s,PASSED
"messageExpected = ""The modifier doesn't have permissions to modify the farm requested.""",,,2019-04-05 15:25:07,2019-04-05 15:25:07,0.000s,PASSED
"println(""Error message response: "" + messageResponse)",,,2019-04-05 15:25:07,2019-04-05 15:25:07,0.001s,PASSED
"println(""Error message expected: "" + messageExpected)",,,2019-04-05 15:25:07,2019-04-05 15:25:07,0.001s,PASSED
"verifyElementPropertyValue(responseFarm, ""message"", messageExpected)",,,2019-04-05 15:25:07,2019-04-05 15:25:07,0.012s,PASSED
,,,,,,
Test Cases/VoGrow/API/Farm/Put/5 API_FARM_When_farm_updated_as_dealer_for_one_grower_assigned_Expected_new_farm_is_added_in_database_only_for_corresponding_grower,,,2019-04-05 15:25:07,2019-04-05 15:25:07,0.447s,PASSED
"connectionCmDatabase.CmConnection.connectDB(""localhost"", ""virtualoptimizer"", ""5432"", ""postgres"", ""admin"")",,,2019-04-05 15:25:07,2019-04-05 15:25:07,0.087s,PASSED
"println(""The farm id updated is : "" + farmId)",,,2019-04-05 15:25:07,2019-04-05 15:25:07,0.001s,PASSED
"query = ""select id, name, userprofile_id from cropmetrics.farm where id ="" + farmId",,,2019-04-05 15:25:07,2019-04-05 15:25:07,0.000s,PASSED
queryResult = connectionCmDatabase.CmConnection.executeQuery(query),,,2019-04-05 15:25:07,2019-04-05 15:25:07,0.003s,PASSED
while (queryResult.next()),,,2019-04-05 15:25:07,2019-04-05 15:25:07,0.006s,PASSED
"query1 = ""select farm_id, currentfarmserviceleveltype_id, onexpirefarmserviceleveltype_id from cropmetrics.farmsubscription where currentfarmserviceleveltype_id = 0 and  onexpirefarmserviceleveltype_id = 0 and farm_id ="" + farmId",,,2019-04-05 15:25:07,2019-04-05 15:25:07,0.000s,PASSED
queryResult1 = connectionCmDatabase.CmConnection.executeQuery(query1),,,2019-04-05 15:25:07,2019-04-05 15:25:07,0.003s,PASSED
while (queryResult1.next()),,,2019-04-05 15:25:07,2019-04-05 15:25:07,0.007s,PASSED
,,,,,,
Test Cases/VoGrow/API/Farm/Put/7 API_FARM_When_farm_updated_as_dealer_for_one_grower_assigned_Expected_new_farm_is_not_added_in_database_for_dealer_account,,,2019-04-05 15:25:07,2019-04-05 15:25:08,0.445s,PASSED
"connectionCmDatabase.CmConnection.connectDB(""localhost"", ""virtualoptimizer"", ""5432"", ""postgres"", ""admin"")",,,2019-04-05 15:25:08,2019-04-05 15:25:08,0.081s,PASSED
dealerId = 2,,,2019-04-05 15:25:08,2019-04-05 15:25:08,0.001s,PASSED
"println(""The farm id updated is : "" + farmId)",,,2019-04-05 15:25:08,2019-04-05 15:25:08,0.001s,PASSED
"println(""Dealer of the grower id that has the farm updated , is : "" + dealerId)",,,2019-04-05 15:25:08,2019-04-05 15:25:08,0.000s,PASSED
"query = ""select id, name, userprofile_id from cropmetrics.farm where id ="" + farmId",,,2019-04-05 15:25:08,2019-04-05 15:25:08,0.000s,PASSED
queryResult = connectionCmDatabase.CmConnection.executeQuery(query),,,2019-04-05 15:25:08,2019-04-05 15:25:08,0.003s,PASSED
while (queryResult.next()),,,2019-04-05 15:25:08,2019-04-05 15:25:08,0.006s,PASSED
,,,,,,
Test Cases/VoGrow/API/Farm/Put/8 API_FARM_When_farm_updated_has_name_attribute_with_more_than_128_chars_Expected_status_code_400,,,2019-04-05 15:25:08,2019-04-05 15:25:17,9.438s,PASSED
"name = ""API_FARM_When_new_farm_has_name_attribute_with_more_than_128_chars_Expected_status_code_400 API_FARM_When_new_farm_has_name_attribute_with_more_than_128_chars_Expected_status_code_400""",,,2019-04-05 15:25:08,2019-04-05 15:25:08,0.001s,PASSED
"farmId = ""7""",,,2019-04-05 15:25:08,2019-04-05 15:25:08,0.000s,PASSED
"tokenUserName = ""jenny.maldonado.tx1@gmail.com""",,,2019-04-05 15:25:08,2019-04-05 15:25:08,0.000s,PASSED
"tokenPassword = ""cropmetrics""",,,2019-04-05 15:25:08,2019-04-05 15:25:08,0.001s,PASSED
"responseToken = sendRequest(findTestObject(""VoPro/Token"", [""usernameToken"":tokenUserName, ""passwordToken"":tokenPassword]))",,,2019-04-05 15:25:08,2019-04-05 15:25:08,0.120s,PASSED
slurper = new groovy.json.JsonSlurper(),,,2019-04-05 15:25:08,2019-04-05 15:25:08,0.000s,PASSED
tokenResult = slurper.parseText(responseToken.getResponseBodyContent()),,,2019-04-05 15:25:08,2019-04-05 15:25:08,0.000s,PASSED
accessToken = access_token,,,2019-04-05 15:25:08,2019-04-05 15:25:08,0.000s,PASSED
"println("".. Current access token generated for dealer account : "" + accessToken)",,,2019-04-05 15:25:08,2019-04-05 15:25:08,0.000s,PASSED
"requestFarmPut = findTestObject(""VoGrow/Farm/FarmPut"", [""access_token"":accessToken, ""farmId"":farmId])",,,2019-04-05 15:25:08,2019-04-05 15:25:08,0.004s,PASSED
"bodyRequest = ""{""name"": """" + name + """"}""",,,2019-04-05 15:25:08,2019-04-05 15:25:08,0.001s,PASSED
try,,,2019-04-05 15:25:08,2019-04-05 15:25:08,0.002s,PASSED
responseFarm = sendRequest(requestFarmPut),,,2019-04-05 15:25:08,2019-04-05 15:25:17,9.056s,PASSED
"verifyResponseStatusCode(responseFarm, 400)",,,2019-04-05 15:25:17,2019-04-05 15:25:17,0.003s,PASSED
,,,,,,
Test Cases/VoGrow/API/Farm/Put/9 API_FARM_When_farm_updated_has_name_attribute_with_more_than_128_chars_Expected_properly_error_message_is_displayed,,,2019-04-05 15:25:17,2019-04-05 15:25:25,7.257s,PASSED
"name = ""API_FARM_When_new_farm_has_name_attribute_with_more_than_128_chars_Expected_status_code_400 API_FARM_When_new_farm_has_name_attribute_with_more_than_128_chars_Expected_status_code_400""",,,2019-04-05 15:25:18,2019-04-05 15:25:18,0.001s,PASSED
"farmId = ""7""",,,2019-04-05 15:25:18,2019-04-05 15:25:18,0.001s,PASSED
"tokenUserName = ""jenny.maldonado.tx1@gmail.com""",,,2019-04-05 15:25:18,2019-04-05 15:25:18,0.001s,PASSED
"tokenPassword = ""cropmetrics""",,,2019-04-05 15:25:18,2019-04-05 15:25:18,0.000s,PASSED
"responseToken = sendRequest(findTestObject(""VoPro/Token"", [""usernameToken"":tokenUserName, ""passwordToken"":tokenPassword]))",,,2019-04-05 15:25:18,2019-04-05 15:25:18,0.195s,PASSED
slurper = new groovy.json.JsonSlurper(),,,2019-04-05 15:25:18,2019-04-05 15:25:18,0.000s,PASSED
tokenResult = slurper.parseText(responseToken.getResponseBodyContent()),,,2019-04-05 15:25:18,2019-04-05 15:25:18,0.000s,PASSED
accessToken = access_token,,,2019-04-05 15:25:18,2019-04-05 15:25:18,0.000s,PASSED
"println("".. Current access token generated for dealer account : "" + accessToken)",,,2019-04-05 15:25:18,2019-04-05 15:25:18,0.000s,PASSED
"requestFarmPut = findTestObject(""VoGrow/Farm/FarmPut"", [""access_token"":accessToken, ""farmId"":farmId])",,,2019-04-05 15:25:18,2019-04-05 15:25:18,0.003s,PASSED
"bodyRequest = ""{""name"": """" + name + """"}""",,,2019-04-05 15:25:18,2019-04-05 15:25:18,0.000s,PASSED
try,,,2019-04-05 15:25:18,2019-04-05 15:25:18,0.001s,PASSED
responseFarm = sendRequest(requestFarmPut),,,2019-04-05 15:25:18,2019-04-05 15:25:25,6.747s,PASSED
slurper1 = new groovy.json.JsonSlurper(),,,2019-04-05 15:25:25,2019-04-05 15:25:25,0.001s,PASSED
FarmPostResult = slurper1.parseText(responseFarm.getResponseBodyContent()),,,2019-04-05 15:25:25,2019-04-05 15:25:25,0.001s,PASSED
messageResponse = message,,,2019-04-05 15:25:25,2019-04-05 15:25:25,0.001s,PASSED
"messageExpected = ""The farm name must contains as max 128 characters.""",,,2019-04-05 15:25:25,2019-04-05 15:25:25,0.000s,PASSED
"println(""Error message response: "" + messageResponse)",,,2019-04-05 15:25:25,2019-04-05 15:25:25,0.000s,PASSED
"println(""Error message expected: "" + messageExpected)",,,2019-04-05 15:25:25,2019-04-05 15:25:25,0.000s,PASSED
"verifyElementPropertyValue(responseFarm, ""message"", messageExpected)",,,2019-04-05 15:25:25,2019-04-05 15:25:25,0.015s,PASSED
,,,,,,
Test Cases/VoGrow/API/Farm/Put/10 API_FARM_When_new_farm_has_name_attribute_with_128_chars_Expected_status_code_201,,,2019-04-05 15:25:25,2019-04-05 15:25:25,0.376s,PASSED
"name = ""129 charsWhen new farm has name attribute with more than 128 chars Expected status code 400 API FARM When new farm has name attr""",,,2019-04-05 15:25:25,2019-04-05 15:25:25,0.001s,PASSED
"farmId = ""7""",,,2019-04-05 15:25:25,2019-04-05 15:25:25,0.001s,PASSED
"tokenUserName = ""jenny.maldonado.tx1@gmail.com""",,,2019-04-05 15:25:25,2019-04-05 15:25:25,0.000s,PASSED
"tokenPassword = ""cropmetrics""",,,2019-04-05 15:25:25,2019-04-05 15:25:25,0.000s,PASSED
"responseToken = sendRequest(findTestObject(""VoPro/Token"", [""usernameToken"":tokenUserName, ""passwordToken"":tokenPassword]))",,,2019-04-05 15:25:25,2019-04-05 15:25:25,0.110s,PASSED
slurper = new groovy.json.JsonSlurper(),,,2019-04-05 15:25:25,2019-04-05 15:25:25,0.001s,PASSED
tokenResult = slurper.parseText(responseToken.getResponseBodyContent()),,,2019-04-05 15:25:25,2019-04-05 15:25:25,0.000s,PASSED
accessToken = access_token,,,2019-04-05 15:25:25,2019-04-05 15:25:25,0.001s,PASSED
"println("".. Current access token generated for admin user : "" + accessToken)",,,2019-04-05 15:25:25,2019-04-05 15:25:25,0.001s,PASSED
"requestFarmPut = findTestObject(""VoGrow/Farm/FarmPut"", [""access_token"":accessToken, ""farmId"":farmId])",,,2019-04-05 15:25:25,2019-04-05 15:25:25,0.003s,PASSED
"bodyRequest = ""{""name"": """" + name + """"}""",,,2019-04-05 15:25:25,2019-04-05 15:25:25,0.000s,PASSED
try,,,2019-04-05 15:25:25,2019-04-05 15:25:25,0.001s,PASSED
responseFarm = sendRequest(requestFarmPut),,,2019-04-05 15:25:25,2019-04-05 15:25:25,0.036s,PASSED
"verifyResponseStatusCode(responseFarm, 200)",,,2019-04-05 15:25:25,2019-04-05 15:25:25,0.002s,PASSED
slurper1 = new groovy.json.JsonSlurper(),,,2019-04-05 15:25:25,2019-04-05 15:25:25,0.000s,PASSED
FarmPutResult = slurper1.parseText(responseFarm.getResponseBodyContent()),,,2019-04-05 15:25:25,2019-04-05 15:25:25,0.001s,PASSED
farmId = id,,,2019-04-05 15:25:25,2019-04-05 15:25:25,0.001s,PASSED
userId = user_id,,,2019-04-05 15:25:25,2019-04-05 15:25:25,0.000s,PASSED
"println(""The Farm updated has the next id:  "" + id)",,,2019-04-05 15:25:25,2019-04-05 15:25:25,0.000s,PASSED
"println(""The Farm updated has the next name:  "" + name)",,,2019-04-05 15:25:25,2019-04-05 15:25:25,0.000s,PASSED
"println(""The Farm updated has the user id:  "" + user_id)",,,2019-04-05 15:25:25,2019-04-05 15:25:25,0.000s,PASSED
"verifyElementPropertyValue(responseFarm, ""id"", farmId)",,,2019-04-05 15:25:25,2019-04-05 15:25:25,0.014s,PASSED
,,,,,,
Test Cases/VoGrow/API/Farm/Put/11 API_FARM_When_farm_updated_has_name_attribute_with_128_chars_Expected_new_farm_is_added_in_database,,,2019-04-05 15:25:25,2019-04-05 15:25:25,0.254s,PASSED
"connectionCmDatabase.CmConnection.connectDB(""localhost"", ""virtualoptimizer"", ""5432"", ""postgres"", ""admin"")",,,2019-04-05 15:25:25,2019-04-05 15:25:25,0.066s,PASSED
"println(""Farm id updated is : "" + farmId)",,,2019-04-05 15:25:25,2019-04-05 15:25:25,0.001s,PASSED
"query = ""select id, name, userprofile_id from cropmetrics.farm where id ="" + farmId",,,2019-04-05 15:25:25,2019-04-05 15:25:25,0.000s,PASSED
queryResult = connectionCmDatabase.CmConnection.executeQuery(query),,,2019-04-05 15:25:25,2019-04-05 15:25:25,0.003s,PASSED
while (queryResult.next()),,,2019-04-05 15:25:25,2019-04-05 15:25:25,0.006s,PASSED
"query1 = ""select farm_id, currentfarmserviceleveltype_id, onexpirefarmserviceleveltype_id from cropmetrics.farmsubscription where currentfarmserviceleveltype_id = 0 and  onexpirefarmserviceleveltype_id = 0 and farm_id ="" + farmId",,,2019-04-05 15:25:25,2019-04-05 15:25:25,0.000s,PASSED
queryResult1 = connectionCmDatabase.CmConnection.executeQuery(query1),,,2019-04-05 15:25:25,2019-04-05 15:25:25,0.002s,PASSED
while (queryResult1.next()),,,2019-04-05 15:25:25,2019-04-05 15:25:25,0.006s,PASSED
,,,,,,
Test Cases/VoGrow/API/Farm/Put/12 API_FARM_When_farm_updated_has_name_attribute_with_only_spaces_Expected_status_code_400,,,2019-04-05 15:25:25,2019-04-05 15:25:30,4.879s,PASSED
"name = ""    """,,,2019-04-05 15:25:26,2019-04-05 15:25:26,0.000s,PASSED
"farmId = ""7""",,,2019-04-05 15:25:26,2019-04-05 15:25:26,0.001s,PASSED
"tokenUserName = ""jenny.maldonado.tx1@gmail.com""",,,2019-04-05 15:25:26,2019-04-05 15:25:26,0.001s,PASSED
"tokenPassword = ""cropmetrics""",,,2019-04-05 15:25:26,2019-04-05 15:25:26,0.000s,PASSED
"responseToken = sendRequest(findTestObject(""VoPro/Token"", [""usernameToken"":tokenUserName, ""passwordToken"":tokenPassword]))",,,2019-04-05 15:25:26,2019-04-05 15:25:26,0.108s,PASSED
slurper = new groovy.json.JsonSlurper(),,,2019-04-05 15:25:26,2019-04-05 15:25:26,0.001s,PASSED
tokenResult = slurper.parseText(responseToken.getResponseBodyContent()),,,2019-04-05 15:25:26,2019-04-05 15:25:26,0.001s,PASSED
accessToken = access_token,,,2019-04-05 15:25:26,2019-04-05 15:25:26,0.000s,PASSED
"println("".. Current access token generated for admin user : "" + accessToken)",,,2019-04-05 15:25:26,2019-04-05 15:25:26,0.000s,PASSED
"requestFarmPut = findTestObject(""VoGrow/Farm/FarmPut"", [""access_token"":accessToken, ""farmId"":farmId])",,,2019-04-05 15:25:26,2019-04-05 15:25:26,0.004s,PASSED
"bodyRequest = ""{""name"": """" + name + """"}""",,,2019-04-05 15:25:26,2019-04-05 15:25:26,0.001s,PASSED
try,,,2019-04-05 15:25:26,2019-04-05 15:25:26,0.001s,PASSED
responseFarm = sendRequest(requestFarmPut),,,2019-04-05 15:25:26,2019-04-05 15:25:30,4.502s,PASSED
"verifyResponseStatusCode(responseFarm, 400)",,,2019-04-05 15:25:30,2019-04-05 15:25:30,0.002s,PASSED
,,,,,,
Test Cases/VoGrow/API/Farm/Put/12.1 API_FARM_When_farm_updated_has_name_attribute_with_only_spaces_Expected_properly_error_message_is_displayed,,,2019-04-05 15:25:30,2019-04-05 15:25:36,5.540s,PASSED
"name = ""    """,,,2019-04-05 15:25:30,2019-04-05 15:25:30,0.001s,PASSED
"farmId = ""7""",,,2019-04-05 15:25:30,2019-04-05 15:25:30,0.001s,PASSED
"tokenUserName = ""jenny.maldonado.tx1@gmail.com""",,,2019-04-05 15:25:30,2019-04-05 15:25:30,0.000s,PASSED
"tokenPassword = ""cropmetrics""",,,2019-04-05 15:25:30,2019-04-05 15:25:30,0.001s,PASSED
"responseToken = sendRequest(findTestObject(""VoPro/Token"", [""usernameToken"":tokenUserName, ""passwordToken"":tokenPassword]))",,,2019-04-05 15:25:30,2019-04-05 15:25:31,0.126s,PASSED
slurper = new groovy.json.JsonSlurper(),,,2019-04-05 15:25:31,2019-04-05 15:25:31,0.000s,PASSED
tokenResult = slurper.parseText(responseToken.getResponseBodyContent()),,,2019-04-05 15:25:31,2019-04-05 15:25:31,0.001s,PASSED
accessToken = access_token,,,2019-04-05 15:25:31,2019-04-05 15:25:31,0.001s,PASSED
"println("".. Current access token generated for admin user : "" + accessToken)",,,2019-04-05 15:25:31,2019-04-05 15:25:31,0.000s,PASSED
"requestFarmPut = findTestObject(""VoGrow/Farm/FarmPut"", [""access_token"":accessToken, ""farmId"":farmId])",,,2019-04-05 15:25:31,2019-04-05 15:25:31,0.004s,PASSED
"bodyRequest = ""{""name"": """" + name + """"}""",,,2019-04-05 15:25:31,2019-04-05 15:25:31,0.000s,PASSED
try,,,2019-04-05 15:25:31,2019-04-05 15:25:31,0.001s,PASSED
responseFarm = sendRequest(requestFarmPut),,,2019-04-05 15:25:31,2019-04-05 15:25:36,5.098s,PASSED
slurper1 = new groovy.json.JsonSlurper(),,,2019-04-05 15:25:36,2019-04-05 15:25:36,0.001s,PASSED
FarmPutResult = slurper1.parseText(responseFarm.getResponseBodyContent()),,,2019-04-05 15:25:36,2019-04-05 15:25:36,0.001s,PASSED
messageResponse = message,,,2019-04-05 15:25:36,2019-04-05 15:25:36,0.001s,PASSED
"messageExpected = ""The farm name must be provided.""",,,2019-04-05 15:25:36,2019-04-05 15:25:36,0.001s,PASSED
"println(""Error message response: "" + messageResponse)",,,2019-04-05 15:25:36,2019-04-05 15:25:36,0.001s,PASSED
"println(""Error message expected: "" + messageExpected)",,,2019-04-05 15:25:36,2019-04-05 15:25:36,0.001s,PASSED
"verifyElementPropertyValue(responseFarm, ""message"", messageExpected)",,,2019-04-05 15:25:36,2019-04-05 15:25:36,0.017s,PASSED
,,,,,,
Test Cases/VoGrow/API/Farm/Put/13 API_FARM_When_farm_updated_has_name_attribute_as_empty_Expected_status_code_400,,,2019-04-05 15:25:36,2019-04-05 15:25:41,4.988s,PASSED
"name = """"",,,2019-04-05 15:25:36,2019-04-05 15:25:36,0.001s,PASSED
"farmId = ""7""",,,2019-04-05 15:25:36,2019-04-05 15:25:36,0.001s,PASSED
"tokenUserName = ""jenny.maldonado.tx1@gmail.com""",,,2019-04-05 15:25:36,2019-04-05 15:25:36,0.002s,PASSED
"tokenPassword = ""cropmetrics""",,,2019-04-05 15:25:36,2019-04-05 15:25:36,0.001s,PASSED
"responseToken = sendRequest(findTestObject(""VoPro/Token"", [""usernameToken"":tokenUserName, ""passwordToken"":tokenPassword]))",,,2019-04-05 15:25:36,2019-04-05 15:25:36,0.119s,PASSED
slurper = new groovy.json.JsonSlurper(),,,2019-04-05 15:25:36,2019-04-05 15:25:36,0.000s,PASSED
tokenResult = slurper.parseText(responseToken.getResponseBodyContent()),,,2019-04-05 15:25:36,2019-04-05 15:25:36,0.001s,PASSED
accessToken = access_token,,,2019-04-05 15:25:36,2019-04-05 15:25:36,0.000s,PASSED
"println("".. Current access token generated for admin user : "" + accessToken)",,,2019-04-05 15:25:36,2019-04-05 15:25:36,0.000s,PASSED
"requestFarmPut = findTestObject(""VoGrow/Farm/FarmPut"", [""access_token"":accessToken, ""farmId"":farmId])",,,2019-04-05 15:25:36,2019-04-05 15:25:36,0.003s,PASSED
"bodyRequest = ""{""name"": """" + name + """"}""",,,2019-04-05 15:25:36,2019-04-05 15:25:36,0.000s,PASSED
try,,,2019-04-05 15:25:36,2019-04-05 15:25:36,0.002s,PASSED
responseFarm = sendRequest(requestFarmPut),,,2019-04-05 15:25:36,2019-04-05 15:25:41,4.650s,PASSED
"verifyResponseStatusCode(responseFarm, 400)",,,2019-04-05 15:25:41,2019-04-05 15:25:41,0.003s,PASSED
,,,,,,
Test Cases/VoGrow/API/Farm/Put/14 API_FARM_When_farm_updated_has_name_attribute_as_empty_Expected_properly_error_message_is_displayed,,,2019-04-05 15:25:41,2019-04-05 15:25:46,5.164s,PASSED
"name = """"",,,2019-04-05 15:25:41,2019-04-05 15:25:41,0.000s,PASSED
"farmId = ""7""",,,2019-04-05 15:25:41,2019-04-05 15:25:41,0.000s,PASSED
"tokenUserName = ""jenny.maldonado.tx1@gmail.com""",,,2019-04-05 15:25:41,2019-04-05 15:25:41,0.001s,PASSED
"tokenPassword = ""cropmetrics""",,,2019-04-05 15:25:41,2019-04-05 15:25:41,0.000s,PASSED
"responseToken = sendRequest(findTestObject(""VoPro/Token"", [""usernameToken"":tokenUserName, ""passwordToken"":tokenPassword]))",,,2019-04-05 15:25:41,2019-04-05 15:25:41,0.114s,PASSED
slurper = new groovy.json.JsonSlurper(),,,2019-04-05 15:25:41,2019-04-05 15:25:41,0.001s,PASSED
tokenResult = slurper.parseText(responseToken.getResponseBodyContent()),,,2019-04-05 15:25:41,2019-04-05 15:25:41,0.000s,PASSED
accessToken = access_token,,,2019-04-05 15:25:41,2019-04-05 15:25:41,0.000s,PASSED
"println("".. Current access token generated for admin user : "" + accessToken)",,,2019-04-05 15:25:41,2019-04-05 15:25:41,0.001s,PASSED
"requestFarmPut = findTestObject(""VoGrow/Farm/FarmPut"", [""access_token"":accessToken, ""farmId"":farmId])",,,2019-04-05 15:25:41,2019-04-05 15:25:41,0.004s,PASSED
"bodyRequest = ""{""name"": """" + name + """"}""",,,2019-04-05 15:25:41,2019-04-05 15:25:41,0.001s,PASSED
try,,,2019-04-05 15:25:41,2019-04-05 15:25:41,0.001s,PASSED
responseFarm = sendRequest(requestFarmPut),,,2019-04-05 15:25:41,2019-04-05 15:25:46,4.742s,PASSED
slurper1 = new groovy.json.JsonSlurper(),,,2019-04-05 15:25:46,2019-04-05 15:25:46,0.001s,PASSED
FarmPutResult = slurper1.parseText(responseFarm.getResponseBodyContent()),,,2019-04-05 15:25:46,2019-04-05 15:25:46,0.001s,PASSED
messageResponse = message,,,2019-04-05 15:25:46,2019-04-05 15:25:46,0.001s,PASSED
"messageExpected = ""The farm name must be provided.""",,,2019-04-05 15:25:46,2019-04-05 15:25:46,0.001s,PASSED
"println(""Error message response: "" + messageResponse)",,,2019-04-05 15:25:46,2019-04-05 15:25:46,0.001s,PASSED
"println(""Error message expected: "" + messageExpected)",,,2019-04-05 15:25:46,2019-04-05 15:25:46,0.001s,PASSED
"verifyElementPropertyValue(responseFarm, ""message"", messageExpected)",,,2019-04-05 15:25:46,2019-04-05 15:25:46,0.020s,PASSED
,,,,,,
Test Cases/VoGrow/API/Farm/Put/15 API_FARM_When_farm_updated_has_name_attribute_as_symbols_Expected_status_code_400,,,2019-04-05 15:25:46,2019-04-05 15:25:50,4.609s,PASSED
"name = ""!@#$%^&*""",,,2019-04-05 15:25:46,2019-04-05 15:25:46,0.001s,PASSED
"farmId = ""7""",,,2019-04-05 15:25:46,2019-04-05 15:25:46,0.001s,PASSED
"tokenUserName = ""jenny.maldonado.tx1@gmail.com""",,,2019-04-05 15:25:46,2019-04-05 15:25:46,0.001s,PASSED
"tokenPassword = ""cropmetrics""",,,2019-04-05 15:25:46,2019-04-05 15:25:46,0.001s,PASSED
"responseToken = sendRequest(findTestObject(""VoPro/Token"", [""usernameToken"":tokenUserName, ""passwordToken"":tokenPassword]))",,,2019-04-05 15:25:46,2019-04-05 15:25:46,0.092s,PASSED
slurper = new groovy.json.JsonSlurper(),,,2019-04-05 15:25:46,2019-04-05 15:25:46,0.000s,PASSED
tokenResult = slurper.parseText(responseToken.getResponseBodyContent()),,,2019-04-05 15:25:46,2019-04-05 15:25:46,0.000s,PASSED
accessToken = access_token,,,2019-04-05 15:25:46,2019-04-05 15:25:46,0.001s,PASSED
"println("".. Current access token generated for admin user : "" + accessToken)",,,2019-04-05 15:25:46,2019-04-05 15:25:46,0.001s,PASSED
"requestFarmPut = findTestObject(""VoGrow/Farm/FarmPut"", [""access_token"":accessToken, ""farmId"":farmId])",,,2019-04-05 15:25:46,2019-04-05 15:25:46,0.004s,PASSED
"bodyRequest = ""{""name"": """" + name + """"}""",,,2019-04-05 15:25:46,2019-04-05 15:25:46,0.000s,PASSED
try,,,2019-04-05 15:25:46,2019-04-05 15:25:46,0.002s,PASSED
responseFarm = sendRequest(requestFarmPut),,,2019-04-05 15:25:46,2019-04-05 15:25:50,4.275s,PASSED
"verifyResponseStatusCode(responseFarm, 400)",,,2019-04-05 15:25:50,2019-04-05 15:25:50,0.002s,PASSED
,,,,,,
Test Cases/VoGrow/API/Farm/Put/16 API_FARM_When_farm_updated_has_name_attribute_as_symbols_Expected_properly_error_message_is_displayed,,,2019-04-05 15:25:50,2019-04-05 15:25:55,5.020s,PASSED
"name = ""!@#$%^&*""",,,2019-04-05 15:25:51,2019-04-05 15:25:51,0.000s,PASSED
"farmId = ""7""",,,2019-04-05 15:25:51,2019-04-05 15:25:51,0.000s,PASSED
"tokenUserName = ""jenny.maldonado.tx1@gmail.com""",,,2019-04-05 15:25:51,2019-04-05 15:25:51,0.000s,PASSED
"tokenPassword = ""cropmetrics""",,,2019-04-05 15:25:51,2019-04-05 15:25:51,0.000s,PASSED
"responseToken = sendRequest(findTestObject(""VoPro/Token"", [""usernameToken"":tokenUserName, ""passwordToken"":tokenPassword]))",,,2019-04-05 15:25:51,2019-04-05 15:25:51,0.139s,PASSED
slurper = new groovy.json.JsonSlurper(),,,2019-04-05 15:25:51,2019-04-05 15:25:51,0.000s,PASSED
tokenResult = slurper.parseText(responseToken.getResponseBodyContent()),,,2019-04-05 15:25:51,2019-04-05 15:25:51,0.001s,PASSED
accessToken = access_token,,,2019-04-05 15:25:51,2019-04-05 15:25:51,0.001s,PASSED
"println("".. Current access token generated for admin user : "" + accessToken)",,,2019-04-05 15:25:51,2019-04-05 15:25:51,0.000s,PASSED
"requestFarmPut = findTestObject(""VoGrow/Farm/FarmPut"", [""access_token"":accessToken, ""farmId"":farmId])",,,2019-04-05 15:25:51,2019-04-05 15:25:51,0.003s,PASSED
"bodyRequest = ""{""name"": """" + name + """"}""",,,2019-04-05 15:25:51,2019-04-05 15:25:51,0.001s,PASSED
try,,,2019-04-05 15:25:51,2019-04-05 15:25:51,0.001s,PASSED
responseFarm = sendRequest(requestFarmPut),,,2019-04-05 15:25:51,2019-04-05 15:25:55,4.644s,PASSED
slurper1 = new groovy.json.JsonSlurper(),,,2019-04-05 15:25:55,2019-04-05 15:25:55,0.001s,PASSED
FarmPutResult = slurper1.parseText(responseFarm.getResponseBodyContent()),,,2019-04-05 15:25:55,2019-04-05 15:25:55,0.001s,PASSED
messageResponse = message,,,2019-04-05 15:25:55,2019-04-05 15:25:55,0.000s,PASSED
"messageExpected = ""The farm name must contain only alphanumeric characters, apostrophes and/or spaces.""",,,2019-04-05 15:25:55,2019-04-05 15:25:55,0.000s,PASSED
"println(""Error message response: "" + messageResponse)",,,2019-04-05 15:25:55,2019-04-05 15:25:55,0.001s,PASSED
"println(""Error message expected: "" + messageExpected)",,,2019-04-05 15:25:55,2019-04-05 15:25:55,0.001s,PASSED
"verifyElementPropertyValue(responseFarm, ""message"", messageExpected)",,,2019-04-05 15:25:55,2019-04-05 15:25:55,0.015s,PASSED
,,,,,,
Test Cases/VoGrow/API/Farm/Put/17 API_FARM_When_farm_updated_has_name_attribute_with_spaces_and_chars_Expected_status_code_201,,,2019-04-05 15:25:56,2019-04-05 15:25:56,0.385s,PASSED
"name = ""   Farm name with spaces is UPDATED    """,,,2019-04-05 15:25:56,2019-04-05 15:25:56,0.001s,PASSED
"farmId = ""7""",,,2019-04-05 15:25:56,2019-04-05 15:25:56,0.000s,PASSED
"tokenUserName = ""jenny.maldonado.tx1@gmail.com""",,,2019-04-05 15:25:56,2019-04-05 15:25:56,0.001s,PASSED
"tokenPassword = ""cropmetrics""",,,2019-04-05 15:25:56,2019-04-05 15:25:56,0.000s,PASSED
"responseToken = sendRequest(findTestObject(""VoPro/Token"", [""usernameToken"":tokenUserName, ""passwordToken"":tokenPassword]))",,,2019-04-05 15:25:56,2019-04-05 15:25:56,0.140s,PASSED
slurper = new groovy.json.JsonSlurper(),,,2019-04-05 15:25:56,2019-04-05 15:25:56,0.000s,PASSED
tokenResult = slurper.parseText(responseToken.getResponseBodyContent()),,,2019-04-05 15:25:56,2019-04-05 15:25:56,0.001s,PASSED
accessToken = access_token,,,2019-04-05 15:25:56,2019-04-05 15:25:56,0.000s,PASSED
"println("".. Current access token generated for admin user : "" + accessToken)",,,2019-04-05 15:25:56,2019-04-05 15:25:56,0.000s,PASSED
"requestFarmPut = findTestObject(""VoGrow/Farm/FarmPut"", [""access_token"":accessToken, ""farmId"":farmId])",,,2019-04-05 15:25:56,2019-04-05 15:25:56,0.005s,PASSED
"bodyRequest = ""{""name"": """" + name + """"}""",,,2019-04-05 15:25:56,2019-04-05 15:25:56,0.001s,PASSED
try,,,2019-04-05 15:25:56,2019-04-05 15:25:56,0.001s,PASSED
responseFarm = sendRequest(requestFarmPut),,,2019-04-05 15:25:56,2019-04-05 15:25:56,0.032s,PASSED
"verifyResponseStatusCode(responseFarm, 200)",,,2019-04-05 15:25:56,2019-04-05 15:25:56,0.002s,PASSED
slurper1 = new groovy.json.JsonSlurper(),,,2019-04-05 15:25:56,2019-04-05 15:25:56,0.001s,PASSED
FarmPutResult = slurper1.parseText(responseFarm.getResponseBodyContent()),,,2019-04-05 15:25:56,2019-04-05 15:25:56,0.000s,PASSED
farmId = id,,,2019-04-05 15:25:56,2019-04-05 15:25:56,0.000s,PASSED
userId = user_id,,,2019-04-05 15:25:56,2019-04-05 15:25:56,0.001s,PASSED
"println(""The Farm updated has the next id:  "" + id)",,,2019-04-05 15:25:56,2019-04-05 15:25:56,0.000s,PASSED
"println(""The Farm updated has the next name:  "" + name)",,,2019-04-05 15:25:56,2019-04-05 15:25:56,0.001s,PASSED
"println(""The Farm updated has the user id:  "" + user_id)",,,2019-04-05 15:25:56,2019-04-05 15:25:56,0.001s,PASSED
"verifyElementPropertyValue(responseFarm, ""id"", farmId)",,,2019-04-05 15:25:56,2019-04-05 15:25:56,0.011s,PASSED
,,,,,,
Test Cases/VoGrow/API/Farm/Put/18 API_FARM_When_farm_updated_has_name_attribute_with_only_numbers_Expected_status_code_201,,,2019-04-05 15:25:56,2019-04-05 15:25:56,0.394s,PASSED
"name = ""5555555555""",,,2019-04-05 15:25:56,2019-04-05 15:25:56,0.001s,PASSED
"farmId = ""7""",,,2019-04-05 15:25:56,2019-04-05 15:25:56,0.001s,PASSED
"tokenUserName = ""jenny.maldonado.tx1@gmail.com""",,,2019-04-05 15:25:56,2019-04-05 15:25:56,0.001s,PASSED
"tokenPassword = ""cropmetrics""",,,2019-04-05 15:25:56,2019-04-05 15:25:56,0.002s,PASSED
"responseToken = sendRequest(findTestObject(""VoPro/Token"", [""usernameToken"":tokenUserName, ""passwordToken"":tokenPassword]))",,,2019-04-05 15:25:56,2019-04-05 15:25:56,0.119s,PASSED
slurper = new groovy.json.JsonSlurper(),,,2019-04-05 15:25:56,2019-04-05 15:25:56,0.001s,PASSED
tokenResult = slurper.parseText(responseToken.getResponseBodyContent()),,,2019-04-05 15:25:56,2019-04-05 15:25:56,0.001s,PASSED
accessToken = access_token,,,2019-04-05 15:25:56,2019-04-05 15:25:56,0.001s,PASSED
"println("".. Current access token generated for admin user : "" + accessToken)",,,2019-04-05 15:25:56,2019-04-05 15:25:56,0.000s,PASSED
"requestFarmPut = findTestObject(""VoGrow/Farm/FarmPut"", [""access_token"":accessToken, ""farmId"":farmId])",,,2019-04-05 15:25:56,2019-04-05 15:25:56,0.003s,PASSED
"bodyRequest = ""{""name"": """" + name + """"}""",,,2019-04-05 15:25:56,2019-04-05 15:25:56,0.001s,PASSED
try,,,2019-04-05 15:25:56,2019-04-05 15:25:56,0.001s,PASSED
responseFarm = sendRequest(requestFarmPut),,,2019-04-05 15:25:56,2019-04-05 15:25:56,0.043s,PASSED
"verifyResponseStatusCode(responseFarm, 200)",,,2019-04-05 15:25:56,2019-04-05 15:25:56,0.002s,PASSED
slurper1 = new groovy.json.JsonSlurper(),,,2019-04-05 15:25:56,2019-04-05 15:25:56,0.000s,PASSED
FarmPutResult = slurper1.parseText(responseFarm.getResponseBodyContent()),,,2019-04-05 15:25:56,2019-04-05 15:25:56,0.000s,PASSED
farmId = id,,,2019-04-05 15:25:56,2019-04-05 15:25:56,0.000s,PASSED
userId = user_id,,,2019-04-05 15:25:56,2019-04-05 15:25:56,0.001s,PASSED
"println(""The Farm updated has the next id:  "" + id)",,,2019-04-05 15:25:56,2019-04-05 15:25:56,0.000s,PASSED
"println(""The Farm updated has the next name:  "" + name)",,,2019-04-05 15:25:56,2019-04-05 15:25:56,0.000s,PASSED
"println(""The Farm updated has the user id:  "" + user_id)",,,2019-04-05 15:25:56,2019-04-05 15:25:56,0.000s,PASSED
"verifyElementPropertyValue(responseFarm, ""id"", farmId)",,,2019-04-05 15:25:56,2019-04-05 15:25:56,0.013s,PASSED
,,,,,,
Test Cases/VoGrow/API/Farm/Put/19 API_FARM_When_farm_is_updated_with_name_attribute_as_only_chars_Expected_status_code_201,,,2019-04-05 15:25:56,2019-04-05 15:25:57,0.460s,PASSED
"name = ""FarmNameWithOnlycharsUPDATED""",,,2019-04-05 15:25:57,2019-04-05 15:25:57,0.001s,PASSED
"farmId = ""7""",,,2019-04-05 15:25:57,2019-04-05 15:25:57,0.001s,PASSED
"tokenUserName = ""jenny.maldonado.tx1@gmail.com""",,,2019-04-05 15:25:57,2019-04-05 15:25:57,0.000s,PASSED
"tokenPassword = ""cropmetrics""",,,2019-04-05 15:25:57,2019-04-05 15:25:57,0.001s,PASSED
"responseToken = sendRequest(findTestObject(""VoPro/Token"", [""usernameToken"":tokenUserName, ""passwordToken"":tokenPassword]))",,,2019-04-05 15:25:57,2019-04-05 15:25:57,0.108s,PASSED
slurper = new groovy.json.JsonSlurper(),,,2019-04-05 15:25:57,2019-04-05 15:25:57,0.000s,PASSED
tokenResult = slurper.parseText(responseToken.getResponseBodyContent()),,,2019-04-05 15:25:57,2019-04-05 15:25:57,0.001s,PASSED
accessToken = access_token,,,2019-04-05 15:25:57,2019-04-05 15:25:57,0.000s,PASSED
"println("".. Current access token generated for admin user : "" + accessToken)",,,2019-04-05 15:25:57,2019-04-05 15:25:57,0.001s,PASSED
"requestFarmPut = findTestObject(""VoGrow/Farm/FarmPut"", [""access_token"":accessToken, ""farmId"":farmId])",,,2019-04-05 15:25:57,2019-04-05 15:25:57,0.004s,PASSED
"bodyRequest = ""{""name"": """" + name + """"}""",,,2019-04-05 15:25:57,2019-04-05 15:25:57,0.001s,PASSED
try,,,2019-04-05 15:25:57,2019-04-05 15:25:57,0.002s,PASSED
responseFarm = sendRequest(requestFarmPut),,,2019-04-05 15:25:57,2019-04-05 15:25:57,0.033s,PASSED
"verifyResponseStatusCode(responseFarm, 200)",,,2019-04-05 15:25:57,2019-04-05 15:25:57,0.001s,PASSED
slurper1 = new groovy.json.JsonSlurper(),,,2019-04-05 15:25:57,2019-04-05 15:25:57,0.000s,PASSED
FarmPutResult = slurper1.parseText(responseFarm.getResponseBodyContent()),,,2019-04-05 15:25:57,2019-04-05 15:25:57,0.001s,PASSED
farmId = id,,,2019-04-05 15:25:57,2019-04-05 15:25:57,0.001s,PASSED
userId = user_id,,,2019-04-05 15:25:57,2019-04-05 15:25:57,0.000s,PASSED
"println(""The Farm updated has the next id:  "" + id)",,,2019-04-05 15:25:57,2019-04-05 15:25:57,0.001s,PASSED
"println(""The Farm updated has the next name:  "" + name)",,,2019-04-05 15:25:57,2019-04-05 15:25:57,0.001s,PASSED
"println(""The Farm updated has the user id:  "" + user_id)",,,2019-04-05 15:25:57,2019-04-05 15:25:57,0.000s,PASSED
"verifyElementPropertyValue(responseFarm, ""id"", farmId)",,,2019-04-05 15:25:57,2019-04-05 15:25:57,0.014s,PASSED
,,,,,,
Test Cases/VoGrow/API/Farm/Put/20 API_FARM_When_farm_updated_has_an_existing_name_for_the_user_token_Expected_status_code_400,,,2019-04-05 15:25:57,2019-04-05 15:26:02,5.499s,PASSED
"name = ""1234567890""",,,2019-04-05 15:25:57,2019-04-05 15:25:57,0.000s,PASSED
"farmId = ""6""",,,2019-04-05 15:25:57,2019-04-05 15:25:57,0.001s,PASSED
"tokenUserName = ""jenny.maldonado.tx1@gmail.com""",,,2019-04-05 15:25:57,2019-04-05 15:25:57,0.001s,PASSED
"tokenPassword = ""cropmetrics""",,,2019-04-05 15:25:57,2019-04-05 15:25:57,0.000s,PASSED
"responseToken = sendRequest(findTestObject(""VoPro/Token"", [""usernameToken"":tokenUserName, ""passwordToken"":tokenPassword]))",,,2019-04-05 15:25:57,2019-04-05 15:25:57,0.093s,PASSED
slurper = new groovy.json.JsonSlurper(),,,2019-04-05 15:25:57,2019-04-05 15:25:57,0.000s,PASSED
tokenResult = slurper.parseText(responseToken.getResponseBodyContent()),,,2019-04-05 15:25:57,2019-04-05 15:25:57,0.000s,PASSED
accessToken = access_token,,,2019-04-05 15:25:57,2019-04-05 15:25:57,0.001s,PASSED
"println("".. Current access token generated for admin user : "" + accessToken)",,,2019-04-05 15:25:57,2019-04-05 15:25:57,0.001s,PASSED
"requestFarmPut = findTestObject(""VoGrow/Farm/FarmPut"", [""access_token"":accessToken, ""farmId"":farmId])",,,2019-04-05 15:25:57,2019-04-05 15:25:57,0.003s,PASSED
"bodyRequest = ""{""name"": """" + name + """"}""",,,2019-04-05 15:25:57,2019-04-05 15:25:57,0.000s,PASSED
try,,,2019-04-05 15:25:57,2019-04-05 15:25:57,0.001s,PASSED
responseFarm = sendRequest(requestFarmPut),,,2019-04-05 15:25:57,2019-04-05 15:26:02,5.179s,PASSED
"verifyResponseStatusCode(responseFarm, 400)",,,2019-04-05 15:26:02,2019-04-05 15:26:02,0.002s,PASSED
,,,,,,
Test Cases/VoGrow/API/Farm/Put/21 API_FARM_When_farm_updated_has_an_existing_name_for_the_user_token_Expected_properly_error_message_is_displayed,,,2019-04-05 15:26:02,2019-04-05 15:26:07,4.686s,PASSED
"name = ""1234567890""",,,2019-04-05 15:26:02,2019-04-05 15:26:02,0.001s,PASSED
"farmId = ""6""",,,2019-04-05 15:26:02,2019-04-05 15:26:02,0.000s,PASSED
"tokenUserName = ""jenny.maldonado.tx1@gmail.com""",,,2019-04-05 15:26:02,2019-04-05 15:26:02,0.000s,PASSED
"tokenPassword = ""cropmetrics""",,,2019-04-05 15:26:02,2019-04-05 15:26:02,0.000s,PASSED
"responseToken = sendRequest(findTestObject(""VoPro/Token"", [""usernameToken"":tokenUserName, ""passwordToken"":tokenPassword]))",,,2019-04-05 15:26:02,2019-04-05 15:26:03,0.067s,PASSED
slurper = new groovy.json.JsonSlurper(),,,2019-04-05 15:26:03,2019-04-05 15:26:03,0.001s,PASSED
tokenResult = slurper.parseText(responseToken.getResponseBodyContent()),,,2019-04-05 15:26:03,2019-04-05 15:26:03,0.001s,PASSED
accessToken = access_token,,,2019-04-05 15:26:03,2019-04-05 15:26:03,0.001s,PASSED
"println("".. Current access token generated for admin user : "" + accessToken)",,,2019-04-05 15:26:03,2019-04-05 15:26:03,0.001s,PASSED
"requestFarmPut = findTestObject(""VoGrow/Farm/FarmPut"", [""access_token"":accessToken, ""farmId"":farmId])",,,2019-04-05 15:26:03,2019-04-05 15:26:03,0.004s,PASSED
"bodyRequest = ""{""name"": """" + name + """"}""",,,2019-04-05 15:26:03,2019-04-05 15:26:03,0.001s,PASSED
try,,,2019-04-05 15:26:03,2019-04-05 15:26:03,0.001s,PASSED
responseFarm = sendRequest(requestFarmPut),,,2019-04-05 15:26:03,2019-04-05 15:26:07,4.382s,PASSED
"verifyResponseStatusCode(responseFarm, 400)",,,2019-04-05 15:26:07,2019-04-05 15:26:07,0.003s,PASSED
slurper1 = new groovy.json.JsonSlurper(),,,2019-04-05 15:26:07,2019-04-05 15:26:07,0.000s,PASSED
FarmPutResult = slurper1.parseText(responseFarm.getResponseBodyContent()),,,2019-04-05 15:26:07,2019-04-05 15:26:07,0.000s,PASSED
messageResponse = message,,,2019-04-05 15:26:07,2019-04-05 15:26:07,0.001s,PASSED
"messageExpected = ""The farm name already exists.""",,,2019-04-05 15:26:07,2019-04-05 15:26:07,0.000s,PASSED
"println(""Error message response: "" + messageResponse)",,,2019-04-05 15:26:07,2019-04-05 15:26:07,0.001s,PASSED
"println(""Error message expected: "" + messageExpected)",,,2019-04-05 15:26:07,2019-04-05 15:26:07,0.001s,PASSED
"verifyElementPropertyValue(responseFarm, ""message"", messageExpected)",,,2019-04-05 15:26:07,2019-04-05 15:26:07,0.010s,PASSED
,,,,,,
Test Cases/VoGrow/API/Farm/Put/22 API_FARM_When_farm_updated_has_the_name_of_the_other_user_different_of_the_user_token_Expected_status_code_201,,,2019-04-05 15:26:07,2019-04-05 15:26:07,0.441s,PASSED
"name = ""1234567890""",,,2019-04-05 15:26:07,2019-04-05 15:26:07,0.001s,PASSED
"farmId = ""7""",,,2019-04-05 15:26:07,2019-04-05 15:26:07,0.001s,PASSED
"tokenUserName = ""jenny.maldonado.tx1@gmail.com""",,,2019-04-05 15:26:07,2019-04-05 15:26:07,0.001s,PASSED
"tokenPassword = ""cropmetrics""",,,2019-04-05 15:26:07,2019-04-05 15:26:07,0.001s,PASSED
"responseToken = sendRequest(findTestObject(""VoPro/Token"", [""usernameToken"":tokenUserName, ""passwordToken"":tokenPassword]))",,,2019-04-05 15:26:07,2019-04-05 15:26:07,0.144s,PASSED
slurper = new groovy.json.JsonSlurper(),,,2019-04-05 15:26:07,2019-04-05 15:26:07,0.000s,PASSED
tokenResult = slurper.parseText(responseToken.getResponseBodyContent()),,,2019-04-05 15:26:07,2019-04-05 15:26:07,0.000s,PASSED
accessToken = access_token,,,2019-04-05 15:26:07,2019-04-05 15:26:07,0.001s,PASSED
"println("".. Current access token generated for admin user : "" + accessToken)",,,2019-04-05 15:26:07,2019-04-05 15:26:07,0.001s,PASSED
"requestFarmPut = findTestObject(""VoGrow/Farm/FarmPut"", [""access_token"":accessToken, ""farmId"":farmId])",,,2019-04-05 15:26:07,2019-04-05 15:26:07,0.003s,PASSED
"bodyRequest = ""{""name"": """" + name + """"}""",,,2019-04-05 15:26:07,2019-04-05 15:26:07,0.001s,PASSED
try,,,2019-04-05 15:26:07,2019-04-05 15:26:07,0.001s,PASSED
responseFarm = sendRequest(requestFarmPut),,,2019-04-05 15:26:07,2019-04-05 15:26:07,0.031s,PASSED
"verifyResponseStatusCode(responseFarm, 200)",,,2019-04-05 15:26:07,2019-04-05 15:26:07,0.002s,PASSED
slurper1 = new groovy.json.JsonSlurper(),,,2019-04-05 15:26:07,2019-04-05 15:26:07,0.001s,PASSED
FarmPutResult = slurper1.parseText(responseFarm.getResponseBodyContent()),,,2019-04-05 15:26:07,2019-04-05 15:26:07,0.000s,PASSED
farmId = id,,,2019-04-05 15:26:07,2019-04-05 15:26:07,0.000s,PASSED
userId = user_id,,,2019-04-05 15:26:07,2019-04-05 15:26:07,0.001s,PASSED
"println(""The Farm updated has the next id:  "" + id)",,,2019-04-05 15:26:07,2019-04-05 15:26:07,0.001s,PASSED
"println(""The Farm updated has the next name:  "" + name)",,,2019-04-05 15:26:07,2019-04-05 15:26:07,0.001s,PASSED
"println(""The Farm updated has the user id:  "" + user_id)",,,2019-04-05 15:26:07,2019-04-05 15:26:07,0.000s,PASSED
"verifyElementPropertyValue(responseFarm, ""id"", farmId)",,,2019-04-05 15:26:07,2019-04-05 15:26:07,0.015s,PASSED
,,,,,,
Test Cases/VoGrow/API/Farm/Put/23 API_FARM_When_farm_updated_has_the_farmid_parameter_as_empty_Expected_status_code_405,,,2019-04-05 15:26:07,2019-04-05 15:26:08,0.325s,PASSED
"name = ""Test Farm Id parameter""",,,2019-04-05 15:26:08,2019-04-05 15:26:08,0.001s,PASSED
"farmId = """"",,,2019-04-05 15:26:08,2019-04-05 15:26:08,0.000s,PASSED
"tokenUserName = ""jenny.maldonado.tx1@gmail.com""",,,2019-04-05 15:26:08,2019-04-05 15:26:08,0.000s,PASSED
"tokenPassword = ""cropmetrics""",,,2019-04-05 15:26:08,2019-04-05 15:26:08,0.000s,PASSED
"responseToken = sendRequest(findTestObject(""VoPro/Token"", [""usernameToken"":tokenUserName, ""passwordToken"":tokenPassword]))",,,2019-04-05 15:26:08,2019-04-05 15:26:08,0.071s,PASSED
slurper = new groovy.json.JsonSlurper(),,,2019-04-05 15:26:08,2019-04-05 15:26:08,0.000s,PASSED
tokenResult = slurper.parseText(responseToken.getResponseBodyContent()),,,2019-04-05 15:26:08,2019-04-05 15:26:08,0.000s,PASSED
accessToken = access_token,,,2019-04-05 15:26:08,2019-04-05 15:26:08,0.001s,PASSED
"println("".. Current access token generated for admin user : "" + accessToken)",,,2019-04-05 15:26:08,2019-04-05 15:26:08,0.000s,PASSED
"requestFarmPut = findTestObject(""VoGrow/Farm/FarmPut"", [""access_token"":accessToken, ""farmId"":farmId])",,,2019-04-05 15:26:08,2019-04-05 15:26:08,0.003s,PASSED
"bodyRequest = ""{""name"": """" + name + """"}""",,,2019-04-05 15:26:08,2019-04-05 15:26:08,0.001s,PASSED
try,,,2019-04-05 15:26:08,2019-04-05 15:26:08,0.001s,PASSED
responseFarm = sendRequest(requestFarmPut),,,2019-04-05 15:26:08,2019-04-05 15:26:08,0.049s,PASSED
"verifyResponseStatusCode(responseFarm, 405)",,,2019-04-05 15:26:08,2019-04-05 15:26:08,0.001s,PASSED
,,,,,,
Test Cases/VoGrow/API/Farm/Put/24 API_FARM_When_farm_updated_has_the_farmid_parameter_as_empty_Expected_properly_error_message_is_displayed,,,2019-04-05 15:26:08,2019-04-05 15:26:08,0.338s,PASSED
"name = ""Test Farm Id parameter""",,,2019-04-05 15:26:08,2019-04-05 15:26:08,0.001s,PASSED
"farmId = """"",,,2019-04-05 15:26:08,2019-04-05 15:26:08,0.000s,PASSED
"tokenUserName = ""jenny.maldonado.tx1@gmail.com""",,,2019-04-05 15:26:08,2019-04-05 15:26:08,0.000s,PASSED
"tokenPassword = ""cropmetrics""",,,2019-04-05 15:26:08,2019-04-05 15:26:08,0.000s,PASSED
"responseToken = sendRequest(findTestObject(""VoPro/Token"", [""usernameToken"":tokenUserName, ""passwordToken"":tokenPassword]))",,,2019-04-05 15:26:08,2019-04-05 15:26:08,0.111s,PASSED
slurper = new groovy.json.JsonSlurper(),,,2019-04-05 15:26:08,2019-04-05 15:26:08,0.001s,PASSED
tokenResult = slurper.parseText(responseToken.getResponseBodyContent()),,,2019-04-05 15:26:08,2019-04-05 15:26:08,0.000s,PASSED
accessToken = access_token,,,2019-04-05 15:26:08,2019-04-05 15:26:08,0.000s,PASSED
"println("".. Current access token generated for admin user : "" + accessToken)",,,2019-04-05 15:26:08,2019-04-05 15:26:08,0.001s,PASSED
"requestFarmPut = findTestObject(""VoGrow/Farm/FarmPut"", [""access_token"":accessToken, ""farmId"":farmId])",,,2019-04-05 15:26:08,2019-04-05 15:26:08,0.004s,PASSED
"bodyRequest = ""{""name"": """" + name + """"}""",,,2019-04-05 15:26:08,2019-04-05 15:26:08,0.000s,PASSED
try,,,2019-04-05 15:26:08,2019-04-05 15:26:08,0.002s,PASSED
responseFarm = sendRequest(requestFarmPut),,,2019-04-05 15:26:08,2019-04-05 15:26:08,0.038s,PASSED
slurper1 = new groovy.json.JsonSlurper(),,,2019-04-05 15:26:08,2019-04-05 15:26:08,0.000s,PASSED
FarmPutResult = slurper1.parseText(responseFarm.getResponseBodyContent()),,,2019-04-05 15:26:08,2019-04-05 15:26:08,0.000s,PASSED
messageResponse = message,,,2019-04-05 15:26:08,2019-04-05 15:26:08,0.000s,PASSED
"messageExpected = ""The requested resource does not support http method 'PUT'.""",,,2019-04-05 15:26:08,2019-04-05 15:26:08,0.000s,PASSED
"println(""Error message response: "" + messageResponse)",,,2019-04-05 15:26:08,2019-04-05 15:26:08,0.001s,PASSED
"println(""Error message expected: "" + messageExpected)",,,2019-04-05 15:26:08,2019-04-05 15:26:08,0.000s,PASSED
"verifyElementPropertyValue(responseFarm, ""message"", messageExpected)",,,2019-04-05 15:26:08,2019-04-05 15:26:08,0.016s,PASSED
,,,,,,
Test Cases/VoGrow/API/Farm/Put/25 API_FARM_When_farm_updated_has_the_farmid_parameter_with_chars_Expected_status_code_404,,,2019-04-05 15:26:08,2019-04-05 15:26:08,0.408s,PASSED
"name = ""Test Farm Id parameter""",,,2019-04-05 15:26:08,2019-04-05 15:26:08,0.001s,PASSED
"farmId = ""one""",,,2019-04-05 15:26:08,2019-04-05 15:26:08,0.001s,PASSED
"tokenUserName = ""jenny.maldonado.tx1@gmail.com""",,,2019-04-05 15:26:08,2019-04-05 15:26:08,0.000s,PASSED
"tokenPassword = ""cropmetrics""",,,2019-04-05 15:26:08,2019-04-05 15:26:08,0.001s,PASSED
"responseToken = sendRequest(findTestObject(""VoPro/Token"", [""usernameToken"":tokenUserName, ""passwordToken"":tokenPassword]))",,,2019-04-05 15:26:08,2019-04-05 15:26:08,0.122s,PASSED
slurper = new groovy.json.JsonSlurper(),,,2019-04-05 15:26:08,2019-04-05 15:26:08,0.000s,PASSED
tokenResult = slurper.parseText(responseToken.getResponseBodyContent()),,,2019-04-05 15:26:08,2019-04-05 15:26:08,0.001s,PASSED
accessToken = access_token,,,2019-04-05 15:26:08,2019-04-05 15:26:08,0.001s,PASSED
"println("".. Current access token generated for admin user : "" + accessToken)",,,2019-04-05 15:26:08,2019-04-05 15:26:08,0.000s,PASSED
"requestFarmPut = findTestObject(""VoGrow/Farm/FarmPut"", [""access_token"":accessToken, ""farmId"":farmId])",,,2019-04-05 15:26:08,2019-04-05 15:26:08,0.003s,PASSED
"bodyRequest = ""{""name"": """" + name + """"}""",,,2019-04-05 15:26:08,2019-04-05 15:26:08,0.001s,PASSED
try,,,2019-04-05 15:26:08,2019-04-05 15:26:08,0.002s,PASSED
responseFarm = sendRequest(requestFarmPut),,,2019-04-05 15:26:08,2019-04-05 15:26:08,0.018s,PASSED
"verifyResponseStatusCode(responseFarm, 404)",,,2019-04-05 15:26:08,2019-04-05 15:26:08,0.002s,PASSED
,,,,,,
Test Cases/VoGrow/API/Farm/Put/27 API_FARM_When_farm_updated_has_the_farmid_paramert_with_spaces_Expected_status_code_400,,,2019-04-05 15:26:08,2019-04-05 15:26:09,0.399s,PASSED
"name = ""Test Farm Id parameter""",,,2019-04-05 15:26:09,2019-04-05 15:26:09,0.000s,PASSED
"farmId = ""   """,,,2019-04-05 15:26:09,2019-04-05 15:26:09,0.000s,PASSED
"tokenUserName = ""jenny.maldonado.tx1@gmail.com""",,,2019-04-05 15:26:09,2019-04-05 15:26:09,0.001s,PASSED
"tokenPassword = ""cropmetrics""",,,2019-04-05 15:26:09,2019-04-05 15:26:09,0.000s,PASSED
"responseToken = sendRequest(findTestObject(""VoPro/Token"", [""usernameToken"":tokenUserName, ""passwordToken"":tokenPassword]))",,,2019-04-05 15:26:09,2019-04-05 15:26:09,0.100s,PASSED
slurper = new groovy.json.JsonSlurper(),,,2019-04-05 15:26:09,2019-04-05 15:26:09,0.001s,PASSED
tokenResult = slurper.parseText(responseToken.getResponseBodyContent()),,,2019-04-05 15:26:09,2019-04-05 15:26:09,0.000s,PASSED
accessToken = access_token,,,2019-04-05 15:26:09,2019-04-05 15:26:09,0.000s,PASSED
"println("".. Current access token generated for admin user : "" + accessToken)",,,2019-04-05 15:26:09,2019-04-05 15:26:09,0.001s,PASSED
"requestFarmPut = findTestObject(""VoGrow/Farm/FarmPut"", [""access_token"":accessToken, ""farmId"":farmId])",,,2019-04-05 15:26:09,2019-04-05 15:26:09,0.003s,PASSED
"bodyRequest = ""{""name"": """" + name + """"}""",,,2019-04-05 15:26:09,2019-04-05 15:26:09,0.000s,PASSED
try,,,2019-04-05 15:26:09,2019-04-05 15:26:09,0.002s,PASSED
responseFarm = sendRequest(requestFarmPut),,,2019-04-05 15:26:09,2019-04-05 15:26:09,0.012s,PASSED
"verifyResponseStatusCode(responseFarm, 400)",,,2019-04-05 15:26:09,2019-04-05 15:26:09,0.001s,PASSED
,,,,,,
Test Cases/VoGrow/API/Farm/Put/29 API_FARM_When_farm_updated_has_the_valid_farmid_parameter_but_different_of_the_user_token_Expected_status_code_400,,,2019-04-05 15:26:09,2019-04-05 15:26:14,4.969s,PASSED
"name = ""Test Farm Id parameter""",,,2019-04-05 15:26:09,2019-04-05 15:26:09,0.000s,PASSED
"farmId = ""3""",,,2019-04-05 15:26:09,2019-04-05 15:26:09,0.000s,PASSED
"tokenUserName = ""jenny.maldonado.tx@gmail.com""",,,2019-04-05 15:26:09,2019-04-05 15:26:09,0.000s,PASSED
"tokenPassword = ""cropmetrics""",,,2019-04-05 15:26:09,2019-04-05 15:26:09,0.001s,PASSED
"responseToken = sendRequest(findTestObject(""VoPro/Token"", [""usernameToken"":tokenUserName, ""passwordToken"":tokenPassword]))",,,2019-04-05 15:26:09,2019-04-05 15:26:09,0.092s,PASSED
slurper = new groovy.json.JsonSlurper(),,,2019-04-05 15:26:09,2019-04-05 15:26:09,0.000s,PASSED
tokenResult = slurper.parseText(responseToken.getResponseBodyContent()),,,2019-04-05 15:26:09,2019-04-05 15:26:09,0.000s,PASSED
accessToken = access_token,,,2019-04-05 15:26:09,2019-04-05 15:26:09,0.000s,PASSED
"println("".. Current access token generated for admin user : "" + accessToken)",,,2019-04-05 15:26:09,2019-04-05 15:26:09,0.001s,PASSED
"requestFarmPut = findTestObject(""VoGrow/Farm/FarmPut"", [""access_token"":accessToken, ""farmId"":farmId])",,,2019-04-05 15:26:09,2019-04-05 15:26:09,0.003s,PASSED
"bodyRequest = ""{""name"": """" + name + """"}""",,,2019-04-05 15:26:09,2019-04-05 15:26:09,0.000s,PASSED
try,,,2019-04-05 15:26:09,2019-04-05 15:26:09,0.001s,PASSED
responseFarm = sendRequest(requestFarmPut),,,2019-04-05 15:26:09,2019-04-05 15:26:14,4.604s,PASSED
"verifyResponseStatusCode(responseFarm, 400)",,,2019-04-05 15:26:14,2019-04-05 15:26:14,0.003s,PASSED
,,,,,,
Test Cases/VoGrow/API/Farm/Put/30 API_FARM_When_farm_updated_has_valid_farmid_parameter_but_different_of_user_token_Expected_properly_error_message_is_displayed,,,2019-04-05 15:26:14,2019-04-05 15:26:19,5.139s,PASSED
"name = ""Test Farm Id parameter""",,,2019-04-05 15:26:14,2019-04-05 15:26:14,0.001s,PASSED
"farmId = ""3""",,,2019-04-05 15:26:14,2019-04-05 15:26:14,0.000s,PASSED
"tokenUserName = ""jenny.maldonado.tx@gmail.com""",,,2019-04-05 15:26:14,2019-04-05 15:26:14,0.000s,PASSED
"tokenPassword = ""cropmetrics""",,,2019-04-05 15:26:14,2019-04-05 15:26:14,0.000s,PASSED
"responseToken = sendRequest(findTestObject(""VoPro/Token"", [""usernameToken"":tokenUserName, ""passwordToken"":tokenPassword]))",,,2019-04-05 15:26:14,2019-04-05 15:26:14,0.164s,PASSED
slurper = new groovy.json.JsonSlurper(),,,2019-04-05 15:26:14,2019-04-05 15:26:14,0.000s,PASSED
tokenResult = slurper.parseText(responseToken.getResponseBodyContent()),,,2019-04-05 15:26:14,2019-04-05 15:26:14,0.000s,PASSED
accessToken = access_token,,,2019-04-05 15:26:14,2019-04-05 15:26:14,0.001s,PASSED
"println("".. Current access token generated for admin user : "" + accessToken)",,,2019-04-05 15:26:14,2019-04-05 15:26:14,0.000s,PASSED
"requestFarmPut = findTestObject(""VoGrow/Farm/FarmPut"", [""access_token"":accessToken, ""farmId"":farmId])",,,2019-04-05 15:26:14,2019-04-05 15:26:14,0.003s,PASSED
"bodyRequest = ""{""name"": """" + name + """"}""",,,2019-04-05 15:26:14,2019-04-05 15:26:14,0.001s,PASSED
try,,,2019-04-05 15:26:14,2019-04-05 15:26:14,0.001s,PASSED
responseFarm = sendRequest(requestFarmPut),,,2019-04-05 15:26:14,2019-04-05 15:26:19,4.536s,PASSED
slurper1 = new groovy.json.JsonSlurper(),,,2019-04-05 15:26:19,2019-04-05 15:26:19,0.000s,PASSED
FarmPutResult = slurper1.parseText(responseFarm.getResponseBodyContent()),,,2019-04-05 15:26:19,2019-04-05 15:26:19,0.000s,PASSED
messageResponse = message,,,2019-04-05 15:26:19,2019-04-05 15:26:19,0.001s,PASSED
"messageExpected = ""The modifier doesn't have permissions to modify the farm requested.""",,,2019-04-05 15:26:19,2019-04-05 15:26:19,0.000s,PASSED
"println(""Error message response: "" + messageResponse)",,,2019-04-05 15:26:19,2019-04-05 15:26:19,0.000s,PASSED
"println(""Error message expected: "" + messageExpected)",,,2019-04-05 15:26:19,2019-04-05 15:26:19,0.001s,PASSED
"verifyElementPropertyValue(responseFarm, ""message"", messageExpected)",,,2019-04-05 15:26:19,2019-04-05 15:26:19,0.013s,PASSED
,,,,,,
Test Cases/VoGrow/API/Farm/Put/31 API_FARM_When_farm_updated_has_an_invalid_farmid_parameter_Expected_status_code_400,,,2019-04-05 15:26:19,2019-04-05 15:26:24,4.674s,PASSED
"name = ""Test Farm Id parameter""",,,2019-04-05 15:26:19,2019-04-05 15:26:19,0.000s,PASSED
"farmId = ""5555""",,,2019-04-05 15:26:19,2019-04-05 15:26:19,0.001s,PASSED
"tokenUserName = ""jenny.maldonado.tx1@gmail.com""",,,2019-04-05 15:26:19,2019-04-05 15:26:19,0.000s,PASSED
"tokenPassword = ""cropmetrics""",,,2019-04-05 15:26:19,2019-04-05 15:26:19,0.000s,PASSED
"responseToken = sendRequest(findTestObject(""VoPro/Token"", [""usernameToken"":tokenUserName, ""passwordToken"":tokenPassword]))",,,2019-04-05 15:26:19,2019-04-05 15:26:19,0.098s,PASSED
slurper = new groovy.json.JsonSlurper(),,,2019-04-05 15:26:19,2019-04-05 15:26:19,0.001s,PASSED
tokenResult = slurper.parseText(responseToken.getResponseBodyContent()),,,2019-04-05 15:26:19,2019-04-05 15:26:19,0.000s,PASSED
accessToken = access_token,,,2019-04-05 15:26:19,2019-04-05 15:26:19,0.000s,PASSED
"println("".. Current access token generated for admin user : "" + accessToken)",,,2019-04-05 15:26:19,2019-04-05 15:26:19,0.001s,PASSED
"requestFarmPut = findTestObject(""VoGrow/Farm/FarmPut"", [""access_token"":accessToken, ""farmId"":farmId])",,,2019-04-05 15:26:19,2019-04-05 15:26:19,0.004s,PASSED
"bodyRequest = ""{""name"": """" + name + """"}""",,,2019-04-05 15:26:19,2019-04-05 15:26:19,0.001s,PASSED
try,,,2019-04-05 15:26:19,2019-04-05 15:26:19,0.001s,PASSED
responseFarm = sendRequest(requestFarmPut),,,2019-04-05 15:26:19,2019-04-05 15:26:24,4.296s,PASSED
"verifyResponseStatusCode(responseFarm, 400)",,,2019-04-05 15:26:24,2019-04-05 15:26:24,0.002s,PASSED
,,,,,,
Test Cases/VoGrow/API/Farm/Put/32 API_FARM_When_farm_updated_has_an_invalid_farmid_parameter_Expected_properly_error_message_is_displayed,,,2019-04-05 15:26:24,2019-04-05 15:26:29,5.655s,PASSED
"name = ""Test Farm Id parameter""",,,2019-04-05 15:26:24,2019-04-05 15:26:24,0.001s,PASSED
"farmId = ""5555""",,,2019-04-05 15:26:24,2019-04-05 15:26:24,0.000s,PASSED
"tokenUserName = ""jenny.maldonado.tx1@gmail.com""",,,2019-04-05 15:26:24,2019-04-05 15:26:24,0.000s,PASSED
"tokenPassword = ""cropmetrics""",,,2019-04-05 15:26:24,2019-04-05 15:26:24,0.001s,PASSED
"responseToken = sendRequest(findTestObject(""VoPro/Token"", [""usernameToken"":tokenUserName, ""passwordToken"":tokenPassword]))",,,2019-04-05 15:26:24,2019-04-05 15:26:24,0.166s,PASSED
slurper = new groovy.json.JsonSlurper(),,,2019-04-05 15:26:24,2019-04-05 15:26:24,0.001s,PASSED
tokenResult = slurper.parseText(responseToken.getResponseBodyContent()),,,2019-04-05 15:26:24,2019-04-05 15:26:24,0.001s,PASSED
accessToken = access_token,,,2019-04-05 15:26:24,2019-04-05 15:26:24,0.000s,PASSED
"println("".. Current access token generated for admin user : "" + accessToken)",,,2019-04-05 15:26:24,2019-04-05 15:26:24,0.001s,PASSED
"requestFarmPut = findTestObject(""VoGrow/Farm/FarmPut"", [""access_token"":accessToken, ""farmId"":farmId])",,,2019-04-05 15:26:24,2019-04-05 15:26:24,0.004s,PASSED
"bodyRequest = ""{""name"": """" + name + """"}""",,,2019-04-05 15:26:24,2019-04-05 15:26:24,0.001s,PASSED
try,,,2019-04-05 15:26:24,2019-04-05 15:26:24,0.001s,PASSED
responseFarm = sendRequest(requestFarmPut),,,2019-04-05 15:26:24,2019-04-05 15:26:29,5.215s,PASSED
"verifyResponseStatusCode(responseFarm, 400)",,,2019-04-05 15:26:29,2019-04-05 15:26:29,0.006s,PASSED
slurper1 = new groovy.json.JsonSlurper(),,,2019-04-05 15:26:29,2019-04-05 15:26:29,0.001s,PASSED
FarmPutResult = slurper1.parseText(responseFarm.getResponseBodyContent()),,,2019-04-05 15:26:29,2019-04-05 15:26:29,0.000s,PASSED
messageResponse = message,,,2019-04-05 15:26:29,2019-04-05 15:26:29,0.000s,PASSED
"messageExpected = ""The farm id is not valid""",,,2019-04-05 15:26:29,2019-04-05 15:26:29,0.000s,PASSED
"println(""Error message response: "" + messageResponse)",,,2019-04-05 15:26:29,2019-04-05 15:26:29,0.000s,PASSED
"println(""Error message expected: "" + messageExpected)",,,2019-04-05 15:26:29,2019-04-05 15:26:29,0.000s,PASSED
"verifyElementPropertyValue(responseFarm, ""message"", messageExpected)",,,2019-04-05 15:26:29,2019-04-05 15:26:29,0.016s,PASSED
,,,,,,
Test Cases/VoGrow/API/Farm/Put/33 API_FARM_When_farm_is_updated_as_dealer_read_only_for_one_of_the_grower_assigned_Expected_status_code_201,,,2019-04-05 15:26:29,2019-04-05 15:26:30,0.586s,PASSED
"name = ""Farm 2 UPDATED by dealer read only""",,,2019-04-05 15:26:30,2019-04-05 15:26:30,0.000s,PASSED
"farmId = ""8""",,,2019-04-05 15:26:30,2019-04-05 15:26:30,0.001s,PASSED
"tokenUserName = ""jenny.maldonado.tx.agent.ro@gmail.com""",,,2019-04-05 15:26:30,2019-04-05 15:26:30,0.001s,PASSED
"tokenPassword = ""cropmetrics""",,,2019-04-05 15:26:30,2019-04-05 15:26:30,0.001s,PASSED
"responseToken = sendRequest(findTestObject(""VoPro/Token"", [""usernameToken"":tokenUserName, ""passwordToken"":tokenPassword]))",,,2019-04-05 15:26:30,2019-04-05 15:26:30,0.191s,PASSED
slurper = new groovy.json.JsonSlurper(),,,2019-04-05 15:26:30,2019-04-05 15:26:30,0.001s,PASSED
tokenResult = slurper.parseText(responseToken.getResponseBodyContent()),,,2019-04-05 15:26:30,2019-04-05 15:26:30,0.001s,PASSED
accessToken = access_token,,,2019-04-05 15:26:30,2019-04-05 15:26:30,0.000s,PASSED
"println("".. Current access token generated for dealer account : "" + accessToken)",,,2019-04-05 15:26:30,2019-04-05 15:26:30,0.000s,PASSED
"requestFarmPut = findTestObject(""VoGrow/Farm/FarmPut"", [""access_token"":accessToken, ""farmId"":farmId])",,,2019-04-05 15:26:30,2019-04-05 15:26:30,0.004s,PASSED
"bodyRequest = ""{""name"": """" + name + """"}""",,,2019-04-05 15:26:30,2019-04-05 15:26:30,0.000s,PASSED
try,,,2019-04-05 15:26:30,2019-04-05 15:26:30,0.002s,PASSED
responseFarm = sendRequest(requestFarmPut),,,2019-04-05 15:26:30,2019-04-05 15:26:30,0.051s,PASSED
"verifyResponseStatusCode(responseFarm, 200)",,,2019-04-05 15:26:30,2019-04-05 15:26:30,0.002s,PASSED
slurper1 = new groovy.json.JsonSlurper(),,,2019-04-05 15:26:30,2019-04-05 15:26:30,0.000s,PASSED
FarmPutResult = slurper1.parseText(responseFarm.getResponseBodyContent()),,,2019-04-05 15:26:30,2019-04-05 15:26:30,0.001s,PASSED
farmId = id,,,2019-04-05 15:26:30,2019-04-05 15:26:30,0.001s,PASSED
userId = user_id,,,2019-04-05 15:26:30,2019-04-05 15:26:30,0.000s,PASSED
"println(""The Farm updated has the next id:  "" + id)",,,2019-04-05 15:26:30,2019-04-05 15:26:30,0.001s,PASSED
"println(""The Farm updated has the next name:  "" + name)",,,2019-04-05 15:26:30,2019-04-05 15:26:30,0.001s,PASSED
"println(""New Farm updated has the user id:  "" + user_id)",,,2019-04-05 15:26:30,2019-04-05 15:26:30,0.000s,PASSED
"verifyElementPropertyValue(responseFarm, ""id"", farmId)",,,2019-04-05 15:26:30,2019-04-05 15:26:30,0.015s,PASSED
