{
  "log" : {
    "version" : "1.2",
    "creator" : {
      "name" : "BrowserMob Proxy",
      "version" : "2.1.5",
      "comment" : ""
    },
    "pages" : [ {
      "id" : "Page 0",
      "startedDateTime" : "2019-04-09T09:50:39.685Z",
      "title" : "Page 0",
      "pageTimings" : {
        "onLoad" : 4313,
        "comment" : ""
      },
      "comment" : ""
    } ],
    "entries" : [ {
      "pageref" : "Page 0",
      "startedDateTime" : "2019-04-09T09:50:39.686Z",
      "request" : {
        "method" : "PUT",
        "url" : "http://localhost:10520/WebAPI/api/mobile/v1/fields/14?",
        "httpVersion" : "HTTP/1.1",
        "cookies" : [ ],
        "headers" : [ {
          "name" : "User-Agent",
          "value" : "Katalon Studio"
        }, {
          "name" : "Content-Type",
          "value" : "application/json"
        }, {
          "name" : "Authorization",
          "value" : "Bearer eyJ0eXAiOiJKV1QiLCJhbGciOiJIUzI1NiJ9.eyJ1bmlxdWVfbmFtZSI6Implbm55Lm1hbGRvbmFkby50eDFAZ21haWwuY29tIiwicm9sZSI6InVzZXIiLCJzdWIiOiJqZW5ueS5tYWxkb25hZG8udHgxQGdtYWlsLmNvbSIsImlzcyI6IkNyb3BNZXRyaWNzIiwiYXVkIjoiYWxsIiwiZXhwIjoxNTU0ODA3MzM5LCJuYmYiOjE1NTQ4MDM0Mzl9.vtcxTAlhQqbtfbA6tWjyrRcNwXROXpEvzKiqQi6W0aw"
        }, {
          "name" : "Host",
          "value" : "localhost:10520"
        }, {
          "name" : "Accept",
          "value" : "text/html, image/gif, image/jpeg, *; q=.2, */*; q=.2"
        }, {
          "name" : "Proxy-Connection",
          "value" : "keep-alive"
        }, {
          "name" : "Content-Length",
          "value" : "490"
        } ],
        "queryString" : [ ],
        "postData" : {
          "mimeType" : "application/json",
          "text" : "{\"field\":{\"name\":\"128 chars as field name API FIELD When new field has name attribute with 128 chars Expected status code 201 API FIELD When new f\",\"boundary\":{\"boundaries\":[{\"boundary\":{\"coords\":[{\"x\":-101.49568751,\"y\":37.14976293},{\"x\":-101.50049403,\"y\":37.14647907},{\"x\":-101.50049403,\"y\":37.14264773},{\"x\":-101.49723246,\"y\":37.1411425},{\"x\":-101.49019435,\"y\":37.14223722},{\"x\":-101.48933604,\"y\":37.14620541},{\"x\":-101.49294093,\"y\":37.14866833},{\"x\":-101.49568751,\"y\":37.14976293}]}}]}}}",
          "comment" : ""
        },
        "headersSize" : 594,
        "bodySize" : 490,
        "comment" : ""
      },
      "response" : {
        "status" : 400,
        "statusText" : "Bad Request",
        "httpVersion" : "HTTP/1.1",
        "cookies" : [ {
          "name" : ".ASPROLES",
          "value" : "qCn27m0dUfgLHmD_m4BatY50MTdp5mJeGA7rIlonkVm4EZSmhsq5aUlz-NMQrw8tMFVSp7mJwLwJykVGBihOovQ-VPvwGwv0cD04YWs87M5NT1xNwrg2eSaq_7TBRik2_ZLJ1gYAIJkMNInv7fgV9C6_SYhpK1k43IzQe-uxMaPrlt4imFtuekJ5fMOgMbhbU-XhUGysEV1A6aJVCiMN4gEKqxwRauCr9oV-3RWsKdXAm3esjOvog-Lqo38vxh648Mgj46KbY9ltrYfbnOddHtRsz_ZLrvTzpm4KTQOUSwkDgnOyE28pKXtfZqFOwonr6aO10FXIa50V_7WVsH5Tag0Kdw8X-q0VPaw2oU6k10zES_XDYI6K2Y0BEQSMvqcfDb--8roQQckzGSLOpnJHfrQBaJL6e-n80uzAP1hoE4BnjAcyJMTinFDIc4PewpLYD388lvIL9kKdePO3BXunq_b1PtNb3uUvkDvMsy4J209nnqjWKfh6N94SOW_m4Q4BNmQcNTqtXgRGaJf3T8e2el4E5_g1",
          "path" : "/",
          "httpOnly" : true,
          "secure" : false,
          "comment" : ""
        } ],
        "headers" : [ {
          "name" : "Cache-Control",
          "value" : "private"
        }, {
          "name" : "Content-Type",
          "value" : "application/json; charset=utf-8"
        }, {
          "name" : "Server",
          "value" : "Microsoft-IIS/10.0"
        }, {
          "name" : "Set-Cookie",
          "value" : ".ASPROLES=qCn27m0dUfgLHmD_m4BatY50MTdp5mJeGA7rIlonkVm4EZSmhsq5aUlz-NMQrw8tMFVSp7mJwLwJykVGBihOovQ-VPvwGwv0cD04YWs87M5NT1xNwrg2eSaq_7TBRik2_ZLJ1gYAIJkMNInv7fgV9C6_SYhpK1k43IzQe-uxMaPrlt4imFtuekJ5fMOgMbhbU-XhUGysEV1A6aJVCiMN4gEKqxwRauCr9oV-3RWsKdXAm3esjOvog-Lqo38vxh648Mgj46KbY9ltrYfbnOddHtRsz_ZLrvTzpm4KTQOUSwkDgnOyE28pKXtfZqFOwonr6aO10FXIa50V_7WVsH5Tag0Kdw8X-q0VPaw2oU6k10zES_XDYI6K2Y0BEQSMvqcfDb--8roQQckzGSLOpnJHfrQBaJL6e-n80uzAP1hoE4BnjAcyJMTinFDIc4PewpLYD388lvIL9kKdePO3BXunq_b1PtNb3uUvkDvMsy4J209nnqjWKfh6N94SOW_m4Q4BNmQcNTqtXgRGaJf3T8e2el4E5_g1; path=/; HttpOnly"
        }, {
          "name" : "X-SourceFiles",
          "value" : "=?UTF-8?B?RDpcVmlydHVhbE9wdGltaXplci1SZWZhY3RvcmluZ1xDcm9wTWV0cmljcy5Wby5BcGlcQ3JvcE1ldHJpY3MuVm8uQXBpXGFwaVxtb2JpbGVcdjFcZmllbGRzXDE0?="
        }, {
          "name" : "X-Powered-By",
          "value" : "ASP.NET"
        }, {
          "name" : "Date",
          "value" : "Tue, 09 Apr 2019 09:50:43 GMT"
        }, {
          "name" : "Content-Length",
          "value" : "40"
        } ],
        "content" : {
          "size" : 40,
          "mimeType" : "application/json; charset=utf-8",
          "text" : "{\"message\":\"The field id is not valid.\"}",
          "comment" : ""
        },
        "redirectURL" : "",
        "headersSize" : 944,
        "bodySize" : 40,
        "comment" : ""
      },
      "cache" : { },
      "timings" : {
        "comment" : "",
        "ssl" : -1,
        "connect" : -1,
        "blocked" : -1,
        "dns" : -1,
        "send" : 0,
        "receive" : 0,
        "wait" : 4308
      },
      "serverIPAddress" : "127.0.0.1",
      "comment" : "",
      "_katalonRequestInformation" : {
        "name" : "37",
        "testObjectId" : "Object Repository/VoGrow/Field/FieldPut",
        "harId" : "9bcd09e6-14db-442a-8d1f-b8b861d6f74c"
      },
      "time" : 4309
    } ],
    "comment" : ""
  }
}