{
  "log" : {
    "version" : "1.2",
    "creator" : {
      "name" : "BrowserMob Proxy",
      "version" : "2.1.5",
      "comment" : ""
    },
    "pages" : [ {
      "id" : "Page 0",
      "startedDateTime" : "2019-04-11T16:04:58.654Z",
      "title" : "Page 0",
      "pageTimings" : {
        "onLoad" : 3277,
        "comment" : ""
      },
      "comment" : ""
    } ],
    "entries" : [ {
      "pageref" : "Page 0",
      "startedDateTime" : "2019-04-11T16:04:58.656Z",
      "request" : {
        "method" : "PUT",
        "url" : "http://localhost:10520/WebAPI/api/mobile/v1/farms/7?",
        "httpVersion" : "HTTP/1.1",
        "cookies" : [ ],
        "headers" : [ {
          "name" : "User-Agent",
          "value" : "Katalon Studio"
        }, {
          "name" : "Content-Type",
          "value" : "application/json"
        }, {
          "name" : "Authorization",
          "value" : "Bearer eyJ0eXAiOiJKV1QiLCJhbGciOiJIUzI1NiJ9.eyJ1bmlxdWVfbmFtZSI6Implbm55Lm1hbGRvbmFkby50eDFAZ21haWwuY29tIiwicm9sZSI6InVzZXIiLCJzdWIiOiJqZW5ueS5tYWxkb25hZG8udHgxQGdtYWlsLmNvbSIsImlzcyI6IkNyb3BNZXRyaWNzIiwiYXVkIjoiYWxsIiwiZXhwIjoxNTU1MDAyNTk4LCJuYmYiOjE1NTQ5OTg2OTh9.V6ClfAYwEvlEV85i8Efc9IOGKqUVsNkW1IMrriJAvs4"
        }, {
          "name" : "Host",
          "value" : "localhost:10520"
        }, {
          "name" : "Accept",
          "value" : "text/html, image/gif, image/jpeg, *; q=.2, */*; q=.2"
        }, {
          "name" : "Proxy-Connection",
          "value" : "keep-alive"
        }, {
          "name" : "Content-Length",
          "value" : "195"
        } ],
        "queryString" : [ ],
        "postData" : {
          "mimeType" : "application/json",
          "text" : "{\"name\": \"API_FARM_When_new_farm_has_name_attribute_with_more_than_128_chars_Expected_status_code_400 API_FARM_When_new_farm_has_name_attribute_with_more_than_128_chars_Expected_status_code_400\"}",
          "comment" : ""
        },
        "headersSize" : 592,
        "bodySize" : 195,
        "comment" : ""
      },
      "response" : {
        "status" : 400,
        "statusText" : "Bad Request",
        "httpVersion" : "HTTP/1.1",
        "cookies" : [ {
          "name" : ".ASPROLES",
          "value" : "s4vRH9HjMNrK_H_nFKbQd1Im6K_3SoQlSTNwHF_laFEkP3M4DuTPSYW2FJCZNBbKyWXiV6iejaj-fNlYo46ATXOK7WP9KDNrB0Br-1OMWwt8GJfl6T0K1lYd3M1eU5yiestoJH5QEyxlHiWYu-PnSiODsNkmGImjsX8RJMP9nkDPk3pJ4Zc_Gexp3BOIHwC_jF3nHztmtjozueIBap2eMmgiKUA7mt_x_e5FgAnYiCLv5K596IqKpWwP12H0LXmiOZhh7n2l5gBzd1SD1GUcrPljMFU4Ww0yE9KbTKCeOJ8XaJw5r-yHJuoCsgaeMUgh91WfhL5srZJ9LNIkIAvdAklrtdh0Pcl2G4iXpsuS6sRZaq_xCP-JCtte-QLfBJzFW5CPANXLhG_OLu6Ie-HRYzezgI8I1DuFx7AJ6DyravIHUMxrjG85GMu7l7EXlR5Rd9e8v9hqyv7AN4C7g6vgJVps41op6ZVoOoX-ypUAFvBypd3QS8j9C1h1kniSt8pDT_m7ZRq4PkkzqM1PSo6QxDNRA_E1",
          "path" : "/",
          "httpOnly" : true,
          "secure" : false,
          "comment" : ""
        } ],
        "headers" : [ {
          "name" : "Cache-Control",
          "value" : "private"
        }, {
          "name" : "Content-Type",
          "value" : "application/json; charset=utf-8"
        }, {
          "name" : "Server",
          "value" : "Microsoft-IIS/10.0"
        }, {
          "name" : "Set-Cookie",
          "value" : ".ASPROLES=s4vRH9HjMNrK_H_nFKbQd1Im6K_3SoQlSTNwHF_laFEkP3M4DuTPSYW2FJCZNBbKyWXiV6iejaj-fNlYo46ATXOK7WP9KDNrB0Br-1OMWwt8GJfl6T0K1lYd3M1eU5yiestoJH5QEyxlHiWYu-PnSiODsNkmGImjsX8RJMP9nkDPk3pJ4Zc_Gexp3BOIHwC_jF3nHztmtjozueIBap2eMmgiKUA7mt_x_e5FgAnYiCLv5K596IqKpWwP12H0LXmiOZhh7n2l5gBzd1SD1GUcrPljMFU4Ww0yE9KbTKCeOJ8XaJw5r-yHJuoCsgaeMUgh91WfhL5srZJ9LNIkIAvdAklrtdh0Pcl2G4iXpsuS6sRZaq_xCP-JCtte-QLfBJzFW5CPANXLhG_OLu6Ie-HRYzezgI8I1DuFx7AJ6DyravIHUMxrjG85GMu7l7EXlR5Rd9e8v9hqyv7AN4C7g6vgJVps41op6ZVoOoX-ypUAFvBypd3QS8j9C1h1kniSt8pDT_m7ZRq4PkkzqM1PSo6QxDNRA_E1; path=/; HttpOnly"
        }, {
          "name" : "X-SourceFiles",
          "value" : "=?UTF-8?B?RDpcVmlydHVhbE9wdGltaXplci1SZWZhY3RvcmluZ1xDcm9wTWV0cmljcy5Wby5BcGlcQ3JvcE1ldHJpY3MuVm8uQXBpXGFwaVxtb2JpbGVcdjFcZmFybXNcNw==?="
        }, {
          "name" : "X-Powered-By",
          "value" : "ASP.NET"
        }, {
          "name" : "Date",
          "value" : "Thu, 11 Apr 2019 16:05:01 GMT"
        }, {
          "name" : "Content-Length",
          "value" : "64"
        } ],
        "content" : {
          "size" : 64,
          "mimeType" : "application/json; charset=utf-8",
          "text" : "{\"message\":\"The farm name must contains as max 128 characters.\"}",
          "comment" : ""
        },
        "redirectURL" : "",
        "headersSize" : 944,
        "bodySize" : 64,
        "comment" : ""
      },
      "cache" : { },
      "timings" : {
        "comment" : "",
        "send" : 0,
        "receive" : 1,
        "dns" : -1,
        "wait" : 3269,
        "connect" : -1,
        "blocked" : -1,
        "ssl" : -1
      },
      "serverIPAddress" : "127.0.0.1",
      "comment" : "",
      "_katalonRequestInformation" : {
        "name" : "9",
        "testObjectId" : "Object Repository/VoGrow/Farm/FarmPut",
        "harId" : "d65ec795-5aee-4724-b4c3-09191f5273f9"
      },
      "time" : 3271
    } ],
    "comment" : ""
  }
}