{
  "log" : {
    "version" : "1.2",
    "creator" : {
      "name" : "BrowserMob Proxy",
      "version" : "2.1.5",
      "comment" : ""
    },
    "pages" : [ {
      "id" : "Page 0",
      "startedDateTime" : "2019-03-27T19:52:45.811Z",
      "title" : "Page 0",
      "pageTimings" : {
        "onLoad" : 133,
        "comment" : ""
      },
      "comment" : ""
    } ],
    "entries" : [ {
      "pageref" : "Page 0",
      "startedDateTime" : "2019-03-27T19:52:45.814Z",
      "request" : {
        "method" : "DELETE",
        "url" : "http://localhost:10520/WebAPI/api/User/testaccountkatalon?",
        "httpVersion" : "HTTP/1.1",
        "cookies" : [ ],
        "headers" : [ {
          "name" : "User-Agent",
          "value" : "Katalon Studio"
        }, {
          "name" : "Authorization",
          "value" : "Bearer eyJ0eXAiOiJKV1QiLCJhbGciOiJIUzI1NiJ9.eyJ1bmlxdWVfbmFtZSI6ImFkbWluIiwicm9sZSI6InVzZXIiLCJzdWIiOiJhZG1pbiIsImlzcyI6IkNyb3BNZXRyaWNzIiwiYXVkIjoiYWxsIiwiZXhwIjoxNTUzNzIwMjY1LCJuYmYiOjE1NTM3MTYzNjV9.nhbRPlXEenYEyUUNXOzO_eK6cTAdE1wR3VK9gyD4nEo"
        }, {
          "name" : "Content-Type",
          "value" : "application/x-www-form-urlencoded"
        }, {
          "name" : "Host",
          "value" : "localhost:10520"
        }, {
          "name" : "Accept",
          "value" : "text/html, image/gif, image/jpeg, *; q=.2, */*; q=.2"
        }, {
          "name" : "Proxy-Connection",
          "value" : "keep-alive"
        }, {
          "name" : "Content-Length",
          "value" : "0"
        } ],
        "queryString" : [ ],
        "headersSize" : 552,
        "bodySize" : 0,
        "comment" : ""
      },
      "response" : {
        "status" : 200,
        "statusText" : "OK",
        "httpVersion" : "HTTP/1.1",
        "cookies" : [ {
          "name" : ".ASPROLES",
          "value" : "hvtwrOgDjZ-4N7mbGsaEV6ZAJvxJexrJ6sVWLESR9TmUZeQsgJQ40ZMsr4nhJb4O7RZH3wwUh2PySuK099UBi23uL6hVzE5F62YAR4IaGb82bSzhcAeqzJsRAE9PpItCrhqC-Q03kk54D04valLPhLzWkF02mjBIfZGS6PaCsSS5oLjcY0pU85c9FGuufGDOQmTpebSvzTIrGLzwMl3EXRU99zonAVBJfjbqbEwd8CzEUYWjM59yuU8x3-T84YfNWEKwNvibwRenSlV_SWHEC2qiRXEo1oBnGxUOCdeURU5xSYeJHRsTIWJqyfvb-m8ywo1ss-im62NBQ_1haa_K9xSR2k3wdzPIsQggMaSmZhrkmRpkGikKu7_6dWyKbhLjaYZTCjWehzvLYRUqNAcpXfApvhqqJhMa0B5YkXG9EEkNz7TsoaLoADQd3cFYC2vyoBYvZdHumnDJKLb5SYKcjWo-9rHWM3s34XDkzfqTcwCLsQAg0",
          "path" : "/",
          "httpOnly" : true,
          "secure" : false,
          "comment" : ""
        } ],
        "headers" : [ {
          "name" : "Cache-Control",
          "value" : "private"
        }, {
          "name" : "Server",
          "value" : "Microsoft-IIS/10.0"
        }, {
          "name" : "Set-Cookie",
          "value" : ".ASPROLES=hvtwrOgDjZ-4N7mbGsaEV6ZAJvxJexrJ6sVWLESR9TmUZeQsgJQ40ZMsr4nhJb4O7RZH3wwUh2PySuK099UBi23uL6hVzE5F62YAR4IaGb82bSzhcAeqzJsRAE9PpItCrhqC-Q03kk54D04valLPhLzWkF02mjBIfZGS6PaCsSS5oLjcY0pU85c9FGuufGDOQmTpebSvzTIrGLzwMl3EXRU99zonAVBJfjbqbEwd8CzEUYWjM59yuU8x3-T84YfNWEKwNvibwRenSlV_SWHEC2qiRXEo1oBnGxUOCdeURU5xSYeJHRsTIWJqyfvb-m8ywo1ss-im62NBQ_1haa_K9xSR2k3wdzPIsQggMaSmZhrkmRpkGikKu7_6dWyKbhLjaYZTCjWehzvLYRUqNAcpXfApvhqqJhMa0B5YkXG9EEkNz7TsoaLoADQd3cFYC2vyoBYvZdHumnDJKLb5SYKcjWo-9rHWM3s34XDkzfqTcwCLsQAg0; path=/; HttpOnly"
        }, {
          "name" : "X-SourceFiles",
          "value" : "=?UTF-8?B?RDpcVmlydHVhbE9wdGltaXplci1SZWZhY3RvcmluZ1xDcm9wTWV0cmljcy5Wby5BcGlcQ3JvcE1ldHJpY3MuVm8uQXBpXGFwaVxVc2VyXHRlc3RhY2NvdW50a2F0YWxvbg==?="
        }, {
          "name" : "X-Powered-By",
          "value" : "ASP.NET"
        }, {
          "name" : "Date",
          "value" : "Wed, 27 Mar 2019 19:52:45 GMT"
        }, {
          "name" : "Content-Length",
          "value" : "0"
        } ],
        "content" : {
          "size" : 0,
          "mimeType" : "",
          "comment" : ""
        },
        "redirectURL" : "",
        "headersSize" : 852,
        "bodySize" : -1,
        "comment" : ""
      },
      "cache" : { },
      "timings" : {
        "comment" : "",
        "ssl" : -1,
        "send" : 0,
        "receive" : 0,
        "wait" : 117,
        "connect" : -1,
        "blocked" : -1,
        "dns" : -1
      },
      "serverIPAddress" : "127.0.0.1",
      "comment" : "",
      "_katalonRequestInformation" : {
        "name" : "3",
        "testObjectId" : "Object Repository/VoPro/User/DeleteUser",
        "harId" : "58a8eded-185b-4572-a8da-dcc2f344e1ac"
      },
      "time" : 118
    } ],
    "comment" : ""
  }
}