{
  "log" : {
    "version" : "1.2",
    "creator" : {
      "name" : "BrowserMob Proxy",
      "version" : "2.1.5",
      "comment" : ""
    },
    "pages" : [ {
      "id" : "Page 0",
      "startedDateTime" : "2019-04-11T16:41:39.559Z",
      "title" : "Page 0",
      "pageTimings" : {
        "onLoad" : 1428,
        "comment" : ""
      },
      "comment" : ""
    } ],
    "entries" : [ {
      "pageref" : "Page 0",
      "startedDateTime" : "2019-04-11T16:41:39.561Z",
      "request" : {
        "method" : "POST",
        "url" : "http://localhost:10520/WebAPI/api/mobile/v1/fields?",
        "httpVersion" : "HTTP/1.1",
        "cookies" : [ ],
        "headers" : [ {
          "name" : "User-Agent",
          "value" : "Katalon Studio"
        }, {
          "name" : "Content-Type",
          "value" : "application/json"
        }, {
          "name" : "Authorization",
          "value" : "Bearer eyJ0eXAiOiJKV1QiLCJhbGciOiJIUzI1NiJ9.eyJ1bmlxdWVfbmFtZSI6Implbm55Lm1hbGRvbmFkby50eDFAZ21haWwuY29tIiwicm9sZSI6InVzZXIiLCJzdWIiOiJqZW5ueS5tYWxkb25hZG8udHgxQGdtYWlsLmNvbSIsImlzcyI6IkNyb3BNZXRyaWNzIiwiYXVkIjoiYWxsIiwiZXhwIjoxNTU1MDA0Nzk5LCJuYmYiOjE1NTUwMDA4OTl9.dL2PI0J4ArOWXzOmBVFF-Ue7FxC6AbhNGbnk1ov_GLI"
        }, {
          "name" : "Host",
          "value" : "localhost:10520"
        }, {
          "name" : "Accept",
          "value" : "text/html, image/gif, image/jpeg, *; q=.2, */*; q=.2"
        }, {
          "name" : "Proxy-Connection",
          "value" : "keep-alive"
        }, {
          "name" : "Content-Length",
          "value" : "397"
        } ],
        "queryString" : [ ],
        "postData" : {
          "mimeType" : "application/json",
          "text" : "{\"field\":{\"farm_id\":2,\"name\":\"Field by dealer account\",\"boundary\":{\"boundaries\":[{\"boundary\":{\"coords\":[{\"x\":-101.49568751,\"y\":37.14976293},{\"x\":-101.50049403,\"y\":37.14647907},{\"x\":-101.50049403,\"y\":37.14264773},{\"x\":-101.49723246,\"y\":37.1411425},{\"x\":-101.49019435,\"y\":37.14223722},{\"x\":-101.48933604,\"y\":37.14620541},{\"x\":-101.49294093,\"y\":37.14866833},{\"x\":-101.49568751,\"y\":37.14976293}]}}]}}}",
          "comment" : ""
        },
        "headersSize" : 592,
        "bodySize" : 397,
        "comment" : ""
      },
      "response" : {
        "status" : 201,
        "statusText" : "Created",
        "httpVersion" : "HTTP/1.1",
        "cookies" : [ {
          "name" : ".ASPROLES",
          "value" : "_etwFEQOAnF1YPEnQpZxRf3sH1lU6nJExV2fq5e4SvT6ZuHc3j05RQOX04x86JBBvDeL6HlyBVcVnewSDa_bv_pkjjgThFzktHrBZQgi6Fk69nbEHDpYsVQzVtlUKaprMTcynCJSQ74WO-AySJjQMocQ8kMz4ORVAe-f7ArVzLmFYrS-4dCivldAX_AiSdTtdrsI2fMc7qpMVQWD7j41Cg2DcUjQFtxZsE2adY1bHSqAjrOzvCMd0cp19ZyNO9ixdghOcGrvAd642XqS5lShcapaZgZDQVuYk67_nfZZA-DzOHMRMrA7hdha-_5swbQvNQHqCm6IOIpRnON2glfaU6WN889PWiptW7CTeNWYw_iN1QCH7fvc4XbG5GvCmQ1WubghLwDrnm86b_8eFhfyXwR2GZZGoEUPCCC16fUB2BGtktezOeNyJtRH0JcTMwTa3M1tnu6bGvUvwKZjC8T9_Rs9clAcXzn_JY1M53-IsFui65YQ8tXAY_37iJlQ50BORQJ5vaVeRZyVPeZL4bUcoZ1O8mk1",
          "path" : "/",
          "httpOnly" : true,
          "secure" : false,
          "comment" : ""
        } ],
        "headers" : [ {
          "name" : "Cache-Control",
          "value" : "private"
        }, {
          "name" : "Content-Type",
          "value" : "application/json; charset=utf-8"
        }, {
          "name" : "Location",
          "value" : "api/mobile/v1/fields/3"
        }, {
          "name" : "Server",
          "value" : "Microsoft-IIS/10.0"
        }, {
          "name" : "Set-Cookie",
          "value" : ".ASPROLES=_etwFEQOAnF1YPEnQpZxRf3sH1lU6nJExV2fq5e4SvT6ZuHc3j05RQOX04x86JBBvDeL6HlyBVcVnewSDa_bv_pkjjgThFzktHrBZQgi6Fk69nbEHDpYsVQzVtlUKaprMTcynCJSQ74WO-AySJjQMocQ8kMz4ORVAe-f7ArVzLmFYrS-4dCivldAX_AiSdTtdrsI2fMc7qpMVQWD7j41Cg2DcUjQFtxZsE2adY1bHSqAjrOzvCMd0cp19ZyNO9ixdghOcGrvAd642XqS5lShcapaZgZDQVuYk67_nfZZA-DzOHMRMrA7hdha-_5swbQvNQHqCm6IOIpRnON2glfaU6WN889PWiptW7CTeNWYw_iN1QCH7fvc4XbG5GvCmQ1WubghLwDrnm86b_8eFhfyXwR2GZZGoEUPCCC16fUB2BGtktezOeNyJtRH0JcTMwTa3M1tnu6bGvUvwKZjC8T9_Rs9clAcXzn_JY1M53-IsFui65YQ8tXAY_37iJlQ50BORQJ5vaVeRZyVPeZL4bUcoZ1O8mk1; path=/; HttpOnly"
        }, {
          "name" : "X-SourceFiles",
          "value" : "=?UTF-8?B?RDpcVmlydHVhbE9wdGltaXplci1SZWZhY3RvcmluZ1xDcm9wTWV0cmljcy5Wby5BcGlcQ3JvcE1ldHJpY3MuVm8uQXBpXGFwaVxtb2JpbGVcdjFcZmllbGRz?="
        }, {
          "name" : "X-Powered-By",
          "value" : "ASP.NET"
        }, {
          "name" : "Date",
          "value" : "Thu, 11 Apr 2019 16:41:40 GMT"
        }, {
          "name" : "Content-Length",
          "value" : "417"
        } ],
        "content" : {
          "size" : 417,
          "mimeType" : "application/json; charset=utf-8",
          "text" : "{\"field\":{\"id\":3,\"farm_id\":2,\"name\":\"Field by dealer account\",\"boundary\":{\"boundaries\":[{\"boundary\":{\"coords\":[{\"x\":-101.49568751,\"y\":37.14976293},{\"x\":-101.49294093,\"y\":37.14866833},{\"x\":-101.48933604,\"y\":37.14620541},{\"x\":-101.49019435,\"y\":37.14223722},{\"x\":-101.49723246,\"y\":37.1411425},{\"x\":-101.50049403,\"y\":37.14264773},{\"x\":-101.50049403,\"y\":37.14647907},{\"x\":-101.49568751,\"y\":37.14976293}]},\"holes\":null}]}}}",
          "comment" : ""
        },
        "redirectURL" : "",
        "headersSize" : 971,
        "bodySize" : 417,
        "comment" : ""
      },
      "cache" : { },
      "timings" : {
        "comment" : "",
        "send" : 0,
        "wait" : 1418,
        "receive" : 2,
        "connect" : -1,
        "blocked" : -1,
        "dns" : -1,
        "ssl" : -1
      },
      "serverIPAddress" : "127.0.0.1",
      "comment" : "",
      "_katalonRequestInformation" : {
        "name" : "9",
        "testObjectId" : "Object Repository/VoGrow/Field/FieldPost",
        "harId" : "dd5bb722-c2ae-4787-a608-9bd1ff2328d9"
      },
      "time" : 1421
    } ],
    "comment" : ""
  }
}