{
  "log" : {
    "version" : "1.2",
    "creator" : {
      "name" : "BrowserMob Proxy",
      "version" : "2.1.5",
      "comment" : ""
    },
    "pages" : [ {
      "id" : "Page 0",
      "startedDateTime" : "2019-04-01T13:34:25.635Z",
      "title" : "Page 0",
      "pageTimings" : {
        "onLoad" : 1822,
        "comment" : ""
      },
      "comment" : ""
    } ],
    "entries" : [ {
      "pageref" : "Page 0",
      "startedDateTime" : "2019-04-01T13:34:25.637Z",
      "request" : {
        "method" : "POST",
        "url" : "http://localhost:10520/WebAPI/api/admin/v1/users/?",
        "httpVersion" : "HTTP/1.1",
        "cookies" : [ ],
        "headers" : [ {
          "name" : "User-Agent",
          "value" : "Katalon Studio"
        }, {
          "name" : "Content-Type",
          "value" : "application/x-www-form-urlencoded"
        }, {
          "name" : "Authorization",
          "value" : "Bearer eyJ0eXAiOiJKV1QiLCJhbGciOiJIUzI1NiJ9.eyJ1bmlxdWVfbmFtZSI6ImFkbWluIiwicm9sZSI6InVzZXIiLCJzdWIiOiJhZG1pbiIsImlzcyI6IkNyb3BNZXRyaWNzIiwiYXVkIjoiYWxsIiwiZXhwIjoxNTU0MTI5NTY1LCJuYmYiOjE1NTQxMjU2NjV9.LgCES7GFG8fYiaxP4xQ-l7srLWu-pY3xhE2252xR5PM"
        }, {
          "name" : "Host",
          "value" : "localhost:10520"
        }, {
          "name" : "Accept",
          "value" : "text/html, image/gif, image/jpeg, *; q=.2, */*; q=.2"
        }, {
          "name" : "Proxy-Connection",
          "value" : "keep-alive"
        }, {
          "name" : "Content-Length",
          "value" : "326"
        } ],
        "queryString" : [ ],
        "postData" : {
          "mimeType" : "application/x-www-form-urlencoded",
          "params" : [ {
            "name" : "password",
            "value" : "cropmetrics",
            "comment" : ""
          }, {
            "name" : "email",
            "value" : "cropmetricsvo.phone.space@gmail.com",
            "comment" : ""
          }, {
            "name" : "fullname",
            "value" : "test validation",
            "comment" : ""
          }, {
            "name" : "phone",
            "value" : "one five nine",
            "comment" : ""
          }, {
            "name" : "dealer",
            "value" : "dealer test validation",
            "comment" : ""
          }, {
            "name" : "addressLine1",
            "value" : "address line 1 test validation",
            "comment" : ""
          }, {
            "name" : "addressLine2",
            "value" : "address line 1 test validation",
            "comment" : ""
          }, {
            "name" : "town",
            "value" : "townValidation",
            "comment" : ""
          }, {
            "name" : "state",
            "value" : "stateValidation",
            "comment" : ""
          }, {
            "name" : "zip",
            "value" : "zipValidation",
            "comment" : ""
          }, {
            "name" : "country",
            "value" : "countryValidation",
            "comment" : ""
          }, {
            "name" : "roles",
            "value" : "Client",
            "comment" : ""
          } ],
          "comment" : ""
        },
        "headersSize" : 544,
        "bodySize" : 326,
        "comment" : ""
      },
      "response" : {
        "status" : 200,
        "statusText" : "OK",
        "httpVersion" : "HTTP/1.1",
        "cookies" : [ {
          "name" : ".ASPROLES",
          "value" : "QG27g7GZ4GmfjWuoglT8pJ3UbKlqQRilSLsirjNIDao-W0xUWT8oZKgXIxCoECuWw6IvBdvTXKSIet5RFY_PHBKSjJz3EM2VkK9qPO8rqQTQ10RdfnZjYCoUJC10lhXN4flh_hbUkwO0GKH8kzrUkknA2FKCr-TX-dRr0XruKlY_Ij-WGlgbPhXuCEvme7ZRf18zCnnDyuHNw_cEB-NFlE-WmGxSGivKHzp_CYFwydIxyA57nbsaWoe8Mme7Zw2AQHpA3_d4PX06zU9qzB7wUrabO4pW74tM8KIohahZbh7iI44_bAhVPqSHPGmVNz0L0OIVBjg48BOyFZYlsJF-7GCURvJYj9nTvkdYgwbfP53hOZYri2drAh28wXh6AWpW0ZCzbWi-cMUQFrDsat0ffzoFg5Qk8vYajUK-mRlBVWi3My8XtKsOxp-zO5J96Hlj_1i2Iwx-2SrdkKaAnxsuQK9gSOZl8VPBHjElh7jnqVHC3SEP0",
          "path" : "/",
          "httpOnly" : true,
          "secure" : false,
          "comment" : ""
        } ],
        "headers" : [ {
          "name" : "Cache-Control",
          "value" : "private"
        }, {
          "name" : "Content-Type",
          "value" : "application/json; charset=utf-8"
        }, {
          "name" : "Server",
          "value" : "Microsoft-IIS/10.0"
        }, {
          "name" : "Set-Cookie",
          "value" : ".ASPROLES=QG27g7GZ4GmfjWuoglT8pJ3UbKlqQRilSLsirjNIDao-W0xUWT8oZKgXIxCoECuWw6IvBdvTXKSIet5RFY_PHBKSjJz3EM2VkK9qPO8rqQTQ10RdfnZjYCoUJC10lhXN4flh_hbUkwO0GKH8kzrUkknA2FKCr-TX-dRr0XruKlY_Ij-WGlgbPhXuCEvme7ZRf18zCnnDyuHNw_cEB-NFlE-WmGxSGivKHzp_CYFwydIxyA57nbsaWoe8Mme7Zw2AQHpA3_d4PX06zU9qzB7wUrabO4pW74tM8KIohahZbh7iI44_bAhVPqSHPGmVNz0L0OIVBjg48BOyFZYlsJF-7GCURvJYj9nTvkdYgwbfP53hOZYri2drAh28wXh6AWpW0ZCzbWi-cMUQFrDsat0ffzoFg5Qk8vYajUK-mRlBVWi3My8XtKsOxp-zO5J96Hlj_1i2Iwx-2SrdkKaAnxsuQK9gSOZl8VPBHjElh7jnqVHC3SEP0; path=/; HttpOnly"
        }, {
          "name" : "X-SourceFiles",
          "value" : "=?UTF-8?B?RDpcVmlydHVhbE9wdGltaXplci1SZWZhY3RvcmluZ1xDcm9wTWV0cmljcy5Wby5BcGlcQ3JvcE1ldHJpY3MuVm8uQXBpXGFwaVxhZG1pblx2MVx1c2Vyc1w=?="
        }, {
          "name" : "X-Powered-By",
          "value" : "ASP.NET"
        }, {
          "name" : "Date",
          "value" : "Mon, 01 Apr 2019 13:34:27 GMT"
        }, {
          "name" : "Content-Length",
          "value" : "8"
        } ],
        "content" : {
          "size" : 8,
          "mimeType" : "application/json; charset=utf-8",
          "text" : "{\"id\":5}",
          "comment" : ""
        },
        "redirectURL" : "",
        "headersSize" : 887,
        "bodySize" : 8,
        "comment" : ""
      },
      "cache" : { },
      "timings" : {
        "comment" : "",
        "ssl" : -1,
        "wait" : 1816,
        "receive" : 1,
        "send" : 0,
        "dns" : -1,
        "blocked" : -1,
        "connect" : -1
      },
      "serverIPAddress" : "127.0.0.1",
      "comment" : "",
      "_katalonRequestInformation" : {
        "name" : "15",
        "testObjectId" : "Object Repository/VoPro/Account/api_admin_v1_users",
        "harId" : "730b7133-0a2f-4d6e-998d-01350180efa4"
      },
      "time" : 1818
    } ],
    "comment" : ""
  }
}