{
  "log" : {
    "version" : "1.2",
    "creator" : {
      "name" : "BrowserMob Proxy",
      "version" : "2.1.5",
      "comment" : ""
    },
    "pages" : [ {
      "id" : "Page 0",
      "startedDateTime" : "2019-04-09T21:27:29.433Z",
      "title" : "Page 0",
      "pageTimings" : {
        "onLoad" : 4280,
        "comment" : ""
      },
      "comment" : ""
    } ],
    "entries" : [ {
      "pageref" : "Page 0",
      "startedDateTime" : "2019-04-09T21:27:29.433Z",
      "request" : {
        "method" : "PUT",
        "url" : "http://localhost:10520/WebAPI/api/mobile/v1/fields/3?",
        "httpVersion" : "HTTP/1.1",
        "cookies" : [ ],
        "headers" : [ {
          "name" : "User-Agent",
          "value" : "Katalon Studio"
        }, {
          "name" : "Content-Type",
          "value" : "application/json"
        }, {
          "name" : "Authorization",
          "value" : "Bearer eyJ0eXAiOiJKV1QiLCJhbGciOiJIUzI1NiJ9.eyJ1bmlxdWVfbmFtZSI6Implbm55Lm1hbGRvbmFkby50eDFAZ21haWwuY29tIiwicm9sZSI6InVzZXIiLCJzdWIiOiJqZW5ueS5tYWxkb25hZG8udHgxQGdtYWlsLmNvbSIsImlzcyI6IkNyb3BNZXRyaWNzIiwiYXVkIjoiYWxsIiwiZXhwIjoxNTU0ODQ5MTQ5LCJuYmYiOjE1NTQ4NDUyNDl9.QVg_OKaMj4IA_NsTO8daQR7Vn9dVeFDlj0j4Hq8FYrg"
        }, {
          "name" : "Host",
          "value" : "localhost:10520"
        }, {
          "name" : "Accept",
          "value" : "text/html, image/gif, image/jpeg, *; q=.2, */*; q=.2"
        }, {
          "name" : "Proxy-Connection",
          "value" : "keep-alive"
        }, {
          "name" : "Content-Length",
          "value" : "401"
        } ],
        "queryString" : [ ],
        "postData" : {
          "mimeType" : "application/json",
          "text" : "{\"field\":{\"name\":\"Field whit invalid y value on boundary\",\"boundary\":{\"boundaries\":[{\"boundary\":{\"coords\":[{\"x\":-101.49568751,\"y\":137.14976293},{\"x\":-101.50049403,\"y\":37.14647907},{\"x\":-101.50049403,\"y\":37.14264773},{\"x\":-101.49723246,\"y\":37.1411425},{\"x\":-101.49019435,\"y\":37.14223722},{\"x\":-101.48933604,\"y\":37.14620541},{\"x\":-101.49294093,\"y\":37.14866833},{\"x\":-101.49568751,\"y\":37.14976293}]}}]}}}",
          "comment" : ""
        },
        "headersSize" : 593,
        "bodySize" : 401,
        "comment" : ""
      },
      "response" : {
        "status" : 400,
        "statusText" : "Bad Request",
        "httpVersion" : "HTTP/1.1",
        "cookies" : [ {
          "name" : ".ASPROLES",
          "value" : "zWvnsM0ApiRWTpRKKlGe5tEt74ImkVA2gj3QnnwOIIIvASmuEWjbXpdqjqCuT5tVhxfFkdCNqZFDTFVPTZLoj_N2a3fFBsAXA649c-gGpSo8zSCIJgffqP1bvwypLMvGdRC-va2NUl-MwVFBTxZZK3CZMXqZ9HOsCYfEHgsumFT2bKF_9q4uK13j9N66NIz3Xdu7_lIyX7bHB4eOf93hnkAP_7RqiufCB0lRrOO11unEXF_YCbz14hhsgC0Jz-hVaflgyy8h1TrcIgs6iEG1Myi4PZ0JOpQzG2Sw4-F337LbI_LNRlgyhklMGHr_rg6aaJgbQ-Wyd55OD23J1XEJvkyLPFtXcIfFvmaLv0nxtYBaZH9U8h7jyzpcH3JH3ktkxCeRoWn8Z0ejD34yx1ABIFF32jOS_kydn3oWCJt-2zEWY1H4xNR00THkARtFelj__zGTeBsIcrQqiE2_tMfR7oE9QgPtFEyPw4zy9yOP4_QpXgqSzLUNQ12--cWp8GqLK7JN0fP2NhhccVm_2BQ3UG60TdA1",
          "path" : "/",
          "httpOnly" : true,
          "secure" : false,
          "comment" : ""
        } ],
        "headers" : [ {
          "name" : "Cache-Control",
          "value" : "private"
        }, {
          "name" : "Content-Type",
          "value" : "application/json; charset=utf-8"
        }, {
          "name" : "Server",
          "value" : "Microsoft-IIS/10.0"
        }, {
          "name" : "Set-Cookie",
          "value" : ".ASPROLES=zWvnsM0ApiRWTpRKKlGe5tEt74ImkVA2gj3QnnwOIIIvASmuEWjbXpdqjqCuT5tVhxfFkdCNqZFDTFVPTZLoj_N2a3fFBsAXA649c-gGpSo8zSCIJgffqP1bvwypLMvGdRC-va2NUl-MwVFBTxZZK3CZMXqZ9HOsCYfEHgsumFT2bKF_9q4uK13j9N66NIz3Xdu7_lIyX7bHB4eOf93hnkAP_7RqiufCB0lRrOO11unEXF_YCbz14hhsgC0Jz-hVaflgyy8h1TrcIgs6iEG1Myi4PZ0JOpQzG2Sw4-F337LbI_LNRlgyhklMGHr_rg6aaJgbQ-Wyd55OD23J1XEJvkyLPFtXcIfFvmaLv0nxtYBaZH9U8h7jyzpcH3JH3ktkxCeRoWn8Z0ejD34yx1ABIFF32jOS_kydn3oWCJt-2zEWY1H4xNR00THkARtFelj__zGTeBsIcrQqiE2_tMfR7oE9QgPtFEyPw4zy9yOP4_QpXgqSzLUNQ12--cWp8GqLK7JN0fP2NhhccVm_2BQ3UG60TdA1; path=/; HttpOnly"
        }, {
          "name" : "X-SourceFiles",
          "value" : "=?UTF-8?B?RDpcVmlydHVhbE9wdGltaXplci1SZWZhY3RvcmluZ1xDcm9wTWV0cmljcy5Wby5BcGlcQ3JvcE1ldHJpY3MuVm8uQXBpXGFwaVxtb2JpbGVcdjFcZmllbGRzXDM=?="
        }, {
          "name" : "X-Powered-By",
          "value" : "ASP.NET"
        }, {
          "name" : "Date",
          "value" : "Tue, 09 Apr 2019 21:27:33 GMT"
        }, {
          "name" : "Content-Length",
          "value" : "119"
        } ],
        "content" : {
          "size" : 119,
          "mimeType" : "application/json; charset=utf-8",
          "text" : "{\"message\":\"The Boundary is not valid. IllegalArgumentException: Points of LinearRing do not form a closed linestring\"}",
          "comment" : ""
        },
        "redirectURL" : "",
        "headersSize" : 945,
        "bodySize" : 119,
        "comment" : ""
      },
      "cache" : { },
      "timings" : {
        "comment" : "",
        "send" : 0,
        "connect" : -1,
        "blocked" : -1,
        "dns" : -1,
        "receive" : 1,
        "wait" : 4273,
        "ssl" : -1
      },
      "serverIPAddress" : "127.0.0.1",
      "comment" : "",
      "_katalonRequestInformation" : {
        "name" : "91",
        "testObjectId" : "Object Repository/VoGrow/Field/FieldPut",
        "harId" : "48a47101-3ee2-492c-a76e-fb4ec6fb50ec"
      },
      "time" : 4275
    } ],
    "comment" : ""
  }
}