{
  "log" : {
    "version" : "1.2",
    "creator" : {
      "name" : "BrowserMob Proxy",
      "version" : "2.1.5",
      "comment" : ""
    },
    "pages" : [ {
      "id" : "Page 0",
      "startedDateTime" : "2019-04-24T20:31:56.699Z",
      "title" : "Page 0",
      "pageTimings" : {
        "onLoad" : 959,
        "comment" : ""
      },
      "comment" : ""
    } ],
    "entries" : [ {
      "pageref" : "Page 0",
      "startedDateTime" : "2019-04-24T20:31:56.700Z",
      "request" : {
        "method" : "PUT",
        "url" : "http://localhost:10520/WebAPI/api/mobile/v1/fields/!!!!!?",
        "httpVersion" : "HTTP/1.1",
        "cookies" : [ ],
        "headers" : [ {
          "name" : "User-Agent",
          "value" : "Katalon Studio"
        }, {
          "name" : "Content-Type",
          "value" : "application/json"
        }, {
          "name" : "Authorization",
          "value" : "Bearer eyJ0eXAiOiJKV1QiLCJhbGciOiJIUzI1NiJ9.eyJ1bmlxdWVfbmFtZSI6Implbm55Lm1hbGRvbmFkby50eDFAZ21haWwuY29tIiwicm9sZSI6InVzZXIiLCJzdWIiOiJqZW5ueS5tYWxkb25hZG8udHgxQGdtYWlsLmNvbSIsImlzcyI6IkNyb3BNZXRyaWNzIiwiYXVkIjoiYWxsIiwiZXhwIjoxNTU2MTQxODE2LCJuYmYiOjE1NTYxMzc5MTZ9.KBtSLDHghrtp1derSDejtqCfO1lweqOMwv3VmuyrU64"
        }, {
          "name" : "Host",
          "value" : "localhost:10520"
        }, {
          "name" : "Accept",
          "value" : "text/html, image/gif, image/jpeg, *; q=.2, */*; q=.2"
        }, {
          "name" : "Proxy-Connection",
          "value" : "keep-alive"
        }, {
          "name" : "Content-Length",
          "value" : "389"
        } ],
        "queryString" : [ ],
        "postData" : {
          "mimeType" : "application/json",
          "text" : "{\"field\":{\"name\":\"Field by agent not assigned\",\"boundary\":{\"boundaries\":[{\"boundary\":{\"coords\":[{\"x\":-101.49568751,\"y\":37.14976293},{\"x\":-101.50049403,\"y\":37.14647907},{\"x\":-101.50049403,\"y\":37.14264773},{\"x\":-101.49723246,\"y\":37.1411425},{\"x\":-101.49019435,\"y\":37.14223722},{\"x\":-101.48933604,\"y\":37.14620541},{\"x\":-101.49294093,\"y\":37.14866833},{\"x\":-101.49568751,\"y\":37.14976293}]}}]}}}",
          "comment" : ""
        },
        "headersSize" : 597,
        "bodySize" : 389,
        "comment" : ""
      },
      "response" : {
        "status" : 400,
        "statusText" : "Bad Request",
        "httpVersion" : "HTTP/1.1",
        "cookies" : [ {
          "name" : ".ASPROLES",
          "value" : "GB1bcpiiKp3CM-Fk1FjPBp_4ZOioOEnFNXqO-23KcIb55cT1QFEF-4yey2OtvEkIjNRY5_U82rtBlvtfvTkvg4mzJeQgQzmukAZ-2GJ0kMn7krGSRqBNwK5wABNf40jlM_MB4bPi9lUYULLwFHKk-rhY6AZDTHaoT0GbLTahw9mId1PoUrn5vMgnBbrosGT27nNgw6zw2bkLAi_3lO0T01ZjYMrKEKGoBMS1hks_0hkx2GGtG2ll2OiQdXhDea_QuGkZ4YiIQAY7hQUhD8Y3fn19fkmsycidc7xAtx__Ymjralz5-fU1CdhClaLemGoXsy9rAANV8A0wSFVjw12cGsbAy4n__wLm0GDCjcpnvy4DTkVI0wDG0mnMkMZz_repiceNiPLqM-hd-iQDQf2mFz0zTJsMWbsCWu2xrB4NvGb1ax4ioTvQMhmFpqvMvqv6dudHKl2k_vO9ljmJNkEx2XEbdktbUme2a2ln_Yga8rrpIqfd0U8_uUZ7-o4EE6I-2uKkGRFYuKiUH4pn3psp95_AwI01",
          "path" : "/",
          "httpOnly" : true,
          "secure" : false,
          "comment" : ""
        } ],
        "headers" : [ {
          "name" : "Cache-Control",
          "value" : "private"
        }, {
          "name" : "Content-Type",
          "value" : "application/json; charset=utf-8"
        }, {
          "name" : "Server",
          "value" : "Microsoft-IIS/10.0"
        }, {
          "name" : "Set-Cookie",
          "value" : ".ASPROLES=GB1bcpiiKp3CM-Fk1FjPBp_4ZOioOEnFNXqO-23KcIb55cT1QFEF-4yey2OtvEkIjNRY5_U82rtBlvtfvTkvg4mzJeQgQzmukAZ-2GJ0kMn7krGSRqBNwK5wABNf40jlM_MB4bPi9lUYULLwFHKk-rhY6AZDTHaoT0GbLTahw9mId1PoUrn5vMgnBbrosGT27nNgw6zw2bkLAi_3lO0T01ZjYMrKEKGoBMS1hks_0hkx2GGtG2ll2OiQdXhDea_QuGkZ4YiIQAY7hQUhD8Y3fn19fkmsycidc7xAtx__Ymjralz5-fU1CdhClaLemGoXsy9rAANV8A0wSFVjw12cGsbAy4n__wLm0GDCjcpnvy4DTkVI0wDG0mnMkMZz_repiceNiPLqM-hd-iQDQf2mFz0zTJsMWbsCWu2xrB4NvGb1ax4ioTvQMhmFpqvMvqv6dudHKl2k_vO9ljmJNkEx2XEbdktbUme2a2ln_Yga8rrpIqfd0U8_uUZ7-o4EE6I-2uKkGRFYuKiUH4pn3psp95_AwI01; path=/; HttpOnly"
        }, {
          "name" : "X-SourceFiles",
          "value" : "=?UTF-8?B?RDpcVmlydHVhbE9wdGltaXplci1SZWZhY3RvcmluZ1xDcm9wTWV0cmljcy5Wby5BcGlcQ3JvcE1ldHJpY3MuVm8uQXBpXGFwaVxtb2JpbGVcdjFcZmllbGRzXCEhISEh?="
        }, {
          "name" : "X-Powered-By",
          "value" : "ASP.NET"
        }, {
          "name" : "Date",
          "value" : "Wed, 24 Apr 2019 20:31:57 GMT"
        }, {
          "name" : "Content-Length",
          "value" : "79"
        } ],
        "content" : {
          "size" : 79,
          "mimeType" : "application/json; charset=utf-8",
          "text" : "{\"message\":\"The request is invalid. The value '!!!!!' is not valid for Int32.\"}",
          "comment" : ""
        },
        "redirectURL" : "",
        "headersSize" : 948,
        "bodySize" : 79,
        "comment" : ""
      },
      "cache" : { },
      "timings" : {
        "comment" : "",
        "send" : 0,
        "wait" : 955,
        "receive" : 1,
        "blocked" : -1,
        "connect" : -1,
        "dns" : -1,
        "ssl" : -1
      },
      "serverIPAddress" : "127.0.0.1",
      "comment" : "",
      "_katalonRequestInformation" : {
        "name" : "29",
        "testObjectId" : "Object Repository/VoGrow/Field/FieldPut",
        "harId" : "770fc4f4-8eae-4c20-9e4a-171fa6ad72b0"
      },
      "time" : 956
    } ],
    "comment" : ""
  }
}