{
  "log" : {
    "version" : "1.2",
    "creator" : {
      "name" : "BrowserMob Proxy",
      "version" : "2.1.5",
      "comment" : ""
    },
    "pages" : [ {
      "id" : "Page 0",
      "startedDateTime" : "2019-04-01T13:35:57.082Z",
      "title" : "Page 0",
      "pageTimings" : {
        "onLoad" : 1855,
        "comment" : ""
      },
      "comment" : ""
    } ],
    "entries" : [ {
      "pageref" : "Page 0",
      "startedDateTime" : "2019-04-01T13:35:57.083Z",
      "request" : {
        "method" : "POST",
        "url" : "http://localhost:10520/WebAPI/api/admin/v1/users/?",
        "httpVersion" : "HTTP/1.1",
        "cookies" : [ ],
        "headers" : [ {
          "name" : "User-Agent",
          "value" : "Katalon Studio"
        }, {
          "name" : "Content-Type",
          "value" : "application/x-www-form-urlencoded"
        }, {
          "name" : "Authorization",
          "value" : "Bearer eyJ0eXAiOiJKV1QiLCJhbGciOiJIUzI1NiJ9.eyJ1bmlxdWVfbmFtZSI6ImFkbWluIiwicm9sZSI6InVzZXIiLCJzdWIiOiJhZG1pbiIsImlzcyI6IkNyb3BNZXRyaWNzIiwiYXVkIjoiYWxsIiwiZXhwIjoxNTU0MTI5NjU3LCJuYmYiOjE1NTQxMjU3NTd9.02wTxfsQcbL_faaR4zQRbJDNy3Z3oRNGjFqwbgKhr4Q"
        }, {
          "name" : "Host",
          "value" : "localhost:10520"
        }, {
          "name" : "Accept",
          "value" : "text/html, image/gif, image/jpeg, *; q=.2, */*; q=.2"
        }, {
          "name" : "Proxy-Connection",
          "value" : "keep-alive"
        }, {
          "name" : "Content-Length",
          "value" : "273"
        } ],
        "queryString" : [ ],
        "postData" : {
          "mimeType" : "application/x-www-form-urlencoded",
          "params" : [ {
            "name" : "password",
            "value" : "cropmetrics",
            "comment" : ""
          }, {
            "name" : "email",
            "value" : "cropmetricsvo.roleadmi@gmail.com",
            "comment" : ""
          }, {
            "name" : "fullname",
            "value" : "test validation",
            "comment" : ""
          }, {
            "name" : "phone",
            "value" : "123",
            "comment" : ""
          }, {
            "name" : "dealer",
            "value" : "x",
            "comment" : ""
          }, {
            "name" : "addressLine1",
            "value" : "address line 1 test validation",
            "comment" : ""
          }, {
            "name" : "addressLine2",
            "value" : "address line 2 test validation",
            "comment" : ""
          }, {
            "name" : "town",
            "value" : "townValidation",
            "comment" : ""
          }, {
            "name" : "state",
            "value" : "stateValidation",
            "comment" : ""
          }, {
            "name" : "zip",
            "value" : "xx",
            "comment" : ""
          }, {
            "name" : "country",
            "value" : "xx",
            "comment" : ""
          }, {
            "name" : "roles",
            "value" : "Administrator",
            "comment" : ""
          } ],
          "comment" : ""
        },
        "headersSize" : 544,
        "bodySize" : 273,
        "comment" : ""
      },
      "response" : {
        "status" : 200,
        "statusText" : "OK",
        "httpVersion" : "HTTP/1.1",
        "cookies" : [ {
          "name" : ".ASPROLES",
          "value" : "2VpNsjKF6UH-kRSsUNCC9VghUS_cVsCQaFJ_5aOVU2WGdg2_LtZo4YmjQjwQubGjjGXZygqU_XCnsrVpcNKKJPNBdL5xw26mLOcJDmszq3kA3z8yMcLNhEeZIqEfxXCuJak20pLqtrxfO-6fDAt6IxBilpUW3DnepS89gnbebaS_-o76IQb--8T_jXF6PaOsQB-CansVM3oAkA7sI4EXh7S8CALNky2qQU_u_CsrOyc9YE-orFTJZYdzllU-FsBkIeEYVdxNHK4rjuLAfM5oZGewQEHelbGSjsb7cmWlfiACwLLrJrbOY5_ZQqUMc48ypmNYjUwQx8SpxB4dPZmmlGb57RJJAV57q60K_QWcym5zY6cnoEEVnrNJsapLF5JF-wGJxmNuj3p_hzVuBKFpFWfKkJYf2gxS5X-vkLMTGFDl3UhyxQUQXZ7v-yqimulsaCpkfeBuPtzYySsUEzUZZz9QoFdR64ojoqmuwb1Ls1IuFphw0",
          "path" : "/",
          "httpOnly" : true,
          "secure" : false,
          "comment" : ""
        } ],
        "headers" : [ {
          "name" : "Cache-Control",
          "value" : "private"
        }, {
          "name" : "Content-Type",
          "value" : "application/json; charset=utf-8"
        }, {
          "name" : "Server",
          "value" : "Microsoft-IIS/10.0"
        }, {
          "name" : "Set-Cookie",
          "value" : ".ASPROLES=2VpNsjKF6UH-kRSsUNCC9VghUS_cVsCQaFJ_5aOVU2WGdg2_LtZo4YmjQjwQubGjjGXZygqU_XCnsrVpcNKKJPNBdL5xw26mLOcJDmszq3kA3z8yMcLNhEeZIqEfxXCuJak20pLqtrxfO-6fDAt6IxBilpUW3DnepS89gnbebaS_-o76IQb--8T_jXF6PaOsQB-CansVM3oAkA7sI4EXh7S8CALNky2qQU_u_CsrOyc9YE-orFTJZYdzllU-FsBkIeEYVdxNHK4rjuLAfM5oZGewQEHelbGSjsb7cmWlfiACwLLrJrbOY5_ZQqUMc48ypmNYjUwQx8SpxB4dPZmmlGb57RJJAV57q60K_QWcym5zY6cnoEEVnrNJsapLF5JF-wGJxmNuj3p_hzVuBKFpFWfKkJYf2gxS5X-vkLMTGFDl3UhyxQUQXZ7v-yqimulsaCpkfeBuPtzYySsUEzUZZz9QoFdR64ojoqmuwb1Ls1IuFphw0; path=/; HttpOnly"
        }, {
          "name" : "X-SourceFiles",
          "value" : "=?UTF-8?B?RDpcVmlydHVhbE9wdGltaXplci1SZWZhY3RvcmluZ1xDcm9wTWV0cmljcy5Wby5BcGlcQ3JvcE1ldHJpY3MuVm8uQXBpXGFwaVxhZG1pblx2MVx1c2Vyc1w=?="
        }, {
          "name" : "X-Powered-By",
          "value" : "ASP.NET"
        }, {
          "name" : "Date",
          "value" : "Mon, 01 Apr 2019 13:35:58 GMT"
        }, {
          "name" : "Content-Length",
          "value" : "9"
        } ],
        "content" : {
          "size" : 9,
          "mimeType" : "application/json; charset=utf-8",
          "text" : "{\"id\":41}",
          "comment" : ""
        },
        "redirectURL" : "",
        "headersSize" : 887,
        "bodySize" : 9,
        "comment" : ""
      },
      "cache" : { },
      "timings" : {
        "comment" : "",
        "ssl" : -1,
        "wait" : 1816,
        "receive" : 0,
        "send" : 0,
        "dns" : -1,
        "blocked" : -1,
        "connect" : -1
      },
      "serverIPAddress" : "127.0.0.1",
      "comment" : "",
      "_katalonRequestInformation" : {
        "name" : "109",
        "testObjectId" : "Object Repository/VoPro/Account/api_admin_v1_users",
        "harId" : "2891dcaf-beb8-47db-ac48-cdc8ee2f15a1"
      },
      "time" : 1817
    } ],
    "comment" : ""
  }
}