{
  "log" : {
    "version" : "1.2",
    "creator" : {
      "name" : "BrowserMob Proxy",
      "version" : "2.1.5",
      "comment" : ""
    },
    "pages" : [ {
      "id" : "Page 0",
      "startedDateTime" : "2019-03-28T19:24:08.261Z",
      "title" : "Page 0",
      "pageTimings" : {
        "onLoad" : 2194,
        "comment" : ""
      },
      "comment" : ""
    } ],
    "entries" : [ {
      "pageref" : "Page 0",
      "startedDateTime" : "2019-03-28T19:24:08.264Z",
      "request" : {
        "method" : "POST",
        "url" : "http://localhost:10520/WebAPI/api/admin/v1/users/?",
        "httpVersion" : "HTTP/1.1",
        "cookies" : [ ],
        "headers" : [ {
          "name" : "User-Agent",
          "value" : "Katalon Studio"
        }, {
          "name" : "Content-Type",
          "value" : "application/x-www-form-urlencoded"
        }, {
          "name" : "Authorization",
          "value" : "Bearer eyJ0eXAiOiJKV1QiLCJhbGciOiJIUzI1NiJ9.eyJ1bmlxdWVfbmFtZSI6ImFkbWluIiwicm9sZSI6InVzZXIiLCJzdWIiOiJhZG1pbiIsImlzcyI6IkNyb3BNZXRyaWNzIiwiYXVkIjoiYWxsIiwiZXhwIjoxNTUzODA0OTQ4LCJuYmYiOjE1NTM4MDEwNDh9.Tc5oWNL9oXP6CVQTPK8nPnH5GjJk2rGvVT8s7LBM-9o"
        }, {
          "name" : "Host",
          "value" : "localhost:10520"
        }, {
          "name" : "Accept",
          "value" : "text/html, image/gif, image/jpeg, *; q=.2, */*; q=.2"
        }, {
          "name" : "Proxy-Connection",
          "value" : "keep-alive"
        }, {
          "name" : "Content-Length",
          "value" : "296"
        } ],
        "queryString" : [ ],
        "postData" : {
          "mimeType" : "application/x-www-form-urlencoded",
          "params" : [ {
            "name" : "password",
            "value" : "cropmetrics",
            "comment" : ""
          }, {
            "name" : "email",
            "value" : "cropmetricsvo.no.roles@gmail.com",
            "comment" : ""
          }, {
            "name" : "fullname",
            "value" : "test validation",
            "comment" : ""
          }, {
            "name" : "phone",
            "value" : "123",
            "comment" : ""
          }, {
            "name" : "dealer",
            "value" : "dealet test",
            "comment" : ""
          }, {
            "name" : "addressLine1",
            "value" : "address line 1 test validation",
            "comment" : ""
          }, {
            "name" : "addressLine2",
            "value" : "address line 2 test validation",
            "comment" : ""
          }, {
            "name" : "town",
            "value" : "townValidation",
            "comment" : ""
          }, {
            "name" : "state",
            "value" : "stateValidation",
            "comment" : ""
          }, {
            "name" : "zip",
            "value" : "zipValidation",
            "comment" : ""
          }, {
            "name" : "country",
            "value" : "countryValidation",
            "comment" : ""
          }, {
            "name" : "roles",
            "value" : "",
            "comment" : ""
          } ],
          "comment" : ""
        },
        "headersSize" : 544,
        "bodySize" : 296,
        "comment" : ""
      },
      "response" : {
        "status" : 500,
        "statusText" : "Internal Server Error",
        "httpVersion" : "HTTP/1.1",
        "cookies" : [ {
          "name" : ".ASPROLES",
          "value" : "yuof2_Ve4EMRwHR1WrgaR1VS1XiBRFM8IebP-VclP0R0dT7dgtTHOQfvtGr31ArIzTYYixoloUt78WnkOSrlb-WFejTHcSvvk7bagQA29PssiPfgDsZ-bmwfwIlrEjGAmB4wBeZtPGL3HFw5N8NIaU9hx0XqhnVkNK9UYur3gDVhMbw_nMNQ7tU1Krh7Sxn442IuT-lMcYmR3G9t7nRCxgam8bP1-MzjOPGp-_0ncg2V9OQXqc0bBKlV_6kaplrqc1XLRLpnapS0TXXuvgK6HF44A-lvgS00xRX4XsqCnnBeN7LztlfzHb8XPlvPmDK1XIosUvzToRJDKQktzlXszYSONTecTTINGvhInI8moOVzxFd3twwnTbnVrRS23DsERdXJFx0BNkIGTo-au_gHf5fxblAuof5hXNQnO3MW-63NtlwJFUkBe_5gBpg96VANbUCjuZ7dVbD727jjgw7wW04QWa3MmngTK7Rh1lw4CQlbyS5a0",
          "path" : "/",
          "httpOnly" : true,
          "secure" : false,
          "comment" : ""
        } ],
        "headers" : [ {
          "name" : "Cache-Control",
          "value" : "private"
        }, {
          "name" : "Content-Type",
          "value" : "application/json; charset=utf-8"
        }, {
          "name" : "Server",
          "value" : "Microsoft-IIS/10.0"
        }, {
          "name" : "Set-Cookie",
          "value" : ".ASPROLES=yuof2_Ve4EMRwHR1WrgaR1VS1XiBRFM8IebP-VclP0R0dT7dgtTHOQfvtGr31ArIzTYYixoloUt78WnkOSrlb-WFejTHcSvvk7bagQA29PssiPfgDsZ-bmwfwIlrEjGAmB4wBeZtPGL3HFw5N8NIaU9hx0XqhnVkNK9UYur3gDVhMbw_nMNQ7tU1Krh7Sxn442IuT-lMcYmR3G9t7nRCxgam8bP1-MzjOPGp-_0ncg2V9OQXqc0bBKlV_6kaplrqc1XLRLpnapS0TXXuvgK6HF44A-lvgS00xRX4XsqCnnBeN7LztlfzHb8XPlvPmDK1XIosUvzToRJDKQktzlXszYSONTecTTINGvhInI8moOVzxFd3twwnTbnVrRS23DsERdXJFx0BNkIGTo-au_gHf5fxblAuof5hXNQnO3MW-63NtlwJFUkBe_5gBpg96VANbUCjuZ7dVbD727jjgw7wW04QWa3MmngTK7Rh1lw4CQlbyS5a0; path=/; HttpOnly"
        }, {
          "name" : "X-SourceFiles",
          "value" : "=?UTF-8?B?RDpcVmlydHVhbE9wdGltaXplci1SZWZhY3RvcmluZ1xDcm9wTWV0cmljcy5Wby5BcGlcQ3JvcE1ldHJpY3MuVm8uQXBpXGFwaVxhZG1pblx2MVx1c2Vyc1w=?="
        }, {
          "name" : "X-Powered-By",
          "value" : "ASP.NET"
        }, {
          "name" : "Date",
          "value" : "Thu, 28 Mar 2019 19:24:10 GMT"
        }, {
          "name" : "Content-Length",
          "value" : "53"
        } ],
        "content" : {
          "size" : 53,
          "mimeType" : "application/json; charset=utf-8",
          "text" : "{\"message\":\"Internal server error in the processing\"}",
          "comment" : ""
        },
        "redirectURL" : "",
        "headersSize" : 907,
        "bodySize" : 53,
        "comment" : ""
      },
      "cache" : { },
      "timings" : {
        "comment" : "",
        "ssl" : -1,
        "wait" : 2183,
        "receive" : 1,
        "send" : 1,
        "connect" : -1,
        "blocked" : -1,
        "dns" : -1
      },
      "serverIPAddress" : "127.0.0.1",
      "comment" : "",
      "_katalonRequestInformation" : {
        "name" : "31",
        "testObjectId" : "Object Repository/VoPro/Account/api_admin_v1_users",
        "harId" : "dbbb9ab9-98b6-4a19-b5ec-748372d8d750"
      },
      "time" : 2187
    } ],
    "comment" : ""
  }
}