Suite/Test/Step Name,Browser,Description,Start time,End time,Duration,Status
Auto_Account,,,2019-03-26 09:19:38,2019-03-26 09:20:42,1m - 3.429s,PASSED
,,,,,,
Test Cases/VoPro/API/Account/API_ACNT_When_new_account_is_created_Expected_status_code_200,,,2019-03-26 09:19:39,2019-03-26 09:19:54,14.843s,PASSED
username = username,,,2019-03-26 09:19:40,2019-03-26 09:19:40,0.031s,PASSED
password = password,,,2019-03-26 09:19:40,2019-03-26 09:19:40,0.003s,PASSED
confirmPassword = confirmPassword,,,2019-03-26 09:19:40,2019-03-26 09:19:40,0.005s,PASSED
email = email,,,2019-03-26 09:19:40,2019-03-26 09:19:41,0.002s,PASSED
fullname = fullname,,,2019-03-26 09:19:41,2019-03-26 09:19:41,0.003s,PASSED
phone = phone,,,2019-03-26 09:19:41,2019-03-26 09:19:41,0.007s,PASSED
dealer = dealer,,,2019-03-26 09:19:41,2019-03-26 09:19:41,0.008s,PASSED
addressLine1 = addressLine1,,,2019-03-26 09:19:41,2019-03-26 09:19:41,0.001s,PASSED
addressLine2 = addressLine2,,,2019-03-26 09:19:41,2019-03-26 09:19:41,0.001s,PASSED
town = town,,,2019-03-26 09:19:41,2019-03-26 09:19:41,0.005s,PASSED
state = state,,,2019-03-26 09:19:41,2019-03-26 09:19:41,0.003s,PASSED
zip = zip,,,2019-03-26 09:19:41,2019-03-26 09:19:41,0.001s,PASSED
country = country,,,2019-03-26 09:19:41,2019-03-26 09:19:41,0.008s,PASSED
roles = roles,,,2019-03-26 09:19:41,2019-03-26 09:19:41,0.023s,PASSED
modifierUsername = modifierUsername,,,2019-03-26 09:19:41,2019-03-26 09:19:41,0.016s,PASSED
modifierUserId = modifierUserId,,,2019-03-26 09:19:41,2019-03-26 09:19:41,0.004s,PASSED
"tokenUserName = ""admin""",,,2019-03-26 09:19:41,2019-03-26 09:19:41,0.003s,PASSED
"tokenPassword = ""cropmetricsvo""",,,2019-03-26 09:19:41,2019-03-26 09:19:41,0.037s,PASSED
"responseToken = sendRequest(findTestObject(""VoPro/Token"", [""usernameToken"":tokenUserName, ""passwordToken"":tokenPassword]))",,,2019-03-26 09:19:41,2019-03-26 09:19:45,4.537s,PASSED
slurper = new groovy.json.JsonSlurper(),,,2019-03-26 09:19:45,2019-03-26 09:19:45,0.033s,PASSED
tokenResult = slurper.parseText(responseToken.getResponseBodyContent()),,,2019-03-26 09:19:45,2019-03-26 09:19:45,0.026s,PASSED
accessToken = access_token,,,2019-03-26 09:19:45,2019-03-26 09:19:45,0.009s,PASSED
"println("".. current access token generated: "" + accessToken)",,,2019-03-26 09:19:45,2019-03-26 09:19:45,0.005s,PASSED
"responseAdminRegister = sendRequest(findTestObject(""VoPro/Account/AdministrativeRegister"", [""access_token"":accessToken, ""username"":username, ""password"":password, ""confirmPassword"":confirmPassword, ""email"":email, ""fullname"":fullname, ... ]))",,,2019-03-26 09:19:45,2019-03-26 09:19:54,8.320s,PASSED
"verifyResponseStatusCode(responseAdminRegister, 200)",,,2019-03-26 09:19:54,2019-03-26 09:19:54,0.015s,PASSED
slurper1 = new groovy.json.JsonSlurper(),,,2019-03-26 09:19:54,2019-03-26 09:19:54,0.001s,PASSED
AdminRegisterResult = slurper1.parseText(responseAdminRegister.getResponseBodyContent()),,,2019-03-26 09:19:54,2019-03-26 09:19:54,0.001s,PASSED
userId = id,,,2019-03-26 09:19:54,2019-03-26 09:19:54,0.115s,PASSED
"println(""New account created has the id: "" + userId)",,,2019-03-26 09:19:54,2019-03-26 09:19:54,0.001s,PASSED
,,,,,,
Test Cases/VoPro/API/Account/API_ACNT_When_new_account_is_created_Expected_new_account_is_added_in_database,,,2019-03-26 09:19:54,2019-03-26 09:19:56,1.902s,PASSED
"connectionCmDatabase.CmConnection.connectDB(""localhost"", ""virtualoptimizer"", ""5432"", ""postgres"", ""admin"")",,,2019-03-26 09:19:54,2019-03-26 09:19:56,1.232s,PASSED
"println(""new account id is: "" + userId)",,,2019-03-26 09:19:56,2019-03-26 09:19:56,0.001s,PASSED
"query = ""select username from cropmetrics.userprofile where id = "" + userId",,,2019-03-26 09:19:56,2019-03-26 09:19:56,0.001s,PASSED
queryResult = connectionCmDatabase.CmConnection.executeQuery(query),,,2019-03-26 09:19:56,2019-03-26 09:19:56,0.075s,PASSED
while (queryResult.next()),,,2019-03-26 09:19:56,2019-03-26 09:19:56,0.022s,PASSED
,,,,,,
Test Cases/VoPro/API/User/API_USER_When_account_is_deleted_Expected_status_code_200,,,2019-03-26 09:19:56,2019-03-26 09:19:57,1.105s,PASSED
"tokenUserName = ""admin""",,,2019-03-26 09:19:56,2019-03-26 09:19:56,0.003s,PASSED
"tokenPassword = ""cropmetricsvo""",,,2019-03-26 09:19:56,2019-03-26 09:19:56,0.001s,PASSED
"responseToken = sendRequest(findTestObject(""VoPro/Token"", [""usernameToken"":tokenUserName, ""passwordToken"":tokenPassword]))",,,2019-03-26 09:19:56,2019-03-26 09:19:56,0.378s,PASSED
slurper = new groovy.json.JsonSlurper(),,,2019-03-26 09:19:56,2019-03-26 09:19:56,0.001s,PASSED
tokenResult = slurper.parseText(responseToken.getResponseBodyContent()),,,2019-03-26 09:19:56,2019-03-26 09:19:56,0.002s,PASSED
accessToken = access_token,,,2019-03-26 09:19:56,2019-03-26 09:19:56,0.001s,PASSED
"println("".. current username generated: "" + accessToken)",,,2019-03-26 09:19:56,2019-03-26 09:19:56,0.001s,PASSED
"connectionCmDatabase.CmConnection.connectDB(""localhost"", ""virtualoptimizer"", ""5432"", ""postgres"", ""admin"")",,,2019-03-26 09:19:56,2019-03-26 09:19:57,0.113s,PASSED
"println(""new user id added is:"" + userId)",,,2019-03-26 09:19:57,2019-03-26 09:19:57,0.002s,PASSED
"query = ""select username from cropmetrics.userprofile where id = "" + userId",,,2019-03-26 09:19:57,2019-03-26 09:19:57,0.002s,PASSED
queryResult = connectionCmDatabase.CmConnection.executeQuery(query),,,2019-03-26 09:19:57,2019-03-26 09:19:57,0.004s,PASSED
while (queryResult.next()),,,2019-03-26 09:19:57,2019-03-26 09:19:57,0.153s,PASSED
,,,,,,
Test Cases/VoPro/API/User/API_USER_When_account_is_deleted_Expected_isvalid_flag_updated_to_false_in_database,,,2019-03-26 09:19:57,2019-03-26 09:19:57,0.339s,PASSED
usenIdDeleted = userId,,,2019-03-26 09:19:57,2019-03-26 09:19:57,0.001s,PASSED
"println(""verificar user eliminado:"" + usenIdDeleted)",,,2019-03-26 09:19:57,2019-03-26 09:19:57,0.001s,PASSED
"connectionCmDatabase.CmConnection.connectDB(""localhost"", ""virtualoptimizer"", ""5432"", ""postgres"", ""admin"")",,,2019-03-26 09:19:57,2019-03-26 09:19:57,0.058s,PASSED
"query = ""select isvalid from cropmetrics.userprofile where id = "" + usenIdDeleted",,,2019-03-26 09:19:57,2019-03-26 09:19:57,0.001s,PASSED
queryResult = connectionCmDatabase.CmConnection.executeQuery(query),,,2019-03-26 09:19:57,2019-03-26 09:19:57,0.004s,PASSED
while (queryResult.next()),,,2019-03-26 09:19:57,2019-03-26 09:19:57,0.004s,PASSED
,,,,,,
Test Cases/VoPro/API/Account/1 API_ACNT_When_try_to_create_a_new_user_without_username_attribute_Expected_status_code_400,,,2019-03-26 09:19:57,2019-03-26 09:20:03,5.545s,PASSED
"username = """"",,,2019-03-26 09:19:57,2019-03-26 09:19:57,0.001s,PASSED
"password = ""cropmetrics""",,,2019-03-26 09:19:57,2019-03-26 09:19:57,0.001s,PASSED
"confirmPassword = ""cropmetrics""",,,2019-03-26 09:19:57,2019-03-26 09:19:57,0.002s,PASSED
"email = ""cropmetricsvo@gmail.com""",,,2019-03-26 09:19:57,2019-03-26 09:19:57,0.001s,PASSED
"fullname = ""test validation""",,,2019-03-26 09:19:57,2019-03-26 09:19:57,0.001s,PASSED
"phone = ""123""",,,2019-03-26 09:19:57,2019-03-26 09:19:57,0.001s,PASSED
"dealer = ""dealer test validation""",,,2019-03-26 09:19:57,2019-03-26 09:19:57,0.001s,PASSED
"addressLine1 = ""address line 1 test validation""",,,2019-03-26 09:19:57,2019-03-26 09:19:57,0.001s,PASSED
"addressLine2 = ""address line 1 test validation""",,,2019-03-26 09:19:57,2019-03-26 09:19:57,0.001s,PASSED
"town = ""townValidation""",,,2019-03-26 09:19:57,2019-03-26 09:19:57,0.001s,PASSED
"state = ""stateValidation""",,,2019-03-26 09:19:57,2019-03-26 09:19:57,0.002s,PASSED
"zip = ""zipValidation""",,,2019-03-26 09:19:57,2019-03-26 09:19:57,0.000s,PASSED
"country = ""countryValidation""",,,2019-03-26 09:19:57,2019-03-26 09:19:57,0.002s,PASSED
"roles = ""Client""",,,2019-03-26 09:19:57,2019-03-26 09:19:57,0.001s,PASSED
"modifierUsername = ""admin""",,,2019-03-26 09:19:57,2019-03-26 09:19:57,0.010s,PASSED
"modifierUserId = ""1""",,,2019-03-26 09:19:57,2019-03-26 09:19:57,0.000s,PASSED
"tokenUserName = ""admin""",,,2019-03-26 09:19:57,2019-03-26 09:19:57,0.004s,PASSED
"tokenPassword = ""cropmetricsvo""",,,2019-03-26 09:19:57,2019-03-26 09:19:57,0.001s,PASSED
"responseToken = sendRequest(findTestObject(""VoPro/Token"", [""usernameToken"":tokenUserName, ""passwordToken"":tokenPassword]))",,,2019-03-26 09:19:57,2019-03-26 09:19:57,0.086s,PASSED
slurper = new groovy.json.JsonSlurper(),,,2019-03-26 09:19:57,2019-03-26 09:19:57,0.000s,PASSED
tokenResult = slurper.parseText(responseToken.getResponseBodyContent()),,,2019-03-26 09:19:57,2019-03-26 09:19:57,0.000s,PASSED
accessToken = access_token,,,2019-03-26 09:19:57,2019-03-26 09:19:57,0.000s,PASSED
"println("".. current access token generated: "" + accessToken)",,,2019-03-26 09:19:57,2019-03-26 09:19:57,0.000s,PASSED
"responseAdminRegister = sendRequest(findTestObject(""VoPro/Account/AdministrativeRegister"", [""access_token"":accessToken, ""username"":username, ""password"":password, ""confirmPassword"":confirmPassword, ""email"":email, ""fullname"":fullname, ... ]))",,,2019-03-26 09:19:57,2019-03-26 09:20:03,5.161s,PASSED
"verifyResponseStatusCode(responseAdminRegister, 400)",,,2019-03-26 09:20:03,2019-03-26 09:20:03,0.002s,PASSED
slurper1 = new groovy.json.JsonSlurper(),,,2019-03-26 09:20:03,2019-03-26 09:20:03,0.002s,PASSED
AdminRegisterResult = slurper1.parseText(responseAdminRegister.getResponseBodyContent()),,,2019-03-26 09:20:03,2019-03-26 09:20:03,0.002s,PASSED
messageResponse = message,,,2019-03-26 09:20:03,2019-03-26 09:20:03,0.001s,PASSED
"messageExpected = ""The User name field is required.
""",,,2019-03-26 09:20:03,2019-03-26 09:20:03,0.000s,PASSED
"println(""Error message response: "" + messageResponse)",,,2019-03-26 09:20:03,2019-03-26 09:20:03,0.001s,PASSED
"println(""Error message expected: "" + messageExpected)",,,2019-03-26 09:20:03,2019-03-26 09:20:03,0.001s,PASSED
"verifyElementPropertyValue(responseAdminRegister, ""message"", messageExpected)",,,2019-03-26 09:20:03,2019-03-26 09:20:03,0.055s,PASSED
,,,,,,
Test Cases/VoPro/API/Account/2 API_ACNT_When_try_to_create_a_new_user_without_password_attribute_Expected_status_code_500,,,2019-03-26 09:20:03,2019-03-26 09:20:06,3.179s,PASSED
"username = ""kusernopassword""",,,2019-03-26 09:20:03,2019-03-26 09:20:03,0.001s,PASSED
"password = """"",,,2019-03-26 09:20:03,2019-03-26 09:20:03,0.001s,PASSED
"confirmPassword = ""cropmetrics""",,,2019-03-26 09:20:03,2019-03-26 09:20:03,0.003s,PASSED
"email = ""cropmetricsvo@gmail.com""",,,2019-03-26 09:20:03,2019-03-26 09:20:03,0.001s,PASSED
"fullname = ""test validation""",,,2019-03-26 09:20:03,2019-03-26 09:20:03,0.000s,PASSED
"phone = ""123""",,,2019-03-26 09:20:03,2019-03-26 09:20:03,0.003s,PASSED
"dealer = ""dealer test validation""",,,2019-03-26 09:20:03,2019-03-26 09:20:03,0.001s,PASSED
"addressLine1 = ""address line 1 test validation""",,,2019-03-26 09:20:03,2019-03-26 09:20:03,0.001s,PASSED
"addressLine2 = ""address line 1 test validation""",,,2019-03-26 09:20:03,2019-03-26 09:20:03,0.002s,PASSED
"town = ""townValidation""",,,2019-03-26 09:20:03,2019-03-26 09:20:03,0.001s,PASSED
"state = ""stateValidation""",,,2019-03-26 09:20:03,2019-03-26 09:20:03,0.001s,PASSED
"zip = ""zipValidation""",,,2019-03-26 09:20:03,2019-03-26 09:20:03,0.004s,PASSED
"country = ""countryValidation""",,,2019-03-26 09:20:03,2019-03-26 09:20:03,0.001s,PASSED
"roles = ""Client""",,,2019-03-26 09:20:03,2019-03-26 09:20:03,0.000s,PASSED
"modifierUsername = ""admin""",,,2019-03-26 09:20:03,2019-03-26 09:20:03,0.001s,PASSED
"modifierUserId = ""1""",,,2019-03-26 09:20:03,2019-03-26 09:20:03,0.001s,PASSED
"tokenUserName = ""admin""",,,2019-03-26 09:20:03,2019-03-26 09:20:03,0.000s,PASSED
"tokenPassword = ""cropmetricsvo""",,,2019-03-26 09:20:03,2019-03-26 09:20:03,0.000s,PASSED
"responseToken = sendRequest(findTestObject(""VoPro/Token"", [""usernameToken"":tokenUserName, ""passwordToken"":tokenPassword]))",,,2019-03-26 09:20:03,2019-03-26 09:20:03,0.111s,PASSED
slurper = new groovy.json.JsonSlurper(),,,2019-03-26 09:20:03,2019-03-26 09:20:03,0.001s,PASSED
tokenResult = slurper.parseText(responseToken.getResponseBodyContent()),,,2019-03-26 09:20:03,2019-03-26 09:20:03,0.001s,PASSED
accessToken = access_token,,,2019-03-26 09:20:03,2019-03-26 09:20:03,0.001s,PASSED
"println("".. current access token generated: "" + accessToken)",,,2019-03-26 09:20:03,2019-03-26 09:20:03,0.001s,PASSED
"responseAdminRegister = sendRequest(findTestObject(""VoPro/Account/AdministrativeRegister"", [""access_token"":accessToken, ""username"":username, ""password"":password, ""confirmPassword"":confirmPassword, ""email"":email, ""fullname"":fullname, ... ]))",,,2019-03-26 09:20:03,2019-03-26 09:20:06,2.606s,PASSED
"verifyResponseStatusCode(responseAdminRegister, 500)",,,2019-03-26 09:20:06,2019-03-26 09:20:06,0.002s,PASSED
,,,,,,
Test Cases/VoPro/API/Account/3 API_ACNT_When_try_to_create_a_new_user_without_confirmpassword_attribute_Expected_status_code_200,,,2019-03-26 09:20:06,2019-03-26 09:20:08,2.021s,PASSED
"username = ""kusernoconfirmpassword""",,,2019-03-26 09:20:06,2019-03-26 09:20:06,0.001s,PASSED
"password = ""cropmetrics""",,,2019-03-26 09:20:06,2019-03-26 09:20:06,0.004s,PASSED
"confirmPassword = """"",,,2019-03-26 09:20:06,2019-03-26 09:20:06,0.001s,PASSED
"email = ""cropmetricsvo@gmail.com""",,,2019-03-26 09:20:06,2019-03-26 09:20:06,0.000s,PASSED
"fullname = ""test validation""",,,2019-03-26 09:20:06,2019-03-26 09:20:06,0.001s,PASSED
"phone = ""123""",,,2019-03-26 09:20:06,2019-03-26 09:20:06,0.000s,PASSED
"dealer = ""dealer test validation""",,,2019-03-26 09:20:06,2019-03-26 09:20:06,0.001s,PASSED
"addressLine1 = ""address line 1 test validation""",,,2019-03-26 09:20:06,2019-03-26 09:20:06,0.001s,PASSED
"addressLine2 = ""address line 1 test validation""",,,2019-03-26 09:20:06,2019-03-26 09:20:06,0.002s,PASSED
"town = ""townValidation""",,,2019-03-26 09:20:06,2019-03-26 09:20:06,0.002s,PASSED
"state = ""stateValidation""",,,2019-03-26 09:20:06,2019-03-26 09:20:06,0.000s,PASSED
"zip = ""zipValidation""",,,2019-03-26 09:20:06,2019-03-26 09:20:06,0.000s,PASSED
"country = ""countryValidation""",,,2019-03-26 09:20:06,2019-03-26 09:20:06,0.001s,PASSED
"roles = ""Client""",,,2019-03-26 09:20:06,2019-03-26 09:20:06,0.001s,PASSED
"modifierUsername = ""admin""",,,2019-03-26 09:20:06,2019-03-26 09:20:06,0.000s,PASSED
"modifierUserId = ""1""",,,2019-03-26 09:20:06,2019-03-26 09:20:06,0.001s,PASSED
"tokenUserName = ""admin""",,,2019-03-26 09:20:06,2019-03-26 09:20:06,0.002s,PASSED
"tokenPassword = ""cropmetricsvo""",,,2019-03-26 09:20:06,2019-03-26 09:20:06,0.001s,PASSED
"responseToken = sendRequest(findTestObject(""VoPro/Token"", [""usernameToken"":tokenUserName, ""passwordToken"":tokenPassword]))",,,2019-03-26 09:20:06,2019-03-26 09:20:06,0.108s,PASSED
slurper = new groovy.json.JsonSlurper(),,,2019-03-26 09:20:06,2019-03-26 09:20:06,0.001s,PASSED
tokenResult = slurper.parseText(responseToken.getResponseBodyContent()),,,2019-03-26 09:20:06,2019-03-26 09:20:06,0.001s,PASSED
accessToken = access_token,,,2019-03-26 09:20:06,2019-03-26 09:20:06,0.000s,PASSED
"println("".. current access token generated: "" + accessToken)",,,2019-03-26 09:20:06,2019-03-26 09:20:06,0.001s,PASSED
"responseAdminRegister = sendRequest(findTestObject(""VoPro/Account/AdministrativeRegister"", [""access_token"":accessToken, ""username"":username, ""password"":password, ""confirmPassword"":confirmPassword, ""email"":email, ""fullname"":fullname, ... ]))",,,2019-03-26 09:20:06,2019-03-26 09:20:08,1.504s,PASSED
"verifyResponseStatusCode(responseAdminRegister, 200)",,,2019-03-26 09:20:08,2019-03-26 09:20:08,0.004s,PASSED
slurper1 = new groovy.json.JsonSlurper(),,,2019-03-26 09:20:08,2019-03-26 09:20:08,0.001s,PASSED
AdminRegisterResult = slurper1.parseText(responseAdminRegister.getResponseBodyContent()),,,2019-03-26 09:20:08,2019-03-26 09:20:08,0.001s,PASSED
idResponse = id,,,2019-03-26 09:20:08,2019-03-26 09:20:08,0.001s,PASSED
"println(""New accoutn is created with the next Id: "" + idResponse)",,,2019-03-26 09:20:08,2019-03-26 09:20:08,0.000s,PASSED
,,,,,,
Test Cases/VoPro/API/Account/4 API_ACNT_When_try_to_create_a_new_user_without_email_attribute_Expected_status_code_500,,,2019-03-26 09:20:08,2019-03-26 09:20:11,3.152s,PASSED
"username = ""kusernoemail""",,,2019-03-26 09:20:08,2019-03-26 09:20:08,0.001s,PASSED
"password = ""cropmetrics""",,,2019-03-26 09:20:08,2019-03-26 09:20:08,0.001s,PASSED
"confirmPassword = ""cropmetrics""",,,2019-03-26 09:20:08,2019-03-26 09:20:08,0.005s,PASSED
"email = """"",,,2019-03-26 09:20:08,2019-03-26 09:20:08,0.004s,PASSED
"fullname = ""test validation""",,,2019-03-26 09:20:08,2019-03-26 09:20:08,0.007s,PASSED
"phone = ""123""",,,2019-03-26 09:20:08,2019-03-26 09:20:08,0.005s,PASSED
"dealer = ""dealer test validation""",,,2019-03-26 09:20:08,2019-03-26 09:20:08,0.000s,PASSED
"addressLine1 = ""address line 1 test validation""",,,2019-03-26 09:20:08,2019-03-26 09:20:08,0.002s,PASSED
"addressLine2 = ""address line 1 test validation""",,,2019-03-26 09:20:08,2019-03-26 09:20:08,0.002s,PASSED
"town = ""townValidation""",,,2019-03-26 09:20:08,2019-03-26 09:20:08,0.000s,PASSED
"state = ""stateValidation""",,,2019-03-26 09:20:08,2019-03-26 09:20:08,0.001s,PASSED
"zip = ""zipValidation""",,,2019-03-26 09:20:08,2019-03-26 09:20:08,0.000s,PASSED
"country = ""countryValidation""",,,2019-03-26 09:20:08,2019-03-26 09:20:08,0.004s,PASSED
"roles = ""Client""",,,2019-03-26 09:20:08,2019-03-26 09:20:08,0.000s,PASSED
"modifierUsername = ""admin""",,,2019-03-26 09:20:08,2019-03-26 09:20:08,0.008s,PASSED
"modifierUserId = ""1""",,,2019-03-26 09:20:08,2019-03-26 09:20:08,0.018s,PASSED
"tokenUserName = ""admin""",,,2019-03-26 09:20:08,2019-03-26 09:20:08,0.002s,PASSED
"tokenPassword = ""cropmetricsvo""",,,2019-03-26 09:20:08,2019-03-26 09:20:08,0.001s,PASSED
"responseToken = sendRequest(findTestObject(""VoPro/Token"", [""usernameToken"":tokenUserName, ""passwordToken"":tokenPassword]))",,,2019-03-26 09:20:08,2019-03-26 09:20:08,0.099s,PASSED
slurper = new groovy.json.JsonSlurper(),,,2019-03-26 09:20:08,2019-03-26 09:20:08,0.001s,PASSED
tokenResult = slurper.parseText(responseToken.getResponseBodyContent()),,,2019-03-26 09:20:08,2019-03-26 09:20:08,0.000s,PASSED
accessToken = access_token,,,2019-03-26 09:20:08,2019-03-26 09:20:08,0.000s,PASSED
"println("".. current access token generated: "" + accessToken)",,,2019-03-26 09:20:08,2019-03-26 09:20:08,0.001s,PASSED
"responseAdminRegister = sendRequest(findTestObject(""VoPro/Account/AdministrativeRegister"", [""access_token"":accessToken, ""username"":username, ""password"":password, ""confirmPassword"":confirmPassword, ""email"":email, ""fullname"":fullname, ... ]))",,,2019-03-26 09:20:08,2019-03-26 09:20:11,2.687s,PASSED
"verifyResponseStatusCode(responseAdminRegister, 500)",,,2019-03-26 09:20:11,2019-03-26 09:20:11,0.001s,PASSED
,,,,,,
Test Cases/VoPro/API/Account/5 API_ACNT_When_try_to_create_a_new_user_without_fullname_attribute_Expected_status_code_500,,,2019-03-26 09:20:11,2019-03-26 09:20:15,3.570s,PASSED
"username = ""kusernofullname""",,,2019-03-26 09:20:11,2019-03-26 09:20:11,0.001s,PASSED
"password = ""cropmetrics""",,,2019-03-26 09:20:11,2019-03-26 09:20:11,0.001s,PASSED
"confirmPassword = ""cropmetrics""",,,2019-03-26 09:20:11,2019-03-26 09:20:11,0.000s,PASSED
"email = ""cropmetricsvo@gmail.com""",,,2019-03-26 09:20:11,2019-03-26 09:20:11,0.000s,PASSED
"fullname = """"",,,2019-03-26 09:20:11,2019-03-26 09:20:11,0.001s,PASSED
"phone = ""123""",,,2019-03-26 09:20:11,2019-03-26 09:20:11,0.001s,PASSED
"dealer = ""dealer test validation""",,,2019-03-26 09:20:11,2019-03-26 09:20:11,0.000s,PASSED
"addressLine1 = ""address line 1 test validation""",,,2019-03-26 09:20:11,2019-03-26 09:20:11,0.000s,PASSED
"addressLine2 = ""address line 1 test validation""",,,2019-03-26 09:20:11,2019-03-26 09:20:11,0.000s,PASSED
"town = ""townValidation""",,,2019-03-26 09:20:11,2019-03-26 09:20:11,0.001s,PASSED
"state = ""stateValidation""",,,2019-03-26 09:20:11,2019-03-26 09:20:11,0.001s,PASSED
"zip = ""zipValidation""",,,2019-03-26 09:20:11,2019-03-26 09:20:11,0.000s,PASSED
"country = ""countryValidation""",,,2019-03-26 09:20:11,2019-03-26 09:20:11,0.001s,PASSED
"roles = ""Client""",,,2019-03-26 09:20:11,2019-03-26 09:20:11,0.000s,PASSED
"modifierUsername = ""admin""",,,2019-03-26 09:20:11,2019-03-26 09:20:11,0.000s,PASSED
"modifierUserId = ""1""",,,2019-03-26 09:20:11,2019-03-26 09:20:11,0.000s,PASSED
"tokenUserName = ""admin""",,,2019-03-26 09:20:11,2019-03-26 09:20:11,0.001s,PASSED
"tokenPassword = ""cropmetricsvo""",,,2019-03-26 09:20:11,2019-03-26 09:20:11,0.001s,PASSED
"responseToken = sendRequest(findTestObject(""VoPro/Token"", [""usernameToken"":tokenUserName, ""passwordToken"":tokenPassword]))",,,2019-03-26 09:20:11,2019-03-26 09:20:11,0.075s,PASSED
slurper = new groovy.json.JsonSlurper(),,,2019-03-26 09:20:11,2019-03-26 09:20:11,0.001s,PASSED
tokenResult = slurper.parseText(responseToken.getResponseBodyContent()),,,2019-03-26 09:20:11,2019-03-26 09:20:11,0.000s,PASSED
accessToken = access_token,,,2019-03-26 09:20:11,2019-03-26 09:20:11,0.000s,PASSED
"println("".. current access token generated: "" + accessToken)",,,2019-03-26 09:20:11,2019-03-26 09:20:11,0.000s,PASSED
"responseAdminRegister = sendRequest(findTestObject(""VoPro/Account/AdministrativeRegister"", [""access_token"":accessToken, ""username"":username, ""password"":password, ""confirmPassword"":confirmPassword, ""email"":email, ""fullname"":fullname, ... ]))",,,2019-03-26 09:20:11,2019-03-26 09:20:15,3.250s,PASSED
"verifyResponseStatusCode(responseAdminRegister, 500)",,,2019-03-26 09:20:15,2019-03-26 09:20:15,0.004s,PASSED
,,,,,,
Test Cases/VoPro/API/Account/6 API_ACNT_When_try_to_create_a_new_user_without_phone_attribute_Expected_status_code_200,,,2019-03-26 09:20:15,2019-03-26 09:20:16,1.799s,PASSED
"username = ""kusernophone""",,,2019-03-26 09:20:15,2019-03-26 09:20:15,0.000s,PASSED
"password = ""cropmetrics""",,,2019-03-26 09:20:15,2019-03-26 09:20:15,0.000s,PASSED
"confirmPassword = ""cropmetrics""",,,2019-03-26 09:20:15,2019-03-26 09:20:15,0.001s,PASSED
"email = ""cropmetricsvo@gmail.com""",,,2019-03-26 09:20:15,2019-03-26 09:20:15,0.001s,PASSED
"fullname = ""test validation""",,,2019-03-26 09:20:15,2019-03-26 09:20:15,0.002s,PASSED
"phone = """"",,,2019-03-26 09:20:15,2019-03-26 09:20:15,0.002s,PASSED
"dealer = ""dealer test validation""",,,2019-03-26 09:20:15,2019-03-26 09:20:15,0.001s,PASSED
"addressLine1 = ""address line 1 test validation""",,,2019-03-26 09:20:15,2019-03-26 09:20:15,0.000s,PASSED
"addressLine2 = ""address line 1 test validation""",,,2019-03-26 09:20:15,2019-03-26 09:20:15,0.002s,PASSED
"town = ""townValidation""",,,2019-03-26 09:20:15,2019-03-26 09:20:15,0.001s,PASSED
"state = ""stateValidation""",,,2019-03-26 09:20:15,2019-03-26 09:20:15,0.001s,PASSED
"zip = ""zipValidation""",,,2019-03-26 09:20:15,2019-03-26 09:20:15,0.000s,PASSED
"country = ""countryValidation""",,,2019-03-26 09:20:15,2019-03-26 09:20:15,0.001s,PASSED
"roles = ""Client""",,,2019-03-26 09:20:15,2019-03-26 09:20:15,0.000s,PASSED
"modifierUsername = ""admin""",,,2019-03-26 09:20:15,2019-03-26 09:20:15,0.001s,PASSED
"modifierUserId = ""1""",,,2019-03-26 09:20:15,2019-03-26 09:20:15,0.000s,PASSED
"tokenUserName = ""admin""",,,2019-03-26 09:20:15,2019-03-26 09:20:15,0.001s,PASSED
"tokenPassword = ""cropmetricsvo""",,,2019-03-26 09:20:15,2019-03-26 09:20:15,0.001s,PASSED
"responseToken = sendRequest(findTestObject(""VoPro/Token"", [""usernameToken"":tokenUserName, ""passwordToken"":tokenPassword]))",,,2019-03-26 09:20:15,2019-03-26 09:20:15,0.083s,PASSED
slurper = new groovy.json.JsonSlurper(),,,2019-03-26 09:20:15,2019-03-26 09:20:15,0.001s,PASSED
tokenResult = slurper.parseText(responseToken.getResponseBodyContent()),,,2019-03-26 09:20:15,2019-03-26 09:20:15,0.001s,PASSED
accessToken = access_token,,,2019-03-26 09:20:15,2019-03-26 09:20:15,0.001s,PASSED
"println("".. current access token generated: "" + accessToken)",,,2019-03-26 09:20:15,2019-03-26 09:20:15,0.001s,PASSED
"responseAdminRegister = sendRequest(findTestObject(""VoPro/Account/AdministrativeRegister"", [""access_token"":accessToken, ""username"":username, ""password"":password, ""confirmPassword"":confirmPassword, ""email"":email, ""fullname"":fullname, ... ]))",,,2019-03-26 09:20:15,2019-03-26 09:20:16,1.399s,PASSED
"verifyResponseStatusCode(responseAdminRegister, 200)",,,2019-03-26 09:20:16,2019-03-26 09:20:16,0.004s,PASSED
slurper1 = new groovy.json.JsonSlurper(),,,2019-03-26 09:20:16,2019-03-26 09:20:16,0.000s,PASSED
AdminRegisterResult = slurper1.parseText(responseAdminRegister.getResponseBodyContent()),,,2019-03-26 09:20:16,2019-03-26 09:20:16,0.000s,PASSED
idResponse = id,,,2019-03-26 09:20:16,2019-03-26 09:20:16,0.000s,PASSED
"println(""New accoutn is created with the next Id: "" + idResponse)",,,2019-03-26 09:20:16,2019-03-26 09:20:16,0.001s,PASSED
,,,,,,
Test Cases/VoPro/API/Account/7 API_ACNT_When_try_to_create_a_new_user_with_phone_attribute_as_char_Expected_status_code_200,,,2019-03-26 09:20:16,2019-03-26 09:20:18,2.093s,PASSED
"username = ""kuserphonechar""",,,2019-03-26 09:20:17,2019-03-26 09:20:17,0.001s,PASSED
"password = ""cropmetrics""",,,2019-03-26 09:20:17,2019-03-26 09:20:17,0.001s,PASSED
"confirmPassword = ""cropmetrics""",,,2019-03-26 09:20:17,2019-03-26 09:20:17,0.000s,PASSED
"email = ""cropmetricsvo@gmail.com""",,,2019-03-26 09:20:17,2019-03-26 09:20:17,0.000s,PASSED
"fullname = ""test validation phone attribute as characters instead of numbers""",,,2019-03-26 09:20:17,2019-03-26 09:20:17,0.001s,PASSED
"phone = ""one""",,,2019-03-26 09:20:17,2019-03-26 09:20:17,0.000s,PASSED
"dealer = ""dealer test validation""",,,2019-03-26 09:20:17,2019-03-26 09:20:17,0.001s,PASSED
"addressLine1 = ""address line 1 test validation""",,,2019-03-26 09:20:17,2019-03-26 09:20:17,0.000s,PASSED
"addressLine2 = ""address line 1 test validation""",,,2019-03-26 09:20:17,2019-03-26 09:20:17,0.001s,PASSED
"town = ""townValidation""",,,2019-03-26 09:20:17,2019-03-26 09:20:17,0.000s,PASSED
"state = ""stateValidation""",,,2019-03-26 09:20:17,2019-03-26 09:20:17,0.000s,PASSED
"zip = ""zipValidation""",,,2019-03-26 09:20:17,2019-03-26 09:20:17,0.001s,PASSED
"country = ""countryValidation""",,,2019-03-26 09:20:17,2019-03-26 09:20:17,0.004s,PASSED
"roles = ""Client""",,,2019-03-26 09:20:17,2019-03-26 09:20:17,0.000s,PASSED
"modifierUsername = ""admin""",,,2019-03-26 09:20:17,2019-03-26 09:20:17,0.001s,PASSED
"modifierUserId = ""1""",,,2019-03-26 09:20:17,2019-03-26 09:20:17,0.000s,PASSED
"tokenUserName = ""admin""",,,2019-03-26 09:20:17,2019-03-26 09:20:17,0.001s,PASSED
"tokenPassword = ""cropmetricsvo""",,,2019-03-26 09:20:17,2019-03-26 09:20:17,0.001s,PASSED
"responseToken = sendRequest(findTestObject(""VoPro/Token"", [""usernameToken"":tokenUserName, ""passwordToken"":tokenPassword]))",,,2019-03-26 09:20:17,2019-03-26 09:20:17,0.188s,PASSED
slurper = new groovy.json.JsonSlurper(),,,2019-03-26 09:20:17,2019-03-26 09:20:17,0.000s,PASSED
tokenResult = slurper.parseText(responseToken.getResponseBodyContent()),,,2019-03-26 09:20:17,2019-03-26 09:20:17,0.001s,PASSED
accessToken = access_token,,,2019-03-26 09:20:17,2019-03-26 09:20:17,0.001s,PASSED
"println("".. current access token generated: "" + accessToken)",,,2019-03-26 09:20:17,2019-03-26 09:20:17,0.001s,PASSED
"responseAdminRegister = sendRequest(findTestObject(""VoPro/Account/AdministrativeRegister"", [""access_token"":accessToken, ""username"":username, ""password"":password, ""confirmPassword"":confirmPassword, ""email"":email, ""fullname"":fullname, ... ]))",,,2019-03-26 09:20:17,2019-03-26 09:20:18,1.645s,PASSED
"verifyResponseStatusCode(responseAdminRegister, 200)",,,2019-03-26 09:20:18,2019-03-26 09:20:18,0.003s,PASSED
slurper1 = new groovy.json.JsonSlurper(),,,2019-03-26 09:20:18,2019-03-26 09:20:18,0.001s,PASSED
AdminRegisterResult = slurper1.parseText(responseAdminRegister.getResponseBodyContent()),,,2019-03-26 09:20:18,2019-03-26 09:20:18,0.001s,PASSED
idResponse = id,,,2019-03-26 09:20:18,2019-03-26 09:20:18,0.001s,PASSED
"println(""New accoutn is created with the next Id: "" + idResponse)",,,2019-03-26 09:20:18,2019-03-26 09:20:18,0.002s,PASSED
,,,,,,
Test Cases/VoPro/API/Account/8 API_ACNT_When_try_to_create_a_new_user_with_phone_attribute_as_spaces_Expected_status_code_200,,,2019-03-26 09:20:18,2019-03-26 09:20:20,1.709s,PASSED
"username = ""kuserphonespace""",,,2019-03-26 09:20:19,2019-03-26 09:20:19,0.000s,PASSED
"password = ""cropmetrics""",,,2019-03-26 09:20:19,2019-03-26 09:20:19,0.000s,PASSED
"confirmPassword = ""cropmetrics""",,,2019-03-26 09:20:19,2019-03-26 09:20:19,0.001s,PASSED
"email = ""cropmetricsvo@gmail.com""",,,2019-03-26 09:20:19,2019-03-26 09:20:19,0.001s,PASSED
"fullname = ""test validation phone attribute as characters instead of numbers""",,,2019-03-26 09:20:19,2019-03-26 09:20:19,0.001s,PASSED
"phone = ""one five nine""",,,2019-03-26 09:20:19,2019-03-26 09:20:19,0.000s,PASSED
"dealer = ""dealer test validation""",,,2019-03-26 09:20:19,2019-03-26 09:20:19,0.001s,PASSED
"addressLine1 = ""address line 1 test validation""",,,2019-03-26 09:20:19,2019-03-26 09:20:19,0.003s,PASSED
"addressLine2 = ""address line 1 test validation""",,,2019-03-26 09:20:19,2019-03-26 09:20:19,0.001s,PASSED
"town = ""townValidation""",,,2019-03-26 09:20:19,2019-03-26 09:20:19,0.000s,PASSED
"state = ""stateValidation""",,,2019-03-26 09:20:19,2019-03-26 09:20:19,0.000s,PASSED
"zip = ""zipValidation""",,,2019-03-26 09:20:19,2019-03-26 09:20:19,0.000s,PASSED
"country = ""countryValidation""",,,2019-03-26 09:20:19,2019-03-26 09:20:19,0.001s,PASSED
"roles = ""Client""",,,2019-03-26 09:20:19,2019-03-26 09:20:19,0.000s,PASSED
"modifierUsername = ""admin""",,,2019-03-26 09:20:19,2019-03-26 09:20:19,0.000s,PASSED
"modifierUserId = ""1""",,,2019-03-26 09:20:19,2019-03-26 09:20:19,0.002s,PASSED
"tokenUserName = ""admin""",,,2019-03-26 09:20:19,2019-03-26 09:20:19,0.001s,PASSED
"tokenPassword = ""cropmetricsvo""",,,2019-03-26 09:20:19,2019-03-26 09:20:19,0.001s,PASSED
"responseToken = sendRequest(findTestObject(""VoPro/Token"", [""usernameToken"":tokenUserName, ""passwordToken"":tokenPassword]))",,,2019-03-26 09:20:19,2019-03-26 09:20:19,0.125s,PASSED
slurper = new groovy.json.JsonSlurper(),,,2019-03-26 09:20:19,2019-03-26 09:20:19,0.001s,PASSED
tokenResult = slurper.parseText(responseToken.getResponseBodyContent()),,,2019-03-26 09:20:19,2019-03-26 09:20:19,0.001s,PASSED
accessToken = access_token,,,2019-03-26 09:20:19,2019-03-26 09:20:19,0.000s,PASSED
"println("".. current access token generated: "" + accessToken)",,,2019-03-26 09:20:19,2019-03-26 09:20:19,0.001s,PASSED
"responseAdminRegister = sendRequest(findTestObject(""VoPro/Account/AdministrativeRegister"", [""access_token"":accessToken, ""username"":username, ""password"":password, ""confirmPassword"":confirmPassword, ""email"":email, ""fullname"":fullname, ... ]))",,,2019-03-26 09:20:19,2019-03-26 09:20:20,1.282s,PASSED
"verifyResponseStatusCode(responseAdminRegister, 200)",,,2019-03-26 09:20:20,2019-03-26 09:20:20,0.003s,PASSED
slurper1 = new groovy.json.JsonSlurper(),,,2019-03-26 09:20:20,2019-03-26 09:20:20,0.000s,PASSED
AdminRegisterResult = slurper1.parseText(responseAdminRegister.getResponseBodyContent()),,,2019-03-26 09:20:20,2019-03-26 09:20:20,0.001s,PASSED
idResponse = id,,,2019-03-26 09:20:20,2019-03-26 09:20:20,0.001s,PASSED
"println(""New accoutn is created with the next Id: "" + idResponse)",,,2019-03-26 09:20:20,2019-03-26 09:20:20,0.001s,PASSED
,,,,,,
Test Cases/VoPro/API/Account/9 API_ACNT_When_try_to_create_a_new_user_without_dealer_attribute_Expected_status_code_200,,,2019-03-26 09:20:20,2019-03-26 09:20:22,1.794s,PASSED
"username = ""kusernodealer""",,,2019-03-26 09:20:20,2019-03-26 09:20:20,0.001s,PASSED
"password = ""cropmetrics""",,,2019-03-26 09:20:20,2019-03-26 09:20:20,0.000s,PASSED
"confirmPassword = ""cropmetrics""",,,2019-03-26 09:20:20,2019-03-26 09:20:20,0.001s,PASSED
"email = ""cropmetricsvo@gmail.com""",,,2019-03-26 09:20:20,2019-03-26 09:20:20,0.000s,PASSED
"fullname = ""test validation phone attribute as characters instead of numbers""",,,2019-03-26 09:20:21,2019-03-26 09:20:21,0.001s,PASSED
"phone = ""123""",,,2019-03-26 09:20:21,2019-03-26 09:20:21,0.001s,PASSED
"dealer = """"",,,2019-03-26 09:20:21,2019-03-26 09:20:21,0.001s,PASSED
"addressLine1 = ""address line 1 test validation""",,,2019-03-26 09:20:21,2019-03-26 09:20:21,0.001s,PASSED
"addressLine2 = ""address line 1 test validation""",,,2019-03-26 09:20:21,2019-03-26 09:20:21,0.000s,PASSED
"town = ""townValidation""",,,2019-03-26 09:20:21,2019-03-26 09:20:21,0.000s,PASSED
"state = ""stateValidation""",,,2019-03-26 09:20:21,2019-03-26 09:20:21,0.001s,PASSED
"zip = ""zipValidation""",,,2019-03-26 09:20:21,2019-03-26 09:20:21,0.000s,PASSED
"country = ""countryValidation""",,,2019-03-26 09:20:21,2019-03-26 09:20:21,0.000s,PASSED
"roles = ""Client""",,,2019-03-26 09:20:21,2019-03-26 09:20:21,0.001s,PASSED
"modifierUsername = ""admin""",,,2019-03-26 09:20:21,2019-03-26 09:20:21,0.001s,PASSED
"modifierUserId = ""1""",,,2019-03-26 09:20:21,2019-03-26 09:20:21,0.000s,PASSED
"tokenUserName = ""admin""",,,2019-03-26 09:20:21,2019-03-26 09:20:21,0.001s,PASSED
"tokenPassword = ""cropmetricsvo""",,,2019-03-26 09:20:21,2019-03-26 09:20:21,0.001s,PASSED
"responseToken = sendRequest(findTestObject(""VoPro/Token"", [""usernameToken"":tokenUserName, ""passwordToken"":tokenPassword]))",,,2019-03-26 09:20:21,2019-03-26 09:20:21,0.112s,PASSED
slurper = new groovy.json.JsonSlurper(),,,2019-03-26 09:20:21,2019-03-26 09:20:21,0.001s,PASSED
tokenResult = slurper.parseText(responseToken.getResponseBodyContent()),,,2019-03-26 09:20:21,2019-03-26 09:20:21,0.001s,PASSED
accessToken = access_token,,,2019-03-26 09:20:21,2019-03-26 09:20:21,0.000s,PASSED
"println("".. current access token generated: "" + accessToken)",,,2019-03-26 09:20:21,2019-03-26 09:20:21,0.000s,PASSED
"responseAdminRegister = sendRequest(findTestObject(""VoPro/Account/AdministrativeRegister"", [""access_token"":accessToken, ""username"":username, ""password"":password, ""confirmPassword"":confirmPassword, ""email"":email, ""fullname"":fullname, ... ]))",,,2019-03-26 09:20:21,2019-03-26 09:20:22,1.329s,PASSED
"verifyResponseStatusCode(responseAdminRegister, 200)",,,2019-03-26 09:20:22,2019-03-26 09:20:22,0.008s,PASSED
slurper1 = new groovy.json.JsonSlurper(),,,2019-03-26 09:20:22,2019-03-26 09:20:22,0.000s,PASSED
AdminRegisterResult = slurper1.parseText(responseAdminRegister.getResponseBodyContent()),,,2019-03-26 09:20:22,2019-03-26 09:20:22,0.001s,PASSED
idResponse = id,,,2019-03-26 09:20:22,2019-03-26 09:20:22,0.000s,PASSED
"println(""New accoutn is created with the next Id: "" + idResponse)",,,2019-03-26 09:20:22,2019-03-26 09:20:22,0.000s,PASSED
,,,,,,
Test Cases/VoPro/API/Account/10 API_ACNT_When_try_to_create_a_new_user_without_addressline1_attribute_Expected_status_code_200,,,2019-03-26 09:20:22,2019-03-26 09:20:24,1.965s,PASSED
"username = ""kusernoaddressline1""",,,2019-03-26 09:20:22,2019-03-26 09:20:22,0.001s,PASSED
"password = ""cropmetrics""",,,2019-03-26 09:20:22,2019-03-26 09:20:22,0.000s,PASSED
"confirmPassword = ""cropmetrics""",,,2019-03-26 09:20:22,2019-03-26 09:20:22,0.001s,PASSED
"email = ""cropmetricsvo@gmail.com""",,,2019-03-26 09:20:22,2019-03-26 09:20:22,0.000s,PASSED
"fullname = ""test validation phone attribute as characters instead of numbers""",,,2019-03-26 09:20:22,2019-03-26 09:20:22,0.001s,PASSED
"phone = ""123""",,,2019-03-26 09:20:22,2019-03-26 09:20:22,0.001s,PASSED
"dealer = ""dealet test""",,,2019-03-26 09:20:22,2019-03-26 09:20:22,0.001s,PASSED
"addressLine1 = """"",,,2019-03-26 09:20:22,2019-03-26 09:20:22,0.000s,PASSED
"addressLine2 = ""address line 2 test validation""",,,2019-03-26 09:20:22,2019-03-26 09:20:22,0.001s,PASSED
"town = ""townValidation""",,,2019-03-26 09:20:22,2019-03-26 09:20:22,0.000s,PASSED
"state = ""stateValidation""",,,2019-03-26 09:20:22,2019-03-26 09:20:22,0.000s,PASSED
"zip = ""zipValidation""",,,2019-03-26 09:20:22,2019-03-26 09:20:22,0.000s,PASSED
"country = ""countryValidation""",,,2019-03-26 09:20:22,2019-03-26 09:20:22,0.000s,PASSED
"roles = ""Client""",,,2019-03-26 09:20:22,2019-03-26 09:20:22,0.001s,PASSED
"modifierUsername = ""admin""",,,2019-03-26 09:20:22,2019-03-26 09:20:22,0.000s,PASSED
"modifierUserId = ""1""",,,2019-03-26 09:20:22,2019-03-26 09:20:22,0.001s,PASSED
"tokenUserName = ""admin""",,,2019-03-26 09:20:22,2019-03-26 09:20:22,0.000s,PASSED
"tokenPassword = ""cropmetricsvo""",,,2019-03-26 09:20:22,2019-03-26 09:20:22,0.000s,PASSED
"responseToken = sendRequest(findTestObject(""VoPro/Token"", [""usernameToken"":tokenUserName, ""passwordToken"":tokenPassword]))",,,2019-03-26 09:20:22,2019-03-26 09:20:22,0.094s,PASSED
slurper = new groovy.json.JsonSlurper(),,,2019-03-26 09:20:22,2019-03-26 09:20:22,0.000s,PASSED
tokenResult = slurper.parseText(responseToken.getResponseBodyContent()),,,2019-03-26 09:20:22,2019-03-26 09:20:22,0.001s,PASSED
accessToken = access_token,,,2019-03-26 09:20:22,2019-03-26 09:20:22,0.001s,PASSED
"println("".. current access token generated: "" + accessToken)",,,2019-03-26 09:20:22,2019-03-26 09:20:22,0.001s,PASSED
"responseAdminRegister = sendRequest(findTestObject(""VoPro/Account/AdministrativeRegister"", [""access_token"":accessToken, ""username"":username, ""password"":password, ""confirmPassword"":confirmPassword, ""email"":email, ""fullname"":fullname, ... ]))",,,2019-03-26 09:20:22,2019-03-26 09:20:24,1.620s,PASSED
"verifyResponseStatusCode(responseAdminRegister, 200)",,,2019-03-26 09:20:24,2019-03-26 09:20:24,0.002s,PASSED
slurper1 = new groovy.json.JsonSlurper(),,,2019-03-26 09:20:24,2019-03-26 09:20:24,0.000s,PASSED
AdminRegisterResult = slurper1.parseText(responseAdminRegister.getResponseBodyContent()),,,2019-03-26 09:20:24,2019-03-26 09:20:24,0.001s,PASSED
idResponse = id,,,2019-03-26 09:20:24,2019-03-26 09:20:24,0.000s,PASSED
"println(""New accoutn is created with the next Id: "" + idResponse)",,,2019-03-26 09:20:24,2019-03-26 09:20:24,0.000s,PASSED
,,,,,,
Test Cases/VoPro/API/Account/11 API_ACNT_When_try_to_create_a_new_user_without_addressline2_attribute_Expected_status_code_200,,,2019-03-26 09:20:24,2019-03-26 09:20:26,1.708s,PASSED
"username = ""kusernoaddressline2""",,,2019-03-26 09:20:24,2019-03-26 09:20:24,0.000s,PASSED
"password = ""cropmetrics""",,,2019-03-26 09:20:24,2019-03-26 09:20:24,0.001s,PASSED
"confirmPassword = ""cropmetrics""",,,2019-03-26 09:20:24,2019-03-26 09:20:24,0.001s,PASSED
"email = ""cropmetricsvo@gmail.com""",,,2019-03-26 09:20:24,2019-03-26 09:20:24,0.001s,PASSED
"fullname = ""test validation phone attribute as characters instead of numbers""",,,2019-03-26 09:20:24,2019-03-26 09:20:24,0.001s,PASSED
"phone = ""123""",,,2019-03-26 09:20:24,2019-03-26 09:20:24,0.001s,PASSED
"dealer = ""dealet test""",,,2019-03-26 09:20:24,2019-03-26 09:20:24,0.000s,PASSED
"addressLine1 = ""address line 1 test validation""",,,2019-03-26 09:20:24,2019-03-26 09:20:24,0.001s,PASSED
"addressLine2 = """"",,,2019-03-26 09:20:24,2019-03-26 09:20:24,0.000s,PASSED
"town = ""townValidation""",,,2019-03-26 09:20:24,2019-03-26 09:20:24,0.000s,PASSED
"state = ""stateValidation""",,,2019-03-26 09:20:24,2019-03-26 09:20:24,0.000s,PASSED
"zip = ""zipValidation""",,,2019-03-26 09:20:24,2019-03-26 09:20:24,0.001s,PASSED
"country = ""countryValidation""",,,2019-03-26 09:20:24,2019-03-26 09:20:24,0.001s,PASSED
"roles = ""Client""",,,2019-03-26 09:20:24,2019-03-26 09:20:24,0.000s,PASSED
"modifierUsername = ""admin""",,,2019-03-26 09:20:24,2019-03-26 09:20:24,0.002s,PASSED
"modifierUserId = ""1""",,,2019-03-26 09:20:24,2019-03-26 09:20:24,0.001s,PASSED
"tokenUserName = ""admin""",,,2019-03-26 09:20:24,2019-03-26 09:20:24,0.000s,PASSED
"tokenPassword = ""cropmetricsvo""",,,2019-03-26 09:20:24,2019-03-26 09:20:24,0.002s,PASSED
"responseToken = sendRequest(findTestObject(""VoPro/Token"", [""usernameToken"":tokenUserName, ""passwordToken"":tokenPassword]))",,,2019-03-26 09:20:24,2019-03-26 09:20:24,0.125s,PASSED
slurper = new groovy.json.JsonSlurper(),,,2019-03-26 09:20:24,2019-03-26 09:20:24,0.001s,PASSED
tokenResult = slurper.parseText(responseToken.getResponseBodyContent()),,,2019-03-26 09:20:24,2019-03-26 09:20:24,0.001s,PASSED
accessToken = access_token,,,2019-03-26 09:20:24,2019-03-26 09:20:24,0.001s,PASSED
"println("".. current access token generated: "" + accessToken)",,,2019-03-26 09:20:24,2019-03-26 09:20:24,0.001s,PASSED
"responseAdminRegister = sendRequest(findTestObject(""VoPro/Account/AdministrativeRegister"", [""access_token"":accessToken, ""username"":username, ""password"":password, ""confirmPassword"":confirmPassword, ""email"":email, ""fullname"":fullname, ... ]))",,,2019-03-26 09:20:24,2019-03-26 09:20:26,1.333s,PASSED
"verifyResponseStatusCode(responseAdminRegister, 200)",,,2019-03-26 09:20:26,2019-03-26 09:20:26,0.003s,PASSED
slurper1 = new groovy.json.JsonSlurper(),,,2019-03-26 09:20:26,2019-03-26 09:20:26,0.000s,PASSED
AdminRegisterResult = slurper1.parseText(responseAdminRegister.getResponseBodyContent()),,,2019-03-26 09:20:26,2019-03-26 09:20:26,0.000s,PASSED
idResponse = id,,,2019-03-26 09:20:26,2019-03-26 09:20:26,0.001s,PASSED
"println(""New accoutn is created with the next Id: "" + idResponse)",,,2019-03-26 09:20:26,2019-03-26 09:20:26,0.000s,PASSED
,,,,,,
Test Cases/VoPro/API/Account/12 API_ACNT_When_try_to_create_a_new_user_without_town_attribute_Expected_status_code_200,,,2019-03-26 09:20:26,2019-03-26 09:20:27,1.656s,PASSED
"username = ""kusernotown""",,,2019-03-26 09:20:26,2019-03-26 09:20:26,0.002s,PASSED
"password = ""cropmetrics""",,,2019-03-26 09:20:26,2019-03-26 09:20:26,0.001s,PASSED
"confirmPassword = ""cropmetrics""",,,2019-03-26 09:20:26,2019-03-26 09:20:26,0.001s,PASSED
"email = ""cropmetricsvo@gmail.com""",,,2019-03-26 09:20:26,2019-03-26 09:20:26,0.001s,PASSED
"fullname = ""test validation phone attribute as characters instead of numbers""",,,2019-03-26 09:20:26,2019-03-26 09:20:26,0.001s,PASSED
"phone = ""123""",,,2019-03-26 09:20:26,2019-03-26 09:20:26,0.001s,PASSED
"dealer = ""dealet test""",,,2019-03-26 09:20:26,2019-03-26 09:20:26,0.000s,PASSED
"addressLine1 = ""address line 1 test validation""",,,2019-03-26 09:20:26,2019-03-26 09:20:26,0.001s,PASSED
"addressLine2 = ""address line 2 test validation""",,,2019-03-26 09:20:26,2019-03-26 09:20:26,0.000s,PASSED
"town = """"",,,2019-03-26 09:20:26,2019-03-26 09:20:26,0.000s,PASSED
"state = ""stateValidation""",,,2019-03-26 09:20:26,2019-03-26 09:20:26,0.002s,PASSED
"zip = ""zipValidation""",,,2019-03-26 09:20:26,2019-03-26 09:20:26,0.002s,PASSED
"country = ""countryValidation""",,,2019-03-26 09:20:26,2019-03-26 09:20:26,0.001s,PASSED
"roles = ""Client""",,,2019-03-26 09:20:26,2019-03-26 09:20:26,0.000s,PASSED
"modifierUsername = ""admin""",,,2019-03-26 09:20:26,2019-03-26 09:20:26,0.000s,PASSED
"modifierUserId = ""1""",,,2019-03-26 09:20:26,2019-03-26 09:20:26,0.001s,PASSED
"tokenUserName = ""admin""",,,2019-03-26 09:20:26,2019-03-26 09:20:26,0.001s,PASSED
"tokenPassword = ""cropmetricsvo""",,,2019-03-26 09:20:26,2019-03-26 09:20:26,0.000s,PASSED
"responseToken = sendRequest(findTestObject(""VoPro/Token"", [""usernameToken"":tokenUserName, ""passwordToken"":tokenPassword]))",,,2019-03-26 09:20:26,2019-03-26 09:20:26,0.085s,PASSED
slurper = new groovy.json.JsonSlurper(),,,2019-03-26 09:20:26,2019-03-26 09:20:26,0.000s,PASSED
tokenResult = slurper.parseText(responseToken.getResponseBodyContent()),,,2019-03-26 09:20:26,2019-03-26 09:20:26,0.001s,PASSED
accessToken = access_token,,,2019-03-26 09:20:26,2019-03-26 09:20:26,0.001s,PASSED
"println("".. current access token generated: "" + accessToken)",,,2019-03-26 09:20:26,2019-03-26 09:20:26,0.001s,PASSED
"responseAdminRegister = sendRequest(findTestObject(""VoPro/Account/AdministrativeRegister"", [""access_token"":accessToken, ""username"":username, ""password"":password, ""confirmPassword"":confirmPassword, ""email"":email, ""fullname"":fullname, ... ]))",,,2019-03-26 09:20:26,2019-03-26 09:20:27,1.281s,PASSED
"verifyResponseStatusCode(responseAdminRegister, 200)",,,2019-03-26 09:20:27,2019-03-26 09:20:27,0.003s,PASSED
slurper1 = new groovy.json.JsonSlurper(),,,2019-03-26 09:20:27,2019-03-26 09:20:27,0.000s,PASSED
AdminRegisterResult = slurper1.parseText(responseAdminRegister.getResponseBodyContent()),,,2019-03-26 09:20:27,2019-03-26 09:20:27,0.000s,PASSED
idResponse = id,,,2019-03-26 09:20:27,2019-03-26 09:20:27,0.001s,PASSED
"println(""New accoutn is created with the next Id: "" + idResponse)",,,2019-03-26 09:20:27,2019-03-26 09:20:27,0.000s,PASSED
,,,,,,
Test Cases/VoPro/API/Account/13 API_ACNT_When_try_to_create_a_new_user_without_state_attribute_Expected_status_code_200,,,2019-03-26 09:20:27,2019-03-26 09:20:29,1.782s,PASSED
"username = ""kusernostate""",,,2019-03-26 09:20:28,2019-03-26 09:20:28,0.001s,PASSED
"password = ""cropmetrics""",,,2019-03-26 09:20:28,2019-03-26 09:20:28,0.001s,PASSED
"confirmPassword = ""cropmetrics""",,,2019-03-26 09:20:28,2019-03-26 09:20:28,0.000s,PASSED
"email = ""cropmetricsvo@gmail.com""",,,2019-03-26 09:20:28,2019-03-26 09:20:28,0.000s,PASSED
"fullname = ""test validation phone attribute as characters instead of numbers""",,,2019-03-26 09:20:28,2019-03-26 09:20:28,0.001s,PASSED
"phone = ""123""",,,2019-03-26 09:20:28,2019-03-26 09:20:28,0.000s,PASSED
"dealer = ""dealet test""",,,2019-03-26 09:20:28,2019-03-26 09:20:28,0.000s,PASSED
"addressLine1 = ""address line 1 test validation""",,,2019-03-26 09:20:28,2019-03-26 09:20:28,0.001s,PASSED
"addressLine2 = ""address line 2 test validation""",,,2019-03-26 09:20:28,2019-03-26 09:20:28,0.000s,PASSED
"town = ""townValidation""",,,2019-03-26 09:20:28,2019-03-26 09:20:28,0.000s,PASSED
"state = """"",,,2019-03-26 09:20:28,2019-03-26 09:20:28,0.001s,PASSED
"zip = ""zipValidation""",,,2019-03-26 09:20:28,2019-03-26 09:20:28,0.001s,PASSED
"country = ""countryValidation""",,,2019-03-26 09:20:28,2019-03-26 09:20:28,0.000s,PASSED
"roles = ""Client""",,,2019-03-26 09:20:28,2019-03-26 09:20:28,0.000s,PASSED
"modifierUsername = ""admin""",,,2019-03-26 09:20:28,2019-03-26 09:20:28,0.001s,PASSED
"modifierUserId = ""1""",,,2019-03-26 09:20:28,2019-03-26 09:20:28,0.001s,PASSED
"tokenUserName = ""admin""",,,2019-03-26 09:20:28,2019-03-26 09:20:28,0.002s,PASSED
"tokenPassword = ""cropmetricsvo""",,,2019-03-26 09:20:28,2019-03-26 09:20:28,0.000s,PASSED
"responseToken = sendRequest(findTestObject(""VoPro/Token"", [""usernameToken"":tokenUserName, ""passwordToken"":tokenPassword]))",,,2019-03-26 09:20:28,2019-03-26 09:20:28,0.155s,PASSED
slurper = new groovy.json.JsonSlurper(),,,2019-03-26 09:20:28,2019-03-26 09:20:28,0.001s,PASSED
tokenResult = slurper.parseText(responseToken.getResponseBodyContent()),,,2019-03-26 09:20:28,2019-03-26 09:20:28,0.001s,PASSED
accessToken = access_token,,,2019-03-26 09:20:28,2019-03-26 09:20:28,0.000s,PASSED
"println("".. current access token generated: "" + accessToken)",,,2019-03-26 09:20:28,2019-03-26 09:20:28,0.001s,PASSED
"responseAdminRegister = sendRequest(findTestObject(""VoPro/Account/AdministrativeRegister"", [""access_token"":accessToken, ""username"":username, ""password"":password, ""confirmPassword"":confirmPassword, ""email"":email, ""fullname"":fullname, ... ]))",,,2019-03-26 09:20:28,2019-03-26 09:20:29,1.359s,PASSED
"verifyResponseStatusCode(responseAdminRegister, 200)",,,2019-03-26 09:20:29,2019-03-26 09:20:29,0.003s,PASSED
slurper1 = new groovy.json.JsonSlurper(),,,2019-03-26 09:20:29,2019-03-26 09:20:29,0.000s,PASSED
AdminRegisterResult = slurper1.parseText(responseAdminRegister.getResponseBodyContent()),,,2019-03-26 09:20:29,2019-03-26 09:20:29,0.000s,PASSED
idResponse = id,,,2019-03-26 09:20:29,2019-03-26 09:20:29,0.001s,PASSED
"println(""New accoutn is created with the next Id: "" + idResponse)",,,2019-03-26 09:20:29,2019-03-26 09:20:29,0.000s,PASSED
,,,,,,
Test Cases/VoPro/API/Account/14 API_ACNT_When_try_to_create_a_new_user_without_zip_attribute_Expected_status_code_200,,,2019-03-26 09:20:29,2019-03-26 09:20:31,1.870s,PASSED
"username = ""kusernozip""",,,2019-03-26 09:20:29,2019-03-26 09:20:29,0.000s,PASSED
"password = ""cropmetrics""",,,2019-03-26 09:20:29,2019-03-26 09:20:29,0.001s,PASSED
"confirmPassword = ""cropmetrics""",,,2019-03-26 09:20:29,2019-03-26 09:20:29,0.000s,PASSED
"email = ""cropmetricsvo@gmail.com""",,,2019-03-26 09:20:29,2019-03-26 09:20:29,0.000s,PASSED
"fullname = ""test validation phone attribute as characters instead of numbers""",,,2019-03-26 09:20:29,2019-03-26 09:20:29,0.000s,PASSED
"phone = ""123""",,,2019-03-26 09:20:29,2019-03-26 09:20:29,0.000s,PASSED
"dealer = ""dealet test""",,,2019-03-26 09:20:29,2019-03-26 09:20:29,0.000s,PASSED
"addressLine1 = ""address line 1 test validation""",,,2019-03-26 09:20:29,2019-03-26 09:20:29,0.001s,PASSED
"addressLine2 = ""address line 2 test validation""",,,2019-03-26 09:20:29,2019-03-26 09:20:29,0.000s,PASSED
"town = ""townValidation""",,,2019-03-26 09:20:29,2019-03-26 09:20:29,0.000s,PASSED
"state = ""stateValidation""",,,2019-03-26 09:20:29,2019-03-26 09:20:29,0.000s,PASSED
"zip = """"",,,2019-03-26 09:20:29,2019-03-26 09:20:29,0.001s,PASSED
"country = ""countryValidation""",,,2019-03-26 09:20:29,2019-03-26 09:20:29,0.000s,PASSED
"roles = ""Client""",,,2019-03-26 09:20:29,2019-03-26 09:20:29,0.001s,PASSED
"modifierUsername = ""admin""",,,2019-03-26 09:20:29,2019-03-26 09:20:29,0.000s,PASSED
"modifierUserId = ""1""",,,2019-03-26 09:20:29,2019-03-26 09:20:29,0.001s,PASSED
"tokenUserName = ""admin""",,,2019-03-26 09:20:29,2019-03-26 09:20:29,0.000s,PASSED
"tokenPassword = ""cropmetricsvo""",,,2019-03-26 09:20:29,2019-03-26 09:20:29,0.001s,PASSED
"responseToken = sendRequest(findTestObject(""VoPro/Token"", [""usernameToken"":tokenUserName, ""passwordToken"":tokenPassword]))",,,2019-03-26 09:20:29,2019-03-26 09:20:30,0.413s,PASSED
slurper = new groovy.json.JsonSlurper(),,,2019-03-26 09:20:30,2019-03-26 09:20:30,0.000s,PASSED
tokenResult = slurper.parseText(responseToken.getResponseBodyContent()),,,2019-03-26 09:20:30,2019-03-26 09:20:30,0.001s,PASSED
accessToken = access_token,,,2019-03-26 09:20:30,2019-03-26 09:20:30,0.001s,PASSED
"println("".. current access token generated: "" + accessToken)",,,2019-03-26 09:20:30,2019-03-26 09:20:30,0.001s,PASSED
"responseAdminRegister = sendRequest(findTestObject(""VoPro/Account/AdministrativeRegister"", [""access_token"":accessToken, ""username"":username, ""password"":password, ""confirmPassword"":confirmPassword, ""email"":email, ""fullname"":fullname, ... ]))",,,2019-03-26 09:20:30,2019-03-26 09:20:31,1.265s,PASSED
"verifyResponseStatusCode(responseAdminRegister, 200)",,,2019-03-26 09:20:31,2019-03-26 09:20:31,0.003s,PASSED
slurper1 = new groovy.json.JsonSlurper(),,,2019-03-26 09:20:31,2019-03-26 09:20:31,0.000s,PASSED
AdminRegisterResult = slurper1.parseText(responseAdminRegister.getResponseBodyContent()),,,2019-03-26 09:20:31,2019-03-26 09:20:31,0.001s,PASSED
idResponse = id,,,2019-03-26 09:20:31,2019-03-26 09:20:31,0.000s,PASSED
"println(""New accoutn is created with the next Id: "" + idResponse)",,,2019-03-26 09:20:31,2019-03-26 09:20:31,0.001s,PASSED
,,,,,,
Test Cases/VoPro/API/Account/15 API_ACNT_When_try_to_create_a_new_user_without_country_attribute_Expected_status_code_200,,,2019-03-26 09:20:31,2019-03-26 09:20:33,1.686s,PASSED
"username = ""kusernocountry""",,,2019-03-26 09:20:31,2019-03-26 09:20:31,0.000s,PASSED
"password = ""cropmetrics""",,,2019-03-26 09:20:31,2019-03-26 09:20:31,0.001s,PASSED
"confirmPassword = ""cropmetrics""",,,2019-03-26 09:20:31,2019-03-26 09:20:31,0.001s,PASSED
"email = ""cropmetricsvo@gmail.com""",,,2019-03-26 09:20:31,2019-03-26 09:20:31,0.001s,PASSED
"fullname = ""test validation phone attribute as characters instead of numbers""",,,2019-03-26 09:20:31,2019-03-26 09:20:31,0.000s,PASSED
"phone = ""123""",,,2019-03-26 09:20:31,2019-03-26 09:20:31,0.000s,PASSED
"dealer = ""dealet test""",,,2019-03-26 09:20:31,2019-03-26 09:20:31,0.001s,PASSED
"addressLine1 = ""address line 1 test validation""",,,2019-03-26 09:20:31,2019-03-26 09:20:31,0.000s,PASSED
"addressLine2 = ""address line 2 test validation""",,,2019-03-26 09:20:31,2019-03-26 09:20:31,0.000s,PASSED
"town = ""townValidation""",,,2019-03-26 09:20:31,2019-03-26 09:20:31,0.000s,PASSED
"state = ""stateValidation""",,,2019-03-26 09:20:31,2019-03-26 09:20:31,0.001s,PASSED
"zip = ""zipValidation""",,,2019-03-26 09:20:31,2019-03-26 09:20:31,0.001s,PASSED
"country = """"",,,2019-03-26 09:20:31,2019-03-26 09:20:31,0.000s,PASSED
"roles = ""Client""",,,2019-03-26 09:20:31,2019-03-26 09:20:31,0.001s,PASSED
"modifierUsername = ""admin""",,,2019-03-26 09:20:31,2019-03-26 09:20:31,0.000s,PASSED
"modifierUserId = ""1""",,,2019-03-26 09:20:31,2019-03-26 09:20:31,0.001s,PASSED
"tokenUserName = ""admin""",,,2019-03-26 09:20:31,2019-03-26 09:20:31,0.000s,PASSED
"tokenPassword = ""cropmetricsvo""",,,2019-03-26 09:20:31,2019-03-26 09:20:31,0.001s,PASSED
"responseToken = sendRequest(findTestObject(""VoPro/Token"", [""usernameToken"":tokenUserName, ""passwordToken"":tokenPassword]))",,,2019-03-26 09:20:31,2019-03-26 09:20:31,0.099s,PASSED
slurper = new groovy.json.JsonSlurper(),,,2019-03-26 09:20:31,2019-03-26 09:20:31,0.001s,PASSED
tokenResult = slurper.parseText(responseToken.getResponseBodyContent()),,,2019-03-26 09:20:31,2019-03-26 09:20:31,0.000s,PASSED
accessToken = access_token,,,2019-03-26 09:20:31,2019-03-26 09:20:31,0.000s,PASSED
"println("".. current access token generated: "" + accessToken)",,,2019-03-26 09:20:31,2019-03-26 09:20:31,0.001s,PASSED
"responseAdminRegister = sendRequest(findTestObject(""VoPro/Account/AdministrativeRegister"", [""access_token"":accessToken, ""username"":username, ""password"":password, ""confirmPassword"":confirmPassword, ""email"":email, ""fullname"":fullname, ... ]))",,,2019-03-26 09:20:31,2019-03-26 09:20:33,1.333s,PASSED
"verifyResponseStatusCode(responseAdminRegister, 200)",,,2019-03-26 09:20:33,2019-03-26 09:20:33,0.002s,PASSED
slurper1 = new groovy.json.JsonSlurper(),,,2019-03-26 09:20:33,2019-03-26 09:20:33,0.001s,PASSED
AdminRegisterResult = slurper1.parseText(responseAdminRegister.getResponseBodyContent()),,,2019-03-26 09:20:33,2019-03-26 09:20:33,0.001s,PASSED
idResponse = id,,,2019-03-26 09:20:33,2019-03-26 09:20:33,0.001s,PASSED
"println(""New accoutn is created with the next Id: "" + idResponse)",,,2019-03-26 09:20:33,2019-03-26 09:20:33,0.000s,PASSED
,,,,,,
Test Cases/VoPro/API/Account/16 API_ACNT_When_try_to_create_a_new_user_without_roles_attribute_Expected_status_code_500,,,2019-03-26 09:20:33,2019-03-26 09:20:36,3.449s,PASSED
"username = ""kusernoroles""",,,2019-03-26 09:20:33,2019-03-26 09:20:33,0.000s,PASSED
"password = ""cropmetrics""",,,2019-03-26 09:20:33,2019-03-26 09:20:33,0.001s,PASSED
"confirmPassword = ""cropmetrics""",,,2019-03-26 09:20:33,2019-03-26 09:20:33,0.001s,PASSED
"email = ""cropmetricsvo@gmail.com""",,,2019-03-26 09:20:33,2019-03-26 09:20:33,0.000s,PASSED
"fullname = ""test validation phone attribute as characters instead of numbers""",,,2019-03-26 09:20:33,2019-03-26 09:20:33,0.001s,PASSED
"phone = ""123""",,,2019-03-26 09:20:33,2019-03-26 09:20:33,0.000s,PASSED
"dealer = ""dealet test""",,,2019-03-26 09:20:33,2019-03-26 09:20:33,0.000s,PASSED
"addressLine1 = ""address line 1 test validation""",,,2019-03-26 09:20:33,2019-03-26 09:20:33,0.000s,PASSED
"addressLine2 = ""address line 2 test validation""",,,2019-03-26 09:20:33,2019-03-26 09:20:33,0.000s,PASSED
"town = ""townValidation""",,,2019-03-26 09:20:33,2019-03-26 09:20:33,0.001s,PASSED
"state = ""stateValidation""",,,2019-03-26 09:20:33,2019-03-26 09:20:33,0.001s,PASSED
"zip = ""zipValidation""",,,2019-03-26 09:20:33,2019-03-26 09:20:33,0.001s,PASSED
"country = ""countryValidation""",,,2019-03-26 09:20:33,2019-03-26 09:20:33,0.001s,PASSED
"roles = """"",,,2019-03-26 09:20:33,2019-03-26 09:20:33,0.000s,PASSED
"modifierUsername = ""admin""",,,2019-03-26 09:20:33,2019-03-26 09:20:33,0.001s,PASSED
"modifierUserId = ""1""",,,2019-03-26 09:20:33,2019-03-26 09:20:33,0.001s,PASSED
"tokenUserName = ""admin""",,,2019-03-26 09:20:33,2019-03-26 09:20:33,0.000s,PASSED
"tokenPassword = ""cropmetricsvo""",,,2019-03-26 09:20:33,2019-03-26 09:20:33,0.001s,PASSED
"responseToken = sendRequest(findTestObject(""VoPro/Token"", [""usernameToken"":tokenUserName, ""passwordToken"":tokenPassword]))",,,2019-03-26 09:20:33,2019-03-26 09:20:33,0.184s,PASSED
slurper = new groovy.json.JsonSlurper(),,,2019-03-26 09:20:33,2019-03-26 09:20:33,0.001s,PASSED
tokenResult = slurper.parseText(responseToken.getResponseBodyContent()),,,2019-03-26 09:20:33,2019-03-26 09:20:33,0.001s,PASSED
accessToken = access_token,,,2019-03-26 09:20:33,2019-03-26 09:20:33,0.001s,PASSED
"println("".. current access token generated: "" + accessToken)",,,2019-03-26 09:20:33,2019-03-26 09:20:33,0.001s,PASSED
"responseAdminRegister = sendRequest(findTestObject(""VoPro/Account/AdministrativeRegister"", [""access_token"":accessToken, ""username"":username, ""password"":password, ""confirmPassword"":confirmPassword, ""email"":email, ""fullname"":fullname, ... ]))",,,2019-03-26 09:20:33,2019-03-26 09:20:36,2.927s,PASSED
"verifyResponseStatusCode(responseAdminRegister, 500)",,,2019-03-26 09:20:36,2019-03-26 09:20:36,0.012s,PASSED
,,,,,,
Test Cases/VoPro/API/Account/17 API_ACNT_When_try_to_create_a_new_user_without_modifierusername_attribute_Expected_status_code_200,,,2019-03-26 09:20:36,2019-03-26 09:20:38,1.914s,PASSED
"username = ""kusernomodifierusername""",,,2019-03-26 09:20:36,2019-03-26 09:20:36,0.000s,PASSED
"password = ""cropmetrics""",,,2019-03-26 09:20:36,2019-03-26 09:20:36,0.000s,PASSED
"confirmPassword = ""cropmetrics""",,,2019-03-26 09:20:36,2019-03-26 09:20:36,0.001s,PASSED
"email = ""cropmetricsvo@gmail.com""",,,2019-03-26 09:20:36,2019-03-26 09:20:36,0.000s,PASSED
"fullname = ""test validation phone attribute as characters instead of numbers""",,,2019-03-26 09:20:36,2019-03-26 09:20:36,0.001s,PASSED
"phone = ""123""",,,2019-03-26 09:20:36,2019-03-26 09:20:36,0.000s,PASSED
"dealer = ""dealet test""",,,2019-03-26 09:20:36,2019-03-26 09:20:36,0.001s,PASSED
"addressLine1 = ""address line 1 test validation""",,,2019-03-26 09:20:36,2019-03-26 09:20:36,0.000s,PASSED
"addressLine2 = ""address line 2 test validation""",,,2019-03-26 09:20:36,2019-03-26 09:20:36,0.000s,PASSED
"town = ""townValidation""",,,2019-03-26 09:20:36,2019-03-26 09:20:36,0.000s,PASSED
"state = ""stateValidation""",,,2019-03-26 09:20:36,2019-03-26 09:20:36,0.000s,PASSED
"zip = ""zipValidation""",,,2019-03-26 09:20:36,2019-03-26 09:20:36,0.001s,PASSED
"country = ""countryValidation""",,,2019-03-26 09:20:36,2019-03-26 09:20:36,0.000s,PASSED
"roles = ""Client""",,,2019-03-26 09:20:36,2019-03-26 09:20:36,0.000s,PASSED
"modifierUsername = """"",,,2019-03-26 09:20:36,2019-03-26 09:20:36,0.000s,PASSED
"modifierUserId = ""1""",,,2019-03-26 09:20:36,2019-03-26 09:20:36,0.001s,PASSED
"tokenUserName = ""admin""",,,2019-03-26 09:20:36,2019-03-26 09:20:36,0.000s,PASSED
"tokenPassword = ""cropmetricsvo""",,,2019-03-26 09:20:36,2019-03-26 09:20:36,0.000s,PASSED
"responseToken = sendRequest(findTestObject(""VoPro/Token"", [""usernameToken"":tokenUserName, ""passwordToken"":tokenPassword]))",,,2019-03-26 09:20:36,2019-03-26 09:20:36,0.089s,PASSED
slurper = new groovy.json.JsonSlurper(),,,2019-03-26 09:20:36,2019-03-26 09:20:36,0.001s,PASSED
tokenResult = slurper.parseText(responseToken.getResponseBodyContent()),,,2019-03-26 09:20:36,2019-03-26 09:20:36,0.001s,PASSED
accessToken = access_token,,,2019-03-26 09:20:36,2019-03-26 09:20:36,0.001s,PASSED
"println("".. current access token generated: "" + accessToken)",,,2019-03-26 09:20:36,2019-03-26 09:20:36,0.001s,PASSED
"responseAdminRegister = sendRequest(findTestObject(""VoPro/Account/AdministrativeRegister"", [""access_token"":accessToken, ""username"":username, ""password"":password, ""confirmPassword"":confirmPassword, ""email"":email, ""fullname"":fullname, ... ]))",,,2019-03-26 09:20:36,2019-03-26 09:20:38,1.583s,PASSED
"verifyResponseStatusCode(responseAdminRegister, 200)",,,2019-03-26 09:20:38,2019-03-26 09:20:38,0.002s,PASSED
slurper1 = new groovy.json.JsonSlurper(),,,2019-03-26 09:20:38,2019-03-26 09:20:38,0.001s,PASSED
AdminRegisterResult = slurper1.parseText(responseAdminRegister.getResponseBodyContent()),,,2019-03-26 09:20:38,2019-03-26 09:20:38,0.000s,PASSED
idResponse = id,,,2019-03-26 09:20:38,2019-03-26 09:20:38,0.001s,PASSED
"println(""New accoutn is created with the next Id: "" + idResponse)",,,2019-03-26 09:20:38,2019-03-26 09:20:38,0.000s,PASSED
,,,,,,
Test Cases/VoPro/API/Account/18 API_ACNT_When_try_to_create_a_new_user_without_modifieruserid_attribute_Expected_status_code_400,,,2019-03-26 09:20:38,2019-03-26 09:20:41,2.685s,PASSED
"username = ""kusernomodifieruserid""",,,2019-03-26 09:20:38,2019-03-26 09:20:38,0.001s,PASSED
"password = ""cropmetrics""",,,2019-03-26 09:20:38,2019-03-26 09:20:38,0.000s,PASSED
"confirmPassword = ""cropmetrics""",,,2019-03-26 09:20:38,2019-03-26 09:20:38,0.000s,PASSED
"email = ""cropmetricsvo@gmail.com""",,,2019-03-26 09:20:38,2019-03-26 09:20:38,0.001s,PASSED
"fullname = ""test validation""",,,2019-03-26 09:20:38,2019-03-26 09:20:38,0.000s,PASSED
"phone = ""123""",,,2019-03-26 09:20:38,2019-03-26 09:20:38,0.001s,PASSED
"dealer = ""dealer test validation""",,,2019-03-26 09:20:38,2019-03-26 09:20:38,0.000s,PASSED
"addressLine1 = ""address line 1 test validation""",,,2019-03-26 09:20:38,2019-03-26 09:20:38,0.000s,PASSED
"addressLine2 = ""address line 1 test validation""",,,2019-03-26 09:20:38,2019-03-26 09:20:38,0.000s,PASSED
"town = ""townValidation""",,,2019-03-26 09:20:38,2019-03-26 09:20:38,0.000s,PASSED
"state = ""stateValidation""",,,2019-03-26 09:20:38,2019-03-26 09:20:38,0.001s,PASSED
"zip = ""zipValidation""",,,2019-03-26 09:20:38,2019-03-26 09:20:38,0.000s,PASSED
"country = ""countryValidation""",,,2019-03-26 09:20:38,2019-03-26 09:20:38,0.000s,PASSED
"roles = ""Client""",,,2019-03-26 09:20:38,2019-03-26 09:20:38,0.001s,PASSED
"modifierUsername = ""admin""",,,2019-03-26 09:20:38,2019-03-26 09:20:38,0.000s,PASSED
"modifierUserId = """"",,,2019-03-26 09:20:38,2019-03-26 09:20:38,0.000s,PASSED
"tokenUserName = ""admin""",,,2019-03-26 09:20:38,2019-03-26 09:20:38,0.001s,PASSED
"tokenPassword = ""cropmetricsvo""",,,2019-03-26 09:20:38,2019-03-26 09:20:38,0.000s,PASSED
"responseToken = sendRequest(findTestObject(""VoPro/Token"", [""usernameToken"":tokenUserName, ""passwordToken"":tokenPassword]))",,,2019-03-26 09:20:38,2019-03-26 09:20:38,0.134s,PASSED
slurper = new groovy.json.JsonSlurper(),,,2019-03-26 09:20:38,2019-03-26 09:20:38,0.001s,PASSED
tokenResult = slurper.parseText(responseToken.getResponseBodyContent()),,,2019-03-26 09:20:38,2019-03-26 09:20:38,0.001s,PASSED
accessToken = access_token,,,2019-03-26 09:20:38,2019-03-26 09:20:38,0.001s,PASSED
"println("".. current access token generated: "" + accessToken)",,,2019-03-26 09:20:38,2019-03-26 09:20:38,0.001s,PASSED
"responseAdminRegister = sendRequest(findTestObject(""VoPro/Account/AdministrativeRegister"", [""access_token"":accessToken, ""username"":username, ""password"":password, ""confirmPassword"":confirmPassword, ""email"":email, ""fullname"":fullname, ... ]))",,,2019-03-26 09:20:38,2019-03-26 09:20:41,2.331s,PASSED
"verifyResponseStatusCode(responseAdminRegister, 400)",,,2019-03-26 09:20:41,2019-03-26 09:20:41,0.002s,PASSED
slurper1 = new groovy.json.JsonSlurper(),,,2019-03-26 09:20:41,2019-03-26 09:20:41,0.000s,PASSED
AdminRegisterResult = slurper1.parseText(responseAdminRegister.getResponseBodyContent()),,,2019-03-26 09:20:41,2019-03-26 09:20:41,0.000s,PASSED
messageResponse = message,,,2019-03-26 09:20:41,2019-03-26 09:20:41,0.000s,PASSED
"messageExpected = ""A value is required.
""",,,2019-03-26 09:20:41,2019-03-26 09:20:41,0.004s,PASSED
"println(""Error message response: "" + messageResponse)",,,2019-03-26 09:20:41,2019-03-26 09:20:41,0.000s,PASSED
"println(""Error message expected: "" + messageExpected)",,,2019-03-26 09:20:41,2019-03-26 09:20:41,0.000s,PASSED
"verifyElementPropertyValue(responseAdminRegister, ""message"", messageExpected)",,,2019-03-26 09:20:41,2019-03-26 09:20:41,0.020s,PASSED
,,,,,,
Test Cases/VoPro/API/Account/19 API_ACNT_When_try_to_create_a_new_user_with_an_existing_username_Expected_status_code_400,,,2019-03-26 09:20:41,2019-03-26 09:20:42,0.804s,PASSED
"username = ""admin""",,,2019-03-26 09:20:41,2019-03-26 09:20:41,0.002s,PASSED
"password = ""cropmetrics""",,,2019-03-26 09:20:41,2019-03-26 09:20:41,0.000s,PASSED
"confirmPassword = ""cropmetrics""",,,2019-03-26 09:20:41,2019-03-26 09:20:41,0.000s,PASSED
"email = ""cropmetricsvo@gmail.com""",,,2019-03-26 09:20:41,2019-03-26 09:20:41,0.000s,PASSED
"fullname = ""test validation""",,,2019-03-26 09:20:41,2019-03-26 09:20:41,0.000s,PASSED
"phone = ""123""",,,2019-03-26 09:20:41,2019-03-26 09:20:41,0.016s,PASSED
"dealer = ""dealer test validation""",,,2019-03-26 09:20:41,2019-03-26 09:20:41,0.010s,PASSED
"addressLine1 = ""address line 1 test validation""",,,2019-03-26 09:20:41,2019-03-26 09:20:41,0.007s,PASSED
"addressLine2 = ""address line 1 test validation""",,,2019-03-26 09:20:41,2019-03-26 09:20:41,0.001s,PASSED
"town = ""townValidation""",,,2019-03-26 09:20:41,2019-03-26 09:20:41,0.000s,PASSED
"state = ""stateValidation""",,,2019-03-26 09:20:41,2019-03-26 09:20:41,0.002s,PASSED
"zip = ""zipValidation""",,,2019-03-26 09:20:41,2019-03-26 09:20:41,0.002s,PASSED
"country = ""countryValidation""",,,2019-03-26 09:20:41,2019-03-26 09:20:41,0.000s,PASSED
"roles = ""Client""",,,2019-03-26 09:20:41,2019-03-26 09:20:41,0.001s,PASSED
"modifierUsername = ""admin""",,,2019-03-26 09:20:41,2019-03-26 09:20:41,0.000s,PASSED
"modifierUserId = ""1""",,,2019-03-26 09:20:41,2019-03-26 09:20:41,0.000s,PASSED
"tokenUserName = ""admin""",,,2019-03-26 09:20:41,2019-03-26 09:20:41,0.000s,PASSED
"tokenPassword = ""cropmetricsvo""",,,2019-03-26 09:20:41,2019-03-26 09:20:41,0.029s,PASSED
"responseToken = sendRequest(findTestObject(""VoPro/Token"", [""usernameToken"":tokenUserName, ""passwordToken"":tokenPassword]))",,,2019-03-26 09:20:41,2019-03-26 09:20:41,0.144s,PASSED
slurper = new groovy.json.JsonSlurper(),,,2019-03-26 09:20:41,2019-03-26 09:20:41,0.002s,PASSED
tokenResult = slurper.parseText(responseToken.getResponseBodyContent()),,,2019-03-26 09:20:41,2019-03-26 09:20:41,0.000s,PASSED
accessToken = access_token,,,2019-03-26 09:20:41,2019-03-26 09:20:41,0.002s,PASSED
"println("".. current access token generated: "" + accessToken)",,,2019-03-26 09:20:41,2019-03-26 09:20:41,0.000s,PASSED
"responseAdminRegister = sendRequest(findTestObject(""VoPro/Account/AdministrativeRegister"", [""access_token"":accessToken, ""username"":username, ""password"":password, ""confirmPassword"":confirmPassword, ""email"":email, ""fullname"":fullname, ... ]))",,,2019-03-26 09:20:41,2019-03-26 09:20:42,0.235s,PASSED
"verifyResponseStatusCode(responseAdminRegister, 400)",,,2019-03-26 09:20:42,2019-03-26 09:20:42,0.005s,PASSED
slurper1 = new groovy.json.JsonSlurper(),,,2019-03-26 09:20:42,2019-03-26 09:20:42,0.000s,PASSED
AdminRegisterResult = slurper1.parseText(responseAdminRegister.getResponseBodyContent()),,,2019-03-26 09:20:42,2019-03-26 09:20:42,0.000s,PASSED
messageResponse = message,,,2019-03-26 09:20:42,2019-03-26 09:20:42,0.000s,PASSED
"messageExpected = ""The request is invalid.""",,,2019-03-26 09:20:42,2019-03-26 09:20:42,0.000s,PASSED
errorResponse = error,,,2019-03-26 09:20:42,2019-03-26 09:20:42,0.000s,PASSED
"println(""Error message response: "" + messageResponse)",,,2019-03-26 09:20:42,2019-03-26 09:20:42,0.005s,PASSED
"println(""Error message expected: "" + messageExpected)",,,2019-03-26 09:20:42,2019-03-26 09:20:42,0.001s,PASSED
"println(""Error response: "" + errorResponse)",,,2019-03-26 09:20:42,2019-03-26 09:20:42,0.000s,PASSED
"verifyElementPropertyValue(responseAdminRegister, ""message"", messageExpected)",,,2019-03-26 09:20:42,2019-03-26 09:20:42,0.013s,PASSED
