{
  "log" : {
    "version" : "1.2",
    "creator" : {
      "name" : "BrowserMob Proxy",
      "version" : "2.1.5",
      "comment" : ""
    },
    "pages" : [ {
      "id" : "Page 0",
      "startedDateTime" : "2019-03-29T19:41:24.514Z",
      "title" : "Page 0",
      "pageTimings" : {
        "onLoad" : 2892,
        "comment" : ""
      },
      "comment" : ""
    } ],
    "entries" : [ {
      "pageref" : "Page 0",
      "startedDateTime" : "2019-03-29T19:41:24.515Z",
      "request" : {
        "method" : "POST",
        "url" : "http://localhost:10520/WebAPI/api/admin/v1/users/?",
        "httpVersion" : "HTTP/1.1",
        "cookies" : [ ],
        "headers" : [ {
          "name" : "User-Agent",
          "value" : "Katalon Studio"
        }, {
          "name" : "Content-Type",
          "value" : "application/x-www-form-urlencoded"
        }, {
          "name" : "Authorization",
          "value" : "Bearer eyJ0eXAiOiJKV1QiLCJhbGciOiJIUzI1NiJ9.eyJ1bmlxdWVfbmFtZSI6ImFkbWluIiwicm9sZSI6InVzZXIiLCJzdWIiOiJhZG1pbiIsImlzcyI6IkNyb3BNZXRyaWNzIiwiYXVkIjoiYWxsIiwiZXhwIjoxNTUzODkyMzg0LCJuYmYiOjE1NTM4ODg0ODR9.iGr7uanv6R57a56mCVArx4WArFZjwjg3_otXoCfeNRM"
        }, {
          "name" : "Host",
          "value" : "localhost:10520"
        }, {
          "name" : "Accept",
          "value" : "text/html, image/gif, image/jpeg, *; q=.2, */*; q=.2"
        }, {
          "name" : "Proxy-Connection",
          "value" : "keep-alive"
        }, {
          "name" : "Content-Length",
          "value" : "262"
        } ],
        "queryString" : [ ],
        "postData" : {
          "mimeType" : "application/x-www-form-urlencoded",
          "params" : [ {
            "name" : "password",
            "value" : "cropmetrics",
            "comment" : ""
          }, {
            "name" : "email",
            "value" : "cropmetricsvo.agent@gmail.com",
            "comment" : ""
          }, {
            "name" : "fullname",
            "value" : "test validation",
            "comment" : ""
          }, {
            "name" : "phone",
            "value" : "123",
            "comment" : ""
          }, {
            "name" : "dealer",
            "value" : "x",
            "comment" : ""
          }, {
            "name" : "addressLine1",
            "value" : "address line 1 test validation",
            "comment" : ""
          }, {
            "name" : "addressLine2",
            "value" : "address line 2 test validation",
            "comment" : ""
          }, {
            "name" : "town",
            "value" : "townValidation",
            "comment" : ""
          }, {
            "name" : "state",
            "value" : "stateValidation",
            "comment" : ""
          }, {
            "name" : "zip",
            "value" : "xx",
            "comment" : ""
          }, {
            "name" : "country",
            "value" : "xx",
            "comment" : ""
          }, {
            "name" : "roles",
            "value" : "Agent",
            "comment" : ""
          } ],
          "comment" : ""
        },
        "headersSize" : 544,
        "bodySize" : 262,
        "comment" : ""
      },
      "response" : {
        "status" : 200,
        "statusText" : "OK",
        "httpVersion" : "HTTP/1.1",
        "cookies" : [ {
          "name" : ".ASPROLES",
          "value" : "VXB0I9DGuHhF42Jlb1lXz8IDUZc68MrRkMh9x5j85LMHdr-vYPWQSYp-pvBapTn3r66-KuvzTLqNCVYnYQfEL961b4JQDtOO-1Rh0C3u9uubPjhwsQiqRL48UzH04H9P0keywx9K5_lrqjvkA9fcSCfPB2anwIvPiVgH2X-09pY92brBYC9O70TRvtAG59EC0mKqB7p5b4ciZOJhjjI0_abVPjvrJPhxFCN7mPKghCykCzym7OOwR5d6yy_zF6f5vU3Or84z_C7_EbDU2qLj06THsj576CsDK-KraVd0VuUKiuV9jyd0_48Xhl0fJQUWqlYDfTirv3KqYUwVoOR3xnNZ2FW58e59f8pERCFl5CU3cuZO2ilAZACsJmn2Ds-DGbRwosPHxpFjDg4eFSqQFxbDjKhxDM9ePSPzipYQ7ISR30-CJ8E5grHWsh965oZuvZ3MFrf2teoKJXgig075O0adsPC81cboWq1kkAmkPkqi5ypZ0",
          "path" : "/",
          "httpOnly" : true,
          "secure" : false,
          "comment" : ""
        } ],
        "headers" : [ {
          "name" : "Cache-Control",
          "value" : "private"
        }, {
          "name" : "Content-Type",
          "value" : "application/json; charset=utf-8"
        }, {
          "name" : "Server",
          "value" : "Microsoft-IIS/10.0"
        }, {
          "name" : "Set-Cookie",
          "value" : ".ASPROLES=VXB0I9DGuHhF42Jlb1lXz8IDUZc68MrRkMh9x5j85LMHdr-vYPWQSYp-pvBapTn3r66-KuvzTLqNCVYnYQfEL961b4JQDtOO-1Rh0C3u9uubPjhwsQiqRL48UzH04H9P0keywx9K5_lrqjvkA9fcSCfPB2anwIvPiVgH2X-09pY92brBYC9O70TRvtAG59EC0mKqB7p5b4ciZOJhjjI0_abVPjvrJPhxFCN7mPKghCykCzym7OOwR5d6yy_zF6f5vU3Or84z_C7_EbDU2qLj06THsj576CsDK-KraVd0VuUKiuV9jyd0_48Xhl0fJQUWqlYDfTirv3KqYUwVoOR3xnNZ2FW58e59f8pERCFl5CU3cuZO2ilAZACsJmn2Ds-DGbRwosPHxpFjDg4eFSqQFxbDjKhxDM9ePSPzipYQ7ISR30-CJ8E5grHWsh965oZuvZ3MFrf2teoKJXgig075O0adsPC81cboWq1kkAmkPkqi5ypZ0; path=/; HttpOnly"
        }, {
          "name" : "X-SourceFiles",
          "value" : "=?UTF-8?B?RDpcVmlydHVhbE9wdGltaXplci1SZWZhY3RvcmluZ1xDcm9wTWV0cmljcy5Wby5BcGlcQ3JvcE1ldHJpY3MuVm8uQXBpXGFwaVxhZG1pblx2MVx1c2Vyc1w=?="
        }, {
          "name" : "X-Powered-By",
          "value" : "ASP.NET"
        }, {
          "name" : "Date",
          "value" : "Fri, 29 Mar 2019 19:41:27 GMT"
        }, {
          "name" : "Content-Length",
          "value" : "9"
        } ],
        "content" : {
          "size" : 9,
          "mimeType" : "application/json; charset=utf-8",
          "text" : "{\"id\":46}",
          "comment" : ""
        },
        "redirectURL" : "",
        "headersSize" : 887,
        "bodySize" : 9,
        "comment" : ""
      },
      "cache" : { },
      "timings" : {
        "comment" : "",
        "ssl" : -1,
        "send" : 0,
        "receive" : 0,
        "wait" : 2886,
        "connect" : -1,
        "blocked" : -1,
        "dns" : -1
      },
      "serverIPAddress" : "127.0.0.1",
      "comment" : "",
      "_katalonRequestInformation" : {
        "name" : "121",
        "testObjectId" : "Object Repository/VoPro/Account/api_admin_v1_users",
        "harId" : "32c15f81-933c-4be8-8e10-a4c5895524de"
      },
      "time" : 2888
    } ],
    "comment" : ""
  }
}