{
  "log" : {
    "version" : "1.2",
    "creator" : {
      "name" : "BrowserMob Proxy",
      "version" : "2.1.5",
      "comment" : ""
    },
    "pages" : [ {
      "id" : "Page 0",
      "startedDateTime" : "2019-03-28T21:18:49.444Z",
      "title" : "Page 0",
      "pageTimings" : {
        "onLoad" : 2418,
        "comment" : ""
      },
      "comment" : ""
    } ],
    "entries" : [ {
      "pageref" : "Page 0",
      "startedDateTime" : "2019-03-28T21:18:49.446Z",
      "request" : {
        "method" : "POST",
        "url" : "http://localhost:10520/WebAPI/api/admin/v1/users/?",
        "httpVersion" : "HTTP/1.1",
        "cookies" : [ ],
        "headers" : [ {
          "name" : "User-Agent",
          "value" : "Katalon Studio"
        }, {
          "name" : "Content-Type",
          "value" : "application/x-www-form-urlencoded"
        }, {
          "name" : "Authorization",
          "value" : "Bearer eyJ0eXAiOiJKV1QiLCJhbGciOiJIUzI1NiJ9.eyJ1bmlxdWVfbmFtZSI6ImFkbWluIiwicm9sZSI6InVzZXIiLCJzdWIiOiJhZG1pbiIsImlzcyI6IkNyb3BNZXRyaWNzIiwiYXVkIjoiYWxsIiwiZXhwIjoxNTUzODExODI5LCJuYmYiOjE1NTM4MDc5Mjl9.VdHic7ztm7ZbndEwtU55BGQpi1GQ6pmGTRfgDP6vqjU"
        }, {
          "name" : "Host",
          "value" : "localhost:10520"
        }, {
          "name" : "Accept",
          "value" : "text/html, image/gif, image/jpeg, *; q=.2, */*; q=.2"
        }, {
          "name" : "Proxy-Connection",
          "value" : "keep-alive"
        }, {
          "name" : "Content-Length",
          "value" : "279"
        } ],
        "queryString" : [ ],
        "postData" : {
          "mimeType" : "application/x-www-form-urlencoded",
          "params" : [ {
            "name" : "password",
            "value" : "cropmetrics",
            "comment" : ""
          }, {
            "name" : "email",
            "value" : "",
            "comment" : ""
          }, {
            "name" : "fullname",
            "value" : "test validation",
            "comment" : ""
          }, {
            "name" : "phone",
            "value" : "123",
            "comment" : ""
          }, {
            "name" : "dealer",
            "value" : "dealer test validation",
            "comment" : ""
          }, {
            "name" : "addressLine1",
            "value" : "address line 1 test validation",
            "comment" : ""
          }, {
            "name" : "addressLine2",
            "value" : "address line 2 test validation",
            "comment" : ""
          }, {
            "name" : "town",
            "value" : "townValidation",
            "comment" : ""
          }, {
            "name" : "state",
            "value" : "stateValidation",
            "comment" : ""
          }, {
            "name" : "zip",
            "value" : "zipValidation",
            "comment" : ""
          }, {
            "name" : "country",
            "value" : "countryValidation",
            "comment" : ""
          }, {
            "name" : "roles",
            "value" : "Client",
            "comment" : ""
          } ],
          "comment" : ""
        },
        "headersSize" : 544,
        "bodySize" : 279,
        "comment" : ""
      },
      "response" : {
        "status" : 500,
        "statusText" : "Internal Server Error",
        "httpVersion" : "HTTP/1.1",
        "cookies" : [ {
          "name" : ".ASPROLES",
          "value" : "0EBLF7kBXUiCjV3yv8UXzEuOv3Ynblp7kJR86SyMBYXrzeQA4yiZegRamsDMqnom3XSrNdAnjKSqM1ImHazY_7IbPEeIT-jWf9flCTEYjNmgs7CDCTq7UxlbDxhGLSk6TvTnfj5GZ8gF94oKqG_P9LoFPkiFSCXqW6A72h38EUpMAGCuB9gETj5wV8cMA4NGCHCb5pc92Zuou6XNgippK_lO7yRatvzV0CICUtSKIc6FsprQsOxCjGI8ZnC3mYAWmHIYRpaZzGQ1rvj5jPN1FGtjWOyFCIsS-Ya3S0cGkA3fi8RP13IsrroE4Tu-_P83OiK9R-xsyHWXDThsS_jy022YNfZHNaFfPAib-946WDhspPp5-jnbTeR27ffogLyY-aqIOPw7jmyDh37u7qrQ9IzjleWs8aBtAX4hVD2SVgHUKK-jRQvV_X4MfExtKWZtTCRXIcAJSp3Co0RvR2VAWSVhxdPhpiZHrFDX_QUfPk30gXc00",
          "path" : "/",
          "httpOnly" : true,
          "secure" : false,
          "comment" : ""
        } ],
        "headers" : [ {
          "name" : "Cache-Control",
          "value" : "private"
        }, {
          "name" : "Content-Type",
          "value" : "application/json; charset=utf-8"
        }, {
          "name" : "Server",
          "value" : "Microsoft-IIS/10.0"
        }, {
          "name" : "Set-Cookie",
          "value" : ".ASPROLES=0EBLF7kBXUiCjV3yv8UXzEuOv3Ynblp7kJR86SyMBYXrzeQA4yiZegRamsDMqnom3XSrNdAnjKSqM1ImHazY_7IbPEeIT-jWf9flCTEYjNmgs7CDCTq7UxlbDxhGLSk6TvTnfj5GZ8gF94oKqG_P9LoFPkiFSCXqW6A72h38EUpMAGCuB9gETj5wV8cMA4NGCHCb5pc92Zuou6XNgippK_lO7yRatvzV0CICUtSKIc6FsprQsOxCjGI8ZnC3mYAWmHIYRpaZzGQ1rvj5jPN1FGtjWOyFCIsS-Ya3S0cGkA3fi8RP13IsrroE4Tu-_P83OiK9R-xsyHWXDThsS_jy022YNfZHNaFfPAib-946WDhspPp5-jnbTeR27ffogLyY-aqIOPw7jmyDh37u7qrQ9IzjleWs8aBtAX4hVD2SVgHUKK-jRQvV_X4MfExtKWZtTCRXIcAJSp3Co0RvR2VAWSVhxdPhpiZHrFDX_QUfPk30gXc00; path=/; HttpOnly"
        }, {
          "name" : "X-SourceFiles",
          "value" : "=?UTF-8?B?RDpcVmlydHVhbE9wdGltaXplci1SZWZhY3RvcmluZ1xDcm9wTWV0cmljcy5Wby5BcGlcQ3JvcE1ldHJpY3MuVm8uQXBpXGFwaVxhZG1pblx2MVx1c2Vyc1w=?="
        }, {
          "name" : "X-Powered-By",
          "value" : "ASP.NET"
        }, {
          "name" : "Date",
          "value" : "Thu, 28 Mar 2019 21:18:51 GMT"
        }, {
          "name" : "Content-Length",
          "value" : "53"
        } ],
        "content" : {
          "size" : 53,
          "mimeType" : "application/json; charset=utf-8",
          "text" : "{\"message\":\"Internal server error in the processing\"}",
          "comment" : ""
        },
        "redirectURL" : "",
        "headersSize" : 907,
        "bodySize" : 53,
        "comment" : ""
      },
      "cache" : { },
      "timings" : {
        "comment" : "",
        "connect" : -1,
        "send" : 0,
        "receive" : 1,
        "dns" : -1,
        "blocked" : -1,
        "wait" : 2411,
        "ssl" : -1
      },
      "serverIPAddress" : "127.0.0.1",
      "comment" : "",
      "_katalonRequestInformation" : {
        "name" : "7",
        "testObjectId" : "Object Repository/VoPro/Account/api_admin_v1_users",
        "harId" : "02c15d47-928a-4033-8f82-27a5a72f1179"
      },
      "time" : 2412
    } ],
    "comment" : ""
  }
}