{
  "log" : {
    "version" : "1.2",
    "creator" : {
      "name" : "BrowserMob Proxy",
      "version" : "2.1.5",
      "comment" : ""
    },
    "pages" : [ {
      "id" : "Page 0",
      "startedDateTime" : "2019-03-29T19:01:44.103Z",
      "title" : "Page 0",
      "pageTimings" : {
        "onLoad" : 3129,
        "comment" : ""
      },
      "comment" : ""
    } ],
    "entries" : [ {
      "pageref" : "Page 0",
      "startedDateTime" : "2019-03-29T19:01:44.104Z",
      "request" : {
        "method" : "POST",
        "url" : "http://localhost:10520/WebAPI/api/admin/v1/users/?",
        "httpVersion" : "HTTP/1.1",
        "cookies" : [ ],
        "headers" : [ {
          "name" : "User-Agent",
          "value" : "Katalon Studio"
        }, {
          "name" : "Content-Type",
          "value" : "application/x-www-form-urlencoded"
        }, {
          "name" : "Authorization",
          "value" : "Bearer eyJ0eXAiOiJKV1QiLCJhbGciOiJIUzI1NiJ9.eyJ1bmlxdWVfbmFtZSI6ImFkbWluIiwicm9sZSI6InVzZXIiLCJzdWIiOiJhZG1pbiIsImlzcyI6IkNyb3BNZXRyaWNzIiwiYXVkIjoiYWxsIiwiZXhwIjoxNTUzODkwMDA0LCJuYmYiOjE1NTM4ODYxMDR9.0qfkPUlsSDT-khmjRSBdfasl1xDQgLYeZRmls9mZTYE"
        }, {
          "name" : "Host",
          "value" : "localhost:10520"
        }, {
          "name" : "Accept",
          "value" : "text/html, image/gif, image/jpeg, *; q=.2, */*; q=.2"
        }, {
          "name" : "Proxy-Connection",
          "value" : "keep-alive"
        }, {
          "name" : "Content-Length",
          "value" : "315"
        } ],
        "queryString" : [ ],
        "postData" : {
          "mimeType" : "application/x-www-form-urlencoded",
          "params" : [ {
            "name" : "password",
            "value" : "cropmetrics",
            "comment" : ""
          }, {
            "name" : "email",
            "value" : "cropmetricsvo.nozip@gmail.com",
            "comment" : ""
          }, {
            "name" : "fullname",
            "value" : "test validation",
            "comment" : ""
          }, {
            "name" : "phone",
            "value" : "phone test validation",
            "comment" : ""
          }, {
            "name" : "dealer",
            "value" : "dealer test validation",
            "comment" : ""
          }, {
            "name" : "addressLine1",
            "value" : "address line 1 test validation",
            "comment" : ""
          }, {
            "name" : "addressLine2",
            "value" : "address line 2 test validation",
            "comment" : ""
          }, {
            "name" : "town",
            "value" : "townValidation",
            "comment" : ""
          }, {
            "name" : "state",
            "value" : "stateValidation",
            "comment" : ""
          }, {
            "name" : "zip",
            "value" : "",
            "comment" : ""
          }, {
            "name" : "country",
            "value" : "countryValidation",
            "comment" : ""
          }, {
            "name" : "roles",
            "value" : "Client",
            "comment" : ""
          } ],
          "comment" : ""
        },
        "headersSize" : 544,
        "bodySize" : 315,
        "comment" : ""
      },
      "response" : {
        "status" : 400,
        "statusText" : "Bad Request",
        "httpVersion" : "HTTP/1.1",
        "cookies" : [ {
          "name" : ".ASPROLES",
          "value" : "WdfRoNFsonEXS_YLLXYTvFiqAchDnrZhrJkMIv6EaojwMfStudyWZrA2oYim2tRw42xsp2cqyGUeCymHh19zwv-oA1ylY5LI7nMnXzqWA207Wlit5GwWRPvVNwmlTRf5M_lfmaawRCWvxuoNnA33Nxc-EoRgYerksnmxGRzxKtXFyO-N5zUvLAqhe1UB1t3HoJfwdK2AMpkYYwOSXoIUTIOwB8JfLMHW752mexWKDfWzeFlszGcBqWK4AZZNf_rcbp9wqyImx47dAJM2rrHP71RnBOjzGgunqaaoLtMIA8nSLW9dul3tXJHLCZywvoq-ATLd6LTtaspRBirElENSwjH0eeygRuXdE6OcUgMqfDRFy71JMq7cUl3SiYNRFMObEksPbP1tn-SGlgvVusVsB_yU673udLUPuGX75_Fpnjcllw8awyNgVnuGpsuGJMhpdHq-VSRhG7yiO5XfmM3_SgwS39jPtKW8scJkR4P9xZUuyd260",
          "path" : "/",
          "httpOnly" : true,
          "secure" : false,
          "comment" : ""
        } ],
        "headers" : [ {
          "name" : "Cache-Control",
          "value" : "private"
        }, {
          "name" : "Content-Type",
          "value" : "application/json; charset=utf-8"
        }, {
          "name" : "Server",
          "value" : "Microsoft-IIS/10.0"
        }, {
          "name" : "Set-Cookie",
          "value" : ".ASPROLES=WdfRoNFsonEXS_YLLXYTvFiqAchDnrZhrJkMIv6EaojwMfStudyWZrA2oYim2tRw42xsp2cqyGUeCymHh19zwv-oA1ylY5LI7nMnXzqWA207Wlit5GwWRPvVNwmlTRf5M_lfmaawRCWvxuoNnA33Nxc-EoRgYerksnmxGRzxKtXFyO-N5zUvLAqhe1UB1t3HoJfwdK2AMpkYYwOSXoIUTIOwB8JfLMHW752mexWKDfWzeFlszGcBqWK4AZZNf_rcbp9wqyImx47dAJM2rrHP71RnBOjzGgunqaaoLtMIA8nSLW9dul3tXJHLCZywvoq-ATLd6LTtaspRBirElENSwjH0eeygRuXdE6OcUgMqfDRFy71JMq7cUl3SiYNRFMObEksPbP1tn-SGlgvVusVsB_yU673udLUPuGX75_Fpnjcllw8awyNgVnuGpsuGJMhpdHq-VSRhG7yiO5XfmM3_SgwS39jPtKW8scJkR4P9xZUuyd260; path=/; HttpOnly"
        }, {
          "name" : "X-SourceFiles",
          "value" : "=?UTF-8?B?RDpcVmlydHVhbE9wdGltaXplci1SZWZhY3RvcmluZ1xDcm9wTWV0cmljcy5Wby5BcGlcQ3JvcE1ldHJpY3MuVm8uQXBpXGFwaVxhZG1pblx2MVx1c2Vyc1w=?="
        }, {
          "name" : "X-Powered-By",
          "value" : "ASP.NET"
        }, {
          "name" : "Date",
          "value" : "Fri, 29 Mar 2019 19:01:47 GMT"
        }, {
          "name" : "Content-Length",
          "value" : "66"
        } ],
        "content" : {
          "size" : 66,
          "mimeType" : "application/json; charset=utf-8",
          "text" : "{\"message\":\"Name cropmetricsvo.nozip@gmail.com is already taken.\"}",
          "comment" : ""
        },
        "redirectURL" : "",
        "headersSize" : 897,
        "bodySize" : 66,
        "comment" : ""
      },
      "cache" : { },
      "timings" : {
        "comment" : "",
        "ssl" : -1,
        "wait" : 3125,
        "send" : 0,
        "receive" : 1,
        "dns" : -1,
        "blocked" : -1,
        "connect" : -1
      },
      "serverIPAddress" : "127.0.0.1",
      "comment" : "",
      "_katalonRequestInformation" : {
        "name" : "121",
        "testObjectId" : "Object Repository/VoPro/Account/api_admin_v1_users",
        "harId" : "24d57ac1-d678-4e22-81f2-9da98693f724"
      },
      "time" : 3127
    } ],
    "comment" : ""
  }
}