{
  "log" : {
    "version" : "1.2",
    "creator" : {
      "name" : "BrowserMob Proxy",
      "version" : "2.1.5",
      "comment" : ""
    },
    "pages" : [ {
      "id" : "Page 0",
      "startedDateTime" : "2019-04-09T20:40:07.947Z",
      "title" : "Page 0",
      "pageTimings" : {
        "onLoad" : 35468,
        "comment" : ""
      },
      "comment" : ""
    } ],
    "entries" : [ {
      "pageref" : "Page 0",
      "startedDateTime" : "2019-04-09T20:40:07.949Z",
      "request" : {
        "method" : "POST",
        "url" : "http://localhost:10520/WebAPI/api/mobile/v1/fields?",
        "httpVersion" : "HTTP/1.1",
        "cookies" : [ ],
        "headers" : [ {
          "name" : "User-Agent",
          "value" : "Katalon Studio"
        }, {
          "name" : "Content-Type",
          "value" : "application/json"
        }, {
          "name" : "Authorization",
          "value" : "Bearer eyJ0eXAiOiJKV1QiLCJhbGciOiJIUzI1NiJ9.eyJ1bmlxdWVfbmFtZSI6Implbm55Lm1hbGRvbmFkby50eDJAZ21haWwuY29tIiwicm9sZSI6InVzZXIiLCJzdWIiOiJqZW5ueS5tYWxkb25hZG8udHgyQGdtYWlsLmNvbSIsImlzcyI6IkNyb3BNZXRyaWNzIiwiYXVkIjoiYWxsIiwiZXhwIjoxNTU0ODQ2MzA3LCJuYmYiOjE1NTQ4NDI0MDd9.YbcAPiWNDTd5dbWvpUbwjhpLNOsZt71qySl0h5IGg7Q"
        }, {
          "name" : "Host",
          "value" : "localhost:10520"
        }, {
          "name" : "Accept",
          "value" : "text/html, image/gif, image/jpeg, *; q=.2, */*; q=.2"
        }, {
          "name" : "Proxy-Connection",
          "value" : "keep-alive"
        }, {
          "name" : "Content-Length",
          "value" : "392"
        } ],
        "queryString" : [ ],
        "postData" : {
          "mimeType" : "application/json",
          "text" : "{\"field\":{\"farm_id\":1,\"name\":\"Field by katakon 1\",\"boundary\":{\"boundaries\":[{\"boundary\":{\"coords\":[{\"x\":-101.49568751,\"y\":37.14976293},{\"x\":-101.50049403,\"y\":37.14647907},{\"x\":-101.50049403,\"y\":37.14264773},{\"x\":-101.49723246,\"y\":37.1411425},{\"x\":-101.49019435,\"y\":37.14223722},{\"x\":-101.48933604,\"y\":37.14620541},{\"x\":-101.49294093,\"y\":37.14866833},{\"x\":-101.49568751,\"y\":37.14976293}]}}]}}}",
          "comment" : ""
        },
        "headersSize" : 592,
        "bodySize" : 392,
        "comment" : ""
      },
      "response" : {
        "status" : 201,
        "statusText" : "Created",
        "httpVersion" : "HTTP/1.1",
        "cookies" : [ {
          "name" : ".ASPROLES",
          "value" : "fWIfzJyhb7vUCjuyJIHjLscYfb1F5nTj-C5o7_k3RuyumOd4HSGJ_5CPe49tHJaEOldP_A_KsYNiPzSiXvSHbRx6kZGWk4Vzgn31yDajD33s9zTSIv25cRMrUdRwZi8Eu90mNSwQ9c9eVPErLsTCUe_R-L4oLWeB0NrlKVi4sGL4pFKCXHGJwsnOfxxBxGXu3i0j7qYJ_Kl7mSRQcm7WV_KaQrHFr8ONWtg_OrbvKWrAzEOzWHvo2pnzoxvbqhWOmQW90NkbQCqSkIyK2LdT-Z5UpyUMvd3Po-PqK69xQs1VnmQxK2NA_fuYfUfLd9OSwmmLGSFVA6qXYu3j0Ca-8fhYZq4vGXyP8sHJopgJugwmx4mJRKdqDMtoNz-Yclt6gW9QwCAxpq3wO-FvJ65JJIHH8VbYmZOz8n358r2FVJrkW20ijSZ0RS8Ps702aq94PKN3HRgHaNS7S10FDhn9M6qP5nhHsncpNW0H7zyHBhEUtgIIJyFAACzIEZuuet-7BaIxBA2",
          "path" : "/",
          "httpOnly" : true,
          "secure" : false,
          "comment" : ""
        } ],
        "headers" : [ {
          "name" : "Cache-Control",
          "value" : "private"
        }, {
          "name" : "Content-Type",
          "value" : "application/json; charset=utf-8"
        }, {
          "name" : "Location",
          "value" : "api/mobile/v1/fields/1"
        }, {
          "name" : "Server",
          "value" : "Microsoft-IIS/10.0"
        }, {
          "name" : "Set-Cookie",
          "value" : ".ASPROLES=fWIfzJyhb7vUCjuyJIHjLscYfb1F5nTj-C5o7_k3RuyumOd4HSGJ_5CPe49tHJaEOldP_A_KsYNiPzSiXvSHbRx6kZGWk4Vzgn31yDajD33s9zTSIv25cRMrUdRwZi8Eu90mNSwQ9c9eVPErLsTCUe_R-L4oLWeB0NrlKVi4sGL4pFKCXHGJwsnOfxxBxGXu3i0j7qYJ_Kl7mSRQcm7WV_KaQrHFr8ONWtg_OrbvKWrAzEOzWHvo2pnzoxvbqhWOmQW90NkbQCqSkIyK2LdT-Z5UpyUMvd3Po-PqK69xQs1VnmQxK2NA_fuYfUfLd9OSwmmLGSFVA6qXYu3j0Ca-8fhYZq4vGXyP8sHJopgJugwmx4mJRKdqDMtoNz-Yclt6gW9QwCAxpq3wO-FvJ65JJIHH8VbYmZOz8n358r2FVJrkW20ijSZ0RS8Ps702aq94PKN3HRgHaNS7S10FDhn9M6qP5nhHsncpNW0H7zyHBhEUtgIIJyFAACzIEZuuet-7BaIxBA2; path=/; HttpOnly"
        }, {
          "name" : "X-SourceFiles",
          "value" : "=?UTF-8?B?RDpcVmlydHVhbE9wdGltaXplci1SZWZhY3RvcmluZ1xDcm9wTWV0cmljcy5Wby5BcGlcQ3JvcE1ldHJpY3MuVm8uQXBpXGFwaVxtb2JpbGVcdjFcZmllbGRz?="
        }, {
          "name" : "X-Powered-By",
          "value" : "ASP.NET"
        }, {
          "name" : "Date",
          "value" : "Tue, 09 Apr 2019 20:40:43 GMT"
        }, {
          "name" : "Content-Length",
          "value" : "412"
        } ],
        "content" : {
          "size" : 412,
          "mimeType" : "application/json; charset=utf-8",
          "text" : "{\"field\":{\"id\":1,\"farm_id\":1,\"name\":\"Field by katakon 1\",\"boundary\":{\"boundaries\":[{\"boundary\":{\"coords\":[{\"x\":-101.49568751,\"y\":37.14976293},{\"x\":-101.49294093,\"y\":37.14866833},{\"x\":-101.48933604,\"y\":37.14620541},{\"x\":-101.49019435,\"y\":37.14223722},{\"x\":-101.49723246,\"y\":37.1411425},{\"x\":-101.50049403,\"y\":37.14264773},{\"x\":-101.50049403,\"y\":37.14647907},{\"x\":-101.49568751,\"y\":37.14976293}]},\"holes\":null}]}}}",
          "comment" : ""
        },
        "redirectURL" : "",
        "headersSize" : 950,
        "bodySize" : 412,
        "comment" : ""
      },
      "cache" : { },
      "timings" : {
        "comment" : "",
        "ssl" : -1,
        "receive" : 6,
        "dns" : -1,
        "send" : 2,
        "blocked" : -1,
        "connect" : -1,
        "wait" : 35452
      },
      "serverIPAddress" : "127.0.0.1",
      "comment" : "",
      "_katalonRequestInformation" : {
        "name" : "1",
        "testObjectId" : "Object Repository/VoGrow/Field/FieldPost",
        "harId" : "da41702b-5c37-4ded-a7c3-258a924c4073"
      },
      "time" : 35461
    } ],
    "comment" : ""
  }
}