{
  "log" : {
    "version" : "1.2",
    "creator" : {
      "name" : "BrowserMob Proxy",
      "version" : "2.1.5",
      "comment" : ""
    },
    "pages" : [ {
      "id" : "Page 0",
      "startedDateTime" : "2019-04-11T16:06:31.713Z",
      "title" : "Page 0",
      "pageTimings" : {
        "onLoad" : 103,
        "comment" : ""
      },
      "comment" : ""
    } ],
    "entries" : [ {
      "pageref" : "Page 0",
      "startedDateTime" : "2019-04-11T16:06:31.714Z",
      "request" : {
        "method" : "POST",
        "url" : "http://localhost:10520/WebAPI/api/mobile/v1/fields?",
        "httpVersion" : "HTTP/1.1",
        "cookies" : [ ],
        "headers" : [ {
          "name" : "User-Agent",
          "value" : "Katalon Studio"
        }, {
          "name" : "Content-Type",
          "value" : "application/json"
        }, {
          "name" : "Authorization",
          "value" : "Bearer eyJ0eXAiOiJKV1QiLCJhbGciOiJIUzI1NiJ9.eyJ1bmlxdWVfbmFtZSI6Implbm55Lm1hbGRvbmFkby50eDFAZ21haWwuY29tIiwicm9sZSI6InVzZXIiLCJzdWIiOiJqZW5ueS5tYWxkb25hZG8udHgxQGdtYWlsLmNvbSIsImlzcyI6IkNyb3BNZXRyaWNzIiwiYXVkIjoiYWxsIiwiZXhwIjoxNTU1MDAyNjkxLCJuYmYiOjE1NTQ5OTg3OTF9.3B4fChW5ZNyB3ArhXEP6PS0ETH3-NLgub5Kkbpx1QqA"
        }, {
          "name" : "Host",
          "value" : "localhost:10520"
        }, {
          "name" : "Accept",
          "value" : "text/html, image/gif, image/jpeg, *; q=.2, */*; q=.2"
        }, {
          "name" : "Proxy-Connection",
          "value" : "keep-alive"
        }, {
          "name" : "Content-Length",
          "value" : "409"
        } ],
        "queryString" : [ ],
        "postData" : {
          "mimeType" : "application/json",
          "text" : "{\"field\":{\"farm_id\":\"!@#$%^&\",\"name\":\"Field by agent not assigned\",\"boundary\":{\"boundaries\":[{\"boundary\":{\"coords\":[{\"x\":-101.49568751,\"y\":37.14976293},{\"x\":-101.50049403,\"y\":37.14647907},{\"x\":-101.50049403,\"y\":37.14264773},{\"x\":-101.49723246,\"y\":37.1411425},{\"x\":-101.49019435,\"y\":37.14223722},{\"x\":-101.48933604,\"y\":37.14620541},{\"x\":-101.49294093,\"y\":37.14866833},{\"x\":-101.49568751,\"y\":37.14976293}]}}]}}}",
          "comment" : ""
        },
        "headersSize" : 592,
        "bodySize" : 409,
        "comment" : ""
      },
      "response" : {
        "status" : 400,
        "statusText" : "Bad Request",
        "httpVersion" : "HTTP/1.1",
        "cookies" : [ {
          "name" : ".ASPROLES",
          "value" : "5bklrESHEilbFR8DcLtEfcf_UXfMQIhRGCT6VPDPp_si2M-Z6MK0dUdNbaO2_2TB_2yfd_AuCBE70IUTf-puPsKtdqs2-MAf8inmMZPyBJd-yyPZUmXhHpVNWcUK65PL3WiVv_c7j5YsYRsKhaezFkgz6YniGcpqkwIMeVACvodnX45jNi9uve75kII_OpTurQr7al6F2zrQqPxe4v6P0JBAVctebzlLhMGpCfZH0C63FQY0e1cb0LYqgazZIMFhCVtwV2rcpCyrXX6HLFReKKefXcqe25-FWWEOLVcrMWIssGEFzRPbrnYfsMP0YhfFkSpLne95z90k2ZR3hIWw05li8IjPNceLG6Qx-aIWijjHPIBXoQP7v3FsPdy1fsU3DVsLFiOwVKBP3_KlV4EElg-qYg_AHLw0JDo106SVsJU_b2brXl3hWo_hAAvQxpPL_YhaxsdK0M77xOc5AF4PGofxBGLiad-a_gzZCA7ZU0VMnIQBd7DLMdV9POqCHrncxOJZIdN4DvwjGJSQEiEqdRp5akk1",
          "path" : "/",
          "httpOnly" : true,
          "secure" : false,
          "comment" : ""
        } ],
        "headers" : [ {
          "name" : "Cache-Control",
          "value" : "private"
        }, {
          "name" : "Content-Type",
          "value" : "application/json; charset=utf-8"
        }, {
          "name" : "Server",
          "value" : "Microsoft-IIS/10.0"
        }, {
          "name" : "Set-Cookie",
          "value" : ".ASPROLES=5bklrESHEilbFR8DcLtEfcf_UXfMQIhRGCT6VPDPp_si2M-Z6MK0dUdNbaO2_2TB_2yfd_AuCBE70IUTf-puPsKtdqs2-MAf8inmMZPyBJd-yyPZUmXhHpVNWcUK65PL3WiVv_c7j5YsYRsKhaezFkgz6YniGcpqkwIMeVACvodnX45jNi9uve75kII_OpTurQr7al6F2zrQqPxe4v6P0JBAVctebzlLhMGpCfZH0C63FQY0e1cb0LYqgazZIMFhCVtwV2rcpCyrXX6HLFReKKefXcqe25-FWWEOLVcrMWIssGEFzRPbrnYfsMP0YhfFkSpLne95z90k2ZR3hIWw05li8IjPNceLG6Qx-aIWijjHPIBXoQP7v3FsPdy1fsU3DVsLFiOwVKBP3_KlV4EElg-qYg_AHLw0JDo106SVsJU_b2brXl3hWo_hAAvQxpPL_YhaxsdK0M77xOc5AF4PGofxBGLiad-a_gzZCA7ZU0VMnIQBd7DLMdV9POqCHrncxOJZIdN4DvwjGJSQEiEqdRp5akk1; path=/; HttpOnly"
        }, {
          "name" : "X-SourceFiles",
          "value" : "=?UTF-8?B?RDpcVmlydHVhbE9wdGltaXplci1SZWZhY3RvcmluZ1xDcm9wTWV0cmljcy5Wby5BcGlcQ3JvcE1ldHJpY3MuVm8uQXBpXGFwaVxtb2JpbGVcdjFcZmllbGRz?="
        }, {
          "name" : "X-Powered-By",
          "value" : "ASP.NET"
        }, {
          "name" : "Date",
          "value" : "Thu, 11 Apr 2019 16:06:31 GMT"
        }, {
          "name" : "Content-Length",
          "value" : "37"
        } ],
        "content" : {
          "size" : 37,
          "mimeType" : "application/json; charset=utf-8",
          "text" : "{\"message\":\"The request is invalid.\"}",
          "comment" : ""
        },
        "redirectURL" : "",
        "headersSize" : 940,
        "bodySize" : 37,
        "comment" : ""
      },
      "cache" : { },
      "timings" : {
        "comment" : "",
        "ssl" : -1,
        "dns" : -1,
        "receive" : 0,
        "blocked" : -1,
        "connect" : -1,
        "wait" : 97,
        "send" : 0
      },
      "serverIPAddress" : "127.0.0.1",
      "comment" : "",
      "_katalonRequestInformation" : {
        "name" : "23",
        "testObjectId" : "Object Repository/VoGrow/Field/FieldPost",
        "harId" : "38f2b972-8207-4024-a221-54a9c6cbd060"
      },
      "time" : 98
    } ],
    "comment" : ""
  }
}