{
  "log" : {
    "version" : "1.2",
    "creator" : {
      "name" : "BrowserMob Proxy",
      "version" : "2.1.5",
      "comment" : ""
    },
    "pages" : [ {
      "id" : "Page 0",
      "startedDateTime" : "2019-03-29T13:31:03.032Z",
      "title" : "Page 0",
      "pageTimings" : {
        "onLoad" : 31,
        "comment" : ""
      },
      "comment" : ""
    } ],
    "entries" : [ {
      "pageref" : "Page 0",
      "startedDateTime" : "2019-03-29T13:31:03.032Z",
      "request" : {
        "method" : "PUT",
        "url" : "http://localhost:10520/WebAPI/api/admin/v1/users/41?",
        "httpVersion" : "HTTP/1.1",
        "cookies" : [ ],
        "headers" : [ {
          "name" : "User-Agent",
          "value" : "Katalon Studio"
        }, {
          "name" : "Content-Type",
          "value" : "application/x-www-form-urlencoded"
        }, {
          "name" : "Authorization",
          "value" : "Bearer eyJ0eXAiOiJKV1QiLCJhbGciOiJIUzI1NiJ9.eyJ1bmlxdWVfbmFtZSI6ImFkbWluIiwicm9sZSI6InVzZXIiLCJzdWIiOiJhZG1pbiIsImlzcyI6IkNyb3BNZXRyaWNzIiwiYXVkIjoiYWxsIiwiZXhwIjoxNTUzODcwMTYyLCJuYmYiOjE1NTM4NjYyNjJ9.1KUMvgRmdBplputFxT4aBgUpNeFb1KvIZgmNfkMt63g"
        }, {
          "name" : "Host",
          "value" : "localhost:10520"
        }, {
          "name" : "Accept",
          "value" : "text/html, image/gif, image/jpeg, *; q=.2, */*; q=.2"
        }, {
          "name" : "Proxy-Connection",
          "value" : "keep-alive"
        }, {
          "name" : "Content-Length",
          "value" : "288"
        } ],
        "queryString" : [ ],
        "postData" : {
          "mimeType" : "application/x-www-form-urlencoded",
          "params" : [ {
            "name" : "password",
            "value" : "cropmetrics",
            "comment" : ""
          }, {
            "name" : "email",
            "value" : "cropmetricsvo.roleclient@gmail.com",
            "comment" : ""
          }, {
            "name" : "fullname",
            "value" : "test validation",
            "comment" : ""
          }, {
            "name" : "phone",
            "value" : "123",
            "comment" : ""
          }, {
            "name" : "dealer",
            "value" : "x",
            "comment" : ""
          }, {
            "name" : "addressLine1",
            "value" : "address line 1 test validation",
            "comment" : ""
          }, {
            "name" : "addressLine2",
            "value" : "address line 2 test validation",
            "comment" : ""
          }, {
            "name" : "town",
            "value" : "townValidation",
            "comment" : ""
          }, {
            "name" : "state",
            "value" : "stateValidation",
            "comment" : ""
          }, {
            "name" : "zip",
            "value" : "xx",
            "comment" : ""
          }, {
            "name" : "country",
            "value" : "xx",
            "comment" : ""
          }, {
            "name" : "roles",
            "value" : "FieldCrew",
            "comment" : ""
          }, {
            "name" : "userProfileId",
            "value" : "41",
            "comment" : ""
          } ],
          "comment" : ""
        },
        "headersSize" : 545,
        "bodySize" : 288,
        "comment" : ""
      },
      "response" : {
        "status" : 400,
        "statusText" : "Bad Request",
        "httpVersion" : "HTTP/1.1",
        "cookies" : [ {
          "name" : ".ASPROLES",
          "value" : "-HmyEpfHP9qVUXvlEIeapHso3ZsI0djaBx_LYvThiPo0UR3fi351lziMFRaNApd8wfwnO8Zfvjc4Ax81GWBVDwSNvXaR0zY0xPcaQGpZzfu4fFZTnSXnhBYtfNP3EVi3cab8zCtT8tUZuMHjNbiOvSC3oQPnaRz4E4Ts4IUNGVf_iauTBziqy9iKdc--PhI34KOZqzvL9O3GlYExGjCs8RcM76ui9WJGlZ6n_23qAl5t-8gwvqELpqNKbZ8TGS02LqUy4QdgmaypF7zLJle7SkHymM3ddm3vaXGURF1Al5Ted1z-JW6AccqnPcEXCPtsgxivTM4QIVRCU5i7Z3Td2Nehgn96VHEqk7mvpt-NgkcaLenPc4Ity2jCehm0zoK3slCqTpyAi8kiH7peCn5V1kUyaK41WCwQ97GpqJSqBKGFzaCKZnOE_QAVppmxX7EAI99KFLpbQrqhIxbphknvIzLmDXEzMGf-mgh3xOakMvMQplgs0",
          "path" : "/",
          "httpOnly" : true,
          "secure" : false,
          "comment" : ""
        } ],
        "headers" : [ {
          "name" : "Cache-Control",
          "value" : "private"
        }, {
          "name" : "Content-Type",
          "value" : "application/json; charset=utf-8"
        }, {
          "name" : "Server",
          "value" : "Microsoft-IIS/10.0"
        }, {
          "name" : "Set-Cookie",
          "value" : ".ASPROLES=-HmyEpfHP9qVUXvlEIeapHso3ZsI0djaBx_LYvThiPo0UR3fi351lziMFRaNApd8wfwnO8Zfvjc4Ax81GWBVDwSNvXaR0zY0xPcaQGpZzfu4fFZTnSXnhBYtfNP3EVi3cab8zCtT8tUZuMHjNbiOvSC3oQPnaRz4E4Ts4IUNGVf_iauTBziqy9iKdc--PhI34KOZqzvL9O3GlYExGjCs8RcM76ui9WJGlZ6n_23qAl5t-8gwvqELpqNKbZ8TGS02LqUy4QdgmaypF7zLJle7SkHymM3ddm3vaXGURF1Al5Ted1z-JW6AccqnPcEXCPtsgxivTM4QIVRCU5i7Z3Td2Nehgn96VHEqk7mvpt-NgkcaLenPc4Ity2jCehm0zoK3slCqTpyAi8kiH7peCn5V1kUyaK41WCwQ97GpqJSqBKGFzaCKZnOE_QAVppmxX7EAI99KFLpbQrqhIxbphknvIzLmDXEzMGf-mgh3xOakMvMQplgs0; path=/; HttpOnly"
        }, {
          "name" : "X-SourceFiles",
          "value" : "=?UTF-8?B?RDpcVmlydHVhbE9wdGltaXplci1SZWZhY3RvcmluZ1xDcm9wTWV0cmljcy5Wby5BcGlcQ3JvcE1ldHJpY3MuVm8uQXBpXGFwaVxhZG1pblx2MVx1c2Vyc1w0MQ==?="
        }, {
          "name" : "X-Powered-By",
          "value" : "ASP.NET"
        }, {
          "name" : "Date",
          "value" : "Fri, 29 Mar 2019 13:31:02 GMT"
        }, {
          "name" : "Content-Length",
          "value" : "78"
        } ],
        "content" : {
          "size" : 78,
          "mimeType" : "application/json; charset=utf-8",
          "text" : "{\"message\":\"The request is invalid. The user profile id is not a valid user.\"}",
          "comment" : ""
        },
        "redirectURL" : "",
        "headersSize" : 901,
        "bodySize" : 78,
        "comment" : ""
      },
      "cache" : { },
      "timings" : {
        "comment" : "",
        "ssl" : -1,
        "send" : 0,
        "wait" : 28,
        "receive" : 0,
        "blocked" : -1,
        "connect" : -1,
        "dns" : -1
      },
      "serverIPAddress" : "127.0.0.1",
      "comment" : "",
      "_katalonRequestInformation" : {
        "name" : "77",
        "testObjectId" : "Object Repository/VoPro/Account/api_admin_v1_users_userprofileid",
        "harId" : "93242c31-9b68-4f4b-bfad-728cc7b81a8c"
      },
      "time" : 29
    } ],
    "comment" : ""
  }
}