{
  "log" : {
    "version" : "1.2",
    "creator" : {
      "name" : "BrowserMob Proxy",
      "version" : "2.1.5",
      "comment" : ""
    },
    "pages" : [ {
      "id" : "Page 0",
      "startedDateTime" : "2019-04-09T21:27:15.874Z",
      "title" : "Page 0",
      "pageTimings" : {
        "onLoad" : 4749,
        "comment" : ""
      },
      "comment" : ""
    } ],
    "entries" : [ {
      "pageref" : "Page 0",
      "startedDateTime" : "2019-04-09T21:27:15.880Z",
      "request" : {
        "method" : "PUT",
        "url" : "http://localhost:10520/WebAPI/api/mobile/v1/fields/3?",
        "httpVersion" : "HTTP/1.1",
        "cookies" : [ ],
        "headers" : [ {
          "name" : "User-Agent",
          "value" : "Katalon Studio"
        }, {
          "name" : "Content-Type",
          "value" : "application/json"
        }, {
          "name" : "Authorization",
          "value" : "Bearer eyJ0eXAiOiJKV1QiLCJhbGciOiJIUzI1NiJ9.eyJ1bmlxdWVfbmFtZSI6Implbm55Lm1hbGRvbmFkby50eDFAZ21haWwuY29tIiwicm9sZSI6InVzZXIiLCJzdWIiOiJqZW5ueS5tYWxkb25hZG8udHgxQGdtYWlsLmNvbSIsImlzcyI6IkNyb3BNZXRyaWNzIiwiYXVkIjoiYWxsIiwiZXhwIjoxNTU0ODQ5MTM1LCJuYmYiOjE1NTQ4NDUyMzV9.NQcdcAbwo19RfAs9QR8DQQgMAmIR2aJRc3MMA_lED8s"
        }, {
          "name" : "Host",
          "value" : "localhost:10520"
        }, {
          "name" : "Accept",
          "value" : "text/html, image/gif, image/jpeg, *; q=.2, */*; q=.2"
        }, {
          "name" : "Proxy-Connection",
          "value" : "keep-alive"
        }, {
          "name" : "Content-Length",
          "value" : "98"
        } ],
        "queryString" : [ ],
        "postData" : {
          "mimeType" : "application/json",
          "text" : "{\"field\":{\"name\":\"Field whit sno coords in boundary\",\"boundary\":{\"boundaries\":[{\"boundary\":{}}]}}}",
          "comment" : ""
        },
        "headersSize" : 592,
        "bodySize" : 98,
        "comment" : ""
      },
      "response" : {
        "status" : 400,
        "statusText" : "Bad Request",
        "httpVersion" : "HTTP/1.1",
        "cookies" : [ {
          "name" : ".ASPROLES",
          "value" : "hLigx128599xjnykhhwGkYmTFEBx7XejMi3CrJzgNjNhlMCxPM90p6gbpZVJ6pepMsM83YIeMvKheS2HlQLKyuHLKokdrQsd3EDIjjAq5OUdbfh1rkfzDRh0b18R3rvZYm-NpMdNPrt6uZ1SCMR1XBFMw2qBHyo5e4MrGRVkp1S8SUP9h_NihtM1sgFWnNIEIqS4so8g5uGkm2PmohxsFbpmmp9YzMcWe10ekc7TWeuVSxWVqH7QOhDc-S3lqeHdpzHkSaCtGtH5txfVghQW0BVJko8TSnGvZcM38z67G_fK9Nb_bnAHzjKd4EZfc0cOvW0DuZobNKHY43Du8AzPkSB6CsOPOFbE1_FAg0Vlla11GPJDEMILviQck3RaGs5nZCBzqM3kOH-4ge_Nyy_hPgNwIBe5gycAD5s5-gJ4oTSJpHnrMyBS1Je6Sq_3kHxLGLbOWjLSvK3M6WjtdvRAVUMb4J34xQXBx_fbSFo8QynRgnvNxi0Wu9hL9SqHFTllV8Y3d604DA6f2cA9SLYYDAuIJYo1",
          "path" : "/",
          "httpOnly" : true,
          "secure" : false,
          "comment" : ""
        } ],
        "headers" : [ {
          "name" : "Cache-Control",
          "value" : "private"
        }, {
          "name" : "Content-Type",
          "value" : "application/json; charset=utf-8"
        }, {
          "name" : "Server",
          "value" : "Microsoft-IIS/10.0"
        }, {
          "name" : "Set-Cookie",
          "value" : ".ASPROLES=hLigx128599xjnykhhwGkYmTFEBx7XejMi3CrJzgNjNhlMCxPM90p6gbpZVJ6pepMsM83YIeMvKheS2HlQLKyuHLKokdrQsd3EDIjjAq5OUdbfh1rkfzDRh0b18R3rvZYm-NpMdNPrt6uZ1SCMR1XBFMw2qBHyo5e4MrGRVkp1S8SUP9h_NihtM1sgFWnNIEIqS4so8g5uGkm2PmohxsFbpmmp9YzMcWe10ekc7TWeuVSxWVqH7QOhDc-S3lqeHdpzHkSaCtGtH5txfVghQW0BVJko8TSnGvZcM38z67G_fK9Nb_bnAHzjKd4EZfc0cOvW0DuZobNKHY43Du8AzPkSB6CsOPOFbE1_FAg0Vlla11GPJDEMILviQck3RaGs5nZCBzqM3kOH-4ge_Nyy_hPgNwIBe5gycAD5s5-gJ4oTSJpHnrMyBS1Je6Sq_3kHxLGLbOWjLSvK3M6WjtdvRAVUMb4J34xQXBx_fbSFo8QynRgnvNxi0Wu9hL9SqHFTllV8Y3d604DA6f2cA9SLYYDAuIJYo1; path=/; HttpOnly"
        }, {
          "name" : "X-SourceFiles",
          "value" : "=?UTF-8?B?RDpcVmlydHVhbE9wdGltaXplci1SZWZhY3RvcmluZ1xDcm9wTWV0cmljcy5Wby5BcGlcQ3JvcE1ldHJpY3MuVm8uQXBpXGFwaVxtb2JpbGVcdjFcZmllbGRzXDM=?="
        }, {
          "name" : "X-Powered-By",
          "value" : "ASP.NET"
        }, {
          "name" : "Date",
          "value" : "Tue, 09 Apr 2019 21:27:20 GMT"
        }, {
          "name" : "Content-Length",
          "value" : "59"
        } ],
        "content" : {
          "size" : 59,
          "mimeType" : "application/json; charset=utf-8",
          "text" : "{\"message\":\"The Boundary is not a valid geojson geometry.\"}",
          "comment" : ""
        },
        "redirectURL" : "",
        "headersSize" : 944,
        "bodySize" : 59,
        "comment" : ""
      },
      "cache" : { },
      "timings" : {
        "comment" : "",
        "send" : 0,
        "connect" : -1,
        "blocked" : -1,
        "dns" : -1,
        "receive" : 0,
        "wait" : 4743,
        "ssl" : -1
      },
      "serverIPAddress" : "127.0.0.1",
      "comment" : "",
      "_katalonRequestInformation" : {
        "name" : "85",
        "testObjectId" : "Object Repository/VoGrow/Field/FieldPut",
        "harId" : "16e361a4-800d-4834-8988-ed4dbe0df4ef"
      },
      "time" : 4744
    } ],
    "comment" : ""
  }
}