{
  "log" : {
    "version" : "1.2",
    "creator" : {
      "name" : "BrowserMob Proxy",
      "version" : "2.1.5",
      "comment" : ""
    },
    "pages" : [ {
      "id" : "Page 0",
      "startedDateTime" : "2019-03-29T19:00:40.639Z",
      "title" : "Page 0",
      "pageTimings" : {
        "onLoad" : 2236,
        "comment" : ""
      },
      "comment" : ""
    } ],
    "entries" : [ {
      "pageref" : "Page 0",
      "startedDateTime" : "2019-03-29T19:00:40.640Z",
      "request" : {
        "method" : "PUT",
        "url" : "http://localhost:10520/WebAPI/api/admin/v1/users/41?",
        "httpVersion" : "HTTP/1.1",
        "cookies" : [ ],
        "headers" : [ {
          "name" : "User-Agent",
          "value" : "Katalon Studio"
        }, {
          "name" : "Content-Type",
          "value" : "application/x-www-form-urlencoded"
        }, {
          "name" : "Authorization",
          "value" : "Bearer eyJ0eXAiOiJKV1QiLCJhbGciOiJIUzI1NiJ9.eyJ1bmlxdWVfbmFtZSI6ImFkbWluIiwicm9sZSI6InVzZXIiLCJzdWIiOiJhZG1pbiIsImlzcyI6IkNyb3BNZXRyaWNzIiwiYXVkIjoiYWxsIiwiZXhwIjoxNTUzODg5OTQwLCJuYmYiOjE1NTM4ODYwNDB9.DSMXBYX6TrUwIVaIREBfUB0n00N4u4qzhG0oOW0cryA"
        }, {
          "name" : "Host",
          "value" : "localhost:10520"
        }, {
          "name" : "Accept",
          "value" : "text/html, image/gif, image/jpeg, *; q=.2, */*; q=.2"
        }, {
          "name" : "Proxy-Connection",
          "value" : "keep-alive"
        }, {
          "name" : "Content-Length",
          "value" : "288"
        } ],
        "queryString" : [ ],
        "postData" : {
          "mimeType" : "application/x-www-form-urlencoded",
          "params" : [ {
            "name" : "password",
            "value" : "cropmetrics",
            "comment" : ""
          }, {
            "name" : "email",
            "value" : "cropmetricsvo.roleclient@gmail.com",
            "comment" : ""
          }, {
            "name" : "fullname",
            "value" : "test validation",
            "comment" : ""
          }, {
            "name" : "phone",
            "value" : "123",
            "comment" : ""
          }, {
            "name" : "dealer",
            "value" : "x",
            "comment" : ""
          }, {
            "name" : "addressLine1",
            "value" : "address line 1 test validation",
            "comment" : ""
          }, {
            "name" : "addressLine2",
            "value" : "address line 2 test validation",
            "comment" : ""
          }, {
            "name" : "town",
            "value" : "townValidation",
            "comment" : ""
          }, {
            "name" : "state",
            "value" : "stateValidation",
            "comment" : ""
          }, {
            "name" : "zip",
            "value" : "xx",
            "comment" : ""
          }, {
            "name" : "country",
            "value" : "xx",
            "comment" : ""
          }, {
            "name" : "roles",
            "value" : "FieldCrew",
            "comment" : ""
          }, {
            "name" : "userProfileId",
            "value" : "41",
            "comment" : ""
          } ],
          "comment" : ""
        },
        "headersSize" : 545,
        "bodySize" : 288,
        "comment" : ""
      },
      "response" : {
        "status" : 200,
        "statusText" : "OK",
        "httpVersion" : "HTTP/1.1",
        "cookies" : [ {
          "name" : ".ASPROLES",
          "value" : "tYWuiZG6AA98DqqIhA3qEE5qDoLdCOVUbCFS0b83n-dkm59ujOIP_3o7AG8iaYvmY7T-jhms705S0jwxFcO3ZwCowpCJrFNl27tkEaLNyV-XWhkbYJBmMNp4Wg_9B9tZ5JJhQPz3IbMM-EHhrDkYnJxqrDa2Xr0GWjuytgWvW8kWxJCntSsTkCScVTaksYC3LkncULT6gIqYpTaL_d-E5S_DPWlMJBKjA_k45OwxRETbbpGZ9_zZIDzWjNy3jb3PSVGci1CJyUonOtEtx8RyAuseICTgIc6ajGSdaXLY-vpNZWX4Aj2U-p0pFSCSnyd9WHmlr1iFd1HdyUKQAx5aWS6gjKe1NgXKgURiFhLifVIw-msMQQNPyX8G0lWU7Zgw2c1g8EnDt8GVRoUdV5iAyMPg94OJYOaosgNdiIJk2vgvZ4YexFOszqtA8ir0qJ96UM-DH5xzjSlrYZS3za210sKttk6nRusdUteEjLp1IYR5Ok0v0",
          "path" : "/",
          "httpOnly" : true,
          "secure" : false,
          "comment" : ""
        } ],
        "headers" : [ {
          "name" : "Cache-Control",
          "value" : "private"
        }, {
          "name" : "Server",
          "value" : "Microsoft-IIS/10.0"
        }, {
          "name" : "Set-Cookie",
          "value" : ".ASPROLES=tYWuiZG6AA98DqqIhA3qEE5qDoLdCOVUbCFS0b83n-dkm59ujOIP_3o7AG8iaYvmY7T-jhms705S0jwxFcO3ZwCowpCJrFNl27tkEaLNyV-XWhkbYJBmMNp4Wg_9B9tZ5JJhQPz3IbMM-EHhrDkYnJxqrDa2Xr0GWjuytgWvW8kWxJCntSsTkCScVTaksYC3LkncULT6gIqYpTaL_d-E5S_DPWlMJBKjA_k45OwxRETbbpGZ9_zZIDzWjNy3jb3PSVGci1CJyUonOtEtx8RyAuseICTgIc6ajGSdaXLY-vpNZWX4Aj2U-p0pFSCSnyd9WHmlr1iFd1HdyUKQAx5aWS6gjKe1NgXKgURiFhLifVIw-msMQQNPyX8G0lWU7Zgw2c1g8EnDt8GVRoUdV5iAyMPg94OJYOaosgNdiIJk2vgvZ4YexFOszqtA8ir0qJ96UM-DH5xzjSlrYZS3za210sKttk6nRusdUteEjLp1IYR5Ok0v0; path=/; HttpOnly"
        }, {
          "name" : "X-SourceFiles",
          "value" : "=?UTF-8?B?RDpcVmlydHVhbE9wdGltaXplci1SZWZhY3RvcmluZ1xDcm9wTWV0cmljcy5Wby5BcGlcQ3JvcE1ldHJpY3MuVm8uQXBpXGFwaVxhZG1pblx2MVx1c2Vyc1w0MQ==?="
        }, {
          "name" : "X-Powered-By",
          "value" : "ASP.NET"
        }, {
          "name" : "Date",
          "value" : "Fri, 29 Mar 2019 19:00:42 GMT"
        }, {
          "name" : "Content-Length",
          "value" : "0"
        } ],
        "content" : {
          "size" : 0,
          "mimeType" : "",
          "text" : "",
          "encoding" : "base64",
          "comment" : ""
        },
        "redirectURL" : "",
        "headersSize" : 844,
        "bodySize" : 0,
        "comment" : ""
      },
      "cache" : { },
      "timings" : {
        "comment" : "",
        "ssl" : -1,
        "wait" : 2164,
        "send" : 0,
        "receive" : 0,
        "dns" : -1,
        "blocked" : -1,
        "connect" : -1
      },
      "serverIPAddress" : "127.0.0.1",
      "comment" : "",
      "_katalonRequestInformation" : {
        "name" : "83",
        "testObjectId" : "Object Repository/VoPro/Account/api_admin_v1_users_userprofileid",
        "harId" : "49257b32-c211-42b5-a605-77799ebae92c"
      },
      "time" : 2166
    } ],
    "comment" : ""
  }
}