Suite/Test/Step Name,Browser,Description,Tag,Start time,End time,Duration,Status
Auto_Delete_probe_readings_databases_of_local_environment,,,,2019-08-07 15:02:18,2019-08-07 15:02:40,22.610s,PASSED
,,,,,,,
Test Cases/Databases/DeleteDatabases/ProbeReadings/DB_Delete_vo_agsenseproberawreadings_database,,,,2019-08-07 15:02:18,2019-08-07 15:02:25,6.247s,PASSED
server = server,,,,2019-08-07 15:02:19,2019-08-07 15:02:19,0.584s,PASSED
port = port,,,,2019-08-07 15:02:19,2019-08-07 15:02:19,0.001s,PASSED
user = userDb,,,,2019-08-07 15:02:19,2019-08-07 15:02:19,0.000s,PASSED
password = passwordDb,,,,2019-08-07 15:02:19,2019-08-07 15:02:19,0.002s,PASSED
pathPostgreSQL = pathPostgreSQLBin,,,,2019-08-07 15:02:19,2019-08-07 15:02:19,0.000s,PASSED
"database = ""vo_agSenseProbeRawReadings""",,,,2019-08-07 15:02:19,2019-08-07 15:02:19,0.000s,PASSED
"command = String.format(""cd ""%s"" && dropdb -h %s -p %d -U %s  %s"", pathPostgreSQL, server, port, user, database)",,,,2019-08-07 15:02:19,2019-08-07 15:02:19,0.010s,PASSED
"commandLine.cmd.cmdLine(command, password)",,,,2019-08-07 15:02:19,2019-08-07 15:02:25,5.183s,PASSED
"println(""The vo_agSenseProbeRawReadings database was deleted..."")",,,,2019-08-07 15:02:25,2019-08-07 15:02:25,0.013s,PASSED
,,,,,,,
Test Cases/Databases/DeleteDatabases/ProbeReadings/DB_Delete_vo_agsenseprobereadings_database,,,,2019-08-07 15:02:25,2019-08-07 15:02:30,5.272s,PASSED
server = server,,,,2019-08-07 15:02:25,2019-08-07 15:02:25,0.001s,PASSED
port = port,,,,2019-08-07 15:02:25,2019-08-07 15:02:25,0.001s,PASSED
user = userDb,,,,2019-08-07 15:02:25,2019-08-07 15:02:25,0.001s,PASSED
password = passwordDb,,,,2019-08-07 15:02:25,2019-08-07 15:02:25,0.002s,PASSED
pathPostgreSQL = pathPostgreSQLBin,,,,2019-08-07 15:02:25,2019-08-07 15:02:25,0.011s,PASSED
"database = ""vo_agSenseProbeReadings""",,,,2019-08-07 15:02:25,2019-08-07 15:02:25,0.004s,PASSED
"command = String.format(""cd ""%s"" && dropdb -h %s -p %d -U %s  %s"", pathPostgreSQL, server, port, user, database)",,,,2019-08-07 15:02:25,2019-08-07 15:02:25,0.003s,PASSED
"commandLine.cmd.cmdLine(command, password)",,,,2019-08-07 15:02:25,2019-08-07 15:02:30,5.011s,PASSED
"println(""The vo_agSenseProbeReadings database was deleted..."")",,,,2019-08-07 15:02:30,2019-08-07 15:02:30,0.010s,PASSED
,,,,,,,
Test Cases/Databases/DeleteDatabases/ProbeReadings/DB_Delete_vo_sentekproberawreadings_database,,,,2019-08-07 15:02:30,2019-08-07 15:02:35,5.320s,PASSED
server = server,,,,2019-08-07 15:02:30,2019-08-07 15:02:30,0.001s,PASSED
port = port,,,,2019-08-07 15:02:30,2019-08-07 15:02:30,0.003s,PASSED
user = userDb,,,,2019-08-07 15:02:30,2019-08-07 15:02:30,0.001s,PASSED
password = passwordDb,,,,2019-08-07 15:02:30,2019-08-07 15:02:30,0.001s,PASSED
pathPostgreSQL = pathPostgreSQLBin,,,,2019-08-07 15:02:30,2019-08-07 15:02:30,0.001s,PASSED
"database = ""vo_sentekProbeRawReadings""",,,,2019-08-07 15:02:30,2019-08-07 15:02:30,0.001s,PASSED
"command = String.format(""cd ""%s"" && dropdb -h %s -p %d -U %s  %s"", pathPostgreSQL, server, port, user, database)",,,,2019-08-07 15:02:30,2019-08-07 15:02:30,0.002s,PASSED
"commandLine.cmd.cmdLine(command, password)",,,,2019-08-07 15:02:30,2019-08-07 15:02:35,5.020s,PASSED
"println(""The vo_sentekProbeRawReadings database was deleted..."")",,,,2019-08-07 15:02:35,2019-08-07 15:02:35,0.002s,PASSED
,,,,,,,
Test Cases/Databases/DeleteDatabases/ProbeReadings/DB_Delete_vo_sentekprobereadings_database,,,,2019-08-07 15:02:35,2019-08-07 15:02:40,5.255s,PASSED
server = server,,,,2019-08-07 15:02:35,2019-08-07 15:02:35,0.001s,PASSED
port = port,,,,2019-08-07 15:02:35,2019-08-07 15:02:35,0.000s,PASSED
user = userDb,,,,2019-08-07 15:02:35,2019-08-07 15:02:35,0.001s,PASSED
password = passwordDb,,,,2019-08-07 15:02:35,2019-08-07 15:02:35,0.001s,PASSED
pathPostgreSQL = pathPostgreSQLBin,,,,2019-08-07 15:02:35,2019-08-07 15:02:35,0.002s,PASSED
"database = ""vo_sentekProbeReadings""",,,,2019-08-07 15:02:35,2019-08-07 15:02:35,0.001s,PASSED
"command = String.format(""cd ""%s"" && dropdb -h %s -p %d -U %s  %s"", pathPostgreSQL, server, port, user, database)",,,,2019-08-07 15:02:35,2019-08-07 15:02:35,0.001s,PASSED
"commandLine.cmd.cmdLine(command, password)",,,,2019-08-07 15:02:35,2019-08-07 15:02:40,5.009s,PASSED
"println(""The vo_sentekProbeReadings database was deleted..."")",,,,2019-08-07 15:02:40,2019-08-07 15:02:40,0.001s,PASSED
