{
  "log" : {
    "version" : "1.2",
    "creator" : {
      "name" : "BrowserMob Proxy",
      "version" : "2.1.5",
      "comment" : ""
    },
    "pages" : [ {
      "id" : "Page 0",
      "startedDateTime" : "2019-03-28T18:59:46.862Z",
      "title" : "Page 0",
      "pageTimings" : {
        "onLoad" : 31,
        "comment" : ""
      },
      "comment" : ""
    } ],
    "entries" : [ {
      "pageref" : "Page 0",
      "startedDateTime" : "2019-03-28T18:59:46.862Z",
      "request" : {
        "method" : "POST",
        "url" : "http://localhost:10520/WebAPI/api/admin/v1/users/?",
        "httpVersion" : "HTTP/1.1",
        "cookies" : [ ],
        "headers" : [ {
          "name" : "User-Agent",
          "value" : "Katalon Studio"
        }, {
          "name" : "Content-Type",
          "value" : "application/x-www-form-urlencoded"
        }, {
          "name" : "Authorization",
          "value" : "Bearer eyJ0eXAiOiJKV1QiLCJhbGciOiJIUzI1NiJ9.eyJ1bmlxdWVfbmFtZSI6ImFkbWluIiwicm9sZSI6InVzZXIiLCJzdWIiOiJhZG1pbiIsImlzcyI6IkNyb3BNZXRyaWNzIiwiYXVkIjoiYWxsIiwiZXhwIjoxNTUzODAzNDg2LCJuYmYiOjE1NTM3OTk1ODZ9.xi7dtBZ_FtIriy7jk_5GlewcQzOqo44ht_k_7kDPTpg"
        }, {
          "name" : "Host",
          "value" : "localhost:10520"
        }, {
          "name" : "Accept",
          "value" : "text/html, image/gif, image/jpeg, *; q=.2, */*; q=.2"
        }, {
          "name" : "Proxy-Connection",
          "value" : "keep-alive"
        }, {
          "name" : "Content-Length",
          "value" : "285"
        } ],
        "queryString" : [ ],
        "postData" : {
          "mimeType" : "application/x-www-form-urlencoded",
          "params" : [ {
            "name" : "password",
            "value" : "cropmetrics",
            "comment" : ""
          }, {
            "name" : "email",
            "value" : "cropmetricsvo.rolesymbols@gmail.com",
            "comment" : ""
          }, {
            "name" : "fullname",
            "value" : "test validation",
            "comment" : ""
          }, {
            "name" : "phone",
            "value" : "123",
            "comment" : ""
          }, {
            "name" : "dealer",
            "value" : "x",
            "comment" : ""
          }, {
            "name" : "addressLine1",
            "value" : "address line 1 test validation",
            "comment" : ""
          }, {
            "name" : "addressLine2",
            "value" : "address line 2 test validation",
            "comment" : ""
          }, {
            "name" : "town",
            "value" : "townValidation",
            "comment" : ""
          }, {
            "name" : "state",
            "value" : "stateValidation",
            "comment" : ""
          }, {
            "name" : "zip",
            "value" : "xx",
            "comment" : ""
          }, {
            "name" : "country",
            "value" : "xx",
            "comment" : ""
          }, {
            "name" : "roles",
            "value" : "!@#$%^&*",
            "comment" : ""
          } ],
          "comment" : ""
        },
        "headersSize" : 544,
        "bodySize" : 285,
        "comment" : ""
      },
      "response" : {
        "status" : 400,
        "statusText" : "Bad Request",
        "httpVersion" : "HTTP/1.1",
        "cookies" : [ {
          "name" : ".ASPROLES",
          "value" : "pgQYrRF3P3gTbzwCQ9krm7g4tzZbMyZPYukHIBgGNeVigMn7DdIOsIXDH9Fzt6Mim7FHlOl3IRwLIZRTDkQr7JgrE5G1sarUFHgZbFtILgzS2nKuyuWyfwQg8joy3ut7LEfs3d_CwfFg-YjCvmz6riDNZhQdrzqNz3LTdwd_LegQqJw2kPpY2_KeJx1_D2SOPh8-vVF4__zJ7OLzIHihHxK2OKsHvnx7SaHPMrTu3iE7TNjXNLtoh096Z4X1_EorQAY9y-FSVoEukvRZU4-u1PEva1dNWdLr8zTUTBLNe9nXoXmHiKAOGTXwIGCQIkoka6CZ8xEQXB-GXCeHvlrQxM_3STd9RSGk7rCpVSiUbrgc7RdApGwBA08P7uVUerpnFieXnA-Vn7FUvKPVNEMTPECK2XDzeRD5TIs7RtWEZqXd67o3TdANAhVROjpgKFyOmjzEeY8UW6h6W2iYJx0gKDF3oETU2riRAuEhSit9zCA54LaX0",
          "path" : "/",
          "httpOnly" : true,
          "secure" : false,
          "comment" : ""
        } ],
        "headers" : [ {
          "name" : "Cache-Control",
          "value" : "private"
        }, {
          "name" : "Content-Type",
          "value" : "application/json; charset=utf-8"
        }, {
          "name" : "Server",
          "value" : "Microsoft-IIS/10.0"
        }, {
          "name" : "Set-Cookie",
          "value" : ".ASPROLES=pgQYrRF3P3gTbzwCQ9krm7g4tzZbMyZPYukHIBgGNeVigMn7DdIOsIXDH9Fzt6Mim7FHlOl3IRwLIZRTDkQr7JgrE5G1sarUFHgZbFtILgzS2nKuyuWyfwQg8joy3ut7LEfs3d_CwfFg-YjCvmz6riDNZhQdrzqNz3LTdwd_LegQqJw2kPpY2_KeJx1_D2SOPh8-vVF4__zJ7OLzIHihHxK2OKsHvnx7SaHPMrTu3iE7TNjXNLtoh096Z4X1_EorQAY9y-FSVoEukvRZU4-u1PEva1dNWdLr8zTUTBLNe9nXoXmHiKAOGTXwIGCQIkoka6CZ8xEQXB-GXCeHvlrQxM_3STd9RSGk7rCpVSiUbrgc7RdApGwBA08P7uVUerpnFieXnA-Vn7FUvKPVNEMTPECK2XDzeRD5TIs7RtWEZqXd67o3TdANAhVROjpgKFyOmjzEeY8UW6h6W2iYJx0gKDF3oETU2riRAuEhSit9zCA54LaX0; path=/; HttpOnly"
        }, {
          "name" : "X-SourceFiles",
          "value" : "=?UTF-8?B?RDpcVmlydHVhbE9wdGltaXplci1SZWZhY3RvcmluZ1xDcm9wTWV0cmljcy5Wby5BcGlcQ3JvcE1ldHJpY3MuVm8uQXBpXGFwaVxhZG1pblx2MVx1c2Vyc1w=?="
        }, {
          "name" : "X-Powered-By",
          "value" : "ASP.NET"
        }, {
          "name" : "Date",
          "value" : "Thu, 28 Mar 2019 18:59:46 GMT"
        }, {
          "name" : "Content-Length",
          "value" : "93"
        } ],
        "content" : {
          "size" : 93,
          "mimeType" : "application/json; charset=utf-8",
          "text" : "{\"message\":\"The request is invalid. The role  !@#$%^&* requested to assign is not a valid..\"}",
          "comment" : ""
        },
        "redirectURL" : "",
        "headersSize" : 897,
        "bodySize" : 93,
        "comment" : ""
      },
      "cache" : { },
      "timings" : {
        "comment" : "",
        "ssl" : -1,
        "connect" : -1,
        "blocked" : -1,
        "receive" : 0,
        "dns" : -1,
        "wait" : 22,
        "send" : 0
      },
      "serverIPAddress" : "127.0.0.1",
      "comment" : "",
      "_katalonRequestInformation" : {
        "name" : "101",
        "testObjectId" : "Object Repository/VoPro/Account/api_admin_v1_users",
        "harId" : "d264a640-09e7-4fd6-bf0d-929a2dc0e3b4"
      },
      "time" : 23
    } ],
    "comment" : ""
  }
}