{
  "log" : {
    "version" : "1.2",
    "creator" : {
      "name" : "BrowserMob Proxy",
      "version" : "2.1.5",
      "comment" : ""
    },
    "pages" : [ {
      "id" : "Page 0",
      "startedDateTime" : "2019-03-29T21:48:44.400Z",
      "title" : "Page 0",
      "pageTimings" : {
        "onLoad" : 1833,
        "comment" : ""
      },
      "comment" : ""
    } ],
    "entries" : [ {
      "pageref" : "Page 0",
      "startedDateTime" : "2019-03-29T21:48:44.402Z",
      "request" : {
        "method" : "PUT",
        "url" : "http://localhost:10520/WebAPI/api/admin/v1/users/15?",
        "httpVersion" : "HTTP/1.1",
        "cookies" : [ ],
        "headers" : [ {
          "name" : "User-Agent",
          "value" : "Katalon Studio"
        }, {
          "name" : "Content-Type",
          "value" : "application/x-www-form-urlencoded"
        }, {
          "name" : "Authorization",
          "value" : "Bearer eyJ0eXAiOiJKV1QiLCJhbGciOiJIUzI1NiJ9.eyJ1bmlxdWVfbmFtZSI6ImFkbWluIiwicm9sZSI6InVzZXIiLCJzdWIiOiJhZG1pbiIsImlzcyI6IkNyb3BNZXRyaWNzIiwiYXVkIjoiYWxsIiwiZXhwIjoxNTUzOTAwMDI0LCJuYmYiOjE1NTM4OTYxMjR9.IP47F1G5Q7jcbkn-WbITOF0_znKlFQrqwr3aioz1hlQ"
        }, {
          "name" : "Host",
          "value" : "localhost:10520"
        }, {
          "name" : "Accept",
          "value" : "text/html, image/gif, image/jpeg, *; q=.2, */*; q=.2"
        }, {
          "name" : "Proxy-Connection",
          "value" : "keep-alive"
        }, {
          "name" : "Content-Length",
          "value" : "306"
        } ],
        "queryString" : [ ],
        "postData" : {
          "mimeType" : "application/x-www-form-urlencoded",
          "params" : [ {
            "name" : "password",
            "value" : "asdfgh",
            "comment" : ""
          }, {
            "name" : "email",
            "value" : "cropmetricsvo.pass6chars@gmail.com",
            "comment" : ""
          }, {
            "name" : "fullname",
            "value" : "test validation",
            "comment" : ""
          }, {
            "name" : "phone",
            "value" : "123",
            "comment" : ""
          }, {
            "name" : "dealer",
            "value" : "x",
            "comment" : ""
          }, {
            "name" : "addressLine1",
            "value" : "address line 1 test validation",
            "comment" : ""
          }, {
            "name" : "addressLine2",
            "value" : "address line 2 test validation",
            "comment" : ""
          }, {
            "name" : "town",
            "value" : "townValidation",
            "comment" : ""
          }, {
            "name" : "state",
            "value" : "stateValidation",
            "comment" : ""
          }, {
            "name" : "zip",
            "value" : "zipValidation",
            "comment" : ""
          }, {
            "name" : "country",
            "value" : "countryValidation",
            "comment" : ""
          }, {
            "name" : "roles",
            "value" : "Client",
            "comment" : ""
          }, {
            "name" : "userProfileId",
            "value" : "15",
            "comment" : ""
          } ],
          "comment" : ""
        },
        "headersSize" : 545,
        "bodySize" : 306,
        "comment" : ""
      },
      "response" : {
        "status" : 200,
        "statusText" : "OK",
        "httpVersion" : "HTTP/1.1",
        "cookies" : [ {
          "name" : ".ASPROLES",
          "value" : "tqR1_aR3yGjFv60ypw-DV8yUigM_wNS23J1DBk8kSipRiu8G-YQwMlAlPPVz3xLU241mMCisrtyJwCoh8zYlahNQc71QKkIb3rIUbZywh889Bf2Pgy_xOerG6i9f9k1JexNJQmjZRCJ-s9CM5U3gYuUqjz1jOpnQwTPy8G0xc6ilIIHCf4tRfXGD7ZLEyJl318nyqrVeQR2rHz5SkY1_TWORm3GG2eLqyvHyykZaCAWMoaGZAbsMxvP63Y-LYtEX4jgbM1EuhArhmmDcAF23XWZp8aW1rme0Ql7xPj20mt6bwY9PBratSWgP6AvFQQ0ZyVWtLSnI5K2tX01zeoUr-AxwFhlZj1wphZXxvgH3McHW1ncqaS8zyNO4_AnaXqPHQVVmuWjBeYLHO69zhviDDp-5NSoAtD-xpe7GgR9VvR8lXu5KUmOMK8QNkSzlcaskPDhTO060Cw7t0MhvDweDMtBiYyO3M06H9ukyghYLo4yeVbKy0",
          "path" : "/",
          "httpOnly" : true,
          "secure" : false,
          "comment" : ""
        } ],
        "headers" : [ {
          "name" : "Cache-Control",
          "value" : "private"
        }, {
          "name" : "Server",
          "value" : "Microsoft-IIS/10.0"
        }, {
          "name" : "Set-Cookie",
          "value" : ".ASPROLES=tqR1_aR3yGjFv60ypw-DV8yUigM_wNS23J1DBk8kSipRiu8G-YQwMlAlPPVz3xLU241mMCisrtyJwCoh8zYlahNQc71QKkIb3rIUbZywh889Bf2Pgy_xOerG6i9f9k1JexNJQmjZRCJ-s9CM5U3gYuUqjz1jOpnQwTPy8G0xc6ilIIHCf4tRfXGD7ZLEyJl318nyqrVeQR2rHz5SkY1_TWORm3GG2eLqyvHyykZaCAWMoaGZAbsMxvP63Y-LYtEX4jgbM1EuhArhmmDcAF23XWZp8aW1rme0Ql7xPj20mt6bwY9PBratSWgP6AvFQQ0ZyVWtLSnI5K2tX01zeoUr-AxwFhlZj1wphZXxvgH3McHW1ncqaS8zyNO4_AnaXqPHQVVmuWjBeYLHO69zhviDDp-5NSoAtD-xpe7GgR9VvR8lXu5KUmOMK8QNkSzlcaskPDhTO060Cw7t0MhvDweDMtBiYyO3M06H9ukyghYLo4yeVbKy0; path=/; HttpOnly"
        }, {
          "name" : "X-SourceFiles",
          "value" : "=?UTF-8?B?RDpcVmlydHVhbE9wdGltaXplci1SZWZhY3RvcmluZ1xDcm9wTWV0cmljcy5Wby5BcGlcQ3JvcE1ldHJpY3MuVm8uQXBpXGFwaVxhZG1pblx2MVx1c2Vyc1wxNQ==?="
        }, {
          "name" : "X-Powered-By",
          "value" : "ASP.NET"
        }, {
          "name" : "Date",
          "value" : "Fri, 29 Mar 2019 21:48:46 GMT"
        }, {
          "name" : "Content-Length",
          "value" : "0"
        } ],
        "content" : {
          "size" : 0,
          "mimeType" : "",
          "text" : "",
          "encoding" : "base64",
          "comment" : ""
        },
        "redirectURL" : "",
        "headersSize" : 844,
        "bodySize" : 0,
        "comment" : ""
      },
      "cache" : { },
      "timings" : {
        "comment" : "",
        "ssl" : -1,
        "receive" : 0,
        "send" : 0,
        "wait" : 1827,
        "dns" : -1,
        "connect" : -1,
        "blocked" : -1
      },
      "serverIPAddress" : "127.0.0.1",
      "comment" : "",
      "_katalonRequestInformation" : {
        "name" : "15",
        "testObjectId" : "Object Repository/VoPro/Account/api_admin_v1_users_userprofileid",
        "harId" : "e699dca4-b2ef-4a10-a5ab-d2022e4e9752"
      },
      "time" : 1827
    } ],
    "comment" : ""
  }
}