{
  "log" : {
    "version" : "1.2",
    "creator" : {
      "name" : "BrowserMob Proxy",
      "version" : "2.1.5",
      "comment" : ""
    },
    "pages" : [ {
      "id" : "Page 0",
      "startedDateTime" : "2019-03-28T20:42:19.958Z",
      "title" : "Page 0",
      "pageTimings" : {
        "onLoad" : 1291,
        "comment" : ""
      },
      "comment" : ""
    } ],
    "entries" : [ {
      "pageref" : "Page 0",
      "startedDateTime" : "2019-03-28T20:42:19.959Z",
      "request" : {
        "method" : "POST",
        "url" : "http://localhost:10520/WebAPI/api/admin/v1/users/?",
        "httpVersion" : "HTTP/1.1",
        "cookies" : [ ],
        "headers" : [ {
          "name" : "User-Agent",
          "value" : "Katalon Studio"
        }, {
          "name" : "Content-Type",
          "value" : "application/x-www-form-urlencoded"
        }, {
          "name" : "Authorization",
          "value" : "Bearer eyJ0eXAiOiJKV1QiLCJhbGciOiJIUzI1NiJ9.eyJ1bmlxdWVfbmFtZSI6ImFkbWluIiwicm9sZSI6InVzZXIiLCJzdWIiOiJhZG1pbiIsImlzcyI6IkNyb3BNZXRyaWNzIiwiYXVkIjoiYWxsIiwiZXhwIjoxNTUzODA5NjM5LCJuYmYiOjE1NTM4MDU3Mzl9.hyFLhPzOVdp-bUFEOpOSWOMiQXjhgYzwKcImdhFFAHA"
        }, {
          "name" : "Host",
          "value" : "localhost:10520"
        }, {
          "name" : "Accept",
          "value" : "text/html, image/gif, image/jpeg, *; q=.2, */*; q=.2"
        }, {
          "name" : "Proxy-Connection",
          "value" : "keep-alive"
        }, {
          "name" : "Content-Length",
          "value" : "288"
        } ],
        "queryString" : [ ],
        "postData" : {
          "mimeType" : "application/x-www-form-urlencoded",
          "params" : [ {
            "name" : "password",
            "value" : "cropmetrics",
            "comment" : ""
          }, {
            "name" : "email",
            "value" : "cropmetricsvo.townsymbols@gmail.com",
            "comment" : ""
          }, {
            "name" : "fullname",
            "value" : "x",
            "comment" : ""
          }, {
            "name" : "phone",
            "value" : "1",
            "comment" : ""
          }, {
            "name" : "dealer",
            "value" : "xx",
            "comment" : ""
          }, {
            "name" : "addressLine1",
            "value" : "address line 1 test validation",
            "comment" : ""
          }, {
            "name" : "addressLine2",
            "value" : "address line 2 test validation",
            "comment" : ""
          }, {
            "name" : "town",
            "value" : "!@#$%^&*",
            "comment" : ""
          }, {
            "name" : "state",
            "value" : "stateValidation",
            "comment" : ""
          }, {
            "name" : "zip",
            "value" : "zipValidation",
            "comment" : ""
          }, {
            "name" : "country",
            "value" : "countryValidation",
            "comment" : ""
          }, {
            "name" : "roles",
            "value" : "Client",
            "comment" : ""
          } ],
          "comment" : ""
        },
        "headersSize" : 544,
        "bodySize" : 288,
        "comment" : ""
      },
      "response" : {
        "status" : 200,
        "statusText" : "OK",
        "httpVersion" : "HTTP/1.1",
        "cookies" : [ {
          "name" : ".ASPROLES",
          "value" : "n5OsWavFsOVaEEhRMM69ZdmtLkCDkz2bIXbjNReZNGzgKa6aUxLFNDZYuEphB7bIFqb1j7sbh4kjATCAvXo8O5itCs-VZVVZ5PUT9wN2upqwm-jCgSMcyd-4WNtMtJDEEth-9YQR7tYOGOVq3ckSGjTbKRQCYxrrXATzcBX29cWskPLOw2jDJG5TdneXC32TQsONr260XWy9cbKWQ9v5F0oXiDq0fTgubaQFfCJ-_dXLweF0Fv-PhQLTJvsedxgF_mTO1-sVwbpC23tn8snc8Yj2iSGZ8rPh4tbnRrVwd3VJaHdaNBJGGC5i830y3iSzM0Cyjzkf4ZifZKRGDWwPm6yU9aJJNyl9xK0Itr1BSIxC6zBFrqmbZOnbmaMddByqmEk3u3Gacjcwqa9MT66cNrfq5G8AJNn76sZitAXkNe98iyOKkFYn0rDd8gYeirHPWIzVnNwQBRAb7hYLKqoLF3_wtayQcwWAcBZIpxp7r8_j9LIH0",
          "path" : "/",
          "httpOnly" : true,
          "secure" : false,
          "comment" : ""
        } ],
        "headers" : [ {
          "name" : "Cache-Control",
          "value" : "private"
        }, {
          "name" : "Content-Type",
          "value" : "application/json; charset=utf-8"
        }, {
          "name" : "Server",
          "value" : "Microsoft-IIS/10.0"
        }, {
          "name" : "Set-Cookie",
          "value" : ".ASPROLES=n5OsWavFsOVaEEhRMM69ZdmtLkCDkz2bIXbjNReZNGzgKa6aUxLFNDZYuEphB7bIFqb1j7sbh4kjATCAvXo8O5itCs-VZVVZ5PUT9wN2upqwm-jCgSMcyd-4WNtMtJDEEth-9YQR7tYOGOVq3ckSGjTbKRQCYxrrXATzcBX29cWskPLOw2jDJG5TdneXC32TQsONr260XWy9cbKWQ9v5F0oXiDq0fTgubaQFfCJ-_dXLweF0Fv-PhQLTJvsedxgF_mTO1-sVwbpC23tn8snc8Yj2iSGZ8rPh4tbnRrVwd3VJaHdaNBJGGC5i830y3iSzM0Cyjzkf4ZifZKRGDWwPm6yU9aJJNyl9xK0Itr1BSIxC6zBFrqmbZOnbmaMddByqmEk3u3Gacjcwqa9MT66cNrfq5G8AJNn76sZitAXkNe98iyOKkFYn0rDd8gYeirHPWIzVnNwQBRAb7hYLKqoLF3_wtayQcwWAcBZIpxp7r8_j9LIH0; path=/; HttpOnly"
        }, {
          "name" : "X-SourceFiles",
          "value" : "=?UTF-8?B?RDpcVmlydHVhbE9wdGltaXplci1SZWZhY3RvcmluZ1xDcm9wTWV0cmljcy5Wby5BcGlcQ3JvcE1ldHJpY3MuVm8uQXBpXGFwaVxhZG1pblx2MVx1c2Vyc1w=?="
        }, {
          "name" : "X-Powered-By",
          "value" : "ASP.NET"
        }, {
          "name" : "Date",
          "value" : "Thu, 28 Mar 2019 20:42:21 GMT"
        }, {
          "name" : "Content-Length",
          "value" : "9"
        } ],
        "content" : {
          "size" : 9,
          "mimeType" : "application/json; charset=utf-8",
          "text" : "{\"id\":27}",
          "comment" : ""
        },
        "redirectURL" : "",
        "headersSize" : 887,
        "bodySize" : 9,
        "comment" : ""
      },
      "cache" : { },
      "timings" : {
        "comment" : "",
        "ssl" : -1,
        "send" : 0,
        "receive" : 0,
        "wait" : 1288,
        "connect" : -1,
        "blocked" : -1,
        "dns" : -1
      },
      "serverIPAddress" : "127.0.0.1",
      "comment" : "",
      "_katalonRequestInformation" : {
        "name" : "73",
        "testObjectId" : "Object Repository/VoPro/Account/api_admin_v1_users",
        "harId" : "05432201-decb-4ccd-97ae-703e72c2b6b8"
      },
      "time" : 1289
    } ],
    "comment" : ""
  }
}