{
  "log" : {
    "version" : "1.2",
    "creator" : {
      "name" : "BrowserMob Proxy",
      "version" : "2.1.5",
      "comment" : ""
    },
    "pages" : [ {
      "id" : "Page 0",
      "startedDateTime" : "2019-04-04T18:52:42.532Z",
      "title" : "Page 0",
      "pageTimings" : {
        "onLoad" : 4594,
        "comment" : ""
      },
      "comment" : ""
    } ],
    "entries" : [ {
      "pageref" : "Page 0",
      "startedDateTime" : "2019-04-04T18:52:42.532Z",
      "request" : {
        "method" : "POST",
        "url" : "http://localhost:10520/WebAPI/api/mobile/v1/farms/?",
        "httpVersion" : "HTTP/1.1",
        "cookies" : [ ],
        "headers" : [ {
          "name" : "User-Agent",
          "value" : "Katalon Studio"
        }, {
          "name" : "Content-Type",
          "value" : "application/json"
        }, {
          "name" : "Authorization",
          "value" : "Bearer eyJ0eXAiOiJKV1QiLCJhbGciOiJIUzI1NiJ9.eyJ1bmlxdWVfbmFtZSI6Implbm55Lm1hbGRvbmFkby50eEBnbWFpbC5jb20iLCJyb2xlIjoidXNlciIsInN1YiI6Implbm55Lm1hbGRvbmFkby50eEBnbWFpbC5jb20iLCJpc3MiOiJDcm9wTWV0cmljcyIsImF1ZCI6ImFsbCIsImV4cCI6MTU1NDQwNzg2MiwibmJmIjoxNTU0NDAzOTYyfQ.9K0ruFAi9YAFm4RqkxpyFnh2yn7TevpQjoDSnXQsYC8"
        }, {
          "name" : "Host",
          "value" : "localhost:10520"
        }, {
          "name" : "Accept",
          "value" : "text/html, image/gif, image/jpeg, *; q=.2, */*; q=.2"
        }, {
          "name" : "Proxy-Connection",
          "value" : "keep-alive"
        }, {
          "name" : "Content-Length",
          "value" : "76"
        } ],
        "queryString" : [ ],
        "postData" : {
          "mimeType" : "application/json",
          "text" : "{\"name\": \"New Farm with userID different of the user token\", \"user_id\": \"4\"}",
          "comment" : ""
        },
        "headersSize" : 589,
        "bodySize" : 76,
        "comment" : ""
      },
      "response" : {
        "status" : 400,
        "statusText" : "Bad Request",
        "httpVersion" : "HTTP/1.1",
        "cookies" : [ {
          "name" : ".ASPROLES",
          "value" : "rkVv8mJBjGSpK8rcLV8AxAJMILn0M3Dh8hABSVVDSgAVgQ9E595Ewl7qoqcDmLnBxZn6zc6WcFNibefw3MpKP37JGYG4uMmEfNwb5UGgOF1d5GRdNvQkLe0fLuETTpnapvcG0sU-7KZ0wXFpTIn4mJTJEDotmkeClWnSfvFalvQxFUcKRfli3AtCmzA1B3544IkvA5BTXkiMmDOSkJZQiVI5DKa_vXd0PJ_gd4SbILRCHfd708ZCd4cwnRf9I1y2qEi-sGIDM959qBPPLMFEHqiNhXoPScs4TxjedP81WhgbVoVKTZR-VqGRg-G-UDJ6TFZ3glFQn-Ymt5rKnN498CGkmWftT2LQWL17cBbKxgOjGVNhP_zBzpOOFR0lmPnnL6qYNcrADejQ-SUlAHS21gcmRbcAHASja_Qs466xgcsTpZJXYrOuZap_XfM8P3DohffzjRPO1a1qBoLHnYawuVg-PsKqE2zquHBSw1827Y1ShDZkQC-d5efGHxnLpteG8qd3cA2",
          "path" : "/",
          "httpOnly" : true,
          "secure" : false,
          "comment" : ""
        } ],
        "headers" : [ {
          "name" : "Cache-Control",
          "value" : "private"
        }, {
          "name" : "Content-Type",
          "value" : "application/json; charset=utf-8"
        }, {
          "name" : "Server",
          "value" : "Microsoft-IIS/10.0"
        }, {
          "name" : "Set-Cookie",
          "value" : ".ASPROLES=rkVv8mJBjGSpK8rcLV8AxAJMILn0M3Dh8hABSVVDSgAVgQ9E595Ewl7qoqcDmLnBxZn6zc6WcFNibefw3MpKP37JGYG4uMmEfNwb5UGgOF1d5GRdNvQkLe0fLuETTpnapvcG0sU-7KZ0wXFpTIn4mJTJEDotmkeClWnSfvFalvQxFUcKRfli3AtCmzA1B3544IkvA5BTXkiMmDOSkJZQiVI5DKa_vXd0PJ_gd4SbILRCHfd708ZCd4cwnRf9I1y2qEi-sGIDM959qBPPLMFEHqiNhXoPScs4TxjedP81WhgbVoVKTZR-VqGRg-G-UDJ6TFZ3glFQn-Ymt5rKnN498CGkmWftT2LQWL17cBbKxgOjGVNhP_zBzpOOFR0lmPnnL6qYNcrADejQ-SUlAHS21gcmRbcAHASja_Qs466xgcsTpZJXYrOuZap_XfM8P3DohffzjRPO1a1qBoLHnYawuVg-PsKqE2zquHBSw1827Y1ShDZkQC-d5efGHxnLpteG8qd3cA2; path=/; HttpOnly"
        }, {
          "name" : "X-SourceFiles",
          "value" : "=?UTF-8?B?RDpcVmlydHVhbE9wdGltaXplci1SZWZhY3RvcmluZ1xDcm9wTWV0cmljcy5Wby5BcGlcQ3JvcE1ldHJpY3MuVm8uQXBpXGFwaVxtb2JpbGVcdjFcZmFybXNc?="
        }, {
          "name" : "X-Powered-By",
          "value" : "ASP.NET"
        }, {
          "name" : "Date",
          "value" : "Thu, 04 Apr 2019 18:52:47 GMT"
        }, {
          "name" : "Content-Length",
          "value" : "57"
        } ],
        "content" : {
          "size" : 57,
          "mimeType" : "application/json; charset=utf-8",
          "text" : "{\"message\":\"The request is not valid for a grower role.\"}",
          "comment" : ""
        },
        "redirectURL" : "",
        "headersSize" : 919,
        "bodySize" : 57,
        "comment" : ""
      },
      "cache" : { },
      "timings" : {
        "comment" : "",
        "receive" : 0,
        "wait" : 4582,
        "send" : 0,
        "blocked" : -1,
        "connect" : -1,
        "dns" : -1,
        "ssl" : -1
      },
      "serverIPAddress" : "127.0.0.1",
      "comment" : "",
      "_katalonRequestInformation" : {
        "name" : "51",
        "testObjectId" : "Object Repository/VoGrow/Farm/FarmPost",
        "harId" : "1a5d4f39-7a97-4790-9577-1356fd5760c3"
      },
      "time" : 4583
    } ],
    "comment" : ""
  }
}