{
  "log" : {
    "version" : "1.2",
    "creator" : {
      "name" : "BrowserMob Proxy",
      "version" : "2.1.5",
      "comment" : ""
    },
    "pages" : [ {
      "id" : "Page 0",
      "startedDateTime" : "2019-03-27T19:35:07.046Z",
      "title" : "Page 0",
      "pageTimings" : {
        "onLoad" : 1290,
        "comment" : ""
      },
      "comment" : ""
    } ],
    "entries" : [ {
      "pageref" : "Page 0",
      "startedDateTime" : "2019-03-27T19:35:07.046Z",
      "request" : {
        "method" : "POST",
        "url" : "http://localhost:10520/WebAPI/api/Account/AdministrativeRegister/?",
        "httpVersion" : "HTTP/1.1",
        "cookies" : [ ],
        "headers" : [ {
          "name" : "User-Agent",
          "value" : "Katalon Studio"
        }, {
          "name" : "Content-Type",
          "value" : "application/x-www-form-urlencoded"
        }, {
          "name" : "Authorization",
          "value" : "Bearer eyJ0eXAiOiJKV1QiLCJhbGciOiJIUzI1NiJ9.eyJ1bmlxdWVfbmFtZSI6ImFkbWluIiwicm9sZSI6InVzZXIiLCJzdWIiOiJhZG1pbiIsImlzcyI6IkNyb3BNZXRyaWNzIiwiYXVkIjoiYWxsIiwiZXhwIjoxNTUzNzE5MjA3LCJuYmYiOjE1NTM3MTUzMDd9.WhGVDAHFeDhXNn5diYKMVyPlvXkeLbDIpYpMuKFQ8d0"
        }, {
          "name" : "Host",
          "value" : "localhost:10520"
        }, {
          "name" : "Accept",
          "value" : "text/html, image/gif, image/jpeg, *; q=.2, */*; q=.2"
        }, {
          "name" : "Proxy-Connection",
          "value" : "keep-alive"
        }, {
          "name" : "Content-Length",
          "value" : "370"
        } ],
        "queryString" : [ ],
        "postData" : {
          "mimeType" : "application/x-www-form-urlencoded",
          "params" : [ {
            "name" : "username",
            "value" : "kusertownsymbols",
            "comment" : ""
          }, {
            "name" : "password",
            "value" : "cropmetrics",
            "comment" : ""
          }, {
            "name" : "confirmPassword",
            "value" : "cropmetrics",
            "comment" : ""
          }, {
            "name" : "email",
            "value" : "cropmetricsvo@gmail.com",
            "comment" : ""
          }, {
            "name" : "fullname",
            "value" : "x",
            "comment" : ""
          }, {
            "name" : "phone",
            "value" : "1",
            "comment" : ""
          }, {
            "name" : "dealer",
            "value" : "xx",
            "comment" : ""
          }, {
            "name" : "addressLine1",
            "value" : "address line 1 test validation",
            "comment" : ""
          }, {
            "name" : "addressLine2",
            "value" : "address line 2 test validation",
            "comment" : ""
          }, {
            "name" : "town",
            "value" : "!@#$%^&*",
            "comment" : ""
          }, {
            "name" : "state",
            "value" : "stateValidation",
            "comment" : ""
          }, {
            "name" : "zip",
            "value" : "zipValidation",
            "comment" : ""
          }, {
            "name" : "country",
            "value" : "countryValidation",
            "comment" : ""
          }, {
            "name" : "roles",
            "value" : "Client",
            "comment" : ""
          }, {
            "name" : "modifierUsername",
            "value" : "admin",
            "comment" : ""
          }, {
            "name" : "modifierUserId",
            "value" : "1",
            "comment" : ""
          } ],
          "comment" : ""
        },
        "headersSize" : 560,
        "bodySize" : 370,
        "comment" : ""
      },
      "response" : {
        "status" : 200,
        "statusText" : "OK",
        "httpVersion" : "HTTP/1.1",
        "cookies" : [ {
          "name" : ".ASPROLES",
          "value" : "ivect9ebn75jM7MOYniaoMwWBWkCAKD0k5Ek1UZfUp3Mx8hNJ3X4Y1fB-ZuyV7307Y-fazXhNyffN9kxeTawR-MhMd64G2mUin-7AqavCc0JFqwYbxn78SWgPLTj_zhNI1yJ3kUBILa9TPBt1kIf3FW1DH8-QA27GIi_4hLeJn1n5lYOfEmpkfOR8HnoNniSWVagE_-hTcwwcIqlD_ltwX2zWytlCdHdoW9kBQBsXYHDVi50-b7zRMtzUFOfL9aqsA3jnikOT4MGeQ4cgWyD_Prp821BcevNYNziTwReXiDl7fyzg9mxiQLJDpojVnBaV1QqTDxYByNt93TlgbqE9_U1qmRR9YbAEcIZxB8bNvFuQqjNljnD3YONDMy_gtjclbMgpk_Dj88LbbTvjUhAkZfhci69ox8h78F10OdKN3ybSxxn99wVMPDN-r4a_kDpVT5ur6S55wNmNRWe2CMheUntR5Vlvu1HuLOgXQVrocvXECah0",
          "path" : "/",
          "httpOnly" : true,
          "secure" : false,
          "comment" : ""
        } ],
        "headers" : [ {
          "name" : "Cache-Control",
          "value" : "private"
        }, {
          "name" : "Content-Type",
          "value" : "application/json; charset=utf-8"
        }, {
          "name" : "Server",
          "value" : "Microsoft-IIS/10.0"
        }, {
          "name" : "Set-Cookie",
          "value" : ".ASPROLES=ivect9ebn75jM7MOYniaoMwWBWkCAKD0k5Ek1UZfUp3Mx8hNJ3X4Y1fB-ZuyV7307Y-fazXhNyffN9kxeTawR-MhMd64G2mUin-7AqavCc0JFqwYbxn78SWgPLTj_zhNI1yJ3kUBILa9TPBt1kIf3FW1DH8-QA27GIi_4hLeJn1n5lYOfEmpkfOR8HnoNniSWVagE_-hTcwwcIqlD_ltwX2zWytlCdHdoW9kBQBsXYHDVi50-b7zRMtzUFOfL9aqsA3jnikOT4MGeQ4cgWyD_Prp821BcevNYNziTwReXiDl7fyzg9mxiQLJDpojVnBaV1QqTDxYByNt93TlgbqE9_U1qmRR9YbAEcIZxB8bNvFuQqjNljnD3YONDMy_gtjclbMgpk_Dj88LbbTvjUhAkZfhci69ox8h78F10OdKN3ybSxxn99wVMPDN-r4a_kDpVT5ur6S55wNmNRWe2CMheUntR5Vlvu1HuLOgXQVrocvXECah0; path=/; HttpOnly"
        }, {
          "name" : "X-SourceFiles",
          "value" : "=?UTF-8?B?RDpcVmlydHVhbE9wdGltaXplci1SZWZhY3RvcmluZ1xDcm9wTWV0cmljcy5Wby5BcGlcQ3JvcE1ldHJpY3MuVm8uQXBpXGFwaVxBY2NvdW50XEFkbWluaXN0cmF0aXZlUmVnaXN0ZXJc?="
        }, {
          "name" : "X-Powered-By",
          "value" : "ASP.NET"
        }, {
          "name" : "Date",
          "value" : "Wed, 27 Mar 2019 19:35:08 GMT"
        }, {
          "name" : "Content-Length",
          "value" : "9"
        } ],
        "content" : {
          "size" : 9,
          "mimeType" : "application/json; charset=utf-8",
          "text" : "{\"id\":26}",
          "comment" : ""
        },
        "redirectURL" : "",
        "headersSize" : 907,
        "bodySize" : 9,
        "comment" : ""
      },
      "cache" : { },
      "timings" : {
        "comment" : "",
        "ssl" : -1,
        "dns" : -1,
        "receive" : 0,
        "blocked" : -1,
        "wait" : 1287,
        "send" : 0,
        "connect" : -1
      },
      "serverIPAddress" : "127.0.0.1",
      "comment" : "",
      "_katalonRequestInformation" : {
        "name" : "63",
        "testObjectId" : "Object Repository/VoPro/Account/AdministrativeRegister",
        "harId" : "6bbf8428-aa7d-43ee-9c70-1dae617a0d10"
      },
      "time" : 1288
    } ],
    "comment" : ""
  }
}