{
  "log" : {
    "version" : "1.2",
    "creator" : {
      "name" : "BrowserMob Proxy",
      "version" : "2.1.5",
      "comment" : ""
    },
    "pages" : [ {
      "id" : "Page 0",
      "startedDateTime" : "2019-04-09T09:50:04.723Z",
      "title" : "Page 0",
      "pageTimings" : {
        "onLoad" : 3746,
        "comment" : ""
      },
      "comment" : ""
    } ],
    "entries" : [ {
      "pageref" : "Page 0",
      "startedDateTime" : "2019-04-09T09:50:04.724Z",
      "request" : {
        "method" : "PUT",
        "url" : "http://localhost:10520/WebAPI/api/mobile/v1/fields/1?",
        "httpVersion" : "HTTP/1.1",
        "cookies" : [ ],
        "headers" : [ {
          "name" : "User-Agent",
          "value" : "Katalon Studio"
        }, {
          "name" : "Content-Type",
          "value" : "application/json"
        }, {
          "name" : "Authorization",
          "value" : "Bearer eyJ0eXAiOiJKV1QiLCJhbGciOiJIUzI1NiJ9.eyJ1bmlxdWVfbmFtZSI6Implbm55Lm1hbGRvbmFkby50eDFAZ21haWwuY29tIiwicm9sZSI6InVzZXIiLCJzdWIiOiJqZW5ueS5tYWxkb25hZG8udHgxQGdtYWlsLmNvbSIsImlzcyI6IkNyb3BNZXRyaWNzIiwiYXVkIjoiYWxsIiwiZXhwIjoxNTU0ODA3MzA0LCJuYmYiOjE1NTQ4MDM0MDR9.LLObuExqXRoLZLlElSODUw2rhYxIagnhkkO5RKx7lqs"
        }, {
          "name" : "Host",
          "value" : "localhost:10520"
        }, {
          "name" : "Accept",
          "value" : "text/html, image/gif, image/jpeg, *; q=.2, */*; q=.2"
        }, {
          "name" : "Proxy-Connection",
          "value" : "keep-alive"
        }, {
          "name" : "Content-Length",
          "value" : "397"
        } ],
        "queryString" : [ ],
        "postData" : {
          "mimeType" : "application/json",
          "text" : "{\"field\":{\"name\":\"Field updated by agent not assigned\",\"boundary\":{\"boundaries\":[{\"boundary\":{\"coords\":[{\"x\":-101.49568751,\"y\":37.14976293},{\"x\":-101.50049403,\"y\":37.14647907},{\"x\":-101.50049403,\"y\":37.14264773},{\"x\":-101.49723246,\"y\":37.1411425},{\"x\":-101.49019435,\"y\":37.14223722},{\"x\":-101.48933604,\"y\":37.14620541},{\"x\":-101.49294093,\"y\":37.14866833},{\"x\":-101.49568751,\"y\":37.14976293}]}}]}}}",
          "comment" : ""
        },
        "headersSize" : 593,
        "bodySize" : 397,
        "comment" : ""
      },
      "response" : {
        "status" : 400,
        "statusText" : "Bad Request",
        "httpVersion" : "HTTP/1.1",
        "cookies" : [ {
          "name" : ".ASPROLES",
          "value" : "-cT8WC7uTC86b8NRolxrDVFkrYfQ7F84Qs3N0-pPudSjVswRcFuT0qQQOlnNFtufIvGUV7beA0eX9m-3u1bipuNkE8TQFuILoByCM8Tq7_dDncE4K4kilyjlk8nuBysFy92Vi_tUAScw-bjoxHFkwOO9-lrXyQ8XuiplD3fFEoc1-GCfEG9dSTgIrR6GBcWnAQiaiWb7G8BJ2WI7WKTHElJlQlpArUlHlyOz79XMy7jWC5pWqMfpOByIrZVv4_KG8TYYrSIKcPEcewx15lqa2K6Zd_W3tx7Y9boqSdzDzDvApoJVfEPBu1VM3zd7K3yySzhFDmmJvPiv0uSIGCOIl_SUD-iMvh0JVQHKjOX67uW15psxUSz0MgNTRhoWtU29cnus38zqapFVHgSqbooxD-1hMo6Q3uzENydZcDRIzae7P4lgwVAsbmyQKbph9DLdwHYTiw-FRv1HAOWOEMyeSBuSVBIAeYvlcFYtyJGS74bF7T14OOI8TF4NdmAUqQ6K-O-F-vXa2tYBROX8U1g2bu47c0o1",
          "path" : "/",
          "httpOnly" : true,
          "secure" : false,
          "comment" : ""
        } ],
        "headers" : [ {
          "name" : "Cache-Control",
          "value" : "private"
        }, {
          "name" : "Content-Type",
          "value" : "application/json; charset=utf-8"
        }, {
          "name" : "Server",
          "value" : "Microsoft-IIS/10.0"
        }, {
          "name" : "Set-Cookie",
          "value" : ".ASPROLES=-cT8WC7uTC86b8NRolxrDVFkrYfQ7F84Qs3N0-pPudSjVswRcFuT0qQQOlnNFtufIvGUV7beA0eX9m-3u1bipuNkE8TQFuILoByCM8Tq7_dDncE4K4kilyjlk8nuBysFy92Vi_tUAScw-bjoxHFkwOO9-lrXyQ8XuiplD3fFEoc1-GCfEG9dSTgIrR6GBcWnAQiaiWb7G8BJ2WI7WKTHElJlQlpArUlHlyOz79XMy7jWC5pWqMfpOByIrZVv4_KG8TYYrSIKcPEcewx15lqa2K6Zd_W3tx7Y9boqSdzDzDvApoJVfEPBu1VM3zd7K3yySzhFDmmJvPiv0uSIGCOIl_SUD-iMvh0JVQHKjOX67uW15psxUSz0MgNTRhoWtU29cnus38zqapFVHgSqbooxD-1hMo6Q3uzENydZcDRIzae7P4lgwVAsbmyQKbph9DLdwHYTiw-FRv1HAOWOEMyeSBuSVBIAeYvlcFYtyJGS74bF7T14OOI8TF4NdmAUqQ6K-O-F-vXa2tYBROX8U1g2bu47c0o1; path=/; HttpOnly"
        }, {
          "name" : "X-SourceFiles",
          "value" : "=?UTF-8?B?RDpcVmlydHVhbE9wdGltaXplci1SZWZhY3RvcmluZ1xDcm9wTWV0cmljcy5Wby5BcGlcQ3JvcE1ldHJpY3MuVm8uQXBpXGFwaVxtb2JpbGVcdjFcZmllbGRzXDE=?="
        }, {
          "name" : "X-Powered-By",
          "value" : "ASP.NET"
        }, {
          "name" : "Date",
          "value" : "Tue, 09 Apr 2019 09:50:08 GMT"
        }, {
          "name" : "Content-Length",
          "value" : "82"
        } ],
        "content" : {
          "size" : 82,
          "mimeType" : "application/json; charset=utf-8",
          "text" : "{\"message\":\"The modifier doesn't have permissions to modify the field requested.\"}",
          "comment" : ""
        },
        "redirectURL" : "",
        "headersSize" : 944,
        "bodySize" : 82,
        "comment" : ""
      },
      "cache" : { },
      "timings" : {
        "comment" : "",
        "ssl" : -1,
        "connect" : -1,
        "blocked" : -1,
        "dns" : -1,
        "send" : 1,
        "receive" : 3,
        "wait" : 3736
      },
      "serverIPAddress" : "127.0.0.1",
      "comment" : "",
      "_katalonRequestInformation" : {
        "name" : "5",
        "testObjectId" : "Object Repository/VoGrow/Field/FieldPut",
        "harId" : "c26edd68-a0b9-4c33-9185-e6d37e4fbdcf"
      },
      "time" : 3741
    } ],
    "comment" : ""
  }
}