{
  "log" : {
    "version" : "1.2",
    "creator" : {
      "name" : "BrowserMob Proxy",
      "version" : "2.1.5",
      "comment" : ""
    },
    "pages" : [ {
      "id" : "Page 0",
      "startedDateTime" : "2019-03-28T20:42:56.096Z",
      "title" : "Page 0",
      "pageTimings" : {
        "onLoad" : 24,
        "comment" : ""
      },
      "comment" : ""
    } ],
    "entries" : [ {
      "pageref" : "Page 0",
      "startedDateTime" : "2019-03-28T20:42:56.097Z",
      "request" : {
        "method" : "POST",
        "url" : "http://localhost:10520/WebAPI/api/admin/v1/users/?",
        "httpVersion" : "HTTP/1.1",
        "cookies" : [ ],
        "headers" : [ {
          "name" : "User-Agent",
          "value" : "Katalon Studio"
        }, {
          "name" : "Content-Type",
          "value" : "application/x-www-form-urlencoded"
        }, {
          "name" : "Authorization",
          "value" : "Bearer eyJ0eXAiOiJKV1QiLCJhbGciOiJIUzI1NiJ9.eyJ1bmlxdWVfbmFtZSI6ImNyb3BtZXRyaWNzdm8uY2xpZW50QGdtYWlsLmNvbSIsInJvbGUiOiJ1c2VyIiwic3ViIjoiY3JvcG1ldHJpY3N2by5jbGllbnRAZ21haWwuY29tIiwiaXNzIjoiQ3JvcE1ldHJpY3MiLCJhdWQiOiJhbGwiLCJleHAiOjE1NTM4MDk2NzYsIm5iZiI6MTU1MzgwNTc3Nn0.Y7mZZHl_JwZS4MzlkWfLojP7OFbEL_3ciQ-4WE7K7fU"
        }, {
          "name" : "Host",
          "value" : "localhost:10520"
        }, {
          "name" : "Accept",
          "value" : "text/html, image/gif, image/jpeg, *; q=.2, */*; q=.2"
        }, {
          "name" : "Proxy-Connection",
          "value" : "keep-alive"
        }, {
          "name" : "Content-Length",
          "value" : "272"
        } ],
        "queryString" : [ ],
        "postData" : {
          "mimeType" : "application/x-www-form-urlencoded",
          "params" : [ {
            "name" : "password",
            "value" : "cropmetrics",
            "comment" : ""
          }, {
            "name" : "email",
            "value" : "cropmetricsvo.clientbyclient@gmail.com",
            "comment" : ""
          }, {
            "name" : "fullname",
            "value" : "test validation",
            "comment" : ""
          }, {
            "name" : "phone",
            "value" : "123",
            "comment" : ""
          }, {
            "name" : "dealer",
            "value" : "x",
            "comment" : ""
          }, {
            "name" : "addressLine1",
            "value" : "address line 1 test validation",
            "comment" : ""
          }, {
            "name" : "addressLine2",
            "value" : "address line 2 test validation",
            "comment" : ""
          }, {
            "name" : "town",
            "value" : "townValidation",
            "comment" : ""
          }, {
            "name" : "state",
            "value" : "stateValidation",
            "comment" : ""
          }, {
            "name" : "zip",
            "value" : "xx",
            "comment" : ""
          }, {
            "name" : "country",
            "value" : "xx",
            "comment" : ""
          }, {
            "name" : "roles",
            "value" : "Client",
            "comment" : ""
          } ],
          "comment" : ""
        },
        "headersSize" : 611,
        "bodySize" : 272,
        "comment" : ""
      },
      "response" : {
        "status" : 401,
        "statusText" : "Unauthorized",
        "httpVersion" : "HTTP/1.1",
        "cookies" : [ {
          "name" : ".ASPROLES",
          "value" : "Zs6tCNg5Hoq2c_f6gW3dkql-WBVHHp0gH7IyAVXmUFLWgHe8PW9t6P-AjoDZZdSI5yXNQ4Ufglmxhb2CMo0YCm9P3vmXKQmT4QDOCLgxr3638dYOCSFDsF2PPFhM9hwtUHFg3Op2hPVE8xJrsitzSB0P2AGX3PuXsbFN-R7TjkYTgJIMWmfH-wiVYFhATQZ4_SxeuU108-StfGwp_tkPLdKs4uKrSWXC_Pw554-Bx7Uzz6oltn0BD-oj3IhgkIggU8iRZgx2vUb8VVJGpGcJ3FohZIyTRbdftvx95WmYmu4snFbymKJJoM_HuhWmSOytVjeIaVPUTF4ySaGXs5AX6xuoGNRs9mTfT-DRag5atjvdFunC8Af4mJ70qaDzc-tu9xyvLm5v5Q0hSAyBu06nPCd6wXsCLx8B89whn2BJ-lIyzNZxrGfm4uML16rNbkmXla_PGNUdmqxbwpMmSdqq6-ageOzCoEz1iVejP9CCuqFY44Dk9gKF04E5N7aenR4-3KP67g2",
          "path" : "/",
          "httpOnly" : true,
          "secure" : false,
          "comment" : ""
        } ],
        "headers" : [ {
          "name" : "Cache-Control",
          "value" : "private"
        }, {
          "name" : "Content-Type",
          "value" : "application/json; charset=utf-8"
        }, {
          "name" : "Server",
          "value" : "Microsoft-IIS/10.0"
        }, {
          "name" : "Set-Cookie",
          "value" : ".ASPROLES=Zs6tCNg5Hoq2c_f6gW3dkql-WBVHHp0gH7IyAVXmUFLWgHe8PW9t6P-AjoDZZdSI5yXNQ4Ufglmxhb2CMo0YCm9P3vmXKQmT4QDOCLgxr3638dYOCSFDsF2PPFhM9hwtUHFg3Op2hPVE8xJrsitzSB0P2AGX3PuXsbFN-R7TjkYTgJIMWmfH-wiVYFhATQZ4_SxeuU108-StfGwp_tkPLdKs4uKrSWXC_Pw554-Bx7Uzz6oltn0BD-oj3IhgkIggU8iRZgx2vUb8VVJGpGcJ3FohZIyTRbdftvx95WmYmu4snFbymKJJoM_HuhWmSOytVjeIaVPUTF4ySaGXs5AX6xuoGNRs9mTfT-DRag5atjvdFunC8Af4mJ70qaDzc-tu9xyvLm5v5Q0hSAyBu06nPCd6wXsCLx8B89whn2BJ-lIyzNZxrGfm4uML16rNbkmXla_PGNUdmqxbwpMmSdqq6-ageOzCoEz1iVejP9CCuqFY44Dk9gKF04E5N7aenR4-3KP67g2; path=/; HttpOnly"
        }, {
          "name" : "X-SourceFiles",
          "value" : "=?UTF-8?B?RDpcVmlydHVhbE9wdGltaXplci1SZWZhY3RvcmluZ1xDcm9wTWV0cmljcy5Wby5BcGlcQ3JvcE1ldHJpY3MuVm8uQXBpXGFwaVxhZG1pblx2MVx1c2Vyc1w=?="
        }, {
          "name" : "X-Powered-By",
          "value" : "ASP.NET"
        }, {
          "name" : "Date",
          "value" : "Thu, 28 Mar 2019 20:42:56 GMT"
        }, {
          "name" : "Content-Length",
          "value" : "61"
        } ],
        "content" : {
          "size" : 61,
          "mimeType" : "application/json; charset=utf-8",
          "text" : "{\"message\":\"Authorization has been denied for this request.\"}",
          "comment" : ""
        },
        "redirectURL" : "",
        "headersSize" : 920,
        "bodySize" : 61,
        "comment" : ""
      },
      "cache" : { },
      "timings" : {
        "comment" : "",
        "ssl" : -1,
        "send" : 0,
        "receive" : 0,
        "wait" : 17,
        "connect" : -1,
        "blocked" : -1,
        "dns" : -1
      },
      "serverIPAddress" : "127.0.0.1",
      "comment" : "",
      "_katalonRequestInformation" : {
        "name" : "119",
        "testObjectId" : "Object Repository/VoPro/Account/api_admin_v1_users",
        "harId" : "b7cb114d-c8ba-445d-ad65-05a69aa9f873"
      },
      "time" : 18
    } ],
    "comment" : ""
  }
}