{
  "log" : {
    "version" : "1.2",
    "creator" : {
      "name" : "BrowserMob Proxy",
      "version" : "2.1.5",
      "comment" : ""
    },
    "pages" : [ {
      "id" : "Page 0",
      "startedDateTime" : "2019-03-29T19:39:44.412Z",
      "title" : "Page 0",
      "pageTimings" : {
        "onLoad" : 2040,
        "comment" : ""
      },
      "comment" : ""
    } ],
    "entries" : [ {
      "pageref" : "Page 0",
      "startedDateTime" : "2019-03-29T19:39:44.414Z",
      "request" : {
        "method" : "POST",
        "url" : "http://localhost:10520/WebAPI/api/admin/v1/users/?",
        "httpVersion" : "HTTP/1.1",
        "cookies" : [ ],
        "headers" : [ {
          "name" : "User-Agent",
          "value" : "Katalon Studio"
        }, {
          "name" : "Content-Type",
          "value" : "application/x-www-form-urlencoded"
        }, {
          "name" : "Authorization",
          "value" : "Bearer eyJ0eXAiOiJKV1QiLCJhbGciOiJIUzI1NiJ9.eyJ1bmlxdWVfbmFtZSI6ImFkbWluIiwicm9sZSI6InVzZXIiLCJzdWIiOiJhZG1pbiIsImlzcyI6IkNyb3BNZXRyaWNzIiwiYXVkIjoiYWxsIiwiZXhwIjoxNTUzODkyMjg0LCJuYmYiOjE1NTM4ODgzODR9.NusTTD4D7Jtq3ssJwyaJYuuJf_eY8Z550j_3iLd45YU"
        }, {
          "name" : "Host",
          "value" : "localhost:10520"
        }, {
          "name" : "Accept",
          "value" : "text/html, image/gif, image/jpeg, *; q=.2, */*; q=.2"
        }, {
          "name" : "Proxy-Connection",
          "value" : "keep-alive"
        }, {
          "name" : "Content-Length",
          "value" : "306"
        } ],
        "queryString" : [ ],
        "postData" : {
          "mimeType" : "application/x-www-form-urlencoded",
          "params" : [ {
            "name" : "password",
            "value" : "!@#$%^",
            "comment" : ""
          }, {
            "name" : "email",
            "value" : "cropmetricsvo.passwithsymbols@gmail.com",
            "comment" : ""
          }, {
            "name" : "fullname",
            "value" : "test validation",
            "comment" : ""
          }, {
            "name" : "phone",
            "value" : "123",
            "comment" : ""
          }, {
            "name" : "dealer",
            "value" : "x",
            "comment" : ""
          }, {
            "name" : "addressLine1",
            "value" : "address line 1 test validation",
            "comment" : ""
          }, {
            "name" : "addressLine2",
            "value" : "address line 2 test validation",
            "comment" : ""
          }, {
            "name" : "town",
            "value" : "townValidation",
            "comment" : ""
          }, {
            "name" : "state",
            "value" : "stateValidation",
            "comment" : ""
          }, {
            "name" : "zip",
            "value" : "zipValidation",
            "comment" : ""
          }, {
            "name" : "country",
            "value" : "countryValidation",
            "comment" : ""
          }, {
            "name" : "roles",
            "value" : "Client",
            "comment" : ""
          } ],
          "comment" : ""
        },
        "headersSize" : 544,
        "bodySize" : 306,
        "comment" : ""
      },
      "response" : {
        "status" : 200,
        "statusText" : "OK",
        "httpVersion" : "HTTP/1.1",
        "cookies" : [ {
          "name" : ".ASPROLES",
          "value" : "B1icggx14aWcQ6u_S0o_NEHqhwBlordBNFGVQy4PkPNGJ9EktfI4837kdhXflLQjTAzAfB37j_R5sLhFmGYYcLzUXcQrjpBeoc3a-j3es3cf9K2wtJTn0pV8dJbeCZx629AMFC6j1ragrXHvkaGkhpdfu9ZxKHFsvuvCOBCBI4VU_7qdG1fJvValpk0CNzR3_3QsUWn-wLbeoLMw8Sw0acsfINxmVz6bQ5gopj4OqJQdUlVdBP_g40nhaJarNCIrP-UGmVEUulIfC9MWM2FQSeGvnPHXtpCt_AZ58nW2l06VzH97OA9tVHQYhV-273rzXaw0ogxuBB4soY8btLRh0-_xR25EpmykmDu97-ZcaYQQj2Bv4Lw1ntkPcea3pIB9Sw-7hYBR6X7Wghzj9-Mywz73FA28wIRuujP-Mev0Ih5NzqLPq7uFkqFMbXSUQKp34uwc9-oeBO9eZYBnVKyPMfObq1Hmn3GKJ3haAQDL0KEtFIeH0",
          "path" : "/",
          "httpOnly" : true,
          "secure" : false,
          "comment" : ""
        } ],
        "headers" : [ {
          "name" : "Cache-Control",
          "value" : "private"
        }, {
          "name" : "Content-Type",
          "value" : "application/json; charset=utf-8"
        }, {
          "name" : "Server",
          "value" : "Microsoft-IIS/10.0"
        }, {
          "name" : "Set-Cookie",
          "value" : ".ASPROLES=B1icggx14aWcQ6u_S0o_NEHqhwBlordBNFGVQy4PkPNGJ9EktfI4837kdhXflLQjTAzAfB37j_R5sLhFmGYYcLzUXcQrjpBeoc3a-j3es3cf9K2wtJTn0pV8dJbeCZx629AMFC6j1ragrXHvkaGkhpdfu9ZxKHFsvuvCOBCBI4VU_7qdG1fJvValpk0CNzR3_3QsUWn-wLbeoLMw8Sw0acsfINxmVz6bQ5gopj4OqJQdUlVdBP_g40nhaJarNCIrP-UGmVEUulIfC9MWM2FQSeGvnPHXtpCt_AZ58nW2l06VzH97OA9tVHQYhV-273rzXaw0ogxuBB4soY8btLRh0-_xR25EpmykmDu97-ZcaYQQj2Bv4Lw1ntkPcea3pIB9Sw-7hYBR6X7Wghzj9-Mywz73FA28wIRuujP-Mev0Ih5NzqLPq7uFkqFMbXSUQKp34uwc9-oeBO9eZYBnVKyPMfObq1Hmn3GKJ3haAQDL0KEtFIeH0; path=/; HttpOnly"
        }, {
          "name" : "X-SourceFiles",
          "value" : "=?UTF-8?B?RDpcVmlydHVhbE9wdGltaXplci1SZWZhY3RvcmluZ1xDcm9wTWV0cmljcy5Wby5BcGlcQ3JvcE1ldHJpY3MuVm8uQXBpXGFwaVxhZG1pblx2MVx1c2Vyc1w=?="
        }, {
          "name" : "X-Powered-By",
          "value" : "ASP.NET"
        }, {
          "name" : "Date",
          "value" : "Fri, 29 Mar 2019 19:39:46 GMT"
        }, {
          "name" : "Content-Length",
          "value" : "9"
        } ],
        "content" : {
          "size" : 9,
          "mimeType" : "application/json; charset=utf-8",
          "text" : "{\"id\":14}",
          "comment" : ""
        },
        "redirectURL" : "",
        "headersSize" : 887,
        "bodySize" : 9,
        "comment" : ""
      },
      "cache" : { },
      "timings" : {
        "comment" : "",
        "ssl" : -1,
        "send" : 0,
        "receive" : 0,
        "wait" : 2035,
        "connect" : -1,
        "blocked" : -1,
        "dns" : -1
      },
      "serverIPAddress" : "127.0.0.1",
      "comment" : "",
      "_katalonRequestInformation" : {
        "name" : "43",
        "testObjectId" : "Object Repository/VoPro/Account/api_admin_v1_users",
        "harId" : "707b3037-0972-421b-aa25-c84ea12b8a9d"
      },
      "time" : 2036
    } ],
    "comment" : ""
  }
}