{
  "log" : {
    "version" : "1.2",
    "creator" : {
      "name" : "BrowserMob Proxy",
      "version" : "2.1.5",
      "comment" : ""
    },
    "pages" : [ {
      "id" : "Page 0",
      "startedDateTime" : "2019-04-24T20:55:32.136Z",
      "title" : "Page 0",
      "pageTimings" : {
        "onLoad" : 3885,
        "comment" : ""
      },
      "comment" : ""
    } ],
    "entries" : [ {
      "pageref" : "Page 0",
      "startedDateTime" : "2019-04-24T20:55:32.137Z",
      "request" : {
        "method" : "POST",
        "url" : "http://localhost:10520/WebAPI/api/mobile/v1/fields?",
        "httpVersion" : "HTTP/1.1",
        "cookies" : [ ],
        "headers" : [ {
          "name" : "User-Agent",
          "value" : "Katalon Studio"
        }, {
          "name" : "Content-Type",
          "value" : "application/json"
        }, {
          "name" : "Authorization",
          "value" : "Bearer eyJ0eXAiOiJKV1QiLCJhbGciOiJIUzI1NiJ9.eyJ1bmlxdWVfbmFtZSI6Implbm55Lm1hbGRvbmFkby50eDFAZ21haWwuY29tIiwicm9sZSI6InVzZXIiLCJzdWIiOiJqZW5ueS5tYWxkb25hZG8udHgxQGdtYWlsLmNvbSIsImlzcyI6IkNyb3BNZXRyaWNzIiwiYXVkIjoiYWxsIiwiZXhwIjoxNTU2MTQzMjMxLCJuYmYiOjE1NTYxMzkzMzF9.MdD__objjXG3OQ0wVWS0FZ6t1Yldn4rAouN9PXLgRno"
        }, {
          "name" : "Host",
          "value" : "localhost:10520"
        }, {
          "name" : "Accept",
          "value" : "text/html, image/gif, image/jpeg, *; q=.2, */*; q=.2"
        }, {
          "name" : "Proxy-Connection",
          "value" : "keep-alive"
        }, {
          "name" : "Content-Length",
          "value" : "87"
        } ],
        "queryString" : [ ],
        "postData" : {
          "mimeType" : "application/json",
          "text" : "{\"field\":{\"farm_id\":7,\"name\":\"Field whit empty boundary\",\"boundary\":{\"boundaries\":[]}}}",
          "comment" : ""
        },
        "headersSize" : 591,
        "bodySize" : 87,
        "comment" : ""
      },
      "response" : {
        "status" : 400,
        "statusText" : "Bad Request",
        "httpVersion" : "HTTP/1.1",
        "cookies" : [ {
          "name" : ".ASPROLES",
          "value" : "GvBhFeQXbsZgZlXL0gLI59C_YPj901iMrVuZxfJgqs1a_1i9AJpUmcOIDQ-X1gKLDmG1hQD8t8tsx2GhG2dZ4PHR6QngTy21PQczx0lhhSHKbdtKP5PFqDv-lrquXGP45aiOSIYRRrfumGi8BC191Ado1u9zciXv08ow2wMCC6gpUWD6O9phRKbDS_Vd4t6YRbp_2C0oWDW8Wh86DPnn67c5gBgQ7d4fyOrnO_stS25Ew211YdmmcEH965CZiVg-j5UcqjlDtPXXeJPQmjF6MnapR9F7BmPBjqnEmGu7M-auq2gCw0yN_cQW5PU9pJcM-cWaI8JP85g9NIuDufh14usRK-F5r6K-qThcvu7n1ZF8bgSKyDD9aVPT_TsxdvPgnWkOwS1K2csx9Tgcd0WcJCzhvBf6yTY_Q1hmXP5m5eQxowaSHbGajfX3MeQYjjl4L17A8XD3IkXcC44owg289oF9PWS-esnoJgBCWYUjXzv-pdyw7jJdp9_-m5jNadeXcYOa6JTALJNzNWm8hOMvtF9ify41",
          "path" : "/",
          "httpOnly" : true,
          "secure" : false,
          "comment" : ""
        } ],
        "headers" : [ {
          "name" : "Cache-Control",
          "value" : "private"
        }, {
          "name" : "Content-Type",
          "value" : "application/json; charset=utf-8"
        }, {
          "name" : "Server",
          "value" : "Microsoft-IIS/10.0"
        }, {
          "name" : "Set-Cookie",
          "value" : ".ASPROLES=GvBhFeQXbsZgZlXL0gLI59C_YPj901iMrVuZxfJgqs1a_1i9AJpUmcOIDQ-X1gKLDmG1hQD8t8tsx2GhG2dZ4PHR6QngTy21PQczx0lhhSHKbdtKP5PFqDv-lrquXGP45aiOSIYRRrfumGi8BC191Ado1u9zciXv08ow2wMCC6gpUWD6O9phRKbDS_Vd4t6YRbp_2C0oWDW8Wh86DPnn67c5gBgQ7d4fyOrnO_stS25Ew211YdmmcEH965CZiVg-j5UcqjlDtPXXeJPQmjF6MnapR9F7BmPBjqnEmGu7M-auq2gCw0yN_cQW5PU9pJcM-cWaI8JP85g9NIuDufh14usRK-F5r6K-qThcvu7n1ZF8bgSKyDD9aVPT_TsxdvPgnWkOwS1K2csx9Tgcd0WcJCzhvBf6yTY_Q1hmXP5m5eQxowaSHbGajfX3MeQYjjl4L17A8XD3IkXcC44owg289oF9PWS-esnoJgBCWYUjXzv-pdyw7jJdp9_-m5jNadeXcYOa6JTALJNzNWm8hOMvtF9ify41; path=/; HttpOnly"
        }, {
          "name" : "X-SourceFiles",
          "value" : "=?UTF-8?B?RDpcVmlydHVhbE9wdGltaXplci1SZWZhY3RvcmluZ1xDcm9wTWV0cmljcy5Wby5BcGlcQ3JvcE1ldHJpY3MuVm8uQXBpXGFwaVxtb2JpbGVcdjFcZmllbGRz?="
        }, {
          "name" : "X-Powered-By",
          "value" : "ASP.NET"
        }, {
          "name" : "Date",
          "value" : "Wed, 24 Apr 2019 20:55:36 GMT"
        }, {
          "name" : "Content-Length",
          "value" : "56"
        } ],
        "content" : {
          "size" : 56,
          "mimeType" : "application/json; charset=utf-8",
          "text" : "{\"message\":\"The Boundary must be a non empty geometry.\"}",
          "comment" : ""
        },
        "redirectURL" : "",
        "headersSize" : 940,
        "bodySize" : 56,
        "comment" : ""
      },
      "cache" : { },
      "timings" : {
        "comment" : "",
        "ssl" : -1,
        "wait" : 3879,
        "send" : 0,
        "receive" : 0,
        "blocked" : -1,
        "dns" : -1,
        "connect" : -1
      },
      "serverIPAddress" : "127.0.0.1",
      "comment" : "",
      "_katalonRequestInformation" : {
        "name" : "73",
        "testObjectId" : "Object Repository/VoGrow/Field/FieldPost",
        "harId" : "3e814b87-ae68-41a8-a441-36fd47c65c25"
      },
      "time" : 3880
    } ],
    "comment" : ""
  }
}