{
  "log" : {
    "version" : "1.2",
    "creator" : {
      "name" : "BrowserMob Proxy",
      "version" : "2.1.5",
      "comment" : ""
    },
    "pages" : [ {
      "id" : "Page 0",
      "startedDateTime" : "2019-03-29T22:10:55.913Z",
      "title" : "Page 0",
      "pageTimings" : {
        "onLoad" : 34,
        "comment" : ""
      },
      "comment" : ""
    } ],
    "entries" : [ {
      "pageref" : "Page 0",
      "startedDateTime" : "2019-03-29T22:10:55.914Z",
      "request" : {
        "method" : "POST",
        "url" : "http://localhost:10520/WebAPI/api/admin/v1/users/?",
        "httpVersion" : "HTTP/1.1",
        "cookies" : [ ],
        "headers" : [ {
          "name" : "User-Agent",
          "value" : "Katalon Studio"
        }, {
          "name" : "Content-Type",
          "value" : "application/x-www-form-urlencoded"
        }, {
          "name" : "Authorization",
          "value" : "Bearer eyJ0eXAiOiJKV1QiLCJhbGciOiJIUzI1NiJ9.eyJ1bmlxdWVfbmFtZSI6ImFkbWluIiwicm9sZSI6InVzZXIiLCJzdWIiOiJhZG1pbiIsImlzcyI6IkNyb3BNZXRyaWNzIiwiYXVkIjoiYWxsIiwiZXhwIjoxNTUzOTAxMzU1LCJuYmYiOjE1NTM4OTc0NTV9.rcsqyRNWOaZsoGajfMhZbxTDoet5vJLXY73T0GZ4pVc"
        }, {
          "name" : "Host",
          "value" : "localhost:10520"
        }, {
          "name" : "Accept",
          "value" : "text/html, image/gif, image/jpeg, *; q=.2, */*; q=.2"
        }, {
          "name" : "Proxy-Connection",
          "value" : "keep-alive"
        }, {
          "name" : "Content-Length",
          "value" : "285"
        } ],
        "queryString" : [ ],
        "postData" : {
          "mimeType" : "application/x-www-form-urlencoded",
          "params" : [ {
            "name" : "password",
            "value" : "cropmetrics",
            "comment" : ""
          }, {
            "name" : "email",
            "value" : "cropmetricsvo.rolesymbols@gmail.com",
            "comment" : ""
          }, {
            "name" : "fullname",
            "value" : "test validation",
            "comment" : ""
          }, {
            "name" : "phone",
            "value" : "123",
            "comment" : ""
          }, {
            "name" : "dealer",
            "value" : "x",
            "comment" : ""
          }, {
            "name" : "addressLine1",
            "value" : "address line 1 test validation",
            "comment" : ""
          }, {
            "name" : "addressLine2",
            "value" : "address line 2 test validation",
            "comment" : ""
          }, {
            "name" : "town",
            "value" : "townValidation",
            "comment" : ""
          }, {
            "name" : "state",
            "value" : "stateValidation",
            "comment" : ""
          }, {
            "name" : "zip",
            "value" : "xx",
            "comment" : ""
          }, {
            "name" : "country",
            "value" : "xx",
            "comment" : ""
          }, {
            "name" : "roles",
            "value" : "!@#$%^&*",
            "comment" : ""
          } ],
          "comment" : ""
        },
        "headersSize" : 544,
        "bodySize" : 285,
        "comment" : ""
      },
      "response" : {
        "status" : 400,
        "statusText" : "Bad Request",
        "httpVersion" : "HTTP/1.1",
        "cookies" : [ {
          "name" : ".ASPROLES",
          "value" : "lvOLN6w5FsFSHzHw6DZyP7g2TdevdyYX0AWuAPi1I6GHDtYSJxCLQLYlOapO3DFxS_5Ihc4SSQtOXWjYk-SxhLMFcwLwstN2fMWwp-O9DR8ipcQnOrvlrD6_kgdYH1vvEMVLZo3Td9OLB56nZaBgUeSKk30-YJbzoPEg8XJdWJkv5OHHOiANMMY98MDE4Ct1qb5X2CwoSl7nOovZw1JT6fMwxZTSligUlnw78V_G5U2D9po4GVBR45fVd3hJoroJ1CTvOs_IuACuXrMmUhiJalvvEahYkHXQI9xMpXtVFkT6oJQkuXRsC_Rkyu8zV8XMCgP0D4-ybmuTF29FZT-NrtPkyD87Rko1Bvoec1b8YlOy-at2A6coyKcsZNows1A9CUOhFEYCAtztF7VNA4tRAPqK3eAQ0sLTVd_InAmfy4pfRcSFGr1HjcceMi8jdlal7as0G7PmsBYbBdKItdZd2G0lMtwS8ffXBPf4eAjfwYSgwh_l0",
          "path" : "/",
          "httpOnly" : true,
          "secure" : false,
          "comment" : ""
        } ],
        "headers" : [ {
          "name" : "Cache-Control",
          "value" : "private"
        }, {
          "name" : "Content-Type",
          "value" : "application/json; charset=utf-8"
        }, {
          "name" : "Server",
          "value" : "Microsoft-IIS/10.0"
        }, {
          "name" : "Set-Cookie",
          "value" : ".ASPROLES=lvOLN6w5FsFSHzHw6DZyP7g2TdevdyYX0AWuAPi1I6GHDtYSJxCLQLYlOapO3DFxS_5Ihc4SSQtOXWjYk-SxhLMFcwLwstN2fMWwp-O9DR8ipcQnOrvlrD6_kgdYH1vvEMVLZo3Td9OLB56nZaBgUeSKk30-YJbzoPEg8XJdWJkv5OHHOiANMMY98MDE4Ct1qb5X2CwoSl7nOovZw1JT6fMwxZTSligUlnw78V_G5U2D9po4GVBR45fVd3hJoroJ1CTvOs_IuACuXrMmUhiJalvvEahYkHXQI9xMpXtVFkT6oJQkuXRsC_Rkyu8zV8XMCgP0D4-ybmuTF29FZT-NrtPkyD87Rko1Bvoec1b8YlOy-at2A6coyKcsZNows1A9CUOhFEYCAtztF7VNA4tRAPqK3eAQ0sLTVd_InAmfy4pfRcSFGr1HjcceMi8jdlal7as0G7PmsBYbBdKItdZd2G0lMtwS8ffXBPf4eAjfwYSgwh_l0; path=/; HttpOnly"
        }, {
          "name" : "X-SourceFiles",
          "value" : "=?UTF-8?B?RDpcVmlydHVhbE9wdGltaXplci1SZWZhY3RvcmluZ1xDcm9wTWV0cmljcy5Wby5BcGlcQ3JvcE1ldHJpY3MuVm8uQXBpXGFwaVxhZG1pblx2MVx1c2Vyc1w=?="
        }, {
          "name" : "X-Powered-By",
          "value" : "ASP.NET"
        }, {
          "name" : "Date",
          "value" : "Fri, 29 Mar 2019 22:10:55 GMT"
        }, {
          "name" : "Content-Length",
          "value" : "92"
        } ],
        "content" : {
          "size" : 92,
          "mimeType" : "application/json; charset=utf-8",
          "text" : "{\"message\":\"The request is invalid. The role  !@#$%^&* requested to assign is not a valid.\"}",
          "comment" : ""
        },
        "redirectURL" : "",
        "headersSize" : 897,
        "bodySize" : 92,
        "comment" : ""
      },
      "cache" : { },
      "timings" : {
        "comment" : "",
        "ssl" : -1,
        "connect" : -1,
        "send" : 0,
        "receive" : 0,
        "wait" : 29,
        "dns" : -1,
        "blocked" : -1
      },
      "serverIPAddress" : "127.0.0.1",
      "comment" : "",
      "_katalonRequestInformation" : {
        "name" : "105",
        "testObjectId" : "Object Repository/VoPro/Account/api_admin_v1_users",
        "harId" : "3cd30e66-be6d-42ce-b818-9e5337dd91a4"
      },
      "time" : 29
    } ],
    "comment" : ""
  }
}