{
  "log" : {
    "version" : "1.2",
    "creator" : {
      "name" : "BrowserMob Proxy",
      "version" : "2.1.5",
      "comment" : ""
    },
    "pages" : [ {
      "id" : "Page 0",
      "startedDateTime" : "2019-04-09T21:06:02.897Z",
      "title" : "Page 0",
      "pageTimings" : {
        "onLoad" : 4489,
        "comment" : ""
      },
      "comment" : ""
    } ],
    "entries" : [ {
      "pageref" : "Page 0",
      "startedDateTime" : "2019-04-09T21:06:02.899Z",
      "request" : {
        "method" : "PUT",
        "url" : "http://localhost:10520/WebAPI/api/mobile/v1/fields/3?",
        "httpVersion" : "HTTP/1.1",
        "cookies" : [ ],
        "headers" : [ {
          "name" : "User-Agent",
          "value" : "Katalon Studio"
        }, {
          "name" : "Content-Type",
          "value" : "application/json"
        }, {
          "name" : "Authorization",
          "value" : "Bearer eyJ0eXAiOiJKV1QiLCJhbGciOiJIUzI1NiJ9.eyJ1bmlxdWVfbmFtZSI6Implbm55Lm1hbGRvbmFkby50eDFAZ21haWwuY29tIiwicm9sZSI6InVzZXIiLCJzdWIiOiJqZW5ueS5tYWxkb25hZG8udHgxQGdtYWlsLmNvbSIsImlzcyI6IkNyb3BNZXRyaWNzIiwiYXVkIjoiYWxsIiwiZXhwIjoxNTU0ODQ3ODYyLCJuYmYiOjE1NTQ4NDM5NjJ9.kWkO2oqEuj3jJVb52M9e31vg49MBiJ8noY3Vvd5i1tM"
        }, {
          "name" : "Host",
          "value" : "localhost:10520"
        }, {
          "name" : "Accept",
          "value" : "text/html, image/gif, image/jpeg, *; q=.2, */*; q=.2"
        }, {
          "name" : "Proxy-Connection",
          "value" : "keep-alive"
        }, {
          "name" : "Content-Length",
          "value" : "379"
        } ],
        "queryString" : [ ],
        "postData" : {
          "mimeType" : "application/json",
          "text" : "{\"field\":{\"name\":\"Field without y value in boundary\",\"boundary\":{\"boundaries\":[{\"boundary\":{\"coords\":[{\"x\":-101.49568751},{\"x\":-101.50049403,\"y\":37.14647907},{\"x\":-101.50049403,\"y\":37.14264773},{\"x\":-101.49723246,\"y\":37.1411425},{\"x\":-101.49019435,\"y\":37.14223722},{\"x\":-101.48933604,\"y\":37.14620541},{\"x\":-101.49294093,\"y\":37.14866833},{\"x\":-101.49568751,\"y\":37.14976293}]}}]}}}",
          "comment" : ""
        },
        "headersSize" : 593,
        "bodySize" : 379,
        "comment" : ""
      },
      "response" : {
        "status" : 400,
        "statusText" : "Bad Request",
        "httpVersion" : "HTTP/1.1",
        "cookies" : [ {
          "name" : ".ASPROLES",
          "value" : "IjU_7ujcci3UZ47mToqqOjeNM_w6Mq-PZ5W14z4CjnKmKdNTMnVPPPigIALi89o1KGEkZLI-QJli7bw6AAsGY8CA72NJ9Um8Tj9kVvXf8GEjPkV2VT_RuutZwtbF3QjTvzZkCV8Y6D68vfHy0Jaxq6EM7AgLtiF-Ikq1iGNhMRctHjYp9fyiK-3jCtfHFL8yFturSHdulju4wjrrR9nwHrGtrAvdX7O4nE5DNproKNQV-uihREk0cgIYo1PJe37EIdocL4k9176oU-Ps1Pxqas8dxiRyCXWZ7DDnw-uRWaXWMpno-Rmip7jH36rXvzDFSVQgtdANj5wVWN1s5-5ehhIzWaqVAWY82GAaN8UKyMaFQZ8GVVAHy1K74A6lIymAw_qUOIiRes6dGeO4hNALKQanVi1B-zOa-v-sGMIbIbts0xGY7A7Dggoz_1nMARTvG5DyICzpNgLrrPv5U_XViQqToT9jVqPnXJ_sVzm5MXQLs5iAZo_g18lvWWOs1t4BFVMleQg3cUGoOoK0CF7U1CW8OCg1",
          "path" : "/",
          "httpOnly" : true,
          "secure" : false,
          "comment" : ""
        } ],
        "headers" : [ {
          "name" : "Cache-Control",
          "value" : "private"
        }, {
          "name" : "Content-Type",
          "value" : "application/json; charset=utf-8"
        }, {
          "name" : "Server",
          "value" : "Microsoft-IIS/10.0"
        }, {
          "name" : "Set-Cookie",
          "value" : ".ASPROLES=IjU_7ujcci3UZ47mToqqOjeNM_w6Mq-PZ5W14z4CjnKmKdNTMnVPPPigIALi89o1KGEkZLI-QJli7bw6AAsGY8CA72NJ9Um8Tj9kVvXf8GEjPkV2VT_RuutZwtbF3QjTvzZkCV8Y6D68vfHy0Jaxq6EM7AgLtiF-Ikq1iGNhMRctHjYp9fyiK-3jCtfHFL8yFturSHdulju4wjrrR9nwHrGtrAvdX7O4nE5DNproKNQV-uihREk0cgIYo1PJe37EIdocL4k9176oU-Ps1Pxqas8dxiRyCXWZ7DDnw-uRWaXWMpno-Rmip7jH36rXvzDFSVQgtdANj5wVWN1s5-5ehhIzWaqVAWY82GAaN8UKyMaFQZ8GVVAHy1K74A6lIymAw_qUOIiRes6dGeO4hNALKQanVi1B-zOa-v-sGMIbIbts0xGY7A7Dggoz_1nMARTvG5DyICzpNgLrrPv5U_XViQqToT9jVqPnXJ_sVzm5MXQLs5iAZo_g18lvWWOs1t4BFVMleQg3cUGoOoK0CF7U1CW8OCg1; path=/; HttpOnly"
        }, {
          "name" : "X-SourceFiles",
          "value" : "=?UTF-8?B?RDpcVmlydHVhbE9wdGltaXplci1SZWZhY3RvcmluZ1xDcm9wTWV0cmljcy5Wby5BcGlcQ3JvcE1ldHJpY3MuVm8uQXBpXGFwaVxtb2JpbGVcdjFcZmllbGRzXDM=?="
        }, {
          "name" : "X-Powered-By",
          "value" : "ASP.NET"
        }, {
          "name" : "Date",
          "value" : "Tue, 09 Apr 2019 21:06:07 GMT"
        }, {
          "name" : "Content-Length",
          "value" : "119"
        } ],
        "content" : {
          "size" : 119,
          "mimeType" : "application/json; charset=utf-8",
          "text" : "{\"message\":\"The Boundary is not valid. IllegalArgumentException: Points of LinearRing do not form a closed linestring\"}",
          "comment" : ""
        },
        "redirectURL" : "",
        "headersSize" : 945,
        "bodySize" : 119,
        "comment" : ""
      },
      "cache" : { },
      "timings" : {
        "comment" : "",
        "send" : 0,
        "connect" : -1,
        "dns" : -1,
        "receive" : 0,
        "wait" : 4484,
        "blocked" : -1,
        "ssl" : -1
      },
      "serverIPAddress" : "127.0.0.1",
      "comment" : "",
      "_katalonRequestInformation" : {
        "name" : "102",
        "testObjectId" : "Object Repository/VoGrow/Field/FieldPut",
        "harId" : "df5b21e7-0f1e-4e64-bde8-ec5b291621d7"
      },
      "time" : 4485
    } ],
    "comment" : ""
  }
}