{
  "log" : {
    "version" : "1.2",
    "creator" : {
      "name" : "BrowserMob Proxy",
      "version" : "2.1.5",
      "comment" : ""
    },
    "pages" : [ {
      "id" : "Page 0",
      "startedDateTime" : "2019-04-09T09:50:16.268Z",
      "title" : "Page 0",
      "pageTimings" : {
        "onLoad" : 3383,
        "comment" : ""
      },
      "comment" : ""
    } ],
    "entries" : [ {
      "pageref" : "Page 0",
      "startedDateTime" : "2019-04-09T09:50:16.270Z",
      "request" : {
        "method" : "PUT",
        "url" : "http://localhost:10520/WebAPI/api/mobile/v1/fields/1?",
        "httpVersion" : "HTTP/1.1",
        "cookies" : [ ],
        "headers" : [ {
          "name" : "User-Agent",
          "value" : "Katalon Studio"
        }, {
          "name" : "Content-Type",
          "value" : "application/json"
        }, {
          "name" : "Authorization",
          "value" : "Bearer eyJ0eXAiOiJKV1QiLCJhbGciOiJIUzI1NiJ9.eyJ1bmlxdWVfbmFtZSI6Implbm55Lm1hbGRvbmFkby50eEBnbWFpbC5jb20iLCJyb2xlIjoidXNlciIsInN1YiI6Implbm55Lm1hbGRvbmFkby50eEBnbWFpbC5jb20iLCJpc3MiOiJDcm9wTWV0cmljcyIsImF1ZCI6ImFsbCIsImV4cCI6MTU1NDgwNzMxNiwibmJmIjoxNTU0ODAzNDE2fQ.E-nh88nnOToBPf4SiePwRV4e-SGflWn7YSrRDoCgTnc"
        }, {
          "name" : "Host",
          "value" : "localhost:10520"
        }, {
          "name" : "Accept",
          "value" : "text/html, image/gif, image/jpeg, *; q=.2, */*; q=.2"
        }, {
          "name" : "Proxy-Connection",
          "value" : "keep-alive"
        }, {
          "name" : "Content-Length",
          "value" : "389"
        } ],
        "queryString" : [ ],
        "postData" : {
          "mimeType" : "application/json",
          "text" : "{\"field\":{\"name\":\"Field by agent not assigned\",\"boundary\":{\"boundaries\":[{\"boundary\":{\"coords\":[{\"x\":-101.49568751,\"y\":37.14976293},{\"x\":-101.50049403,\"y\":37.14647907},{\"x\":-101.50049403,\"y\":37.14264773},{\"x\":-101.49723246,\"y\":37.1411425},{\"x\":-101.49019435,\"y\":37.14223722},{\"x\":-101.48933604,\"y\":37.14620541},{\"x\":-101.49294093,\"y\":37.14866833},{\"x\":-101.49568751,\"y\":37.14976293}]}}]}}}",
          "comment" : ""
        },
        "headersSize" : 591,
        "bodySize" : 389,
        "comment" : ""
      },
      "response" : {
        "status" : 400,
        "statusText" : "Bad Request",
        "httpVersion" : "HTTP/1.1",
        "cookies" : [ {
          "name" : ".ASPROLES",
          "value" : "ERjBgkUGovPbrOGiR0jYm53J2mqmMplYfY1SCKg_PKGyVUF3ZWV3bnVRvdW4uEwMyx0CVxwee-TnAblrP1f7kMmN_lNpuwc0UWuP_LSmLpwPz4prku1w7CP7nkqTVnEZyv4M3iw4gJ_HnkBeLdeXlO51nUl4OyI4OyoRzRxTtT-MKZIvJJLFsVJzx9a8WUY4u-spXxpaf52e_Q8jq-H2m-N53k6FTJmWiWXBn2tc5oxNY0J0y7iqhkxHsRjx3CSZvOURGPUUBaRkroHqpmXO0jBPSsVJbODmHHpqnbPerAgO_CvzNYt-P6jNXtEw9Pt3mkL1qkTtZ8VXtrnvknaPJmQ_-td8JSMoxnCU8GCxll2fGPS3Xw7edXtV1PlxmqG01V14qJlSVQD8YCrWlasMwQQLuIS1NStiWXpEhhZINLE-DpG0Nng_D9IuqKxhL_WkXd3yo-MkxO-giLQeiztetD1NzLM8KlRi6j8N5O5147l9kdHNIQtdnWohm0EcLlfBXbNXtw2",
          "path" : "/",
          "httpOnly" : true,
          "secure" : false,
          "comment" : ""
        } ],
        "headers" : [ {
          "name" : "Cache-Control",
          "value" : "private"
        }, {
          "name" : "Content-Type",
          "value" : "application/json; charset=utf-8"
        }, {
          "name" : "Server",
          "value" : "Microsoft-IIS/10.0"
        }, {
          "name" : "Set-Cookie",
          "value" : ".ASPROLES=ERjBgkUGovPbrOGiR0jYm53J2mqmMplYfY1SCKg_PKGyVUF3ZWV3bnVRvdW4uEwMyx0CVxwee-TnAblrP1f7kMmN_lNpuwc0UWuP_LSmLpwPz4prku1w7CP7nkqTVnEZyv4M3iw4gJ_HnkBeLdeXlO51nUl4OyI4OyoRzRxTtT-MKZIvJJLFsVJzx9a8WUY4u-spXxpaf52e_Q8jq-H2m-N53k6FTJmWiWXBn2tc5oxNY0J0y7iqhkxHsRjx3CSZvOURGPUUBaRkroHqpmXO0jBPSsVJbODmHHpqnbPerAgO_CvzNYt-P6jNXtEw9Pt3mkL1qkTtZ8VXtrnvknaPJmQ_-td8JSMoxnCU8GCxll2fGPS3Xw7edXtV1PlxmqG01V14qJlSVQD8YCrWlasMwQQLuIS1NStiWXpEhhZINLE-DpG0Nng_D9IuqKxhL_WkXd3yo-MkxO-giLQeiztetD1NzLM8KlRi6j8N5O5147l9kdHNIQtdnWohm0EcLlfBXbNXtw2; path=/; HttpOnly"
        }, {
          "name" : "X-SourceFiles",
          "value" : "=?UTF-8?B?RDpcVmlydHVhbE9wdGltaXplci1SZWZhY3RvcmluZ1xDcm9wTWV0cmljcy5Wby5BcGlcQ3JvcE1ldHJpY3MuVm8uQXBpXGFwaVxtb2JpbGVcdjFcZmllbGRzXDE=?="
        }, {
          "name" : "X-Powered-By",
          "value" : "ASP.NET"
        }, {
          "name" : "Date",
          "value" : "Tue, 09 Apr 2019 09:50:19 GMT"
        }, {
          "name" : "Content-Length",
          "value" : "82"
        } ],
        "content" : {
          "size" : 82,
          "mimeType" : "application/json; charset=utf-8",
          "text" : "{\"message\":\"The modifier doesn't have permissions to modify the field requested.\"}",
          "comment" : ""
        },
        "redirectURL" : "",
        "headersSize" : 923,
        "bodySize" : 82,
        "comment" : ""
      },
      "cache" : { },
      "timings" : {
        "comment" : "",
        "ssl" : -1,
        "connect" : -1,
        "blocked" : -1,
        "dns" : -1,
        "send" : 0,
        "receive" : 1,
        "wait" : 3377
      },
      "serverIPAddress" : "127.0.0.1",
      "comment" : "",
      "_katalonRequestInformation" : {
        "name" : "21",
        "testObjectId" : "Object Repository/VoGrow/Field/FieldPut",
        "harId" : "a8d9be24-b712-4fe3-a8b4-3958ef1204cf"
      },
      "time" : 3379
    } ],
    "comment" : ""
  }
}