{
  "log" : {
    "version" : "1.2",
    "creator" : {
      "name" : "BrowserMob Proxy",
      "version" : "2.1.5",
      "comment" : ""
    },
    "pages" : [ {
      "id" : "Page 0",
      "startedDateTime" : "2019-04-24T20:34:59.336Z",
      "title" : "Page 0",
      "pageTimings" : {
        "onLoad" : 938,
        "comment" : ""
      },
      "comment" : ""
    } ],
    "entries" : [ {
      "pageref" : "Page 0",
      "startedDateTime" : "2019-04-24T20:34:59.338Z",
      "request" : {
        "method" : "GET",
        "url" : "http://localhost:10520/WebAPI/api/mobile/v1/users?",
        "httpVersion" : "HTTP/1.1",
        "cookies" : [ ],
        "headers" : [ {
          "name" : "User-Agent",
          "value" : "Katalon Studio"
        }, {
          "name" : "Content-Type",
          "value" : "application/json"
        }, {
          "name" : "Authorization",
          "value" : "Bearer eyJ0eXAiOiJKV1QiLCJhbGciOiJIUzI1NiJ9.eyJ1bmlxdWVfbmFtZSI6Implbm55Lm1hbGRvbmFkby50eDFAZ21haWwuY29tIiwicm9sZSI6InVzZXIiLCJzdWIiOiJqZW5ueS5tYWxkb25hZG8udHgxQGdtYWlsLmNvbSIsImlzcyI6IkNyb3BNZXRyaWNzIiwiYXVkIjoiYWxsIiwiZXhwIjoxNTU2MTQxOTk5LCJuYmYiOjE1NTYxMzgwOTl9.Z-d73cN1Qsr5Zz2PG-tYbw69PQVea3dIMpsFfLtbKBI"
        }, {
          "name" : "Host",
          "value" : "localhost:10520"
        }, {
          "name" : "Accept",
          "value" : "text/html, image/gif, image/jpeg, *; q=.2, */*; q=.2"
        }, {
          "name" : "Proxy-Connection",
          "value" : "keep-alive"
        } ],
        "queryString" : [ ],
        "headersSize" : 569,
        "bodySize" : 0,
        "comment" : ""
      },
      "response" : {
        "status" : 200,
        "statusText" : "OK",
        "httpVersion" : "HTTP/1.1",
        "cookies" : [ {
          "name" : ".ASPROLES",
          "value" : "NGiDvwxE6iJM1l-UB2-oNNWro1jJJ83f4YduHCxlify9zoMIQ1igSw9D_T0cDqk54IDznAfaZsTw4biBofeVkhBOklk9aKE_3ABUDvPuurYPrOG4ILcecqD6OZBXQhoEdED1frB1DWahqHR9hZi9T_03Yc1hvVXmaJnRKtSkEEsaPKNWIwMu3ygjXKiFzMOPRaWFIs9bCa1krLDqnLWpaSnp14nSguen5qktkrsxTK9_bSLKBesqI0rHAuPn9hUpeh4IRgGdkcUkmMsUVgewdRMGitE0dJNoiWUpc-QrXIEbElCr8NUBSQDlzbTtf2KHfg4W0iSfPo8nhOTpIAG-ShlTUxcZ8pk7PvNXJ4RViClIQUEbr0nn3ZZXXXKXi3MBjEicp9W5VqSvhVGBg-PfSADNDqLCnzQtxhi5nyoBYnTs1shcudR1DijgOIzIrFXBCsdh_AVb4an4aTS0IVUNOfKqp5nhOfaGSHcPdzOyxEGNEvS6co2NrGDoNSUThJOVVOO-_AAjcuxqqj5gj_gefoPK8Ac1",
          "path" : "/",
          "httpOnly" : true,
          "secure" : false,
          "comment" : ""
        } ],
        "headers" : [ {
          "name" : "Cache-Control",
          "value" : "private"
        }, {
          "name" : "Content-Type",
          "value" : "application/json; charset=utf-8"
        }, {
          "name" : "Server",
          "value" : "Microsoft-IIS/10.0"
        }, {
          "name" : "Set-Cookie",
          "value" : ".ASPROLES=NGiDvwxE6iJM1l-UB2-oNNWro1jJJ83f4YduHCxlify9zoMIQ1igSw9D_T0cDqk54IDznAfaZsTw4biBofeVkhBOklk9aKE_3ABUDvPuurYPrOG4ILcecqD6OZBXQhoEdED1frB1DWahqHR9hZi9T_03Yc1hvVXmaJnRKtSkEEsaPKNWIwMu3ygjXKiFzMOPRaWFIs9bCa1krLDqnLWpaSnp14nSguen5qktkrsxTK9_bSLKBesqI0rHAuPn9hUpeh4IRgGdkcUkmMsUVgewdRMGitE0dJNoiWUpc-QrXIEbElCr8NUBSQDlzbTtf2KHfg4W0iSfPo8nhOTpIAG-ShlTUxcZ8pk7PvNXJ4RViClIQUEbr0nn3ZZXXXKXi3MBjEicp9W5VqSvhVGBg-PfSADNDqLCnzQtxhi5nyoBYnTs1shcudR1DijgOIzIrFXBCsdh_AVb4an4aTS0IVUNOfKqp5nhOfaGSHcPdzOyxEGNEvS6co2NrGDoNSUThJOVVOO-_AAjcuxqqj5gj_gefoPK8Ac1; path=/; HttpOnly"
        }, {
          "name" : "X-SourceFiles",
          "value" : "=?UTF-8?B?RDpcVmlydHVhbE9wdGltaXplci1SZWZhY3RvcmluZ1xDcm9wTWV0cmljcy5Wby5BcGlcQ3JvcE1ldHJpY3MuVm8uQXBpXGFwaVxtb2JpbGVcdjFcdXNlcnM=?="
        }, {
          "name" : "X-Powered-By",
          "value" : "ASP.NET"
        }, {
          "name" : "Date",
          "value" : "Wed, 24 Apr 2019 20:35:00 GMT"
        }, {
          "name" : "Content-Length",
          "value" : "72"
        } ],
        "content" : {
          "size" : 72,
          "mimeType" : "application/json; charset=utf-8",
          "text" : "[{\"id\":2,\"name\":\"Agent account\"},{\"id\":3,\"name\":\"grower 1  with agent\"}]",
          "comment" : ""
        },
        "redirectURL" : "",
        "headersSize" : 931,
        "bodySize" : 72,
        "comment" : ""
      },
      "cache" : { },
      "timings" : {
        "comment" : "",
        "blocked" : -1,
        "receive" : 0,
        "connect" : -1,
        "wait" : 816,
        "send" : 0,
        "dns" : -1,
        "ssl" : -1
      },
      "serverIPAddress" : "127.0.0.1",
      "comment" : "",
      "_katalonRequestInformation" : {
        "name" : "7",
        "testObjectId" : "Object Repository/VoGrow/User/Users",
        "harId" : "c9784931-5408-401d-bd4b-c41481ff1c4d"
      },
      "time" : 817
    } ],
    "comment" : ""
  }
}