{
  "log" : {
    "version" : "1.2",
    "creator" : {
      "name" : "BrowserMob Proxy",
      "version" : "2.1.5",
      "comment" : ""
    },
    "pages" : [ {
      "id" : "Page 0",
      "startedDateTime" : "2019-03-28T21:50:55.289Z",
      "title" : "Page 0",
      "pageTimings" : {
        "onLoad" : 45,
        "comment" : ""
      },
      "comment" : ""
    } ],
    "entries" : [ {
      "pageref" : "Page 0",
      "startedDateTime" : "2019-03-28T21:50:55.290Z",
      "request" : {
        "method" : "POST",
        "url" : "http://localhost:10520/WebAPI/api/admin/v1/users/?",
        "httpVersion" : "HTTP/1.1",
        "cookies" : [ ],
        "headers" : [ {
          "name" : "User-Agent",
          "value" : "Katalon Studio"
        }, {
          "name" : "Content-Type",
          "value" : "application/x-www-form-urlencoded"
        }, {
          "name" : "Authorization",
          "value" : "Bearer eyJ0eXAiOiJKV1QiLCJhbGciOiJIUzI1NiJ9.eyJ1bmlxdWVfbmFtZSI6ImFkbWluIiwicm9sZSI6InVzZXIiLCJzdWIiOiJhZG1pbiIsImlzcyI6IkNyb3BNZXRyaWNzIiwiYXVkIjoiYWxsIiwiZXhwIjoxNTUzODEzNzU1LCJuYmYiOjE1NTM4MDk4NTV9.ifAUik4A0n8A6nRzi6tS1jiBbx3cBI0IYAS2gwD6nOo"
        }, {
          "name" : "Host",
          "value" : "localhost:10520"
        }, {
          "name" : "Accept",
          "value" : "text/html, image/gif, image/jpeg, *; q=.2, */*; q=.2"
        }, {
          "name" : "Proxy-Connection",
          "value" : "keep-alive"
        }, {
          "name" : "Content-Length",
          "value" : "327"
        } ],
        "queryString" : [ ],
        "postData" : {
          "mimeType" : "application/x-www-form-urlencoded",
          "params" : [ {
            "name" : "password",
            "value" : "morethan15characters",
            "comment" : ""
          }, {
            "name" : "email",
            "value" : "cropmetricsvo.longpass@gmail.com",
            "comment" : ""
          }, {
            "name" : "fullname",
            "value" : "test validation",
            "comment" : ""
          }, {
            "name" : "phone",
            "value" : "12323456",
            "comment" : ""
          }, {
            "name" : "dealer",
            "value" : "dealer test validation",
            "comment" : ""
          }, {
            "name" : "addressLine1",
            "value" : "address line 1 test validation",
            "comment" : ""
          }, {
            "name" : "addressLine2",
            "value" : "address line 2 test validation",
            "comment" : ""
          }, {
            "name" : "town",
            "value" : "townValidation",
            "comment" : ""
          }, {
            "name" : "state",
            "value" : "stateValidation",
            "comment" : ""
          }, {
            "name" : "zip",
            "value" : "zipValidation",
            "comment" : ""
          }, {
            "name" : "country",
            "value" : "countryValidation",
            "comment" : ""
          }, {
            "name" : "roles",
            "value" : "Client",
            "comment" : ""
          } ],
          "comment" : ""
        },
        "headersSize" : 544,
        "bodySize" : 327,
        "comment" : ""
      },
      "response" : {
        "status" : 400,
        "statusText" : "Bad Request",
        "httpVersion" : "HTTP/1.1",
        "cookies" : [ {
          "name" : ".ASPROLES",
          "value" : "ZxWFXsoXmjkp_h6ivUA9yUB4oFWXHUNO1jEUPQePS8OdghWyoG3ikF6WQR3iRL0WWnI5HR1VMy78HIsnYXHAIxBgztXysJhcYDeIt8lyV6JOj0X31a9xeQ6rKhMZg0Kbmwuw7TtOqQAvvU5iLrdJN2gldIEeAVIfJ292opd2MVMw8Xb3OR0EZ1LRO57AH63A819KvyALLQc-7Aq1JwClz5PC8JWrEDIAt-NqmG0pP8pSJGCXxr_tKROdAmhjcOoK0hzNYE6WPVPO3kSVkmScQl9n5t7c04S0gmorWFm8q5NSxQTVAEoyqfohxUYgunjwb4y9X6NR3I4nfvrAQ6PIP_aAW7ZVwLngiqfD30AbQq_FRsPVkB94OiDp0dyGAcYYqIYE8Vq9TAfnMTwoyl_jeCUbdY87-SVOwOncdd-5pysYYY_iWSmX2zRACl7Afy5-grx7RueEfQNtgvGBAsdlmJf0ctfwFFCKunAYgK1i4GlG88dm0",
          "path" : "/",
          "httpOnly" : true,
          "secure" : false,
          "comment" : ""
        } ],
        "headers" : [ {
          "name" : "Cache-Control",
          "value" : "private"
        }, {
          "name" : "Content-Type",
          "value" : "application/json; charset=utf-8"
        }, {
          "name" : "Server",
          "value" : "Microsoft-IIS/10.0"
        }, {
          "name" : "Set-Cookie",
          "value" : ".ASPROLES=ZxWFXsoXmjkp_h6ivUA9yUB4oFWXHUNO1jEUPQePS8OdghWyoG3ikF6WQR3iRL0WWnI5HR1VMy78HIsnYXHAIxBgztXysJhcYDeIt8lyV6JOj0X31a9xeQ6rKhMZg0Kbmwuw7TtOqQAvvU5iLrdJN2gldIEeAVIfJ292opd2MVMw8Xb3OR0EZ1LRO57AH63A819KvyALLQc-7Aq1JwClz5PC8JWrEDIAt-NqmG0pP8pSJGCXxr_tKROdAmhjcOoK0hzNYE6WPVPO3kSVkmScQl9n5t7c04S0gmorWFm8q5NSxQTVAEoyqfohxUYgunjwb4y9X6NR3I4nfvrAQ6PIP_aAW7ZVwLngiqfD30AbQq_FRsPVkB94OiDp0dyGAcYYqIYE8Vq9TAfnMTwoyl_jeCUbdY87-SVOwOncdd-5pysYYY_iWSmX2zRACl7Afy5-grx7RueEfQNtgvGBAsdlmJf0ctfwFFCKunAYgK1i4GlG88dm0; path=/; HttpOnly"
        }, {
          "name" : "X-SourceFiles",
          "value" : "=?UTF-8?B?RDpcVmlydHVhbE9wdGltaXplci1SZWZhY3RvcmluZ1xDcm9wTWV0cmljcy5Wby5BcGlcQ3JvcE1ldHJpY3MuVm8uQXBpXGFwaVxhZG1pblx2MVx1c2Vyc1w=?="
        }, {
          "name" : "X-Powered-By",
          "value" : "ASP.NET"
        }, {
          "name" : "Date",
          "value" : "Thu, 28 Mar 2019 21:50:55 GMT"
        }, {
          "name" : "Content-Length",
          "value" : "85"
        } ],
        "content" : {
          "size" : 85,
          "mimeType" : "application/json; charset=utf-8",
          "text" : "{\"message\":\"The request is invalid. The Password must contain as max 15 characters.\"}",
          "comment" : ""
        },
        "redirectURL" : "",
        "headersSize" : 897,
        "bodySize" : 85,
        "comment" : ""
      },
      "cache" : { },
      "timings" : {
        "comment" : "",
        "blocked" : -1,
        "wait" : 40,
        "receive" : 0,
        "dns" : -1,
        "send" : 0,
        "connect" : -1,
        "ssl" : -1
      },
      "serverIPAddress" : "127.0.0.1",
      "comment" : "",
      "_katalonRequestInformation" : {
        "name" : "35",
        "testObjectId" : "Object Repository/VoPro/Account/api_admin_v1_users",
        "harId" : "9192c1b9-7dd6-4d20-9792-7c2d49d180df"
      },
      "time" : 41
    } ],
    "comment" : ""
  }
}