{
  "log" : {
    "version" : "1.2",
    "creator" : {
      "name" : "BrowserMob Proxy",
      "version" : "2.1.5",
      "comment" : ""
    },
    "pages" : [ {
      "id" : "Page 0",
      "startedDateTime" : "2019-04-09T21:03:43.415Z",
      "title" : "Page 0",
      "pageTimings" : {
        "onLoad" : 28,
        "comment" : ""
      },
      "comment" : ""
    } ],
    "entries" : [ {
      "pageref" : "Page 0",
      "startedDateTime" : "2019-04-09T21:03:43.418Z",
      "request" : {
        "method" : "PUT",
        "url" : "http://localhost:10520/WebAPI/api/mobile/v1/fields/!!!!!?",
        "httpVersion" : "HTTP/1.1",
        "cookies" : [ ],
        "headers" : [ {
          "name" : "User-Agent",
          "value" : "Katalon Studio"
        }, {
          "name" : "Content-Type",
          "value" : "application/json"
        }, {
          "name" : "Authorization",
          "value" : "Bearer eyJ0eXAiOiJKV1QiLCJhbGciOiJIUzI1NiJ9.eyJ1bmlxdWVfbmFtZSI6Implbm55Lm1hbGRvbmFkby50eDFAZ21haWwuY29tIiwicm9sZSI6InVzZXIiLCJzdWIiOiJqZW5ueS5tYWxkb25hZG8udHgxQGdtYWlsLmNvbSIsImlzcyI6IkNyb3BNZXRyaWNzIiwiYXVkIjoiYWxsIiwiZXhwIjoxNTU0ODQ3NzIzLCJuYmYiOjE1NTQ4NDM4MjN9.gVRRwmRwbWYRr4oNq5aaAvKBRuQvBmKhb2APwrOOxf8"
        }, {
          "name" : "Host",
          "value" : "localhost:10520"
        }, {
          "name" : "Accept",
          "value" : "text/html, image/gif, image/jpeg, *; q=.2, */*; q=.2"
        }, {
          "name" : "Proxy-Connection",
          "value" : "keep-alive"
        }, {
          "name" : "Content-Length",
          "value" : "389"
        } ],
        "queryString" : [ ],
        "postData" : {
          "mimeType" : "application/json",
          "text" : "{\"field\":{\"name\":\"Field by agent not assigned\",\"boundary\":{\"boundaries\":[{\"boundary\":{\"coords\":[{\"x\":-101.49568751,\"y\":37.14976293},{\"x\":-101.50049403,\"y\":37.14647907},{\"x\":-101.50049403,\"y\":37.14264773},{\"x\":-101.49723246,\"y\":37.1411425},{\"x\":-101.49019435,\"y\":37.14223722},{\"x\":-101.48933604,\"y\":37.14620541},{\"x\":-101.49294093,\"y\":37.14866833},{\"x\":-101.49568751,\"y\":37.14976293}]}}]}}}",
          "comment" : ""
        },
        "headersSize" : 597,
        "bodySize" : 389,
        "comment" : ""
      },
      "response" : {
        "status" : 400,
        "statusText" : "Bad Request",
        "httpVersion" : "HTTP/1.1",
        "cookies" : [ {
          "name" : ".ASPROLES",
          "value" : "m5vFSd9nLE3WsVZPnEi7e7nd3ly4BY7UDYi4Tb2B0wZtuUjjB50AwEliaBvg46rEr7WG_HWB-Ln2zGyMI-1XgcqSh1orhlX3NGSvlF_hVD1SmEcZgmX-HmuBcMZHyM-WM9pVn0aOaTsGCKO491FiW-60f8ssGSGbgoWKx-ZrwLLFjCU5E8CsDozIRFxNdCdpEtLK1VQ2-UmUkynvKm_uG1fOTypFDSUfYSwKpVPYrRxqLPTBirAIkESW05HHzjcJKfBjW9d3PmPzoRRGJDHyrUSDrq3XR3ZvvbVMeCJxnSZqowqoMMEtSrlLhwi27iNdhP2l4ZGgXZzYlR52EOAdVRuBC3L_yBJcAZtqFIviSzzptNpCMVWa2-B0tPdsXU_OVdrjnquFLzq1aEWgNb2PqFYl9YR0YoHQfJ-zgM2x5N9TVXAw0lm8TUkVHd7Y8P97MClRr6ugAG6oREkFq7n8mm6Rr4Zp8wkR-BAhaWemz80skRE2u4j0mbyJpqHtyobmeOzS0EL0Oyv1R5Py5F_CMcI0nRo1",
          "path" : "/",
          "httpOnly" : true,
          "secure" : false,
          "comment" : ""
        } ],
        "headers" : [ {
          "name" : "Cache-Control",
          "value" : "private"
        }, {
          "name" : "Content-Type",
          "value" : "application/json; charset=utf-8"
        }, {
          "name" : "Server",
          "value" : "Microsoft-IIS/10.0"
        }, {
          "name" : "Set-Cookie",
          "value" : ".ASPROLES=m5vFSd9nLE3WsVZPnEi7e7nd3ly4BY7UDYi4Tb2B0wZtuUjjB50AwEliaBvg46rEr7WG_HWB-Ln2zGyMI-1XgcqSh1orhlX3NGSvlF_hVD1SmEcZgmX-HmuBcMZHyM-WM9pVn0aOaTsGCKO491FiW-60f8ssGSGbgoWKx-ZrwLLFjCU5E8CsDozIRFxNdCdpEtLK1VQ2-UmUkynvKm_uG1fOTypFDSUfYSwKpVPYrRxqLPTBirAIkESW05HHzjcJKfBjW9d3PmPzoRRGJDHyrUSDrq3XR3ZvvbVMeCJxnSZqowqoMMEtSrlLhwi27iNdhP2l4ZGgXZzYlR52EOAdVRuBC3L_yBJcAZtqFIviSzzptNpCMVWa2-B0tPdsXU_OVdrjnquFLzq1aEWgNb2PqFYl9YR0YoHQfJ-zgM2x5N9TVXAw0lm8TUkVHd7Y8P97MClRr6ugAG6oREkFq7n8mm6Rr4Zp8wkR-BAhaWemz80skRE2u4j0mbyJpqHtyobmeOzS0EL0Oyv1R5Py5F_CMcI0nRo1; path=/; HttpOnly"
        }, {
          "name" : "X-SourceFiles",
          "value" : "=?UTF-8?B?RDpcVmlydHVhbE9wdGltaXplci1SZWZhY3RvcmluZ1xDcm9wTWV0cmljcy5Wby5BcGlcQ3JvcE1ldHJpY3MuVm8uQXBpXGFwaVxtb2JpbGVcdjFcZmllbGRzXCEhISEh?="
        }, {
          "name" : "X-Powered-By",
          "value" : "ASP.NET"
        }, {
          "name" : "Date",
          "value" : "Tue, 09 Apr 2019 21:03:42 GMT"
        }, {
          "name" : "Content-Length",
          "value" : "79"
        } ],
        "content" : {
          "size" : 79,
          "mimeType" : "application/json; charset=utf-8",
          "text" : "{\"message\":\"The request is invalid. The value '!!!!!' is not valid for Int32.\"}",
          "comment" : ""
        },
        "redirectURL" : "",
        "headersSize" : 948,
        "bodySize" : 79,
        "comment" : ""
      },
      "cache" : { },
      "timings" : {
        "comment" : "",
        "send" : 0,
        "connect" : -1,
        "dns" : -1,
        "receive" : 0,
        "wait" : 22,
        "blocked" : -1,
        "ssl" : -1
      },
      "serverIPAddress" : "127.0.0.1",
      "comment" : "",
      "_katalonRequestInformation" : {
        "name" : "31",
        "testObjectId" : "Object Repository/VoGrow/Field/FieldPut",
        "harId" : "bb9481fe-1122-40fc-9abd-d9bd20f09da0"
      },
      "time" : 23
    } ],
    "comment" : ""
  }
}