{
  "log" : {
    "version" : "1.2",
    "creator" : {
      "name" : "BrowserMob Proxy",
      "version" : "2.1.5",
      "comment" : ""
    },
    "pages" : [ {
      "id" : "Page 0",
      "startedDateTime" : "2019-04-01T13:34:19.469Z",
      "title" : "Page 0",
      "pageTimings" : {
        "onLoad" : 123,
        "comment" : ""
      },
      "comment" : ""
    } ],
    "entries" : [ {
      "pageref" : "Page 0",
      "startedDateTime" : "2019-04-01T13:34:19.471Z",
      "request" : {
        "method" : "POST",
        "url" : "http://localhost:10520/WebAPI/api/admin/v1/users/?",
        "httpVersion" : "HTTP/1.1",
        "cookies" : [ ],
        "headers" : [ {
          "name" : "User-Agent",
          "value" : "Katalon Studio"
        }, {
          "name" : "Content-Type",
          "value" : "application/x-www-form-urlencoded"
        }, {
          "name" : "Authorization",
          "value" : "Bearer eyJ0eXAiOiJKV1QiLCJhbGciOiJIUzI1NiJ9.eyJ1bmlxdWVfbmFtZSI6ImFkbWluIiwicm9sZSI6InVzZXIiLCJzdWIiOiJhZG1pbiIsImlzcyI6IkNyb3BNZXRyaWNzIiwiYXVkIjoiYWxsIiwiZXhwIjoxNTU0MTI5NTU5LCJuYmYiOjE1NTQxMjU2NTl9.8MwIngavEerc3rAh7qBmy-pJmZIZ8jCAH0p-JMZ23Fc"
        }, {
          "name" : "Host",
          "value" : "localhost:10520"
        }, {
          "name" : "Accept",
          "value" : "text/html, image/gif, image/jpeg, *; q=.2, */*; q=.2"
        }, {
          "name" : "Proxy-Connection",
          "value" : "keep-alive"
        }, {
          "name" : "Content-Length",
          "value" : "279"
        } ],
        "queryString" : [ ],
        "postData" : {
          "mimeType" : "application/x-www-form-urlencoded",
          "params" : [ {
            "name" : "password",
            "value" : "cropmetrics",
            "comment" : ""
          }, {
            "name" : "email",
            "value" : "",
            "comment" : ""
          }, {
            "name" : "fullname",
            "value" : "test validation",
            "comment" : ""
          }, {
            "name" : "phone",
            "value" : "123",
            "comment" : ""
          }, {
            "name" : "dealer",
            "value" : "dealer test validation",
            "comment" : ""
          }, {
            "name" : "addressLine1",
            "value" : "address line 1 test validation",
            "comment" : ""
          }, {
            "name" : "addressLine2",
            "value" : "address line 2 test validation",
            "comment" : ""
          }, {
            "name" : "town",
            "value" : "townValidation",
            "comment" : ""
          }, {
            "name" : "state",
            "value" : "stateValidation",
            "comment" : ""
          }, {
            "name" : "zip",
            "value" : "zipValidation",
            "comment" : ""
          }, {
            "name" : "country",
            "value" : "countryValidation",
            "comment" : ""
          }, {
            "name" : "roles",
            "value" : "Client",
            "comment" : ""
          } ],
          "comment" : ""
        },
        "headersSize" : 544,
        "bodySize" : 279,
        "comment" : ""
      },
      "response" : {
        "status" : 400,
        "statusText" : "Bad Request",
        "httpVersion" : "HTTP/1.1",
        "cookies" : [ {
          "name" : ".ASPROLES",
          "value" : "JbifGQpkcCWNBMqnLnazuKHyycexJ15YXFh8fDXoa8zl7kdV4kiMUSKcWyL7_lnX8JJIFplWaHoKDk_RB8-eLPyi5luQu-KiO6UGJMBV4DN5aLX_Ge3SB3LngYQizOMbUwaCPimy__-66e2VVaeqHkw7GTC_oP1HPsyEczfZvCfIK_vV7YA8AZdXlOHotse_jS1RbGNEp8MnEfbfiA9B41_cdWvn9SRk9810j2qBdpkOhmek-nHatTzBhNh3ZYptRuqTCsst2ME90Q3Nga1rvc9d_bgnIhdUWC0L7NKMdjT9uI27NTlrEg3G3vqgZGSpTmYgMpivv8iOwm25JiFB2hOqVBtU0rgb7VNBuC3cU3zSduGZ5nHBCCeHoEBNKWNExDiO_0C21yJ9D-GYyWSEYRuNdVUQt9z_14mUPqZGOHuJaPThZ38yufzId7Jf7FXlFub2CUtYXbbSh46FT5d_pPSxZ7zJeKgcA7UINyT5LlcpeK7l0",
          "path" : "/",
          "httpOnly" : true,
          "secure" : false,
          "comment" : ""
        } ],
        "headers" : [ {
          "name" : "Cache-Control",
          "value" : "private"
        }, {
          "name" : "Content-Type",
          "value" : "application/json; charset=utf-8"
        }, {
          "name" : "Server",
          "value" : "Microsoft-IIS/10.0"
        }, {
          "name" : "Set-Cookie",
          "value" : ".ASPROLES=JbifGQpkcCWNBMqnLnazuKHyycexJ15YXFh8fDXoa8zl7kdV4kiMUSKcWyL7_lnX8JJIFplWaHoKDk_RB8-eLPyi5luQu-KiO6UGJMBV4DN5aLX_Ge3SB3LngYQizOMbUwaCPimy__-66e2VVaeqHkw7GTC_oP1HPsyEczfZvCfIK_vV7YA8AZdXlOHotse_jS1RbGNEp8MnEfbfiA9B41_cdWvn9SRk9810j2qBdpkOhmek-nHatTzBhNh3ZYptRuqTCsst2ME90Q3Nga1rvc9d_bgnIhdUWC0L7NKMdjT9uI27NTlrEg3G3vqgZGSpTmYgMpivv8iOwm25JiFB2hOqVBtU0rgb7VNBuC3cU3zSduGZ5nHBCCeHoEBNKWNExDiO_0C21yJ9D-GYyWSEYRuNdVUQt9z_14mUPqZGOHuJaPThZ38yufzId7Jf7FXlFub2CUtYXbbSh46FT5d_pPSxZ7zJeKgcA7UINyT5LlcpeK7l0; path=/; HttpOnly"
        }, {
          "name" : "X-SourceFiles",
          "value" : "=?UTF-8?B?RDpcVmlydHVhbE9wdGltaXplci1SZWZhY3RvcmluZ1xDcm9wTWV0cmljcy5Wby5BcGlcQ3JvcE1ldHJpY3MuVm8uQXBpXGFwaVxhZG1pblx2MVx1c2Vyc1w=?="
        }, {
          "name" : "X-Powered-By",
          "value" : "ASP.NET"
        }, {
          "name" : "Date",
          "value" : "Mon, 01 Apr 2019 13:34:18 GMT"
        }, {
          "name" : "Content-Length",
          "value" : "97"
        } ],
        "content" : {
          "size" : 97,
          "mimeType" : "application/json; charset=utf-8",
          "text" : "{\"message\":\"The request is invalid. The Email cannot be blank or the value provided is invalid.\"}",
          "comment" : ""
        },
        "redirectURL" : "",
        "headersSize" : 897,
        "bodySize" : 97,
        "comment" : ""
      },
      "cache" : { },
      "timings" : {
        "comment" : "",
        "ssl" : -1,
        "wait" : 115,
        "receive" : 1,
        "send" : 0,
        "dns" : -1,
        "blocked" : -1,
        "connect" : -1
      },
      "serverIPAddress" : "127.0.0.1",
      "comment" : "",
      "_katalonRequestInformation" : {
        "name" : "7",
        "testObjectId" : "Object Repository/VoPro/Account/api_admin_v1_users",
        "harId" : "a4ef5781-1d0d-40e3-9f3e-f093c0873982"
      },
      "time" : 117
    } ],
    "comment" : ""
  }
}