{
  "log" : {
    "version" : "1.2",
    "creator" : {
      "name" : "BrowserMob Proxy",
      "version" : "2.1.5",
      "comment" : ""
    },
    "pages" : [ {
      "id" : "Page 0",
      "startedDateTime" : "2019-03-28T19:24:49.526Z",
      "title" : "Page 0",
      "pageTimings" : {
        "onLoad" : 1421,
        "comment" : ""
      },
      "comment" : ""
    } ],
    "entries" : [ {
      "pageref" : "Page 0",
      "startedDateTime" : "2019-03-28T19:24:49.527Z",
      "request" : {
        "method" : "POST",
        "url" : "http://localhost:10520/WebAPI/api/admin/v1/users/?",
        "httpVersion" : "HTTP/1.1",
        "cookies" : [ ],
        "headers" : [ {
          "name" : "User-Agent",
          "value" : "Katalon Studio"
        }, {
          "name" : "Content-Type",
          "value" : "application/x-www-form-urlencoded"
        }, {
          "name" : "Authorization",
          "value" : "Bearer eyJ0eXAiOiJKV1QiLCJhbGciOiJIUzI1NiJ9.eyJ1bmlxdWVfbmFtZSI6ImFkbWluIiwicm9sZSI6InVzZXIiLCJzdWIiOiJhZG1pbiIsImlzcyI6IkNyb3BNZXRyaWNzIiwiYXVkIjoiYWxsIiwiZXhwIjoxNTUzODA0OTg5LCJuYmYiOjE1NTM4MDEwODl9.BrwbCTAZ1rkDKh3mjWXYoHRPcrW7coaGFJo5uwYIMjQ"
        }, {
          "name" : "Host",
          "value" : "localhost:10520"
        }, {
          "name" : "Accept",
          "value" : "text/html, image/gif, image/jpeg, *; q=.2, */*; q=.2"
        }, {
          "name" : "Proxy-Connection",
          "value" : "keep-alive"
        }, {
          "name" : "Content-Length",
          "value" : "586"
        } ],
        "queryString" : [ ],
        "postData" : {
          "mimeType" : "application/x-www-form-urlencoded",
          "params" : [ {
            "name" : "password",
            "value" : "cropmetrics",
            "comment" : ""
          }, {
            "name" : "email",
            "value" : "cropmetricsvo.ziplong@gmail.com",
            "comment" : ""
          }, {
            "name" : "fullname",
            "value" : "test validation",
            "comment" : ""
          }, {
            "name" : "phone",
            "value" : "123",
            "comment" : ""
          }, {
            "name" : "dealer",
            "value" : "x",
            "comment" : ""
          }, {
            "name" : "addressLine1",
            "value" : "address line 1 test validation",
            "comment" : ""
          }, {
            "name" : "addressLine2",
            "value" : "address line 2 test validation",
            "comment" : ""
          }, {
            "name" : "town",
            "value" : "townValidation",
            "comment" : ""
          }, {
            "name" : "state",
            "value" : "stateValidation",
            "comment" : ""
          }, {
            "name" : "zip",
            "value" : "23 API_ACNT_When_new_account_have_long_zip_attribute_Expected_status_code_20023 API_ACNT_When_new_account_have_long_zip_attribute_Expected_status_code_20023 API_ACNT_When_new_account_have_long_zip_attribute_Expected_status_code_20023 API_ACNT_When_new_account_have_long_zip_attribute_Expected_status_code_200",
            "comment" : ""
          }, {
            "name" : "country",
            "value" : "countryValidation",
            "comment" : ""
          }, {
            "name" : "roles",
            "value" : "Client",
            "comment" : ""
          } ],
          "comment" : ""
        },
        "headersSize" : 544,
        "bodySize" : 586,
        "comment" : ""
      },
      "response" : {
        "status" : 200,
        "statusText" : "OK",
        "httpVersion" : "HTTP/1.1",
        "cookies" : [ {
          "name" : ".ASPROLES",
          "value" : "NaqW4zLPtEJQCD9H_fBA3TdK-7k9Gvo9ca4A2jwBNDaA2EnNJDZGoYCvBvdhZ0f2DIKVfLntofzjkyrodluHk7-kNtKYmEnD54-IyDxNVjhbCGN72Bwx7FsHb7_XLhgaqt5m2WmdmhZXXvz5DltCMJP4WCrAYJdyApVvZjFnVPp_HunzII7lpJTEw8o730NHQbNdcve6gafwsKPY4ySnGcmXvg3NxIVLSfiyriQw_QItrm5COZycGbnRuQIJftuyb1tf21QVglU6DtVoEpEGbeFnQnRC8ntDuDs0J7uriOZJlJMVNDEfNDfF-i8YEOzRFVMjMYozsHKBPY_DCpNRrttxb91jto4GAJYmXmdjLXc-dpSBCKwqwSjGesOOC7MNDBys6KbKeRkRDardbMtzt_n6AuHPkX-dbCb10HOJHdxLirAfrEQJAfoOdWZkBMFvIVLoetwXvlJP54B5tAm1-E0lgZBkfnPolURF8BJ5A8KcM4to0",
          "path" : "/",
          "httpOnly" : true,
          "secure" : false,
          "comment" : ""
        } ],
        "headers" : [ {
          "name" : "Cache-Control",
          "value" : "private"
        }, {
          "name" : "Content-Type",
          "value" : "application/json; charset=utf-8"
        }, {
          "name" : "Server",
          "value" : "Microsoft-IIS/10.0"
        }, {
          "name" : "Set-Cookie",
          "value" : ".ASPROLES=NaqW4zLPtEJQCD9H_fBA3TdK-7k9Gvo9ca4A2jwBNDaA2EnNJDZGoYCvBvdhZ0f2DIKVfLntofzjkyrodluHk7-kNtKYmEnD54-IyDxNVjhbCGN72Bwx7FsHb7_XLhgaqt5m2WmdmhZXXvz5DltCMJP4WCrAYJdyApVvZjFnVPp_HunzII7lpJTEw8o730NHQbNdcve6gafwsKPY4ySnGcmXvg3NxIVLSfiyriQw_QItrm5COZycGbnRuQIJftuyb1tf21QVglU6DtVoEpEGbeFnQnRC8ntDuDs0J7uriOZJlJMVNDEfNDfF-i8YEOzRFVMjMYozsHKBPY_DCpNRrttxb91jto4GAJYmXmdjLXc-dpSBCKwqwSjGesOOC7MNDBys6KbKeRkRDardbMtzt_n6AuHPkX-dbCb10HOJHdxLirAfrEQJAfoOdWZkBMFvIVLoetwXvlJP54B5tAm1-E0lgZBkfnPolURF8BJ5A8KcM4to0; path=/; HttpOnly"
        }, {
          "name" : "X-SourceFiles",
          "value" : "=?UTF-8?B?RDpcVmlydHVhbE9wdGltaXplci1SZWZhY3RvcmluZ1xDcm9wTWV0cmljcy5Wby5BcGlcQ3JvcE1ldHJpY3MuVm8uQXBpXGFwaVxhZG1pblx2MVx1c2Vyc1w=?="
        }, {
          "name" : "X-Powered-By",
          "value" : "ASP.NET"
        }, {
          "name" : "Date",
          "value" : "Thu, 28 Mar 2019 19:24:50 GMT"
        }, {
          "name" : "Content-Length",
          "value" : "9"
        } ],
        "content" : {
          "size" : 9,
          "mimeType" : "application/json; charset=utf-8",
          "text" : "{\"id\":31}",
          "comment" : ""
        },
        "redirectURL" : "",
        "headersSize" : 887,
        "bodySize" : 9,
        "comment" : ""
      },
      "cache" : { },
      "timings" : {
        "comment" : "",
        "ssl" : -1,
        "wait" : 1416,
        "receive" : 0,
        "send" : 0,
        "connect" : -1,
        "blocked" : -1,
        "dns" : -1
      },
      "serverIPAddress" : "127.0.0.1",
      "comment" : "",
      "_katalonRequestInformation" : {
        "name" : "77",
        "testObjectId" : "Object Repository/VoPro/Account/api_admin_v1_users",
        "harId" : "993037db-ca49-4bba-8a6d-acd9a9ef9367"
      },
      "time" : 1417
    } ],
    "comment" : ""
  }
}