{
  "log" : {
    "version" : "1.2",
    "creator" : {
      "name" : "BrowserMob Proxy",
      "version" : "2.1.5",
      "comment" : ""
    },
    "pages" : [ {
      "id" : "Page 0",
      "startedDateTime" : "2019-03-29T16:39:53.991Z",
      "title" : "Page 0",
      "pageTimings" : {
        "onLoad" : 31,
        "comment" : ""
      },
      "comment" : ""
    } ],
    "entries" : [ {
      "pageref" : "Page 0",
      "startedDateTime" : "2019-03-29T16:39:53.991Z",
      "request" : {
        "method" : "POST",
        "url" : "http://localhost:10520/WebAPI/api/admin/v1/users/?",
        "httpVersion" : "HTTP/1.1",
        "cookies" : [ ],
        "headers" : [ {
          "name" : "User-Agent",
          "value" : "Katalon Studio"
        }, {
          "name" : "Content-Type",
          "value" : "application/x-www-form-urlencoded"
        }, {
          "name" : "Authorization",
          "value" : "Bearer eyJ0eXAiOiJKV1QiLCJhbGciOiJIUzI1NiJ9.eyJ1bmlxdWVfbmFtZSI6ImFkbWluIiwicm9sZSI6InVzZXIiLCJzdWIiOiJhZG1pbiIsImlzcyI6IkNyb3BNZXRyaWNzIiwiYXVkIjoiYWxsIiwiZXhwIjoxNTUzODgxNDkzLCJuYmYiOjE1NTM4Nzc1OTN9.DVvCoDs9IXyK80rrNxZqKr-IxPf0XEaUvzmL7z5xA4I"
        }, {
          "name" : "Host",
          "value" : "localhost:10520"
        }, {
          "name" : "Accept",
          "value" : "text/html, image/gif, image/jpeg, *; q=.2, */*; q=.2"
        }, {
          "name" : "Proxy-Connection",
          "value" : "keep-alive"
        }, {
          "name" : "Content-Length",
          "value" : "298"
        } ],
        "queryString" : [ ],
        "postData" : {
          "mimeType" : "application/x-www-form-urlencoded",
          "params" : [ {
            "name" : "password",
            "value" : "cropmetrics",
            "comment" : ""
          }, {
            "name" : "email",
            "value" : "cropmetricsvo emailwrongformat gmail.com",
            "comment" : ""
          }, {
            "name" : "fullname",
            "value" : "test validation",
            "comment" : ""
          }, {
            "name" : "phone",
            "value" : "123",
            "comment" : ""
          }, {
            "name" : "dealer",
            "value" : "x",
            "comment" : ""
          }, {
            "name" : "addressLine1",
            "value" : "address line 1 test validation",
            "comment" : ""
          }, {
            "name" : "addressLine2",
            "value" : "address line 1 test validation",
            "comment" : ""
          }, {
            "name" : "town",
            "value" : "townValidation",
            "comment" : ""
          }, {
            "name" : "state",
            "value" : "stateValidation",
            "comment" : ""
          }, {
            "name" : "zip",
            "value" : "zipValidation",
            "comment" : ""
          }, {
            "name" : "country",
            "value" : "countryValidation",
            "comment" : ""
          }, {
            "name" : "roles",
            "value" : "Client",
            "comment" : ""
          } ],
          "comment" : ""
        },
        "headersSize" : 544,
        "bodySize" : 298,
        "comment" : ""
      },
      "response" : {
        "status" : 400,
        "statusText" : "Bad Request",
        "httpVersion" : "HTTP/1.1",
        "cookies" : [ {
          "name" : ".ASPROLES",
          "value" : "Hm-tGGvfR5f9H18g5IZ5D-tne_ndBhONF7zt3vYS3HINoMIaKXSgk2OfcK6pMpPE-AOhwwIjHLn0Et-Jk_bz7Uou4IJueAMAmcpSpf1x3NxjLqRQ2VPEcvhwhgwmKWR4MCHMH87FI4MM4tDHnFpT5SmXRxAI214eVx36_O7XNqPzgf09ZZ-N8XmW3mJhzlui3GjpF_no_1v5onyU_EZpvAtTlvIYxqL9zzEv9ovip6GhNvCSyar3wUsr9D94ZgWoTT43ctU3MNP4RKpp1nym4eMlw0Po7RloQp1dNyebuZkUR7GsRp0JVjwWFMMtNiF5gc5UQ_LUENBfGZdZqVT6-mJpXXQDmZ_7tv-to7J_FdDpghtU1FEOoxQwmyLbR1ksdyKfjJv-0bhnlEYK_Fli7da4mM3WWvgcw2hs4afPfaDg9e4Ywj1QtleXjXqcU7tgxwYyGBGgjcsktbPEKU-x8jsBvI7aqcwNwaeSRPx0lHw9Ktn10",
          "path" : "/",
          "httpOnly" : true,
          "secure" : false,
          "comment" : ""
        } ],
        "headers" : [ {
          "name" : "Cache-Control",
          "value" : "private"
        }, {
          "name" : "Content-Type",
          "value" : "application/json; charset=utf-8"
        }, {
          "name" : "Server",
          "value" : "Microsoft-IIS/10.0"
        }, {
          "name" : "Set-Cookie",
          "value" : ".ASPROLES=Hm-tGGvfR5f9H18g5IZ5D-tne_ndBhONF7zt3vYS3HINoMIaKXSgk2OfcK6pMpPE-AOhwwIjHLn0Et-Jk_bz7Uou4IJueAMAmcpSpf1x3NxjLqRQ2VPEcvhwhgwmKWR4MCHMH87FI4MM4tDHnFpT5SmXRxAI214eVx36_O7XNqPzgf09ZZ-N8XmW3mJhzlui3GjpF_no_1v5onyU_EZpvAtTlvIYxqL9zzEv9ovip6GhNvCSyar3wUsr9D94ZgWoTT43ctU3MNP4RKpp1nym4eMlw0Po7RloQp1dNyebuZkUR7GsRp0JVjwWFMMtNiF5gc5UQ_LUENBfGZdZqVT6-mJpXXQDmZ_7tv-to7J_FdDpghtU1FEOoxQwmyLbR1ksdyKfjJv-0bhnlEYK_Fli7da4mM3WWvgcw2hs4afPfaDg9e4Ywj1QtleXjXqcU7tgxwYyGBGgjcsktbPEKU-x8jsBvI7aqcwNwaeSRPx0lHw9Ktn10; path=/; HttpOnly"
        }, {
          "name" : "X-SourceFiles",
          "value" : "=?UTF-8?B?RDpcVmlydHVhbE9wdGltaXplci1SZWZhY3RvcmluZ1xDcm9wTWV0cmljcy5Wby5BcGlcQ3JvcE1ldHJpY3MuVm8uQXBpXGFwaVxhZG1pblx2MVx1c2Vyc1w=?="
        }, {
          "name" : "X-Powered-By",
          "value" : "ASP.NET"
        }, {
          "name" : "Date",
          "value" : "Fri, 29 Mar 2019 16:39:53 GMT"
        }, {
          "name" : "Content-Length",
          "value" : "127"
        } ],
        "content" : {
          "size" : 127,
          "mimeType" : "application/json; charset=utf-8",
          "text" : "{\"message\":\"The request is invalid. The Email provided is not a valid email address. cropmetricsvo emailwrongformat gmail.com\"}",
          "comment" : ""
        },
        "redirectURL" : "",
        "headersSize" : 898,
        "bodySize" : 127,
        "comment" : ""
      },
      "cache" : { },
      "timings" : {
        "comment" : "",
        "ssl" : -1,
        "wait" : 29,
        "connect" : -1,
        "send" : 0,
        "blocked" : -1,
        "receive" : 0,
        "dns" : -1
      },
      "serverIPAddress" : "127.0.0.1",
      "comment" : "",
      "_katalonRequestInformation" : {
        "name" : "49",
        "testObjectId" : "Object Repository/VoPro/Account/api_admin_v1_users",
        "harId" : "85665aa8-1d7b-41de-acdd-9525ae9864b7"
      },
      "time" : 30
    } ],
    "comment" : ""
  }
}