{
  "log" : {
    "version" : "1.2",
    "creator" : {
      "name" : "BrowserMob Proxy",
      "version" : "2.1.5",
      "comment" : ""
    },
    "pages" : [ {
      "id" : "Page 0",
      "startedDateTime" : "2019-04-24T20:30:57.967Z",
      "title" : "Page 0",
      "pageTimings" : {
        "onLoad" : 3073,
        "comment" : ""
      },
      "comment" : ""
    } ],
    "entries" : [ {
      "pageref" : "Page 0",
      "startedDateTime" : "2019-04-24T20:30:57.968Z",
      "request" : {
        "method" : "POST",
        "url" : "http://localhost:10520/WebAPI/api/mobile/v1/fields?",
        "httpVersion" : "HTTP/1.1",
        "cookies" : [ ],
        "headers" : [ {
          "name" : "User-Agent",
          "value" : "Katalon Studio"
        }, {
          "name" : "Content-Type",
          "value" : "application/json"
        }, {
          "name" : "Authorization",
          "value" : "Bearer eyJ0eXAiOiJKV1QiLCJhbGciOiJIUzI1NiJ9.eyJ1bmlxdWVfbmFtZSI6Implbm55Lm1hbGRvbmFkby50eDFAZ21haWwuY29tIiwicm9sZSI6InVzZXIiLCJzdWIiOiJqZW5ueS5tYWxkb25hZG8udHgxQGdtYWlsLmNvbSIsImlzcyI6IkNyb3BNZXRyaWNzIiwiYXVkIjoiYWxsIiwiZXhwIjoxNTU2MTQxNzU3LCJuYmYiOjE1NTYxMzc4NTd9.PQns9K8EOm5aX2uFDhYmxd75LqWlGQnGIxXylY23wbg"
        }, {
          "name" : "Host",
          "value" : "localhost:10520"
        }, {
          "name" : "Accept",
          "value" : "text/html, image/gif, image/jpeg, *; q=.2, */*; q=.2"
        }, {
          "name" : "Proxy-Connection",
          "value" : "keep-alive"
        }, {
          "name" : "Content-Length",
          "value" : "371"
        } ],
        "queryString" : [ ],
        "postData" : {
          "mimeType" : "application/json",
          "text" : "{\"field\":{\"farm_id\":7,\"name\":\"Field without x value in boundary\",\"boundary\":{\"boundaries\":[{\"boundary\":{\"coords\":[{\"x\":-101.49568751,\"y\":37.14976293},{\"x\":-101.50049403,\"y\":37.14647907},{\"x\":-101.50049403,\"y\":37.14264773},{\"x\":-101.49723246,\"y\":37.1411425},{\"x\":-101.49019435,\"y\":37.14223722},{\"x\":-101.48933604,\"y\":37.14620541},{\"x\":-101.49294093,\"y\":37.14866833}]}}]}}}",
          "comment" : ""
        },
        "headersSize" : 592,
        "bodySize" : 371,
        "comment" : ""
      },
      "response" : {
        "status" : 400,
        "statusText" : "Bad Request",
        "httpVersion" : "HTTP/1.1",
        "cookies" : [ {
          "name" : ".ASPROLES",
          "value" : "4sRs-B69pYI_fzOy2tyUfgdF5odkh0EPm-hwe1LTA9_pPxkqLjcTIMqQ9HfSMWELOiuugbjdX-I9iNxONU6299fm1O98oyxiKp1TXK2-kkGXjb9pd5sswireI3IlGQ-Jn3P-Yja-31mcL7s_1tlxARNz0EZ2K_hjAXtW3MNvLcoysHNQl-dZE9U8MyPeXfYPxdYgcNADhMECXcd2IFwS0K51jEuif3YKQkwHyEXWJHgbZghJQN7PaC9f8bZzaDUilsYBRI1mU0PjTCbCu19v8-CH4EdXI_PZ9kijbfYzMQNlzRMe31ZvDGJA5zA6j2imO4S6StmpkfHxdLOMjkyE7Keo7lXMixx2sdSQrZElnc-Q1xiKCGXLkfJCtitI64fHCxHaPd0qs9mWel_EAx1qunqt8NBOBcyFADQp134tchuP6yZTVBQw97MWiKtSTXs6Bv3MjbN2tSZMMLXySvxlNO-v38lVwfEaVaQEJC2Qappv3z_3odKsibcWDbVkumqYPy7wA2AbgzTFqic26nSY30JzoJY1",
          "path" : "/",
          "httpOnly" : true,
          "secure" : false,
          "comment" : ""
        } ],
        "headers" : [ {
          "name" : "Cache-Control",
          "value" : "private"
        }, {
          "name" : "Content-Type",
          "value" : "application/json; charset=utf-8"
        }, {
          "name" : "Server",
          "value" : "Microsoft-IIS/10.0"
        }, {
          "name" : "Set-Cookie",
          "value" : ".ASPROLES=4sRs-B69pYI_fzOy2tyUfgdF5odkh0EPm-hwe1LTA9_pPxkqLjcTIMqQ9HfSMWELOiuugbjdX-I9iNxONU6299fm1O98oyxiKp1TXK2-kkGXjb9pd5sswireI3IlGQ-Jn3P-Yja-31mcL7s_1tlxARNz0EZ2K_hjAXtW3MNvLcoysHNQl-dZE9U8MyPeXfYPxdYgcNADhMECXcd2IFwS0K51jEuif3YKQkwHyEXWJHgbZghJQN7PaC9f8bZzaDUilsYBRI1mU0PjTCbCu19v8-CH4EdXI_PZ9kijbfYzMQNlzRMe31ZvDGJA5zA6j2imO4S6StmpkfHxdLOMjkyE7Keo7lXMixx2sdSQrZElnc-Q1xiKCGXLkfJCtitI64fHCxHaPd0qs9mWel_EAx1qunqt8NBOBcyFADQp134tchuP6yZTVBQw97MWiKtSTXs6Bv3MjbN2tSZMMLXySvxlNO-v38lVwfEaVaQEJC2Qappv3z_3odKsibcWDbVkumqYPy7wA2AbgzTFqic26nSY30JzoJY1; path=/; HttpOnly"
        }, {
          "name" : "X-SourceFiles",
          "value" : "=?UTF-8?B?RDpcVmlydHVhbE9wdGltaXplci1SZWZhY3RvcmluZ1xDcm9wTWV0cmljcy5Wby5BcGlcQ3JvcE1ldHJpY3MuVm8uQXBpXGFwaVxtb2JpbGVcdjFcZmllbGRz?="
        }, {
          "name" : "X-Powered-By",
          "value" : "ASP.NET"
        }, {
          "name" : "Date",
          "value" : "Wed, 24 Apr 2019 20:31:01 GMT"
        }, {
          "name" : "Content-Length",
          "value" : "119"
        } ],
        "content" : {
          "size" : 119,
          "mimeType" : "application/json; charset=utf-8",
          "text" : "{\"message\":\"The Boundary is not valid. IllegalArgumentException: Points of LinearRing do not form a closed linestring\"}",
          "comment" : ""
        },
        "redirectURL" : "",
        "headersSize" : 941,
        "bodySize" : 119,
        "comment" : ""
      },
      "cache" : { },
      "timings" : {
        "comment" : "",
        "ssl" : -1,
        "receive" : 0,
        "send" : 0,
        "wait" : 3069,
        "connect" : -1,
        "blocked" : -1,
        "dns" : -1
      },
      "serverIPAddress" : "127.0.0.1",
      "comment" : "",
      "_katalonRequestInformation" : {
        "name" : "112",
        "testObjectId" : "Object Repository/VoGrow/Field/FieldPost",
        "harId" : "d8c50962-5ecf-49c1-a4f2-b3ad4ddcf845"
      },
      "time" : 3070
    } ],
    "comment" : ""
  }
}