Suite/Test/Step Name,Browser,Description,Tag,Start time,End time,Duration,Status
Restore_databases_with_flyway,,,,2019-08-01 10:51:13,2019-08-01 10:51:34,21.759s,PASSED
,,,,,,,
Test Cases/Databases/DB_Create_virtualoptimizer_database,,,,2019-08-01 10:51:13,2019-08-01 10:51:21,7.296s,PASSED
server = server,,,,2019-08-01 10:51:14,2019-08-01 10:51:15,0.936s,PASSED
port = port,,,,2019-08-01 10:51:15,2019-08-01 10:51:15,0.005s,PASSED
user = userDb,,,,2019-08-01 10:51:15,2019-08-01 10:51:15,0.002s,PASSED
password = passwordDb,,,,2019-08-01 10:51:15,2019-08-01 10:51:15,0.007s,PASSED
pathPostgreSQL = pathPostgreSQLBin,,,,2019-08-01 10:51:15,2019-08-01 10:51:15,0.015s,PASSED
"database = ""virtualoptimizer""",,,,2019-08-01 10:51:15,2019-08-01 10:51:15,0.013s,PASSED
"command = String.format(""cd ""%s"" && createdb -h %s -p %d -U %s  %s"", pathPostgreSQL, server, port, user, database)",,,,2019-08-01 10:51:15,2019-08-01 10:51:15,0.010s,PASSED
"commandLine.cmd.cmdLine(command, password)",,,,2019-08-01 10:51:15,2019-08-01 10:51:21,5.193s,PASSED
,,,,,,,
Test Cases/Databases/DBRestore_SqlScripts/DB_Restore_virtualoptimizer,,,,2019-08-01 10:51:21,2019-08-01 10:51:26,5.576s,PASSED
server = server,,,,2019-08-01 10:51:21,2019-08-01 10:51:21,0.001s,PASSED
port = port,,,,2019-08-01 10:51:21,2019-08-01 10:51:21,0.001s,PASSED
user = userDb,,,,2019-08-01 10:51:21,2019-08-01 10:51:21,0.001s,PASSED
password = passwordDb,,,,2019-08-01 10:51:21,2019-08-01 10:51:21,0.001s,PASSED
pathPostgreSQL = pathPostgreSQLBin,,,,2019-08-01 10:51:21,2019-08-01 10:51:21,0.004s,PASSED
"database = ""virtualoptimizer""",,,,2019-08-01 10:51:21,2019-08-01 10:51:21,0.002s,PASSED
"pathDumpFile = ""C:\KatalonFiles\virtualoptimizer.dump""",,,,2019-08-01 10:51:21,2019-08-01 10:51:21,0.002s,PASSED
"cRestore = String.format(""cd ""%s"" && pg_restore -U %s -h %s -p %d -c -C -d %s -v ""%s"""", pathPostgreSQL, user, server, port, database, pathDumpFile)",,,,2019-08-01 10:51:21,2019-08-01 10:51:21,0.005s,PASSED
"commandLine.cmd.cmdLine(cRestore, password)",,,,2019-08-01 10:51:21,2019-08-01 10:51:26,5.028s,PASSED
"println(""The restore virtualoptimizer database was completed..."")",,,,2019-08-01 10:51:26,2019-08-01 10:51:26,0.049s,PASSED
,,,,,,,
Test Cases/Databases/DB_Create_vo_probereadings_database,,,,2019-08-01 10:51:26,2019-08-01 10:51:33,6.493s,PASSED
server = server,,,,2019-08-01 10:51:28,2019-08-01 10:51:28,0.007s,PASSED
port = port,,,,2019-08-01 10:51:28,2019-08-01 10:51:28,0.006s,PASSED
user = userDb,,,,2019-08-01 10:51:28,2019-08-01 10:51:28,0.005s,PASSED
password = passwordDb,,,,2019-08-01 10:51:28,2019-08-01 10:51:28,0.004s,PASSED
pathPostgreSQL = pathPostgreSQLBin,,,,2019-08-01 10:51:28,2019-08-01 10:51:28,0.006s,PASSED
"database = ""vo_probeReadings""",,,,2019-08-01 10:51:28,2019-08-01 10:51:28,0.009s,PASSED
"command = String.format(""cd ""%s"" && createdb -h %s -p %d -U %s  %s"", pathPostgreSQL, server, port, user, database)",,,,2019-08-01 10:51:28,2019-08-01 10:51:28,0.013s,PASSED
"commandLine.cmd.cmdLine(command, password)",,,,2019-08-01 10:51:28,2019-08-01 10:51:33,5.024s,PASSED
,,,,,,,
Test Cases/Databases/DB_vo_probereadings_with_flyway,,,,2019-08-01 10:51:33,2019-08-01 10:51:34,1.340s,PASSED
user = userDb,,,,2019-08-01 10:51:33,2019-08-01 10:51:33,0.004s,PASSED
password = passwordDb,,,,2019-08-01 10:51:33,2019-08-01 10:51:33,0.009s,PASSED
pathFlyWay = flyway,,,,2019-08-01 10:51:33,2019-08-01 10:51:33,0.002s,PASSED
"url = ""jdbc:postgresql://localhost:5432/vo_probeReadings""",,,,2019-08-01 10:51:33,2019-08-01 10:51:33,0.000s,PASSED
"filesystem = ""C:\VirtualOptimizer-Refactoring\CropMetrics.Vo.Api\CropMetrics.Vo.Api\Resources\Database\probeReadings""",,,,2019-08-01 10:51:33,2019-08-01 10:51:33,0.000s,PASSED
"commandFlyWay = String.format(""cd ""%s"" && flyway -user=%s -password=%s -url=%s -locations=filesystem:""%s""  migrate"", pathFlyWay, user, password, url, filesystem)",,,,2019-08-01 10:51:33,2019-08-01 10:51:33,0.008s,PASSED
commandLine.cmd.singleCommand(commandFlyWay),,,,2019-08-01 10:51:33,2019-08-01 10:51:34,1.009s,PASSED
