{
  "log" : {
    "version" : "1.2",
    "creator" : {
      "name" : "BrowserMob Proxy",
      "version" : "2.1.5",
      "comment" : ""
    },
    "pages" : [ {
      "id" : "Page 0",
      "startedDateTime" : "2019-04-09T09:38:58.897Z",
      "title" : "Page 0",
      "pageTimings" : {
        "onLoad" : 11531,
        "comment" : ""
      },
      "comment" : ""
    } ],
    "entries" : [ {
      "pageref" : "Page 0",
      "startedDateTime" : "2019-04-09T09:38:58.897Z",
      "request" : {
        "method" : "POST",
        "url" : "http://localhost:10520/WebAPI/api/mobile/v1/fields?",
        "httpVersion" : "HTTP/1.1",
        "cookies" : [ ],
        "headers" : [ {
          "name" : "User-Agent",
          "value" : "Katalon Studio"
        }, {
          "name" : "Content-Type",
          "value" : "application/json"
        }, {
          "name" : "Authorization",
          "value" : "Bearer eyJ0eXAiOiJKV1QiLCJhbGciOiJIUzI1NiJ9.eyJ1bmlxdWVfbmFtZSI6Implbm55Lm1hbGRvbmFkby50eDFAZ21haWwuY29tIiwicm9sZSI6InVzZXIiLCJzdWIiOiJqZW5ueS5tYWxkb25hZG8udHgxQGdtYWlsLmNvbSIsImlzcyI6IkNyb3BNZXRyaWNzIiwiYXVkIjoiYWxsIiwiZXhwIjoxNTU0ODA2NjM4LCJuYmYiOjE1NTQ4MDI3Mzh9.991YSXp17LlE9V5ymHaWz16NmLcSeZMsjlNLBNrx2LA"
        }, {
          "name" : "Host",
          "value" : "localhost:10520"
        }, {
          "name" : "Accept",
          "value" : "text/html, image/gif, image/jpeg, *; q=.2, */*; q=.2"
        }, {
          "name" : "Proxy-Connection",
          "value" : "keep-alive"
        }, {
          "name" : "Content-Length",
          "value" : "396"
        } ],
        "queryString" : [ ],
        "postData" : {
          "mimeType" : "application/json",
          "text" : "{\"field\":{\"farm_id\":3,\"name\":\"FieldNameWithOnlyChars\",\"boundary\":{\"boundaries\":[{\"boundary\":{\"coords\":[{\"x\":-101.49568751,\"y\":37.14976293},{\"x\":-101.50049403,\"y\":37.14647907},{\"x\":-101.50049403,\"y\":37.14264773},{\"x\":-101.49723246,\"y\":37.1411425},{\"x\":-101.49019435,\"y\":37.14223722},{\"x\":-101.48933604,\"y\":37.14620541},{\"x\":-101.49294093,\"y\":37.14866833},{\"x\":-101.49568751,\"y\":37.14976293}]}}]}}}",
          "comment" : ""
        },
        "headersSize" : 592,
        "bodySize" : 396,
        "comment" : ""
      },
      "response" : {
        "status" : 400,
        "statusText" : "Bad Request",
        "httpVersion" : "HTTP/1.1",
        "cookies" : [ {
          "name" : ".ASPROLES",
          "value" : "Ljfqkgmloh1DjnRvWevgcb4ugZTSoBqrwtziqKQRAj1DJJbkiF9-BNzfClqXfhlqBaF9BS1T2hLId3L224PEQqwp1pAxPZcl2LyAk7-tBloveF-UhFSTRtYohLkjaglvtOo6q7VHmGoJnI6ZhRCXBxE6IwnaSP-uWANNOTiyL0okOXCVjZU5EPhCiQV72d2YduzzffxlfmFdei0misPAYDeSthDmPeIB4XKPSWcugaqu-8YEEeJAjq1P5huXWdoVFRofwR8PTFnQGQ1mKwk5nbc_FbZ8M3bkXDwjXjjlyfatUeBAwk2L6ipnmzTPEg6Xov_g_qf9dMKrJqSbWKG34gswL1nzTOKKjopjYExvGFLxhvHupL5y_EC8iw8vbr2ANE7CgmHgukZTqI2WMJtUCkUmDSq5mK1sRREnyynL5S57z431UC9rY_UXQVsbJkDR7uLjHlAclaZT6OFuMX9hKtYVQcbzspYg2bsmsOQ7RC3KvoNR-w8ItPBMIRe0QB8LgMLaBKedXifOis2blQzvn__ukKs1",
          "path" : "/",
          "httpOnly" : true,
          "secure" : false,
          "comment" : ""
        } ],
        "headers" : [ {
          "name" : "Cache-Control",
          "value" : "private"
        }, {
          "name" : "Content-Type",
          "value" : "application/json; charset=utf-8"
        }, {
          "name" : "Server",
          "value" : "Microsoft-IIS/10.0"
        }, {
          "name" : "Set-Cookie",
          "value" : ".ASPROLES=Ljfqkgmloh1DjnRvWevgcb4ugZTSoBqrwtziqKQRAj1DJJbkiF9-BNzfClqXfhlqBaF9BS1T2hLId3L224PEQqwp1pAxPZcl2LyAk7-tBloveF-UhFSTRtYohLkjaglvtOo6q7VHmGoJnI6ZhRCXBxE6IwnaSP-uWANNOTiyL0okOXCVjZU5EPhCiQV72d2YduzzffxlfmFdei0misPAYDeSthDmPeIB4XKPSWcugaqu-8YEEeJAjq1P5huXWdoVFRofwR8PTFnQGQ1mKwk5nbc_FbZ8M3bkXDwjXjjlyfatUeBAwk2L6ipnmzTPEg6Xov_g_qf9dMKrJqSbWKG34gswL1nzTOKKjopjYExvGFLxhvHupL5y_EC8iw8vbr2ANE7CgmHgukZTqI2WMJtUCkUmDSq5mK1sRREnyynL5S57z431UC9rY_UXQVsbJkDR7uLjHlAclaZT6OFuMX9hKtYVQcbzspYg2bsmsOQ7RC3KvoNR-w8ItPBMIRe0QB8LgMLaBKedXifOis2blQzvn__ukKs1; path=/; HttpOnly"
        }, {
          "name" : "X-SourceFiles",
          "value" : "=?UTF-8?B?RDpcVmlydHVhbE9wdGltaXplci1SZWZhY3RvcmluZ1xDcm9wTWV0cmljcy5Wby5BcGlcQ3JvcE1ldHJpY3MuVm8uQXBpXGFwaVxtb2JpbGVcdjFcZmllbGRz?="
        }, {
          "name" : "X-Powered-By",
          "value" : "ASP.NET"
        }, {
          "name" : "Date",
          "value" : "Tue, 09 Apr 2019 09:39:10 GMT"
        }, {
          "name" : "Content-Length",
          "value" : "56"
        } ],
        "content" : {
          "size" : 56,
          "mimeType" : "application/json; charset=utf-8",
          "text" : "{\"message\":\"The field name already exists in the farm.\"}",
          "comment" : ""
        },
        "redirectURL" : "",
        "headersSize" : 940,
        "bodySize" : 56,
        "comment" : ""
      },
      "cache" : { },
      "timings" : {
        "comment" : "",
        "ssl" : -1,
        "receive" : 0,
        "wait" : 11526,
        "connect" : -1,
        "blocked" : -1,
        "dns" : -1,
        "send" : 0
      },
      "serverIPAddress" : "127.0.0.1",
      "comment" : "",
      "_katalonRequestInformation" : {
        "name" : "61",
        "testObjectId" : "Object Repository/VoGrow/Field/FieldPost",
        "harId" : "916b88c7-8b55-428e-8ca5-1666a6bd7c09"
      },
      "time" : 11528
    } ],
    "comment" : ""
  }
}