{
  "log" : {
    "version" : "1.2",
    "creator" : {
      "name" : "BrowserMob Proxy",
      "version" : "2.1.5",
      "comment" : ""
    },
    "pages" : [ {
      "id" : "Page 0",
      "startedDateTime" : "2019-03-29T22:10:40.163Z",
      "title" : "Page 0",
      "pageTimings" : {
        "onLoad" : 1803,
        "comment" : ""
      },
      "comment" : ""
    } ],
    "entries" : [ {
      "pageref" : "Page 0",
      "startedDateTime" : "2019-03-29T22:10:40.164Z",
      "request" : {
        "method" : "POST",
        "url" : "http://localhost:10520/WebAPI/api/admin/v1/users/?",
        "httpVersion" : "HTTP/1.1",
        "cookies" : [ ],
        "headers" : [ {
          "name" : "User-Agent",
          "value" : "Katalon Studio"
        }, {
          "name" : "Content-Type",
          "value" : "application/x-www-form-urlencoded"
        }, {
          "name" : "Authorization",
          "value" : "Bearer eyJ0eXAiOiJKV1QiLCJhbGciOiJIUzI1NiJ9.eyJ1bmlxdWVfbmFtZSI6ImFkbWluIiwicm9sZSI6InVzZXIiLCJzdWIiOiJhZG1pbiIsImlzcyI6IkNyb3BNZXRyaWNzIiwiYXVkIjoiYWxsIiwiZXhwIjoxNTUzOTAxMzQwLCJuYmYiOjE1NTM4OTc0NDB9.v1vFqoGYHI4eCgrtIzpkgd4u7TQ1dOVVud17dx3BDvY"
        }, {
          "name" : "Host",
          "value" : "localhost:10520"
        }, {
          "name" : "Accept",
          "value" : "text/html, image/gif, image/jpeg, *; q=.2, */*; q=.2"
        }, {
          "name" : "Proxy-Connection",
          "value" : "keep-alive"
        }, {
          "name" : "Content-Length",
          "value" : "306"
        } ],
        "queryString" : [ ],
        "postData" : {
          "mimeType" : "application/x-www-form-urlencoded",
          "params" : [ {
            "name" : "password",
            "value" : "cropmetrics",
            "comment" : ""
          }, {
            "name" : "email",
            "value" : "cropmetricsvo.zipsymbol@gmail.com",
            "comment" : ""
          }, {
            "name" : "fullname",
            "value" : "test validation",
            "comment" : ""
          }, {
            "name" : "phone",
            "value" : "123",
            "comment" : ""
          }, {
            "name" : "dealer",
            "value" : "x",
            "comment" : ""
          }, {
            "name" : "addressLine1",
            "value" : "address line 1 test validation",
            "comment" : ""
          }, {
            "name" : "addressLine2",
            "value" : "address line 12 test validation",
            "comment" : ""
          }, {
            "name" : "town",
            "value" : "townValidation",
            "comment" : ""
          }, {
            "name" : "state",
            "value" : "stateValidation",
            "comment" : ""
          }, {
            "name" : "zip",
            "value" : "!@#$%^&*(",
            "comment" : ""
          }, {
            "name" : "country",
            "value" : "countryValidation",
            "comment" : ""
          }, {
            "name" : "roles",
            "value" : "Client",
            "comment" : ""
          } ],
          "comment" : ""
        },
        "headersSize" : 544,
        "bodySize" : 306,
        "comment" : ""
      },
      "response" : {
        "status" : 200,
        "statusText" : "OK",
        "httpVersion" : "HTTP/1.1",
        "cookies" : [ {
          "name" : ".ASPROLES",
          "value" : "r6C2WMXmn3eLAlENOXGsQmjQ59zTbdluOHQ0wwE11-xpTHf1qZPzR4CWiJO8eSNIdS1C9sy_u2n7RvvHynVkLh15VrpKeaeFAC5l18RSqYf5ndcurlYQXa4xh_5ItW6djXnZgTmtBSZmImDXL4C5Cau8PHm63PE8NjtGf2ZIgQJCR8Vw4BVXegwm4GDuciboS2T_FnFtPjvRql9xIYml7gVbYu3vndG0s0eKsQ0qNEGMyHT_Au01Z-MRJBgii2B1QtSmNiL5sgHdUMBqnu1kAj32etktPVbS8DXX2VUpvu24LfgsTuG7oDghbj68HNxB48r1vO2aPc7xXDgbKtKQqpg3X2-8_7If-7EDqklKsBaCg5gdunMPYoRd5y_H4MxhAocxt2pmx99-B6rChrUX6uB7x10n_lRQZRk-UxaI9ZNvFmu9UBeYNNAAhE4mPG3FPPyjNSYEvySlUwRTeQXjRD7HYem90jus0JOZ99ioX1rCkyu-0",
          "path" : "/",
          "httpOnly" : true,
          "secure" : false,
          "comment" : ""
        } ],
        "headers" : [ {
          "name" : "Cache-Control",
          "value" : "private"
        }, {
          "name" : "Content-Type",
          "value" : "application/json; charset=utf-8"
        }, {
          "name" : "Server",
          "value" : "Microsoft-IIS/10.0"
        }, {
          "name" : "Set-Cookie",
          "value" : ".ASPROLES=r6C2WMXmn3eLAlENOXGsQmjQ59zTbdluOHQ0wwE11-xpTHf1qZPzR4CWiJO8eSNIdS1C9sy_u2n7RvvHynVkLh15VrpKeaeFAC5l18RSqYf5ndcurlYQXa4xh_5ItW6djXnZgTmtBSZmImDXL4C5Cau8PHm63PE8NjtGf2ZIgQJCR8Vw4BVXegwm4GDuciboS2T_FnFtPjvRql9xIYml7gVbYu3vndG0s0eKsQ0qNEGMyHT_Au01Z-MRJBgii2B1QtSmNiL5sgHdUMBqnu1kAj32etktPVbS8DXX2VUpvu24LfgsTuG7oDghbj68HNxB48r1vO2aPc7xXDgbKtKQqpg3X2-8_7If-7EDqklKsBaCg5gdunMPYoRd5y_H4MxhAocxt2pmx99-B6rChrUX6uB7x10n_lRQZRk-UxaI9ZNvFmu9UBeYNNAAhE4mPG3FPPyjNSYEvySlUwRTeQXjRD7HYem90jus0JOZ99ioX1rCkyu-0; path=/; HttpOnly"
        }, {
          "name" : "X-SourceFiles",
          "value" : "=?UTF-8?B?RDpcVmlydHVhbE9wdGltaXplci1SZWZhY3RvcmluZ1xDcm9wTWV0cmljcy5Wby5BcGlcQ3JvcE1ldHJpY3MuVm8uQXBpXGFwaVxhZG1pblx2MVx1c2Vyc1w=?="
        }, {
          "name" : "X-Powered-By",
          "value" : "ASP.NET"
        }, {
          "name" : "Date",
          "value" : "Fri, 29 Mar 2019 22:10:41 GMT"
        }, {
          "name" : "Content-Length",
          "value" : "9"
        } ],
        "content" : {
          "size" : 9,
          "mimeType" : "application/json; charset=utf-8",
          "text" : "{\"id\":33}",
          "comment" : ""
        },
        "redirectURL" : "",
        "headersSize" : 887,
        "bodySize" : 9,
        "comment" : ""
      },
      "cache" : { },
      "timings" : {
        "comment" : "",
        "ssl" : -1,
        "connect" : -1,
        "send" : 0,
        "receive" : 0,
        "wait" : 1799,
        "dns" : -1,
        "blocked" : -1
      },
      "serverIPAddress" : "127.0.0.1",
      "comment" : "",
      "_katalonRequestInformation" : {
        "name" : "87",
        "testObjectId" : "Object Repository/VoPro/Account/api_admin_v1_users",
        "harId" : "89f9b66f-283e-46e5-b6c1-e195946b0d63"
      },
      "time" : 1800
    } ],
    "comment" : ""
  }
}