{
  "log" : {
    "version" : "1.2",
    "creator" : {
      "name" : "BrowserMob Proxy",
      "version" : "2.1.5",
      "comment" : ""
    },
    "pages" : [ {
      "id" : "Page 0",
      "startedDateTime" : "2019-03-28T20:41:59.221Z",
      "title" : "Page 0",
      "pageTimings" : {
        "onLoad" : 2465,
        "comment" : ""
      },
      "comment" : ""
    } ],
    "entries" : [ {
      "pageref" : "Page 0",
      "startedDateTime" : "2019-03-28T20:41:59.222Z",
      "request" : {
        "method" : "POST",
        "url" : "http://localhost:10520/WebAPI/api/admin/v1/users/?",
        "httpVersion" : "HTTP/1.1",
        "cookies" : [ ],
        "headers" : [ {
          "name" : "User-Agent",
          "value" : "Katalon Studio"
        }, {
          "name" : "Content-Type",
          "value" : "application/x-www-form-urlencoded"
        }, {
          "name" : "Authorization",
          "value" : "Bearer eyJ0eXAiOiJKV1QiLCJhbGciOiJIUzI1NiJ9.eyJ1bmlxdWVfbmFtZSI6ImFkbWluIiwicm9sZSI6InVzZXIiLCJzdWIiOiJhZG1pbiIsImlzcyI6IkNyb3BNZXRyaWNzIiwiYXVkIjoiYWxsIiwiZXhwIjoxNTUzODA5NjE5LCJuYmYiOjE1NTM4MDU3MTl9.Qee3tB0sZ3ZWoQO5Xjci0Y2jHegbB-UTdGJlnwm65gY"
        }, {
          "name" : "Host",
          "value" : "localhost:10520"
        }, {
          "name" : "Accept",
          "value" : "text/html, image/gif, image/jpeg, *; q=.2, */*; q=.2"
        }, {
          "name" : "Proxy-Connection",
          "value" : "keep-alive"
        }, {
          "name" : "Content-Length",
          "value" : "315"
        } ],
        "queryString" : [ ],
        "postData" : {
          "mimeType" : "application/x-www-form-urlencoded",
          "params" : [ {
            "name" : "password",
            "value" : "cropmetrics",
            "comment" : ""
          }, {
            "name" : "email",
            "value" : "cropmetricsvo.pass6chars@gmail.com",
            "comment" : ""
          }, {
            "name" : "fullname",
            "value" : "test validation",
            "comment" : ""
          }, {
            "name" : "phone",
            "value" : "123",
            "comment" : ""
          }, {
            "name" : "dealer",
            "value" : "dealer test validation",
            "comment" : ""
          }, {
            "name" : "addressLine1",
            "value" : "address line 1 test validation",
            "comment" : ""
          }, {
            "name" : "addressLine2",
            "value" : "address line 1 test validation",
            "comment" : ""
          }, {
            "name" : "town",
            "value" : "townValidation",
            "comment" : ""
          }, {
            "name" : "state",
            "value" : "stateValidation",
            "comment" : ""
          }, {
            "name" : "zip",
            "value" : "zipValidation",
            "comment" : ""
          }, {
            "name" : "country",
            "value" : "countryValidation",
            "comment" : ""
          }, {
            "name" : "roles",
            "value" : "Client",
            "comment" : ""
          } ],
          "comment" : ""
        },
        "headersSize" : 544,
        "bodySize" : 315,
        "comment" : ""
      },
      "response" : {
        "status" : 400,
        "statusText" : "Bad Request",
        "httpVersion" : "HTTP/1.1",
        "cookies" : [ {
          "name" : ".ASPROLES",
          "value" : "SITfRlMH3QucJlSe5ndT3JRBJ82a1jswqZ4hkWuXCrz_EmxlndxJ9qLTqVCozKVK1wStUvoU1z1n-4MZBNF6EygR7EGxdCM4qrbl6aOHp6-uC3YE-wVwQ0uOZgnH4idjmr1JtecR093121Wjv3AY-28T86ICQq5RN1MyZuVLzxM8Z-D9OhbZ6OrugXrAIs3O1TkBaK-D-GVFPsGhKNNnSXaxOGhB1EtbVCo7HbeiM-1kHSuQLc-ZIOcwY4Kce7H4r2Twaorlmx1B6LHRUwIMByhMiviQ0pA7zEfNwxQ7WlaCgph49gxO2nYZl_yZaZkfMaIyJlLfwaap7zFdwRAiEZAvqhBltrJqdlZ0Db8vslIgQlZqqlEaJHH1sTWiVnxStZz2kXtJ1zhTQ1iAzVFQBvrfY0hFIJOlPO69ovcq9HH7-_cS2sD7Mz-gf0jGQk-LPbcdRBRnA7H60MsLTs8jX0vtbNOiHPc3sLD3jljcE1c4JFvW0",
          "path" : "/",
          "httpOnly" : true,
          "secure" : false,
          "comment" : ""
        } ],
        "headers" : [ {
          "name" : "Cache-Control",
          "value" : "private"
        }, {
          "name" : "Content-Type",
          "value" : "application/json; charset=utf-8"
        }, {
          "name" : "Server",
          "value" : "Microsoft-IIS/10.0"
        }, {
          "name" : "Set-Cookie",
          "value" : ".ASPROLES=SITfRlMH3QucJlSe5ndT3JRBJ82a1jswqZ4hkWuXCrz_EmxlndxJ9qLTqVCozKVK1wStUvoU1z1n-4MZBNF6EygR7EGxdCM4qrbl6aOHp6-uC3YE-wVwQ0uOZgnH4idjmr1JtecR093121Wjv3AY-28T86ICQq5RN1MyZuVLzxM8Z-D9OhbZ6OrugXrAIs3O1TkBaK-D-GVFPsGhKNNnSXaxOGhB1EtbVCo7HbeiM-1kHSuQLc-ZIOcwY4Kce7H4r2Twaorlmx1B6LHRUwIMByhMiviQ0pA7zEfNwxQ7WlaCgph49gxO2nYZl_yZaZkfMaIyJlLfwaap7zFdwRAiEZAvqhBltrJqdlZ0Db8vslIgQlZqqlEaJHH1sTWiVnxStZz2kXtJ1zhTQ1iAzVFQBvrfY0hFIJOlPO69ovcq9HH7-_cS2sD7Mz-gf0jGQk-LPbcdRBRnA7H60MsLTs8jX0vtbNOiHPc3sLD3jljcE1c4JFvW0; path=/; HttpOnly"
        }, {
          "name" : "X-SourceFiles",
          "value" : "=?UTF-8?B?RDpcVmlydHVhbE9wdGltaXplci1SZWZhY3RvcmluZ1xDcm9wTWV0cmljcy5Wby5BcGlcQ3JvcE1ldHJpY3MuVm8uQXBpXGFwaVxhZG1pblx2MVx1c2Vyc1w=?="
        }, {
          "name" : "X-Powered-By",
          "value" : "ASP.NET"
        }, {
          "name" : "Date",
          "value" : "Thu, 28 Mar 2019 20:42:01 GMT"
        }, {
          "name" : "Content-Length",
          "value" : "71"
        } ],
        "content" : {
          "size" : 71,
          "mimeType" : "application/json; charset=utf-8",
          "text" : "{\"message\":\"Name cropmetricsvo.pass6chars@gmail.com is already taken.\"}",
          "comment" : ""
        },
        "redirectURL" : "",
        "headersSize" : 897,
        "bodySize" : 71,
        "comment" : ""
      },
      "cache" : { },
      "timings" : {
        "comment" : "",
        "ssl" : -1,
        "send" : 0,
        "receive" : 0,
        "wait" : 2460,
        "connect" : -1,
        "blocked" : -1,
        "dns" : -1
      },
      "serverIPAddress" : "127.0.0.1",
      "comment" : "",
      "_katalonRequestInformation" : {
        "name" : "47",
        "testObjectId" : "Object Repository/VoPro/Account/api_admin_v1_users",
        "harId" : "80be8cb8-7f67-4449-986d-4dc471c43cf4"
      },
      "time" : 2462
    } ],
    "comment" : ""
  }
}