{
  "log" : {
    "version" : "1.2",
    "creator" : {
      "name" : "BrowserMob Proxy",
      "version" : "2.1.5",
      "comment" : ""
    },
    "pages" : [ {
      "id" : "Page 0",
      "startedDateTime" : "2019-03-28T20:23:43.236Z",
      "title" : "Page 0",
      "pageTimings" : {
        "onLoad" : 50,
        "comment" : ""
      },
      "comment" : ""
    } ],
    "entries" : [ {
      "pageref" : "Page 0",
      "startedDateTime" : "2019-03-28T20:23:43.237Z",
      "request" : {
        "method" : "POST",
        "url" : "http://localhost:10520/WebAPI/api/admin/v1/users/?",
        "httpVersion" : "HTTP/1.1",
        "cookies" : [ ],
        "headers" : [ {
          "name" : "User-Agent",
          "value" : "Katalon Studio"
        }, {
          "name" : "Content-Type",
          "value" : "application/x-www-form-urlencoded"
        }, {
          "name" : "Authorization",
          "value" : "Bearer eyJ0eXAiOiJKV1QiLCJhbGciOiJIUzI1NiJ9.eyJ1bmlxdWVfbmFtZSI6ImFkbWluIiwicm9sZSI6InVzZXIiLCJzdWIiOiJhZG1pbiIsImlzcyI6IkNyb3BNZXRyaWNzIiwiYXVkIjoiYWxsIiwiZXhwIjoxNTUzODA4NTIzLCJuYmYiOjE1NTM4MDQ2MjN9.of60FhMOwycjP_4oBzsIdPemKxUarRBHTVIQQgs-ero"
        }, {
          "name" : "Host",
          "value" : "localhost:10520"
        }, {
          "name" : "Accept",
          "value" : "text/html, image/gif, image/jpeg, *; q=.2, */*; q=.2"
        }, {
          "name" : "Proxy-Connection",
          "value" : "keep-alive"
        }, {
          "name" : "Content-Length",
          "value" : "307"
        } ],
        "queryString" : [ ],
        "postData" : {
          "mimeType" : "application/x-www-form-urlencoded",
          "params" : [ {
            "name" : "password",
            "value" : "lessp",
            "comment" : ""
          }, {
            "name" : "email",
            "value" : "cropmetricsvo.lesspass@gmail.com",
            "comment" : ""
          }, {
            "name" : "fullname",
            "value" : "test validation",
            "comment" : ""
          }, {
            "name" : "phone",
            "value" : "123",
            "comment" : ""
          }, {
            "name" : "dealer",
            "value" : "dealer test validation",
            "comment" : ""
          }, {
            "name" : "addressLine1",
            "value" : "address line 1 test validation",
            "comment" : ""
          }, {
            "name" : "addressLine2",
            "value" : "address line 2 test validation",
            "comment" : ""
          }, {
            "name" : "town",
            "value" : "townValidation",
            "comment" : ""
          }, {
            "name" : "state",
            "value" : "stateValidation",
            "comment" : ""
          }, {
            "name" : "zip",
            "value" : "zipValidation",
            "comment" : ""
          }, {
            "name" : "country",
            "value" : "countryValidation",
            "comment" : ""
          }, {
            "name" : "roles",
            "value" : "Client",
            "comment" : ""
          } ],
          "comment" : ""
        },
        "headersSize" : 544,
        "bodySize" : 307,
        "comment" : ""
      },
      "response" : {
        "status" : 400,
        "statusText" : "Bad Request",
        "httpVersion" : "HTTP/1.1",
        "cookies" : [ {
          "name" : ".ASPROLES",
          "value" : "9mI_ylfqrC23UVbiYuOKl0W3A1GAsnnGH7uwG1QeG3wh8HcuT3Eyh4PZXMAjm8yVgg8k4nSfY4bKz0GCMc5BpbiJPogejWoxmxnKVMqhgmdw0j_H14w3iVc2X5Vnvsg-9s6Xb5vgP-z8Sc3g7TRgUi2v5OP7oUQ28gO9yv-lfGf42N-fiKAHzal3QkHvla3fjV2kDrRCOJj3fbGdnAjbwODIRCJ-hgDqDORhi4WoyGeqSnyNawokaNIOfVn_WjwJkFkMg5MCxjBf-DfCzeNYcBfun13rdVH_PoMauXQy_dl3pqpndoU-ivtiGmM0TzOWjm8SZaEAvmsW6yzqK1oLNCkpwCu5QHw6e7WO8rMQ87N3DrBUt5uom5BFVI1rp0RQK58fmINWyIO29YlV2Wl_YiXaRss0s4RGsTac-30RhWBWu2lkdn2lNWx-s9lfv6iut7T18myXMVPCwgfR5fxrl-dSuzsUJvifuVxrcNxIzibIzp8i0",
          "path" : "/",
          "httpOnly" : true,
          "secure" : false,
          "comment" : ""
        } ],
        "headers" : [ {
          "name" : "Cache-Control",
          "value" : "private"
        }, {
          "name" : "Content-Type",
          "value" : "application/json; charset=utf-8"
        }, {
          "name" : "Server",
          "value" : "Microsoft-IIS/10.0"
        }, {
          "name" : "Set-Cookie",
          "value" : ".ASPROLES=9mI_ylfqrC23UVbiYuOKl0W3A1GAsnnGH7uwG1QeG3wh8HcuT3Eyh4PZXMAjm8yVgg8k4nSfY4bKz0GCMc5BpbiJPogejWoxmxnKVMqhgmdw0j_H14w3iVc2X5Vnvsg-9s6Xb5vgP-z8Sc3g7TRgUi2v5OP7oUQ28gO9yv-lfGf42N-fiKAHzal3QkHvla3fjV2kDrRCOJj3fbGdnAjbwODIRCJ-hgDqDORhi4WoyGeqSnyNawokaNIOfVn_WjwJkFkMg5MCxjBf-DfCzeNYcBfun13rdVH_PoMauXQy_dl3pqpndoU-ivtiGmM0TzOWjm8SZaEAvmsW6yzqK1oLNCkpwCu5QHw6e7WO8rMQ87N3DrBUt5uom5BFVI1rp0RQK58fmINWyIO29YlV2Wl_YiXaRss0s4RGsTac-30RhWBWu2lkdn2lNWx-s9lfv6iut7T18myXMVPCwgfR5fxrl-dSuzsUJvifuVxrcNxIzibIzp8i0; path=/; HttpOnly"
        }, {
          "name" : "X-SourceFiles",
          "value" : "=?UTF-8?B?RDpcVmlydHVhbE9wdGltaXplci1SZWZhY3RvcmluZ1xDcm9wTWV0cmljcy5Wby5BcGlcQ3JvcE1ldHJpY3MuVm8uQXBpXGFwaVxhZG1pblx2MVx1c2Vyc1w=?="
        }, {
          "name" : "X-Powered-By",
          "value" : "ASP.NET"
        }, {
          "name" : "Date",
          "value" : "Thu, 28 Mar 2019 20:23:42 GMT"
        }, {
          "name" : "Content-Length",
          "value" : "116"
        } ],
        "content" : {
          "size" : 116,
          "mimeType" : "application/json; charset=utf-8",
          "text" : "{\"message\":\"The request is invalid. The Password must have at least 6 characters (distinct to the space character)\"}",
          "comment" : ""
        },
        "redirectURL" : "",
        "headersSize" : 898,
        "bodySize" : 116,
        "comment" : ""
      },
      "cache" : { },
      "timings" : {
        "comment" : "",
        "wait" : 45,
        "dns" : -1,
        "blocked" : -1,
        "connect" : -1,
        "receive" : 0,
        "send" : 0,
        "ssl" : -1
      },
      "serverIPAddress" : "127.0.0.1",
      "comment" : "",
      "_katalonRequestInformation" : {
        "name" : "33",
        "testObjectId" : "Object Repository/VoPro/Account/api_admin_v1_users",
        "harId" : "38db16d2-0a91-447e-b218-b0de5648153f"
      },
      "time" : 46
    } ],
    "comment" : ""
  }
}