{
  "log" : {
    "version" : "1.2",
    "creator" : {
      "name" : "BrowserMob Proxy",
      "version" : "2.1.5",
      "comment" : ""
    },
    "pages" : [ {
      "id" : "Page 0",
      "startedDateTime" : "2019-04-09T09:34:55.638Z",
      "title" : "Page 0",
      "pageTimings" : {
        "onLoad" : 18,
        "comment" : ""
      },
      "comment" : ""
    } ],
    "entries" : [ {
      "pageref" : "Page 0",
      "startedDateTime" : "2019-04-09T09:34:55.638Z",
      "request" : {
        "method" : "POST",
        "url" : "http://localhost:10520/WebAPI/api/mobile/v1/fields?",
        "httpVersion" : "HTTP/1.1",
        "cookies" : [ ],
        "headers" : [ {
          "name" : "User-Agent",
          "value" : "Katalon Studio"
        }, {
          "name" : "Content-Type",
          "value" : "application/json"
        }, {
          "name" : "Authorization",
          "value" : "Bearer eyJ0eXAiOiJKV1QiLCJhbGciOiJIUzI1NiJ9.eyJ1bmlxdWVfbmFtZSI6Implbm55Lm1hbGRvbmFkby50eDFAZ21haWwuY29tIiwicm9sZSI6InVzZXIiLCJzdWIiOiJqZW5ueS5tYWxkb25hZG8udHgxQGdtYWlsLmNvbSIsImlzcyI6IkNyb3BNZXRyaWNzIiwiYXVkIjoiYWxsIiwiZXhwIjoxNTU0ODA2Mzk1LCJuYmYiOjE1NTQ4MDI0OTV9.tMQ5G7FkkDi8oioOBbBbu1fGV8RKA1V_IublUxmgcN4"
        }, {
          "name" : "Host",
          "value" : "localhost:10520"
        }, {
          "name" : "Accept",
          "value" : "text/html, image/gif, image/jpeg, *; q=.2, */*; q=.2"
        }, {
          "name" : "Proxy-Connection",
          "value" : "keep-alive"
        }, {
          "name" : "Content-Length",
          "value" : "409"
        } ],
        "queryString" : [ ],
        "postData" : {
          "mimeType" : "application/json",
          "text" : "{\"field\":{\"farm_id\":\"!@#$%^&\",\"name\":\"Field by agent not assigned\",\"boundary\":{\"boundaries\":[{\"boundary\":{\"coords\":[{\"x\":-101.49568751,\"y\":37.14976293},{\"x\":-101.50049403,\"y\":37.14647907},{\"x\":-101.50049403,\"y\":37.14264773},{\"x\":-101.49723246,\"y\":37.1411425},{\"x\":-101.49019435,\"y\":37.14223722},{\"x\":-101.48933604,\"y\":37.14620541},{\"x\":-101.49294093,\"y\":37.14866833},{\"x\":-101.49568751,\"y\":37.14976293}]}}]}}}",
          "comment" : ""
        },
        "headersSize" : 592,
        "bodySize" : 409,
        "comment" : ""
      },
      "response" : {
        "status" : 400,
        "statusText" : "Bad Request",
        "httpVersion" : "HTTP/1.1",
        "cookies" : [ {
          "name" : ".ASPROLES",
          "value" : "_me-ivwp2b7WBWog1os6kU6M_NpM4iH6YhblPQ9D1blUhhYQoeGD6jUjkelJOKfmXjss7Y1Ev5FaRCYwt03OxBELxCNuLMGo1rlhXmY-eVLH9KT4hoxY7DmdjBqNMfOJKauNr3rjGVhIadSz2Ee52a38E_BxqKPx_EiNX-SWE1TSoaRl7giztEOncUAaUSifAm71l783-1dYFPtZa_S8tttc_Xlu1A2duV1xh74FK4qwmGvyTcy5wyUt7EGaVLG4EBeCicX4ArjUt4_uTmQh3WONbv_UpS39zdDka9yBtgymjUxJgQkMgVCZjcsnr3Lo25a1zGZkXljsDC2p2z8QTQLhvQO2vOC55WOakmgEmyB3PihlBeRj3_wE50JnL9reUeVd72DBdnqzwAqYwHrGdoFVgrt2dqo9DXPihU-BIVHToMJ2tDwXjQAAffR3VEw-A5uFT8DblzmGigW_4mzhyllHHZKaouJ9hgF99cQr8dwmPsMopcMhQ6u_G5wnj0xnGGHa7KWzCVhvUAODqxVT6ubKaZ81",
          "path" : "/",
          "httpOnly" : true,
          "secure" : false,
          "comment" : ""
        } ],
        "headers" : [ {
          "name" : "Cache-Control",
          "value" : "private"
        }, {
          "name" : "Content-Type",
          "value" : "application/json; charset=utf-8"
        }, {
          "name" : "Server",
          "value" : "Microsoft-IIS/10.0"
        }, {
          "name" : "Set-Cookie",
          "value" : ".ASPROLES=_me-ivwp2b7WBWog1os6kU6M_NpM4iH6YhblPQ9D1blUhhYQoeGD6jUjkelJOKfmXjss7Y1Ev5FaRCYwt03OxBELxCNuLMGo1rlhXmY-eVLH9KT4hoxY7DmdjBqNMfOJKauNr3rjGVhIadSz2Ee52a38E_BxqKPx_EiNX-SWE1TSoaRl7giztEOncUAaUSifAm71l783-1dYFPtZa_S8tttc_Xlu1A2duV1xh74FK4qwmGvyTcy5wyUt7EGaVLG4EBeCicX4ArjUt4_uTmQh3WONbv_UpS39zdDka9yBtgymjUxJgQkMgVCZjcsnr3Lo25a1zGZkXljsDC2p2z8QTQLhvQO2vOC55WOakmgEmyB3PihlBeRj3_wE50JnL9reUeVd72DBdnqzwAqYwHrGdoFVgrt2dqo9DXPihU-BIVHToMJ2tDwXjQAAffR3VEw-A5uFT8DblzmGigW_4mzhyllHHZKaouJ9hgF99cQr8dwmPsMopcMhQ6u_G5wnj0xnGGHa7KWzCVhvUAODqxVT6ubKaZ81; path=/; HttpOnly"
        }, {
          "name" : "X-SourceFiles",
          "value" : "=?UTF-8?B?RDpcVmlydHVhbE9wdGltaXplci1SZWZhY3RvcmluZ1xDcm9wTWV0cmljcy5Wby5BcGlcQ3JvcE1ldHJpY3MuVm8uQXBpXGFwaVxtb2JpbGVcdjFcZmllbGRz?="
        }, {
          "name" : "X-Powered-By",
          "value" : "ASP.NET"
        }, {
          "name" : "Date",
          "value" : "Tue, 09 Apr 2019 09:34:54 GMT"
        }, {
          "name" : "Content-Length",
          "value" : "37"
        } ],
        "content" : {
          "size" : 37,
          "mimeType" : "application/json; charset=utf-8",
          "text" : "{\"message\":\"The request is invalid.\"}",
          "comment" : ""
        },
        "redirectURL" : "",
        "headersSize" : 940,
        "bodySize" : 37,
        "comment" : ""
      },
      "cache" : { },
      "timings" : {
        "comment" : "",
        "ssl" : -1,
        "receive" : 0,
        "wait" : 11,
        "connect" : -1,
        "blocked" : -1,
        "dns" : -1,
        "send" : 0
      },
      "serverIPAddress" : "127.0.0.1",
      "comment" : "",
      "_katalonRequestInformation" : {
        "name" : "25",
        "testObjectId" : "Object Repository/VoGrow/Field/FieldPost",
        "harId" : "060245ef-8c7e-4c81-9eba-8888779e7dde"
      },
      "time" : 12
    } ],
    "comment" : ""
  }
}