{
  "log" : {
    "version" : "1.2",
    "creator" : {
      "name" : "BrowserMob Proxy",
      "version" : "2.1.5",
      "comment" : ""
    },
    "pages" : [ {
      "id" : "Page 0",
      "startedDateTime" : "2019-03-28T20:24:26.701Z",
      "title" : "Page 0",
      "pageTimings" : {
        "onLoad" : 1310,
        "comment" : ""
      },
      "comment" : ""
    } ],
    "entries" : [ {
      "pageref" : "Page 0",
      "startedDateTime" : "2019-03-28T20:24:26.703Z",
      "request" : {
        "method" : "POST",
        "url" : "http://localhost:10520/WebAPI/api/admin/v1/users/?",
        "httpVersion" : "HTTP/1.1",
        "cookies" : [ ],
        "headers" : [ {
          "name" : "User-Agent",
          "value" : "Katalon Studio"
        }, {
          "name" : "Content-Type",
          "value" : "application/x-www-form-urlencoded"
        }, {
          "name" : "Authorization",
          "value" : "Bearer eyJ0eXAiOiJKV1QiLCJhbGciOiJIUzI1NiJ9.eyJ1bmlxdWVfbmFtZSI6ImFkbWluIiwicm9sZSI6InVzZXIiLCJzdWIiOiJhZG1pbiIsImlzcyI6IkNyb3BNZXRyaWNzIiwiYXVkIjoiYWxsIiwiZXhwIjoxNTUzODA4NTY2LCJuYmYiOjE1NTM4MDQ2NjZ9.ViZq2tj02_GGAZJQVBVqR8ec8Pp3VOBLlGgqz_dtAhc"
        }, {
          "name" : "Host",
          "value" : "localhost:10520"
        }, {
          "name" : "Accept",
          "value" : "text/html, image/gif, image/jpeg, *; q=.2, */*; q=.2"
        }, {
          "name" : "Proxy-Connection",
          "value" : "keep-alive"
        }, {
          "name" : "Content-Length",
          "value" : "306"
        } ],
        "queryString" : [ ],
        "postData" : {
          "mimeType" : "application/x-www-form-urlencoded",
          "params" : [ {
            "name" : "password",
            "value" : "cropmetrics",
            "comment" : ""
          }, {
            "name" : "email",
            "value" : "cropmetricsvo.zipsymbol@gmail.com",
            "comment" : ""
          }, {
            "name" : "fullname",
            "value" : "test validation",
            "comment" : ""
          }, {
            "name" : "phone",
            "value" : "123",
            "comment" : ""
          }, {
            "name" : "dealer",
            "value" : "x",
            "comment" : ""
          }, {
            "name" : "addressLine1",
            "value" : "address line 1 test validation",
            "comment" : ""
          }, {
            "name" : "addressLine2",
            "value" : "address line 12 test validation",
            "comment" : ""
          }, {
            "name" : "town",
            "value" : "townValidation",
            "comment" : ""
          }, {
            "name" : "state",
            "value" : "stateValidation",
            "comment" : ""
          }, {
            "name" : "zip",
            "value" : "!@#$%^&*(",
            "comment" : ""
          }, {
            "name" : "country",
            "value" : "countryValidation",
            "comment" : ""
          }, {
            "name" : "roles",
            "value" : "Client",
            "comment" : ""
          } ],
          "comment" : ""
        },
        "headersSize" : 544,
        "bodySize" : 306,
        "comment" : ""
      },
      "response" : {
        "status" : 200,
        "statusText" : "OK",
        "httpVersion" : "HTTP/1.1",
        "cookies" : [ {
          "name" : ".ASPROLES",
          "value" : "WshE0IPff8MHawQwqVvFFmTwtRIw_DrrL0v1D4-Ct-YPIgYrXTECoF9-Xkc6AxotU6lCRHMSTqN7aWdvrpvgIxvfk758wPqaZaz3nW2AABcbfw0UbTpiBEj8iHgpypifv7YewI8MpGKFyenaIR7u97K7iO3g8ujZqDRS1HKznpRS-PKvHlGWPOce69imsH4nGF4KiGZcnSdNac29K_KlhmfMDUQ40DaVloRhO3LZGRY_BC5UJH9Nv3lG0EnKBTR0sbxWMmwSV0O7TGJHmux3Y95WZ-iVKWiwq6etda4jgamkIllddxYVykALg3kZ_IVBusstU1js_WIeS-yZyo_AerdK8MHzxJuSkpkT_voCBluYVHx20GG813a31uIdJFjRtUq83x80KgbHkUa2-tsxdCq8R6UwfY6OKGBKOgrkUKkaUor3i-eWI4T7ELUCG8UriJUQRpXUhWnynilQnYQCgLc-SPZndENa3aqFNpHKK_WTAG0Y0",
          "path" : "/",
          "httpOnly" : true,
          "secure" : false,
          "comment" : ""
        } ],
        "headers" : [ {
          "name" : "Cache-Control",
          "value" : "private"
        }, {
          "name" : "Content-Type",
          "value" : "application/json; charset=utf-8"
        }, {
          "name" : "Server",
          "value" : "Microsoft-IIS/10.0"
        }, {
          "name" : "Set-Cookie",
          "value" : ".ASPROLES=WshE0IPff8MHawQwqVvFFmTwtRIw_DrrL0v1D4-Ct-YPIgYrXTECoF9-Xkc6AxotU6lCRHMSTqN7aWdvrpvgIxvfk758wPqaZaz3nW2AABcbfw0UbTpiBEj8iHgpypifv7YewI8MpGKFyenaIR7u97K7iO3g8ujZqDRS1HKznpRS-PKvHlGWPOce69imsH4nGF4KiGZcnSdNac29K_KlhmfMDUQ40DaVloRhO3LZGRY_BC5UJH9Nv3lG0EnKBTR0sbxWMmwSV0O7TGJHmux3Y95WZ-iVKWiwq6etda4jgamkIllddxYVykALg3kZ_IVBusstU1js_WIeS-yZyo_AerdK8MHzxJuSkpkT_voCBluYVHx20GG813a31uIdJFjRtUq83x80KgbHkUa2-tsxdCq8R6UwfY6OKGBKOgrkUKkaUor3i-eWI4T7ELUCG8UriJUQRpXUhWnynilQnYQCgLc-SPZndENa3aqFNpHKK_WTAG0Y0; path=/; HttpOnly"
        }, {
          "name" : "X-SourceFiles",
          "value" : "=?UTF-8?B?RDpcVmlydHVhbE9wdGltaXplci1SZWZhY3RvcmluZ1xDcm9wTWV0cmljcy5Wby5BcGlcQ3JvcE1ldHJpY3MuVm8uQXBpXGFwaVxhZG1pblx2MVx1c2Vyc1w=?="
        }, {
          "name" : "X-Powered-By",
          "value" : "ASP.NET"
        }, {
          "name" : "Date",
          "value" : "Thu, 28 Mar 2019 20:24:28 GMT"
        }, {
          "name" : "Content-Length",
          "value" : "9"
        } ],
        "content" : {
          "size" : 9,
          "mimeType" : "application/json; charset=utf-8",
          "text" : "{\"id\":33}",
          "comment" : ""
        },
        "redirectURL" : "",
        "headersSize" : 887,
        "bodySize" : 9,
        "comment" : ""
      },
      "cache" : { },
      "timings" : {
        "comment" : "",
        "wait" : 1306,
        "dns" : -1,
        "blocked" : -1,
        "connect" : -1,
        "receive" : 0,
        "send" : 0,
        "ssl" : -1
      },
      "serverIPAddress" : "127.0.0.1",
      "comment" : "",
      "_katalonRequestInformation" : {
        "name" : "83",
        "testObjectId" : "Object Repository/VoPro/Account/api_admin_v1_users",
        "harId" : "2b4440e7-445a-482e-ab93-8ba07f5dc42d"
      },
      "time" : 1307
    } ],
    "comment" : ""
  }
}