{
  "log" : {
    "version" : "1.2",
    "creator" : {
      "name" : "BrowserMob Proxy",
      "version" : "2.1.5",
      "comment" : ""
    },
    "pages" : [ {
      "id" : "Page 0",
      "startedDateTime" : "2019-04-01T13:34:17.810Z",
      "title" : "Page 0",
      "pageTimings" : {
        "onLoad" : 66,
        "comment" : ""
      },
      "comment" : ""
    } ],
    "entries" : [ {
      "pageref" : "Page 0",
      "startedDateTime" : "2019-04-01T13:34:17.813Z",
      "request" : {
        "method" : "DELETE",
        "url" : "http://localhost:10520/WebAPI/api/User/jenny.maldonado.tx@gmail.com/?",
        "httpVersion" : "HTTP/1.1",
        "cookies" : [ ],
        "headers" : [ {
          "name" : "User-Agent",
          "value" : "Katalon Studio"
        }, {
          "name" : "Authorization",
          "value" : "Bearer eyJ0eXAiOiJKV1QiLCJhbGciOiJIUzI1NiJ9.eyJ1bmlxdWVfbmFtZSI6ImFkbWluIiwicm9sZSI6InVzZXIiLCJzdWIiOiJhZG1pbiIsImlzcyI6IkNyb3BNZXRyaWNzIiwiYXVkIjoiYWxsIiwiZXhwIjoxNTU0MTI5NTU3LCJuYmYiOjE1NTQxMjU2NTd9.PsqxWmeEinJge8D-I-dpI2In3zji376g3VnNoCPBE6g"
        }, {
          "name" : "Content-Type",
          "value" : "application/x-www-form-urlencoded"
        }, {
          "name" : "Host",
          "value" : "localhost:10520"
        }, {
          "name" : "Accept",
          "value" : "text/html, image/gif, image/jpeg, *; q=.2, */*; q=.2"
        }, {
          "name" : "Proxy-Connection",
          "value" : "keep-alive"
        }, {
          "name" : "Content-Length",
          "value" : "0"
        } ],
        "queryString" : [ ],
        "headersSize" : 563,
        "bodySize" : 0,
        "comment" : ""
      },
      "response" : {
        "status" : 200,
        "statusText" : "OK",
        "httpVersion" : "HTTP/1.1",
        "cookies" : [ {
          "name" : ".ASPROLES",
          "value" : "YlBaaIqRzSxrBwvs_6xVg67ma2Pu38VL--MoHqN0BUGDYDk1wF7buKlYfs2ZfAdayRkOBnuEamHq3NXuRiezdzV9LtWoD5CLOe5bikeSoNC4APvwtR9JtFu5wMqDzcJW7LH7496RUtuB4NWaGjgxPBdkiotibUS2GyvsC0mhD31jh0GOn5zzTMetmTzjfxnDOEuw4JWhCD2GKi4bzHLn7CO8AOtQgDjzuHO8_Wa9evsgY6SeGLalrFIh9vOxEYXTNeCcQl37tuDqJydvUtD2MKWNPjebgelAK_OQIHe5GJXO50mIE866sWgRUwBQ02wHgawrl_LEkJ-fveErTxFaHYEXRqziswTZhKxttfpRrP39YzXFdqpJfbGZGMxY3xQivHLyMjg6f0z9pLKz9N6WcOKoj2QmQQx85oJ5dAhYe1zEppH3vTJfoV1NTFNMK4rvRhPfG45qmPp9-kDXBzJS_rJF04jgqAHJX5KM5qMnZQCeiB180",
          "path" : "/",
          "httpOnly" : true,
          "secure" : false,
          "comment" : ""
        } ],
        "headers" : [ {
          "name" : "Cache-Control",
          "value" : "private"
        }, {
          "name" : "Server",
          "value" : "Microsoft-IIS/10.0"
        }, {
          "name" : "Set-Cookie",
          "value" : ".ASPROLES=YlBaaIqRzSxrBwvs_6xVg67ma2Pu38VL--MoHqN0BUGDYDk1wF7buKlYfs2ZfAdayRkOBnuEamHq3NXuRiezdzV9LtWoD5CLOe5bikeSoNC4APvwtR9JtFu5wMqDzcJW7LH7496RUtuB4NWaGjgxPBdkiotibUS2GyvsC0mhD31jh0GOn5zzTMetmTzjfxnDOEuw4JWhCD2GKi4bzHLn7CO8AOtQgDjzuHO8_Wa9evsgY6SeGLalrFIh9vOxEYXTNeCcQl37tuDqJydvUtD2MKWNPjebgelAK_OQIHe5GJXO50mIE866sWgRUwBQ02wHgawrl_LEkJ-fveErTxFaHYEXRqziswTZhKxttfpRrP39YzXFdqpJfbGZGMxY3xQivHLyMjg6f0z9pLKz9N6WcOKoj2QmQQx85oJ5dAhYe1zEppH3vTJfoV1NTFNMK4rvRhPfG45qmPp9-kDXBzJS_rJF04jgqAHJX5KM5qMnZQCeiB180; path=/; HttpOnly"
        }, {
          "name" : "X-SourceFiles",
          "value" : "=?UTF-8?B?RDpcVmlydHVhbE9wdGltaXplci1SZWZhY3RvcmluZ1xDcm9wTWV0cmljcy5Wby5BcGlcQ3JvcE1ldHJpY3MuVm8uQXBpXGFwaVxVc2VyXGplbm55Lm1hbGRvbmFkby50eEBnbWFpbC5jb21c?="
        }, {
          "name" : "X-Powered-By",
          "value" : "ASP.NET"
        }, {
          "name" : "Date",
          "value" : "Mon, 01 Apr 2019 13:34:17 GMT"
        }, {
          "name" : "Content-Length",
          "value" : "0"
        } ],
        "content" : {
          "size" : 0,
          "mimeType" : "",
          "comment" : ""
        },
        "redirectURL" : "",
        "headersSize" : 864,
        "bodySize" : -1,
        "comment" : ""
      },
      "cache" : { },
      "timings" : {
        "comment" : "",
        "ssl" : -1,
        "wait" : 38,
        "receive" : 0,
        "send" : 0,
        "dns" : -1,
        "blocked" : -1,
        "connect" : -1
      },
      "serverIPAddress" : "127.0.0.1",
      "comment" : "",
      "_katalonRequestInformation" : {
        "name" : "3",
        "testObjectId" : "Object Repository/VoPro/User/DeleteUser",
        "harId" : "979a961c-de56-41f0-b7af-97e74135207f"
      },
      "time" : 39
    } ],
    "comment" : ""
  }
}