{
  "log" : {
    "version" : "1.2",
    "creator" : {
      "name" : "BrowserMob Proxy",
      "version" : "2.1.5",
      "comment" : ""
    },
    "pages" : [ {
      "id" : "Page 0",
      "startedDateTime" : "2019-04-05T19:22:48.939Z",
      "title" : "Page 0",
      "pageTimings" : {
        "onLoad" : 266,
        "comment" : ""
      },
      "comment" : ""
    } ],
    "entries" : [ {
      "pageref" : "Page 0",
      "startedDateTime" : "2019-04-05T19:22:48.941Z",
      "request" : {
        "method" : "POST",
        "url" : "http://localhost:10520/WebAPI/api/mobile/v1/farms/?",
        "httpVersion" : "HTTP/1.1",
        "cookies" : [ ],
        "headers" : [ {
          "name" : "User-Agent",
          "value" : "Katalon Studio"
        }, {
          "name" : "Content-Type",
          "value" : "application/json"
        }, {
          "name" : "Authorization",
          "value" : "Bearer eyJ0eXAiOiJKV1QiLCJhbGciOiJIUzI1NiJ9.eyJ1bmlxdWVfbmFtZSI6Implbm55Lm1hbGRvbmFkby50eDFAZ21haWwuY29tIiwicm9sZSI6InVzZXIiLCJzdWIiOiJqZW5ueS5tYWxkb25hZG8udHgxQGdtYWlsLmNvbSIsImlzcyI6IkNyb3BNZXRyaWNzIiwiYXVkIjoiYWxsIiwiZXhwIjoxNTU0NDk2MDY4LCJuYmYiOjE1NTQ0OTIxNjh9.1R4YshykG_MMi3GxCiyo3lM_v8mv53S_1esMVNn5e_8"
        }, {
          "name" : "Host",
          "value" : "localhost:10520"
        }, {
          "name" : "Accept",
          "value" : "text/html, image/gif, image/jpeg, *; q=.2, */*; q=.2"
        }, {
          "name" : "Proxy-Connection",
          "value" : "keep-alive"
        }, {
          "name" : "Content-Length",
          "value" : "50"
        } ],
        "queryString" : [ ],
        "postData" : {
          "mimeType" : "application/json",
          "text" : "{\"name\": \"Farm 2 created by dealer\", \"user_id\": 3}",
          "comment" : ""
        },
        "headersSize" : 591,
        "bodySize" : 50,
        "comment" : ""
      },
      "response" : {
        "status" : 201,
        "statusText" : "Created",
        "httpVersion" : "HTTP/1.1",
        "cookies" : [ {
          "name" : ".ASPROLES",
          "value" : "sydbjqTHZkEaLE-bS_FD4zlsivLRjJhdi_GJzcANzacggswyILZv-Iq1nDNR5AreWrGk3CN68JaVwCM0knVwQVvIIT29AATCB3gW2usfdTY9qJhQ1l2UbC6Nb3pAWYG1BHxSC_PNXfbBF5UIpy3SAzknJKWMPSnofAetWPCbbHBaIHP8U1VAUwG3WRk_1rBsy_EqDSRk1UCqcojdr8QH94ww66HilzjFV9iyRkqyieN48h0vqJrkFfVvprVi_OH1auVSrzW8bOT_MR1O4HOFZ91KPBhIn3BTT4L4x76jb4TCHZqBKjz7SQcoIXDbjHDOKrIPShdUGU9fAN7DNnn25MxcwbQy35NSA2rOz05Jglu2DI0WDr3aZovVlDkI72oWRtIT7RprwcW3EIJdX40j1QdGyO5cgvurSIGdJ3VxWZsD4gM3kbtKGfNmKSJPzXSbitvdMsjXWL735ieRF5q7_pFS659L3o9nU7EZf37byTrbrJ2A_Js27DySecn8YcFkJ6i8POBknANk9WnUgUgrhQfat6s1",
          "path" : "/",
          "httpOnly" : true,
          "secure" : false,
          "comment" : ""
        } ],
        "headers" : [ {
          "name" : "Cache-Control",
          "value" : "private"
        }, {
          "name" : "Content-Type",
          "value" : "application/json; charset=utf-8"
        }, {
          "name" : "Location",
          "value" : "api/mobile/v1/farms/2"
        }, {
          "name" : "Server",
          "value" : "Microsoft-IIS/10.0"
        }, {
          "name" : "Set-Cookie",
          "value" : ".ASPROLES=sydbjqTHZkEaLE-bS_FD4zlsivLRjJhdi_GJzcANzacggswyILZv-Iq1nDNR5AreWrGk3CN68JaVwCM0knVwQVvIIT29AATCB3gW2usfdTY9qJhQ1l2UbC6Nb3pAWYG1BHxSC_PNXfbBF5UIpy3SAzknJKWMPSnofAetWPCbbHBaIHP8U1VAUwG3WRk_1rBsy_EqDSRk1UCqcojdr8QH94ww66HilzjFV9iyRkqyieN48h0vqJrkFfVvprVi_OH1auVSrzW8bOT_MR1O4HOFZ91KPBhIn3BTT4L4x76jb4TCHZqBKjz7SQcoIXDbjHDOKrIPShdUGU9fAN7DNnn25MxcwbQy35NSA2rOz05Jglu2DI0WDr3aZovVlDkI72oWRtIT7RprwcW3EIJdX40j1QdGyO5cgvurSIGdJ3VxWZsD4gM3kbtKGfNmKSJPzXSbitvdMsjXWL735ieRF5q7_pFS659L3o9nU7EZf37byTrbrJ2A_Js27DySecn8YcFkJ6i8POBknANk9WnUgUgrhQfat6s1; path=/; HttpOnly"
        }, {
          "name" : "X-SourceFiles",
          "value" : "=?UTF-8?B?RDpcVmlydHVhbE9wdGltaXplci1SZWZhY3RvcmluZ1xDcm9wTWV0cmljcy5Wby5BcGlcQ3JvcE1ldHJpY3MuVm8uQXBpXGFwaVxtb2JpbGVcdjFcZmFybXNc?="
        }, {
          "name" : "X-Powered-By",
          "value" : "ASP.NET"
        }, {
          "name" : "Date",
          "value" : "Fri, 05 Apr 2019 19:22:48 GMT"
        }, {
          "name" : "Content-Length",
          "value" : "54"
        } ],
        "content" : {
          "size" : 54,
          "mimeType" : "application/json; charset=utf-8",
          "text" : "{\"id\":2,\"name\":\"Farm 2 created by dealer\",\"user_id\":3}",
          "comment" : ""
        },
        "redirectURL" : "",
        "headersSize" : 969,
        "bodySize" : 54,
        "comment" : ""
      },
      "cache" : { },
      "timings" : {
        "comment" : "",
        "ssl" : -1,
        "wait" : 260,
        "receive" : 1,
        "send" : 0,
        "blocked" : -1,
        "connect" : -1,
        "dns" : -1
      },
      "serverIPAddress" : "127.0.0.1",
      "comment" : "",
      "_katalonRequestInformation" : {
        "name" : "3",
        "testObjectId" : "Object Repository/VoGrow/Farm/FarmPost",
        "harId" : "66dc309e-e3b6-4338-bb28-92ca5dc3ff02"
      },
      "time" : 262
    } ],
    "comment" : ""
  }
}