{
  "log" : {
    "version" : "1.2",
    "creator" : {
      "name" : "BrowserMob Proxy",
      "version" : "2.1.5",
      "comment" : ""
    },
    "pages" : [ {
      "id" : "Page 0",
      "startedDateTime" : "2019-04-24T20:56:31.275Z",
      "title" : "Page 0",
      "pageTimings" : {
        "onLoad" : 3026,
        "comment" : ""
      },
      "comment" : ""
    } ],
    "entries" : [ {
      "pageref" : "Page 0",
      "startedDateTime" : "2019-04-24T20:56:31.276Z",
      "request" : {
        "method" : "POST",
        "url" : "http://localhost:10520/WebAPI/api/mobile/v1/fields?",
        "httpVersion" : "HTTP/1.1",
        "cookies" : [ ],
        "headers" : [ {
          "name" : "User-Agent",
          "value" : "Katalon Studio"
        }, {
          "name" : "Content-Type",
          "value" : "application/json"
        }, {
          "name" : "Authorization",
          "value" : "Bearer eyJ0eXAiOiJKV1QiLCJhbGciOiJIUzI1NiJ9.eyJ1bmlxdWVfbmFtZSI6Implbm55Lm1hbGRvbmFkby50eDFAZ21haWwuY29tIiwicm9sZSI6InVzZXIiLCJzdWIiOiJqZW5ueS5tYWxkb25hZG8udHgxQGdtYWlsLmNvbSIsImlzcyI6IkNyb3BNZXRyaWNzIiwiYXVkIjoiYWxsIiwiZXhwIjoxNTU2MTQzMjkxLCJuYmYiOjE1NTYxMzkzOTF9.HUh0YCb8FJA-ZVYfD6eAyqj_cX4eRk9iMHLKt2becP0"
        }, {
          "name" : "Host",
          "value" : "localhost:10520"
        }, {
          "name" : "Accept",
          "value" : "text/html, image/gif, image/jpeg, *; q=.2, */*; q=.2"
        }, {
          "name" : "Proxy-Connection",
          "value" : "keep-alive"
        }, {
          "name" : "Content-Length",
          "value" : "371"
        } ],
        "queryString" : [ ],
        "postData" : {
          "mimeType" : "application/json",
          "text" : "{\"field\":{\"farm_id\":7,\"name\":\"Field without x value in boundary\",\"boundary\":{\"boundaries\":[{\"boundary\":{\"coords\":[{\"x\":-101.49568751,\"y\":37.14976293},{\"x\":-101.50049403,\"y\":37.14647907},{\"x\":-101.50049403,\"y\":37.14264773},{\"x\":-101.49723246,\"y\":37.1411425},{\"x\":-101.49019435,\"y\":37.14223722},{\"x\":-101.48933604,\"y\":37.14620541},{\"x\":-101.49294093,\"y\":37.14866833}]}}]}}}",
          "comment" : ""
        },
        "headersSize" : 592,
        "bodySize" : 371,
        "comment" : ""
      },
      "response" : {
        "status" : 400,
        "statusText" : "Bad Request",
        "httpVersion" : "HTTP/1.1",
        "cookies" : [ {
          "name" : ".ASPROLES",
          "value" : "KKWL7uq7yA3iyt6dDO1JqahJtD3AidmZ9o1J4PbR6LPC6rAfAxAfdyntZ0qISC2bmr4NyeelZjTK2XVfKNs4KOFWBSHG9CRRHKoMOk_eEV2vUhEhC-PEondYH5PHeIQ-iMwI1asawo4JlLUIgTXi2OzTXau1YUq-6rG0rLtwajEvOCWMcr-ETn4a044Y27qxACRU1tpYHq7waqKElTp927YbpwAamKBE-__qRvUNHjFTr99tp9ajqsQisiajwlqbFJb8dX3fSflwMMVRxE8bY7jBkTjCgsbQfG5vaC3d3eDV0axtEcpkpPklDmVXIeZSes4-MOZnic9Z70H8WeajyKvXRF-ZknVNAPdLFLIHcDjUuznnciZeIybZzQsvyyiqtmeWTSIx1EYpRPGFCGqLEU54rhokHQZ1NWx5Cwzhafxzu1LoZKZIx_vItr-oJMEvR0ZyqZZkTHeg2rir6aBhRRICFaAn6g-LWz_oCZD29TrhN6MlPk1sXZy37aWQHO0YzeUr_3Vr4d88wZs2-BLbZ7zLzjw1",
          "path" : "/",
          "httpOnly" : true,
          "secure" : false,
          "comment" : ""
        } ],
        "headers" : [ {
          "name" : "Cache-Control",
          "value" : "private"
        }, {
          "name" : "Content-Type",
          "value" : "application/json; charset=utf-8"
        }, {
          "name" : "Server",
          "value" : "Microsoft-IIS/10.0"
        }, {
          "name" : "Set-Cookie",
          "value" : ".ASPROLES=KKWL7uq7yA3iyt6dDO1JqahJtD3AidmZ9o1J4PbR6LPC6rAfAxAfdyntZ0qISC2bmr4NyeelZjTK2XVfKNs4KOFWBSHG9CRRHKoMOk_eEV2vUhEhC-PEondYH5PHeIQ-iMwI1asawo4JlLUIgTXi2OzTXau1YUq-6rG0rLtwajEvOCWMcr-ETn4a044Y27qxACRU1tpYHq7waqKElTp927YbpwAamKBE-__qRvUNHjFTr99tp9ajqsQisiajwlqbFJb8dX3fSflwMMVRxE8bY7jBkTjCgsbQfG5vaC3d3eDV0axtEcpkpPklDmVXIeZSes4-MOZnic9Z70H8WeajyKvXRF-ZknVNAPdLFLIHcDjUuznnciZeIybZzQsvyyiqtmeWTSIx1EYpRPGFCGqLEU54rhokHQZ1NWx5Cwzhafxzu1LoZKZIx_vItr-oJMEvR0ZyqZZkTHeg2rir6aBhRRICFaAn6g-LWz_oCZD29TrhN6MlPk1sXZy37aWQHO0YzeUr_3Vr4d88wZs2-BLbZ7zLzjw1; path=/; HttpOnly"
        }, {
          "name" : "X-SourceFiles",
          "value" : "=?UTF-8?B?RDpcVmlydHVhbE9wdGltaXplci1SZWZhY3RvcmluZ1xDcm9wTWV0cmljcy5Wby5BcGlcQ3JvcE1ldHJpY3MuVm8uQXBpXGFwaVxtb2JpbGVcdjFcZmllbGRz?="
        }, {
          "name" : "X-Powered-By",
          "value" : "ASP.NET"
        }, {
          "name" : "Date",
          "value" : "Wed, 24 Apr 2019 20:56:34 GMT"
        }, {
          "name" : "Content-Length",
          "value" : "119"
        } ],
        "content" : {
          "size" : 119,
          "mimeType" : "application/json; charset=utf-8",
          "text" : "{\"message\":\"The Boundary is not valid. IllegalArgumentException: Points of LinearRing do not form a closed linestring\"}",
          "comment" : ""
        },
        "redirectURL" : "",
        "headersSize" : 941,
        "bodySize" : 119,
        "comment" : ""
      },
      "cache" : { },
      "timings" : {
        "comment" : "",
        "ssl" : -1,
        "wait" : 3022,
        "send" : 0,
        "receive" : 0,
        "blocked" : -1,
        "dns" : -1,
        "connect" : -1
      },
      "serverIPAddress" : "127.0.0.1",
      "comment" : "",
      "_katalonRequestInformation" : {
        "name" : "109",
        "testObjectId" : "Object Repository/VoGrow/Field/FieldPost",
        "harId" : "61850bc4-6cc8-48c2-8a70-f3ebab734f76"
      },
      "time" : 3022
    } ],
    "comment" : ""
  }
}