{
  "log" : {
    "version" : "1.2",
    "creator" : {
      "name" : "BrowserMob Proxy",
      "version" : "2.1.5",
      "comment" : ""
    },
    "pages" : [ {
      "id" : "Page 0",
      "startedDateTime" : "2019-04-09T09:31:58.052Z",
      "title" : "Page 0",
      "pageTimings" : {
        "onLoad" : 29,
        "comment" : ""
      },
      "comment" : ""
    } ],
    "entries" : [ {
      "pageref" : "Page 0",
      "startedDateTime" : "2019-04-09T09:31:58.054Z",
      "request" : {
        "method" : "PUT",
        "url" : "http://localhost:10520/WebAPI/api/mobile/v1/farms/8?",
        "httpVersion" : "HTTP/1.1",
        "cookies" : [ ],
        "headers" : [ {
          "name" : "User-Agent",
          "value" : "Katalon Studio"
        }, {
          "name" : "Content-Type",
          "value" : "application/json"
        }, {
          "name" : "Authorization",
          "value" : "Bearer eyJ0eXAiOiJKV1QiLCJhbGciOiJIUzI1NiJ9.eyJ1bmlxdWVfbmFtZSI6Implbm55Lm1hbGRvbmFkby50eC5hZ2VudC5yb0BnbWFpbC5jb20iLCJyb2xlIjoidXNlciIsInN1YiI6Implbm55Lm1hbGRvbmFkby50eC5hZ2VudC5yb0BnbWFpbC5jb20iLCJpc3MiOiJDcm9wTWV0cmljcyIsImF1ZCI6ImFsbCIsImV4cCI6MTU1NDgwNjIxOCwibmJmIjoxNTU0ODAyMzE4fQ.HG7aEqLMBKNO0dPe7JHS1YFRGg5ja7xPuDPw2banObI"
        }, {
          "name" : "Host",
          "value" : "localhost:10520"
        }, {
          "name" : "Accept",
          "value" : "text/html, image/gif, image/jpeg, *; q=.2, */*; q=.2"
        }, {
          "name" : "Proxy-Connection",
          "value" : "keep-alive"
        }, {
          "name" : "Content-Length",
          "value" : "46"
        } ],
        "queryString" : [ ],
        "postData" : {
          "mimeType" : "application/json",
          "text" : "{\"name\": \"Farm 2 UPDATED by dealer read only\"}",
          "comment" : ""
        },
        "headersSize" : 613,
        "bodySize" : 46,
        "comment" : ""
      },
      "response" : {
        "status" : 200,
        "statusText" : "OK",
        "httpVersion" : "HTTP/1.1",
        "cookies" : [ {
          "name" : ".ASPROLES",
          "value" : "HzSPMs59gbMcHR92i4_DDb6QN4hFLA-gX5PwHGAmMFnwK1_fJKtQA_2CoQMRkkwCK51Z9KimvUIVqQCVvrreO2jOmdk0yCWr_L92ExqQe5lfFH4Z6WutgQIi9aOoz-axdhjrNIUNgCKn3bNn6nARcVKJ0PvfLuW1CEP8gMt9nrKkOTJI55p9f3aFcNBYOSrtd0ulmeg7w2MCR51Qg7_Hs1_TOzCHBG-X2lxLrzfMRQ0FgY4N-XFc2t4YNFSPeTVP5sSuTW_Dlf9es5OD75Ndx9OpqCJayDd3costz3q-VEH3IslF8H5J-PA1JrRehg0kcw7XlzmOB0tVkn2PFmd0QLIi1bJPTNAp3VMqNSm9SKv_dkNq2-YcqeaadzIz8X52EKGmnl2UZrunJaFQP--NDJxikVCkbc1SmL7AMblXhlfqF5MrcTV2wvv-WMlDQ9fSey0EK6tCjNJQdY-oEzkf7aZP-tAWBfgJ-vFEOC3-0zOyxRWMjORkxV0repU1eJpE_4XdqDdJGoZN7TcwqO-mlW6ZhvI1",
          "path" : "/",
          "httpOnly" : true,
          "secure" : false,
          "comment" : ""
        } ],
        "headers" : [ {
          "name" : "Cache-Control",
          "value" : "private"
        }, {
          "name" : "Content-Type",
          "value" : "application/json; charset=utf-8"
        }, {
          "name" : "Server",
          "value" : "Microsoft-IIS/10.0"
        }, {
          "name" : "Set-Cookie",
          "value" : ".ASPROLES=HzSPMs59gbMcHR92i4_DDb6QN4hFLA-gX5PwHGAmMFnwK1_fJKtQA_2CoQMRkkwCK51Z9KimvUIVqQCVvrreO2jOmdk0yCWr_L92ExqQe5lfFH4Z6WutgQIi9aOoz-axdhjrNIUNgCKn3bNn6nARcVKJ0PvfLuW1CEP8gMt9nrKkOTJI55p9f3aFcNBYOSrtd0ulmeg7w2MCR51Qg7_Hs1_TOzCHBG-X2lxLrzfMRQ0FgY4N-XFc2t4YNFSPeTVP5sSuTW_Dlf9es5OD75Ndx9OpqCJayDd3costz3q-VEH3IslF8H5J-PA1JrRehg0kcw7XlzmOB0tVkn2PFmd0QLIi1bJPTNAp3VMqNSm9SKv_dkNq2-YcqeaadzIz8X52EKGmnl2UZrunJaFQP--NDJxikVCkbc1SmL7AMblXhlfqF5MrcTV2wvv-WMlDQ9fSey0EK6tCjNJQdY-oEzkf7aZP-tAWBfgJ-vFEOC3-0zOyxRWMjORkxV0repU1eJpE_4XdqDdJGoZN7TcwqO-mlW6ZhvI1; path=/; HttpOnly"
        }, {
          "name" : "X-SourceFiles",
          "value" : "=?UTF-8?B?RDpcVmlydHVhbE9wdGltaXplci1SZWZhY3RvcmluZ1xDcm9wTWV0cmljcy5Wby5BcGlcQ3JvcE1ldHJpY3MuVm8uQXBpXGFwaVxtb2JpbGVcdjFcZmFybXNcOA==?="
        }, {
          "name" : "X-Powered-By",
          "value" : "ASP.NET"
        }, {
          "name" : "Date",
          "value" : "Tue, 09 Apr 2019 09:31:57 GMT"
        }, {
          "name" : "Content-Length",
          "value" : "64"
        } ],
        "content" : {
          "size" : 64,
          "mimeType" : "application/json; charset=utf-8",
          "text" : "{\"id\":8,\"name\":\"Farm 2 UPDATED by dealer read only\",\"user_id\":3}",
          "comment" : ""
        },
        "redirectURL" : "",
        "headersSize" : 935,
        "bodySize" : 64,
        "comment" : ""
      },
      "cache" : { },
      "timings" : {
        "comment" : "",
        "ssl" : -1,
        "receive" : 0,
        "blocked" : -1,
        "connect" : -1,
        "send" : 0,
        "wait" : 24,
        "dns" : -1
      },
      "serverIPAddress" : "127.0.0.1",
      "comment" : "",
      "_katalonRequestInformation" : {
        "name" : "55",
        "testObjectId" : "Object Repository/VoGrow/Farm/FarmPut",
        "harId" : "6266c207-8930-4dad-8973-b87fb3d5dcf7"
      },
      "time" : 25
    } ],
    "comment" : ""
  }
}