{
  "log" : {
    "version" : "1.2",
    "creator" : {
      "name" : "BrowserMob Proxy",
      "version" : "2.1.5",
      "comment" : ""
    },
    "pages" : [ {
      "id" : "Page 0",
      "startedDateTime" : "2019-03-27T19:35:25.505Z",
      "title" : "Page 0",
      "pageTimings" : {
        "onLoad" : 1537,
        "comment" : ""
      },
      "comment" : ""
    } ],
    "entries" : [ {
      "pageref" : "Page 0",
      "startedDateTime" : "2019-03-27T19:35:25.506Z",
      "request" : {
        "method" : "POST",
        "url" : "http://localhost:10520/WebAPI/api/Account/AdministrativeRegister/?",
        "httpVersion" : "HTTP/1.1",
        "cookies" : [ ],
        "headers" : [ {
          "name" : "User-Agent",
          "value" : "Katalon Studio"
        }, {
          "name" : "Content-Type",
          "value" : "application/x-www-form-urlencoded"
        }, {
          "name" : "Authorization",
          "value" : "Bearer eyJ0eXAiOiJKV1QiLCJhbGciOiJIUzI1NiJ9.eyJ1bmlxdWVfbmFtZSI6ImFkbWluIiwicm9sZSI6InVzZXIiLCJzdWIiOiJhZG1pbiIsImlzcyI6IkNyb3BNZXRyaWNzIiwiYXVkIjoiYWxsIiwiZXhwIjoxNTUzNzE5MjI1LCJuYmYiOjE1NTM3MTUzMjV9.HpJH2kOdYwKxmfNlD18c_C72gUpGBynb4pOx5kwz_R8"
        }, {
          "name" : "Host",
          "value" : "localhost:10520"
        }, {
          "name" : "Accept",
          "value" : "text/html, image/gif, image/jpeg, *; q=.2, */*; q=.2"
        }, {
          "name" : "Proxy-Connection",
          "value" : "keep-alive"
        }, {
          "name" : "Content-Length",
          "value" : "361"
        } ],
        "queryString" : [ ],
        "postData" : {
          "mimeType" : "application/x-www-form-urlencoded",
          "params" : [ {
            "name" : "username",
            "value" : "kusercountrynumber",
            "comment" : ""
          }, {
            "name" : "password",
            "value" : "cropmetrics",
            "comment" : ""
          }, {
            "name" : "confirmPassword",
            "value" : "cropmetrics",
            "comment" : ""
          }, {
            "name" : "email",
            "value" : "cropmetricsvo@gmail.com",
            "comment" : ""
          }, {
            "name" : "fullname",
            "value" : "test validation",
            "comment" : ""
          }, {
            "name" : "phone",
            "value" : "123",
            "comment" : ""
          }, {
            "name" : "dealer",
            "value" : "x",
            "comment" : ""
          }, {
            "name" : "addressLine1",
            "value" : "address line 1 test validation",
            "comment" : ""
          }, {
            "name" : "addressLine2",
            "value" : "address line 2 test validation",
            "comment" : ""
          }, {
            "name" : "town",
            "value" : "townValidation",
            "comment" : ""
          }, {
            "name" : "state",
            "value" : "stateValidation",
            "comment" : ""
          }, {
            "name" : "zip",
            "value" : "123457",
            "comment" : ""
          }, {
            "name" : "country",
            "value" : "123456",
            "comment" : ""
          }, {
            "name" : "roles",
            "value" : "Client",
            "comment" : ""
          }, {
            "name" : "modifierUsername",
            "value" : "admin",
            "comment" : ""
          }, {
            "name" : "modifierUserId",
            "value" : "1",
            "comment" : ""
          } ],
          "comment" : ""
        },
        "headersSize" : 560,
        "bodySize" : 361,
        "comment" : ""
      },
      "response" : {
        "status" : 200,
        "statusText" : "OK",
        "httpVersion" : "HTTP/1.1",
        "cookies" : [ {
          "name" : ".ASPROLES",
          "value" : "8Y4ojd1CsA23aEr_pZJR1MEmsdleib8QST3RFKN2KIvRAo6ceV3ONFkEz2nd5Qivz0RQaeDW_t9h99QcC0YiTNuD974NT5_Oh4Wya6G0DNPqdp3ngGDWzQDALDTXGWGlCzwZ5yAarlZ7aiQLVWWznBQnggTPje9OOfiZfAm3nM3dJamA5Ilm1f8IbgKzYENb_7C1n_zq_B01nOo6cC03unHEAgzMgxLBL7iBH7KoF1RenjOxo1th8ibna2pJLtrHO28W6uFprdrkgHYpBLFVwFAMAfEucEP05Bu87iPbxcxVYyBafONrxdSLY3hqdOboQXU6HeBgukb60T73EbkyIHvk44RGRoBPHvU8wskrvcEMEOw3Z4qi-HV33gMxmju2fCDhkEFZrIE2JuXQ-7DHE-ddKjL4dV45IO5fXNz01h4WbaSoMp3BcaL82R7Q6ABbIgU9jyE_hNQXht_2ox_X7EFwxvjT-er_5IsRyOh2Vg_0yGAJ0",
          "path" : "/",
          "httpOnly" : true,
          "secure" : false,
          "comment" : ""
        } ],
        "headers" : [ {
          "name" : "Cache-Control",
          "value" : "private"
        }, {
          "name" : "Content-Type",
          "value" : "application/json; charset=utf-8"
        }, {
          "name" : "Server",
          "value" : "Microsoft-IIS/10.0"
        }, {
          "name" : "Set-Cookie",
          "value" : ".ASPROLES=8Y4ojd1CsA23aEr_pZJR1MEmsdleib8QST3RFKN2KIvRAo6ceV3ONFkEz2nd5Qivz0RQaeDW_t9h99QcC0YiTNuD974NT5_Oh4Wya6G0DNPqdp3ngGDWzQDALDTXGWGlCzwZ5yAarlZ7aiQLVWWznBQnggTPje9OOfiZfAm3nM3dJamA5Ilm1f8IbgKzYENb_7C1n_zq_B01nOo6cC03unHEAgzMgxLBL7iBH7KoF1RenjOxo1th8ibna2pJLtrHO28W6uFprdrkgHYpBLFVwFAMAfEucEP05Bu87iPbxcxVYyBafONrxdSLY3hqdOboQXU6HeBgukb60T73EbkyIHvk44RGRoBPHvU8wskrvcEMEOw3Z4qi-HV33gMxmju2fCDhkEFZrIE2JuXQ-7DHE-ddKjL4dV45IO5fXNz01h4WbaSoMp3BcaL82R7Q6ABbIgU9jyE_hNQXht_2ox_X7EFwxvjT-er_5IsRyOh2Vg_0yGAJ0; path=/; HttpOnly"
        }, {
          "name" : "X-SourceFiles",
          "value" : "=?UTF-8?B?RDpcVmlydHVhbE9wdGltaXplci1SZWZhY3RvcmluZ1xDcm9wTWV0cmljcy5Wby5BcGlcQ3JvcE1ldHJpY3MuVm8uQXBpXGFwaVxBY2NvdW50XEFkbWluaXN0cmF0aXZlUmVnaXN0ZXJc?="
        }, {
          "name" : "X-Powered-By",
          "value" : "ASP.NET"
        }, {
          "name" : "Date",
          "value" : "Wed, 27 Mar 2019 19:35:27 GMT"
        }, {
          "name" : "Content-Length",
          "value" : "9"
        } ],
        "content" : {
          "size" : 9,
          "mimeType" : "application/json; charset=utf-8",
          "text" : "{\"id\":37}",
          "comment" : ""
        },
        "redirectURL" : "",
        "headersSize" : 907,
        "bodySize" : 9,
        "comment" : ""
      },
      "cache" : { },
      "timings" : {
        "comment" : "",
        "ssl" : -1,
        "dns" : -1,
        "receive" : 0,
        "blocked" : -1,
        "wait" : 1540,
        "send" : 0,
        "connect" : -1
      },
      "serverIPAddress" : "127.0.0.1",
      "comment" : "",
      "_katalonRequestInformation" : {
        "name" : "85",
        "testObjectId" : "Object Repository/VoPro/Account/AdministrativeRegister",
        "harId" : "3586a584-bf43-49ec-a257-79dbe215ed54"
      },
      "time" : 1541
    } ],
    "comment" : ""
  }
}