{
  "log" : {
    "version" : "1.2",
    "creator" : {
      "name" : "BrowserMob Proxy",
      "version" : "2.1.5",
      "comment" : ""
    },
    "pages" : [ {
      "id" : "Page 0",
      "startedDateTime" : "2019-04-24T20:27:17.757Z",
      "title" : "Page 0",
      "pageTimings" : {
        "onLoad" : 4017,
        "comment" : ""
      },
      "comment" : ""
    } ],
    "entries" : [ {
      "pageref" : "Page 0",
      "startedDateTime" : "2019-04-24T20:27:17.758Z",
      "request" : {
        "method" : "PUT",
        "url" : "http://localhost:10520/WebAPI/api/mobile/v1/farms/5555?",
        "httpVersion" : "HTTP/1.1",
        "cookies" : [ ],
        "headers" : [ {
          "name" : "User-Agent",
          "value" : "Katalon Studio"
        }, {
          "name" : "Content-Type",
          "value" : "application/json"
        }, {
          "name" : "Authorization",
          "value" : "Bearer eyJ0eXAiOiJKV1QiLCJhbGciOiJIUzI1NiJ9.eyJ1bmlxdWVfbmFtZSI6Implbm55Lm1hbGRvbmFkby50eDFAZ21haWwuY29tIiwicm9sZSI6InVzZXIiLCJzdWIiOiJqZW5ueS5tYWxkb25hZG8udHgxQGdtYWlsLmNvbSIsImlzcyI6IkNyb3BNZXRyaWNzIiwiYXVkIjoiYWxsIiwiZXhwIjoxNTU2MTQxNTM3LCJuYmYiOjE1NTYxMzc2Mzd9.Ui2YporualyMdwBdhVsS2kyGNZ_no264dWxMXePI0aM"
        }, {
          "name" : "Host",
          "value" : "localhost:10520"
        }, {
          "name" : "Accept",
          "value" : "text/html, image/gif, image/jpeg, *; q=.2, */*; q=.2"
        }, {
          "name" : "Proxy-Connection",
          "value" : "keep-alive"
        }, {
          "name" : "Content-Length",
          "value" : "34"
        } ],
        "queryString" : [ ],
        "postData" : {
          "mimeType" : "application/json",
          "text" : "{\"name\": \"Test Farm Id parameter\"}",
          "comment" : ""
        },
        "headersSize" : 594,
        "bodySize" : 34,
        "comment" : ""
      },
      "response" : {
        "status" : 400,
        "statusText" : "Bad Request",
        "httpVersion" : "HTTP/1.1",
        "cookies" : [ {
          "name" : ".ASPROLES",
          "value" : "btHvRVrNGhd9A7RXu7lj52KxBkBr4AIyzvTjwnQi0X19PP8iD2FeOksVuu3slP8m_7iHne14vs2CXcu9Ehe3Fajstv0Ild2ppK8xhNA5qFFH-mQq14z2QwVZrKErj-B_1OGtzUM6PayFwDcOa8rxz0-PFtE6bLQQyNSktJzjIksWuxKTHZeUxBekM_bOlOwGdz9xUNCE_NogBPaz3CayBvaXdIvmCgoPmHij2vh438BB8v5S74O6XrCECh1mbq21CUlKra_OSw77R-yOtlsDSiyQS23L_kRZGS2jBs4t2ppA5-TU-iY7smSXzWqIAfby9VpHTonW5dI2sY3nGTtI-OQfrGPuIjM76ePFoMk_pmvQGAhJfEGlDjfCfmxU7xP3EdiUDeyZnbz1jVUxHjDflOfvw2uAS9nlmQ_XUIKWtwJrdUTpvTAeRBXAEHdZk2FaucsK4rnGCqqUayhCOeE7FRAEgmIWmZFRctFmzysJ54rHvVWGf9ICbnirhykYUR0msn2N0SNQbBCqwrsFar06-1SWtoQ1",
          "path" : "/",
          "httpOnly" : true,
          "secure" : false,
          "comment" : ""
        } ],
        "headers" : [ {
          "name" : "Cache-Control",
          "value" : "private"
        }, {
          "name" : "Content-Type",
          "value" : "application/json; charset=utf-8"
        }, {
          "name" : "Server",
          "value" : "Microsoft-IIS/10.0"
        }, {
          "name" : "Set-Cookie",
          "value" : ".ASPROLES=btHvRVrNGhd9A7RXu7lj52KxBkBr4AIyzvTjwnQi0X19PP8iD2FeOksVuu3slP8m_7iHne14vs2CXcu9Ehe3Fajstv0Ild2ppK8xhNA5qFFH-mQq14z2QwVZrKErj-B_1OGtzUM6PayFwDcOa8rxz0-PFtE6bLQQyNSktJzjIksWuxKTHZeUxBekM_bOlOwGdz9xUNCE_NogBPaz3CayBvaXdIvmCgoPmHij2vh438BB8v5S74O6XrCECh1mbq21CUlKra_OSw77R-yOtlsDSiyQS23L_kRZGS2jBs4t2ppA5-TU-iY7smSXzWqIAfby9VpHTonW5dI2sY3nGTtI-OQfrGPuIjM76ePFoMk_pmvQGAhJfEGlDjfCfmxU7xP3EdiUDeyZnbz1jVUxHjDflOfvw2uAS9nlmQ_XUIKWtwJrdUTpvTAeRBXAEHdZk2FaucsK4rnGCqqUayhCOeE7FRAEgmIWmZFRctFmzysJ54rHvVWGf9ICbnirhykYUR0msn2N0SNQbBCqwrsFar06-1SWtoQ1; path=/; HttpOnly"
        }, {
          "name" : "X-SourceFiles",
          "value" : "=?UTF-8?B?RDpcVmlydHVhbE9wdGltaXplci1SZWZhY3RvcmluZ1xDcm9wTWV0cmljcy5Wby5BcGlcQ3JvcE1ldHJpY3MuVm8uQXBpXGFwaVxtb2JpbGVcdjFcZmFybXNcNTU1NQ==?="
        }, {
          "name" : "X-Powered-By",
          "value" : "ASP.NET"
        }, {
          "name" : "Date",
          "value" : "Wed, 24 Apr 2019 20:27:21 GMT"
        }, {
          "name" : "Content-Length",
          "value" : "38"
        } ],
        "content" : {
          "size" : 38,
          "mimeType" : "application/json; charset=utf-8",
          "text" : "{\"message\":\"The farm id is not valid\"}",
          "comment" : ""
        },
        "redirectURL" : "",
        "headersSize" : 948,
        "bodySize" : 38,
        "comment" : ""
      },
      "cache" : { },
      "timings" : {
        "comment" : "",
        "connect" : -1,
        "wait" : 4011,
        "send" : 0,
        "receive" : 0,
        "dns" : -1,
        "blocked" : -1,
        "ssl" : -1
      },
      "serverIPAddress" : "127.0.0.1",
      "comment" : "",
      "_katalonRequestInformation" : {
        "name" : "51",
        "testObjectId" : "Object Repository/VoGrow/Farm/FarmPut",
        "harId" : "8cd24baa-5c1c-4a12-8d04-1a7496e5b01c"
      },
      "time" : 4012
    } ],
    "comment" : ""
  }
}