{
  "log" : {
    "version" : "1.2",
    "creator" : {
      "name" : "BrowserMob Proxy",
      "version" : "2.1.5",
      "comment" : ""
    },
    "pages" : [ {
      "id" : "Page 0",
      "startedDateTime" : "2019-03-28T18:59:55.070Z",
      "title" : "Page 0",
      "pageTimings" : {
        "onLoad" : 1234,
        "comment" : ""
      },
      "comment" : ""
    } ],
    "entries" : [ {
      "pageref" : "Page 0",
      "startedDateTime" : "2019-03-28T18:59:55.070Z",
      "request" : {
        "method" : "POST",
        "url" : "http://localhost:10520/WebAPI/api/admin/v1/users/?",
        "httpVersion" : "HTTP/1.1",
        "cookies" : [ ],
        "headers" : [ {
          "name" : "User-Agent",
          "value" : "Katalon Studio"
        }, {
          "name" : "Content-Type",
          "value" : "application/x-www-form-urlencoded"
        }, {
          "name" : "Authorization",
          "value" : "Bearer eyJ0eXAiOiJKV1QiLCJhbGciOiJIUzI1NiJ9.eyJ1bmlxdWVfbmFtZSI6ImFkbWluIiwicm9sZSI6InVzZXIiLCJzdWIiOiJhZG1pbiIsImlzcyI6IkNyb3BNZXRyaWNzIiwiYXVkIjoiYWxsIiwiZXhwIjoxNTUzODAzNDk1LCJuYmYiOjE1NTM3OTk1OTV9.8JRg-LiDl6CBdWzQ0acsJ-n1QOf3lkVFdXLypuPdwJY"
        }, {
          "name" : "Host",
          "value" : "localhost:10520"
        }, {
          "name" : "Accept",
          "value" : "text/html, image/gif, image/jpeg, *; q=.2, */*; q=.2"
        }, {
          "name" : "Proxy-Connection",
          "value" : "keep-alive"
        }, {
          "name" : "Content-Length",
          "value" : "264"
        } ],
        "queryString" : [ ],
        "postData" : {
          "mimeType" : "application/x-www-form-urlencoded",
          "params" : [ {
            "name" : "password",
            "value" : "cropmetrics",
            "comment" : ""
          }, {
            "name" : "email",
            "value" : "cropmetricsvo.client@gmail.com",
            "comment" : ""
          }, {
            "name" : "fullname",
            "value" : "test validation",
            "comment" : ""
          }, {
            "name" : "phone",
            "value" : "123",
            "comment" : ""
          }, {
            "name" : "dealer",
            "value" : "x",
            "comment" : ""
          }, {
            "name" : "addressLine1",
            "value" : "address line 1 test validation",
            "comment" : ""
          }, {
            "name" : "addressLine2",
            "value" : "address line 2 test validation",
            "comment" : ""
          }, {
            "name" : "town",
            "value" : "townValidation",
            "comment" : ""
          }, {
            "name" : "state",
            "value" : "stateValidation",
            "comment" : ""
          }, {
            "name" : "zip",
            "value" : "xx",
            "comment" : ""
          }, {
            "name" : "country",
            "value" : "xx",
            "comment" : ""
          }, {
            "name" : "roles",
            "value" : "Client",
            "comment" : ""
          } ],
          "comment" : ""
        },
        "headersSize" : 544,
        "bodySize" : 264,
        "comment" : ""
      },
      "response" : {
        "status" : 200,
        "statusText" : "OK",
        "httpVersion" : "HTTP/1.1",
        "cookies" : [ {
          "name" : ".ASPROLES",
          "value" : "yLq9zbK-yfnrtdSBGNbBFXLezE0jsPl5YjPQnGuhwXvyfNL3xVz16EOR53moRk-d1o4OEMZ-uXcid529YCMr_LMGXlfWiBhjfjjdM3rRbxoOiusvz8tBnGG9XaQ1Oz3ByYVUvFTrc0s-fz7KayCxJoKYLZK4LUiLwqhAb8RxdrhUyQ3QYfuIzHh8nbgrcT1aj8Iizs7OS9Op6r5Ju0aHHXf6UCQnV3xc2pOC1EqYaEdLrIaThH0gn4zMl_n50yvQUi-bl5gJQwaa3gCJCvE7fsq4afSECNog7i_uusJmbSqS_RZyV-8_4EpUOuTH-QU02_DnCQK2oOoYk6sWYA0Vgk2WgkqHcH5yYDS10zOjU0ksPEsr07TInaLlZtILKFo7eOgrOo9lPIhYba_I3zhi_hbSFwlftarxIEO5izoEP_pmmCcA-goVP8AiXXA82L1foWqhhEILzKnk-7-TeZIUWQoZ6c93Of7PEFjXjOzaA42IJsDW0",
          "path" : "/",
          "httpOnly" : true,
          "secure" : false,
          "comment" : ""
        } ],
        "headers" : [ {
          "name" : "Cache-Control",
          "value" : "private"
        }, {
          "name" : "Content-Type",
          "value" : "application/json; charset=utf-8"
        }, {
          "name" : "Server",
          "value" : "Microsoft-IIS/10.0"
        }, {
          "name" : "Set-Cookie",
          "value" : ".ASPROLES=yLq9zbK-yfnrtdSBGNbBFXLezE0jsPl5YjPQnGuhwXvyfNL3xVz16EOR53moRk-d1o4OEMZ-uXcid529YCMr_LMGXlfWiBhjfjjdM3rRbxoOiusvz8tBnGG9XaQ1Oz3ByYVUvFTrc0s-fz7KayCxJoKYLZK4LUiLwqhAb8RxdrhUyQ3QYfuIzHh8nbgrcT1aj8Iizs7OS9Op6r5Ju0aHHXf6UCQnV3xc2pOC1EqYaEdLrIaThH0gn4zMl_n50yvQUi-bl5gJQwaa3gCJCvE7fsq4afSECNog7i_uusJmbSqS_RZyV-8_4EpUOuTH-QU02_DnCQK2oOoYk6sWYA0Vgk2WgkqHcH5yYDS10zOjU0ksPEsr07TInaLlZtILKFo7eOgrOo9lPIhYba_I3zhi_hbSFwlftarxIEO5izoEP_pmmCcA-goVP8AiXXA82L1foWqhhEILzKnk-7-TeZIUWQoZ6c93Of7PEFjXjOzaA42IJsDW0; path=/; HttpOnly"
        }, {
          "name" : "X-SourceFiles",
          "value" : "=?UTF-8?B?RDpcVmlydHVhbE9wdGltaXplci1SZWZhY3RvcmluZ1xDcm9wTWV0cmljcy5Wby5BcGlcQ3JvcE1ldHJpY3MuVm8uQXBpXGFwaVxhZG1pblx2MVx1c2Vyc1w=?="
        }, {
          "name" : "X-Powered-By",
          "value" : "ASP.NET"
        }, {
          "name" : "Date",
          "value" : "Thu, 28 Mar 2019 18:59:56 GMT"
        }, {
          "name" : "Content-Length",
          "value" : "9"
        } ],
        "content" : {
          "size" : 9,
          "mimeType" : "application/json; charset=utf-8",
          "text" : "{\"id\":45}",
          "comment" : ""
        },
        "redirectURL" : "",
        "headersSize" : 887,
        "bodySize" : 9,
        "comment" : ""
      },
      "cache" : { },
      "timings" : {
        "comment" : "",
        "ssl" : -1,
        "connect" : -1,
        "blocked" : -1,
        "receive" : 0,
        "dns" : -1,
        "wait" : 1232,
        "send" : 0
      },
      "serverIPAddress" : "127.0.0.1",
      "comment" : "",
      "_katalonRequestInformation" : {
        "name" : "112",
        "testObjectId" : "Object Repository/VoPro/Account/api_admin_v1_users",
        "harId" : "30b314d6-4e98-48ee-8578-39f9cc60a536"
      },
      "time" : 1233
    } ],
    "comment" : ""
  }
}