{
  "log" : {
    "version" : "1.2",
    "creator" : {
      "name" : "BrowserMob Proxy",
      "version" : "2.1.5",
      "comment" : ""
    },
    "pages" : [ {
      "id" : "Page 0",
      "startedDateTime" : "2019-03-29T20:32:13.409Z",
      "title" : "Page 0",
      "pageTimings" : {
        "onLoad" : 3356,
        "comment" : ""
      },
      "comment" : ""
    } ],
    "entries" : [ {
      "pageref" : "Page 0",
      "startedDateTime" : "2019-03-29T20:32:13.409Z",
      "request" : {
        "method" : "PUT",
        "url" : "http://localhost:10520/WebAPI/api/admin/v1/users/41?",
        "httpVersion" : "HTTP/1.1",
        "cookies" : [ ],
        "headers" : [ {
          "name" : "User-Agent",
          "value" : "Katalon Studio"
        }, {
          "name" : "Content-Type",
          "value" : "application/x-www-form-urlencoded"
        }, {
          "name" : "Authorization",
          "value" : "Bearer eyJ0eXAiOiJKV1QiLCJhbGciOiJIUzI1NiJ9.eyJ1bmlxdWVfbmFtZSI6ImFkbWluIiwicm9sZSI6InVzZXIiLCJzdWIiOiJhZG1pbiIsImlzcyI6IkNyb3BNZXRyaWNzIiwiYXVkIjoiYWxsIiwiZXhwIjoxNTUzODk1NDMzLCJuYmYiOjE1NTM4OTE1MzN9.FFN8QPSLQ8qu7_UhlHDEpK1G0bOF_Bz6_6tPYMBH1nY"
        }, {
          "name" : "Host",
          "value" : "localhost:10520"
        }, {
          "name" : "Accept",
          "value" : "text/html, image/gif, image/jpeg, *; q=.2, */*; q=.2"
        }, {
          "name" : "Proxy-Connection",
          "value" : "keep-alive"
        }, {
          "name" : "Content-Length",
          "value" : "292"
        } ],
        "queryString" : [ ],
        "postData" : {
          "mimeType" : "application/x-www-form-urlencoded",
          "params" : [ {
            "name" : "password",
            "value" : "cropmetrics",
            "comment" : ""
          }, {
            "name" : "email",
            "value" : "cropmetricsvo.roleclient@gmail.com",
            "comment" : ""
          }, {
            "name" : "fullname",
            "value" : "test validation",
            "comment" : ""
          }, {
            "name" : "phone",
            "value" : "123",
            "comment" : ""
          }, {
            "name" : "dealer",
            "value" : "x",
            "comment" : ""
          }, {
            "name" : "addressLine1",
            "value" : "address line 1 test validation",
            "comment" : ""
          }, {
            "name" : "addressLine2",
            "value" : "address line 2 test validation",
            "comment" : ""
          }, {
            "name" : "town",
            "value" : "townValidation",
            "comment" : ""
          }, {
            "name" : "state",
            "value" : "stateValidation",
            "comment" : ""
          }, {
            "name" : "zip",
            "value" : "xx",
            "comment" : ""
          }, {
            "name" : "country",
            "value" : "xx",
            "comment" : ""
          }, {
            "name" : "roles",
            "value" : "Administrator",
            "comment" : ""
          }, {
            "name" : "userProfileId",
            "value" : "41",
            "comment" : ""
          } ],
          "comment" : ""
        },
        "headersSize" : 545,
        "bodySize" : 292,
        "comment" : ""
      },
      "response" : {
        "status" : 400,
        "statusText" : "Bad Request",
        "httpVersion" : "HTTP/1.1",
        "cookies" : [ {
          "name" : ".ASPROLES",
          "value" : "L_R2PntWod2ih7B37CKZD5ABGUmDQSmF0QgxnptYNfklppLEWKof2ZQcTvpmpEEm3ZF4jDKU0fyuBl_ga9AGITu8VOreIkG-Ue0bw4hoTMKJCzyCRMxgJFkujtSgZ19Ca7NlOAC6wVTaVlkkmA6Uq34mmfHG3Oos3ogqoy9LSiLIrQyDMWMIm1aHzVCv4QYsqwT9y1gfkzQu0IN-IXKM2KEL49-ikHhB1cTkt1Gybgf681ZsNHTZH7_Sb-c9pEdP7_4kWPUjSO8gzz_yxqunhuRDeHLX1TH8Vm1wjU405qvpA2dyYQ56RIgDwajIPdDwMVdrvM6NDcTS4f85gKhxPEU_LXS9h5qG-HHdLq6C8eZf3-YxowvrxZHNfeOFqRyMAZS0XtpppcYIezOTDAggUlkD6GDuDciCpU3P60c5_DZ19Etj3dkbqTW6LGCyZTz-1H8H0QcqCJT6BI2BQr0b3m352SdTqnQE42Z0hkzquqxxYxxw0",
          "path" : "/",
          "httpOnly" : true,
          "secure" : false,
          "comment" : ""
        } ],
        "headers" : [ {
          "name" : "Cache-Control",
          "value" : "private"
        }, {
          "name" : "Content-Type",
          "value" : "application/json; charset=utf-8"
        }, {
          "name" : "Server",
          "value" : "Microsoft-IIS/10.0"
        }, {
          "name" : "Set-Cookie",
          "value" : ".ASPROLES=L_R2PntWod2ih7B37CKZD5ABGUmDQSmF0QgxnptYNfklppLEWKof2ZQcTvpmpEEm3ZF4jDKU0fyuBl_ga9AGITu8VOreIkG-Ue0bw4hoTMKJCzyCRMxgJFkujtSgZ19Ca7NlOAC6wVTaVlkkmA6Uq34mmfHG3Oos3ogqoy9LSiLIrQyDMWMIm1aHzVCv4QYsqwT9y1gfkzQu0IN-IXKM2KEL49-ikHhB1cTkt1Gybgf681ZsNHTZH7_Sb-c9pEdP7_4kWPUjSO8gzz_yxqunhuRDeHLX1TH8Vm1wjU405qvpA2dyYQ56RIgDwajIPdDwMVdrvM6NDcTS4f85gKhxPEU_LXS9h5qG-HHdLq6C8eZf3-YxowvrxZHNfeOFqRyMAZS0XtpppcYIezOTDAggUlkD6GDuDciCpU3P60c5_DZ19Etj3dkbqTW6LGCyZTz-1H8H0QcqCJT6BI2BQr0b3m352SdTqnQE42Z0hkzquqxxYxxw0; path=/; HttpOnly"
        }, {
          "name" : "X-SourceFiles",
          "value" : "=?UTF-8?B?RDpcVmlydHVhbE9wdGltaXplci1SZWZhY3RvcmluZ1xDcm9wTWV0cmljcy5Wby5BcGlcQ3JvcE1ldHJpY3MuVm8uQXBpXGFwaVxhZG1pblx2MVx1c2Vyc1w0MQ==?="
        }, {
          "name" : "X-Powered-By",
          "value" : "ASP.NET"
        }, {
          "name" : "Date",
          "value" : "Fri, 29 Mar 2019 20:32:16 GMT"
        }, {
          "name" : "Content-Length",
          "value" : "71"
        } ],
        "content" : {
          "size" : 71,
          "mimeType" : "application/json; charset=utf-8",
          "text" : "{\"message\":\"Name cropmetricsvo.roleclient@gmail.com is already taken.\"}",
          "comment" : ""
        },
        "redirectURL" : "",
        "headersSize" : 901,
        "bodySize" : 71,
        "comment" : ""
      },
      "cache" : { },
      "timings" : {
        "comment" : "",
        "ssl" : -1,
        "send" : 0,
        "wait" : 3348,
        "connect" : -1,
        "blocked" : -1,
        "receive" : 0,
        "dns" : -1
      },
      "serverIPAddress" : "127.0.0.1",
      "comment" : "",
      "_katalonRequestInformation" : {
        "name" : "79",
        "testObjectId" : "Object Repository/VoPro/Account/api_admin_v1_users_userprofileid",
        "harId" : "45c4bfc3-deb9-4f2a-a827-b0ea925483de"
      },
      "time" : 3349
    } ],
    "comment" : ""
  }
}