{
  "log" : {
    "version" : "1.2",
    "creator" : {
      "name" : "BrowserMob Proxy",
      "version" : "2.1.5",
      "comment" : ""
    },
    "pages" : [ {
      "id" : "Page 0",
      "startedDateTime" : "2019-04-09T20:39:25.989Z",
      "title" : "Page 0",
      "pageTimings" : {
        "onLoad" : 3086,
        "comment" : ""
      },
      "comment" : ""
    } ],
    "entries" : [ {
      "pageref" : "Page 0",
      "startedDateTime" : "2019-04-09T20:39:25.991Z",
      "request" : {
        "method" : "PUT",
        "url" : "http://localhost:10520/WebAPI/api/mobile/v1/farms/7?",
        "httpVersion" : "HTTP/1.1",
        "cookies" : [ ],
        "headers" : [ {
          "name" : "User-Agent",
          "value" : "Katalon Studio"
        }, {
          "name" : "Content-Type",
          "value" : "application/json"
        }, {
          "name" : "Authorization",
          "value" : "Bearer eyJ0eXAiOiJKV1QiLCJhbGciOiJIUzI1NiJ9.eyJ1bmlxdWVfbmFtZSI6Implbm55Lm1hbGRvbmFkby50eDFAZ21haWwuY29tIiwicm9sZSI6InVzZXIiLCJzdWIiOiJqZW5ueS5tYWxkb25hZG8udHgxQGdtYWlsLmNvbSIsImlzcyI6IkNyb3BNZXRyaWNzIiwiYXVkIjoiYWxsIiwiZXhwIjoxNTU0ODQ2MjY1LCJuYmYiOjE1NTQ4NDIzNjV9.4Dd8jHVxUDogYeR_9Wja3yZDxcGXWc4VqIEqvO8A-Pk"
        }, {
          "name" : "Host",
          "value" : "localhost:10520"
        }, {
          "name" : "Accept",
          "value" : "text/html, image/gif, image/jpeg, *; q=.2, */*; q=.2"
        }, {
          "name" : "Proxy-Connection",
          "value" : "keep-alive"
        }, {
          "name" : "Content-Length",
          "value" : "20"
        } ],
        "queryString" : [ ],
        "postData" : {
          "mimeType" : "application/json",
          "text" : "{\"name\": \"!@#$%^&*\"}",
          "comment" : ""
        },
        "headersSize" : 591,
        "bodySize" : 20,
        "comment" : ""
      },
      "response" : {
        "status" : 400,
        "statusText" : "Bad Request",
        "httpVersion" : "HTTP/1.1",
        "cookies" : [ {
          "name" : ".ASPROLES",
          "value" : "hVo_m-wsHQ4Ghb2kd5E0iuQnY0id2rA-UISKZ36XnwDxhqiacsDMYQ7g_ht4RN2k25f3VgV62SdTUWLuvzGgZx75xJs3R0QSxVxvJ2RFiOHGzmrIpkchN-OAK1YwNl5POmQJQcSTvYQEHc43Zd3aBwoCYnHto22puFRME53FNtR9L648lqpYzPVpsQ8puzxrxXC8OttsRcNWsyDylhLkW1RTkGCB4ouT2UzUfsBSAAH9Cnx97Z0KaHwpIPpGkWFXKjY4w9Obt1zjrXgtH7RoSzasOGN3JwXfdm_f0vBtNTltHfEewTtPdVa84AFV4kcZ067IXhsSlkZxLukLciaZT7UGJmD7WpJZOxKQWzLsgpCDo_F0YNISwBt_vVJ_JowApNXxJxKRNO3EPEDVCDpZoI2_hwqYriScT7lk4xQL610lbDheTzAqL0fd5teDrUUQHi5Yvxhnd4BXUFQMLgj-WzlaMElHXNrAelRIjx_bLSiYK6xWisakXo4sfXGodnz3-o9oVg488gPFDdqXrEP-d28jM8Q1",
          "path" : "/",
          "httpOnly" : true,
          "secure" : false,
          "comment" : ""
        } ],
        "headers" : [ {
          "name" : "Cache-Control",
          "value" : "private"
        }, {
          "name" : "Content-Type",
          "value" : "application/json; charset=utf-8"
        }, {
          "name" : "Server",
          "value" : "Microsoft-IIS/10.0"
        }, {
          "name" : "Set-Cookie",
          "value" : ".ASPROLES=hVo_m-wsHQ4Ghb2kd5E0iuQnY0id2rA-UISKZ36XnwDxhqiacsDMYQ7g_ht4RN2k25f3VgV62SdTUWLuvzGgZx75xJs3R0QSxVxvJ2RFiOHGzmrIpkchN-OAK1YwNl5POmQJQcSTvYQEHc43Zd3aBwoCYnHto22puFRME53FNtR9L648lqpYzPVpsQ8puzxrxXC8OttsRcNWsyDylhLkW1RTkGCB4ouT2UzUfsBSAAH9Cnx97Z0KaHwpIPpGkWFXKjY4w9Obt1zjrXgtH7RoSzasOGN3JwXfdm_f0vBtNTltHfEewTtPdVa84AFV4kcZ067IXhsSlkZxLukLciaZT7UGJmD7WpJZOxKQWzLsgpCDo_F0YNISwBt_vVJ_JowApNXxJxKRNO3EPEDVCDpZoI2_hwqYriScT7lk4xQL610lbDheTzAqL0fd5teDrUUQHi5Yvxhnd4BXUFQMLgj-WzlaMElHXNrAelRIjx_bLSiYK6xWisakXo4sfXGodnz3-o9oVg488gPFDdqXrEP-d28jM8Q1; path=/; HttpOnly"
        }, {
          "name" : "X-SourceFiles",
          "value" : "=?UTF-8?B?RDpcVmlydHVhbE9wdGltaXplci1SZWZhY3RvcmluZ1xDcm9wTWV0cmljcy5Wby5BcGlcQ3JvcE1ldHJpY3MuVm8uQXBpXGFwaVxtb2JpbGVcdjFcZmFybXNcNw==?="
        }, {
          "name" : "X-Powered-By",
          "value" : "ASP.NET"
        }, {
          "name" : "Date",
          "value" : "Tue, 09 Apr 2019 20:39:29 GMT"
        }, {
          "name" : "Content-Length",
          "value" : "97"
        } ],
        "content" : {
          "size" : 97,
          "mimeType" : "application/json; charset=utf-8",
          "text" : "{\"message\":\"The farm name must contain only alphanumeric characters, apostrophes and/or spaces.\"}",
          "comment" : ""
        },
        "redirectURL" : "",
        "headersSize" : 944,
        "bodySize" : 97,
        "comment" : ""
      },
      "cache" : { },
      "timings" : {
        "comment" : "",
        "ssl" : -1,
        "blocked" : -1,
        "dns" : -1,
        "send" : 0,
        "receive" : 1,
        "connect" : -1,
        "wait" : 3077
      },
      "serverIPAddress" : "127.0.0.1",
      "comment" : "",
      "_katalonRequestInformation" : {
        "name" : "23",
        "testObjectId" : "Object Repository/VoGrow/Farm/FarmPut",
        "harId" : "6df49419-4aac-48cd-bc25-0829349ff9c3"
      },
      "time" : 3079
    } ],
    "comment" : ""
  }
}