{
  "log" : {
    "version" : "1.2",
    "creator" : {
      "name" : "BrowserMob Proxy",
      "version" : "2.1.5",
      "comment" : ""
    },
    "pages" : [ {
      "id" : "Page 0",
      "startedDateTime" : "2019-04-05T19:29:24.005Z",
      "title" : "Page 0",
      "pageTimings" : {
        "onLoad" : 38,
        "comment" : ""
      },
      "comment" : ""
    } ],
    "entries" : [ {
      "pageref" : "Page 0",
      "startedDateTime" : "2019-04-05T19:29:24.008Z",
      "request" : {
        "method" : "POST",
        "url" : "http://localhost:10520/WebAPI/api/mobile/v1/fields?",
        "httpVersion" : "HTTP/1.1",
        "cookies" : [ ],
        "headers" : [ {
          "name" : "User-Agent",
          "value" : "Katalon Studio"
        }, {
          "name" : "Content-Type",
          "value" : "application/json"
        }, {
          "name" : "Authorization",
          "value" : "Bearer eyJ0eXAiOiJKV1QiLCJhbGciOiJIUzI1NiJ9.eyJ1bmlxdWVfbmFtZSI6Implbm55Lm1hbGRvbmFkby50eDFAZ21haWwuY29tIiwicm9sZSI6InVzZXIiLCJzdWIiOiJqZW5ueS5tYWxkb25hZG8udHgxQGdtYWlsLmNvbSIsImlzcyI6IkNyb3BNZXRyaWNzIiwiYXVkIjoiYWxsIiwiZXhwIjoxNTU0NDk2NDYzLCJuYmYiOjE1NTQ0OTI1NjN9.Hm5kAaeS0KvoySiS_jzzIYBhXTJQgnziyluSRODwP9k"
        }, {
          "name" : "Host",
          "value" : "localhost:10520"
        }, {
          "name" : "Accept",
          "value" : "text/html, image/gif, image/jpeg, *; q=.2, */*; q=.2"
        }, {
          "name" : "Proxy-Connection",
          "value" : "keep-alive"
        }, {
          "name" : "Content-Length",
          "value" : "407"
        } ],
        "queryString" : [ ],
        "postData" : {
          "mimeType" : "application/json",
          "text" : "{\"field\":{\"farm_id\":\"     \",\"name\":\"Field by agent not assigned\",\"boundary\":{\"boundaries\":[{\"boundary\":{\"coords\":[{\"x\":-101.49568751,\"y\":37.14976293},{\"x\":-101.50049403,\"y\":37.14647907},{\"x\":-101.50049403,\"y\":37.14264773},{\"x\":-101.49723246,\"y\":37.1411425},{\"x\":-101.49019435,\"y\":37.14223722},{\"x\":-101.48933604,\"y\":37.14620541},{\"x\":-101.49294093,\"y\":37.14866833},{\"x\":-101.49568751,\"y\":37.14976293}]}}]}}}",
          "comment" : ""
        },
        "headersSize" : 592,
        "bodySize" : 407,
        "comment" : ""
      },
      "response" : {
        "status" : 400,
        "statusText" : "Bad Request",
        "httpVersion" : "HTTP/1.1",
        "cookies" : [ {
          "name" : ".ASPROLES",
          "value" : "ttBIkwA6j6Y3EGDcZaSc-JusdFzuhv2CidhsDVs89n2Kz5_iiFUD3-Mq3sp1i7ymBnxw14-LCbia1asryLvHPRAXUJXQNFL7ckzY3A-puWo7VB8VwfRGO82hGMOvC8ofgtnCsGd_jDTz_tgIyCPDiOcPv6Wc5-xI1o38MVGiKuEqtJqtv6QB21EgB6Ahep5YpU16c9jMvY-wGE56ICuv2d73SdVKkJ_UC7C9hNKTq1FN-2QOkeKhloA1weyzSwUuJ1X2TBHnsFG8Ut2U47esY4m7v_s9LnFovdYz4zN-514qRhnxbDTa44l91wHEStWTlL6AEc1waKiAc6f6ouWM1thzy9FDj7xyuKR5UhOJEzZW2jkiKXGh16oCNB8LgbbDzhhx8JWDhgDV_3m0VaiXU6lga-PSEEabtCcr_R0oTXknhwJoWMmyUsZbsf8EC5xmTgzjtk88Pt14kFi_Rt7q4bZ5ISIPyLMjNqQGKwyRcf1Kr_HjGRtaS7V790lQh7wPY0ZLxQwhyurulh_chrQ-R5g8SCw1",
          "path" : "/",
          "httpOnly" : true,
          "secure" : false,
          "comment" : ""
        } ],
        "headers" : [ {
          "name" : "Cache-Control",
          "value" : "private"
        }, {
          "name" : "Content-Type",
          "value" : "application/json; charset=utf-8"
        }, {
          "name" : "Server",
          "value" : "Microsoft-IIS/10.0"
        }, {
          "name" : "Set-Cookie",
          "value" : ".ASPROLES=ttBIkwA6j6Y3EGDcZaSc-JusdFzuhv2CidhsDVs89n2Kz5_iiFUD3-Mq3sp1i7ymBnxw14-LCbia1asryLvHPRAXUJXQNFL7ckzY3A-puWo7VB8VwfRGO82hGMOvC8ofgtnCsGd_jDTz_tgIyCPDiOcPv6Wc5-xI1o38MVGiKuEqtJqtv6QB21EgB6Ahep5YpU16c9jMvY-wGE56ICuv2d73SdVKkJ_UC7C9hNKTq1FN-2QOkeKhloA1weyzSwUuJ1X2TBHnsFG8Ut2U47esY4m7v_s9LnFovdYz4zN-514qRhnxbDTa44l91wHEStWTlL6AEc1waKiAc6f6ouWM1thzy9FDj7xyuKR5UhOJEzZW2jkiKXGh16oCNB8LgbbDzhhx8JWDhgDV_3m0VaiXU6lga-PSEEabtCcr_R0oTXknhwJoWMmyUsZbsf8EC5xmTgzjtk88Pt14kFi_Rt7q4bZ5ISIPyLMjNqQGKwyRcf1Kr_HjGRtaS7V790lQh7wPY0ZLxQwhyurulh_chrQ-R5g8SCw1; path=/; HttpOnly"
        }, {
          "name" : "X-SourceFiles",
          "value" : "=?UTF-8?B?RDpcVmlydHVhbE9wdGltaXplci1SZWZhY3RvcmluZ1xDcm9wTWV0cmljcy5Wby5BcGlcQ3JvcE1ldHJpY3MuVm8uQXBpXGFwaVxtb2JpbGVcdjFcZmllbGRz?="
        }, {
          "name" : "X-Powered-By",
          "value" : "ASP.NET"
        }, {
          "name" : "Date",
          "value" : "Fri, 05 Apr 2019 19:29:23 GMT"
        }, {
          "name" : "Content-Length",
          "value" : "37"
        } ],
        "content" : {
          "size" : 37,
          "mimeType" : "application/json; charset=utf-8",
          "text" : "{\"message\":\"The request is invalid.\"}",
          "comment" : ""
        },
        "redirectURL" : "",
        "headersSize" : 940,
        "bodySize" : 37,
        "comment" : ""
      },
      "cache" : { },
      "timings" : {
        "comment" : "",
        "ssl" : -1,
        "connect" : -1,
        "blocked" : -1,
        "send" : 0,
        "dns" : -1,
        "receive" : 0,
        "wait" : 29
      },
      "serverIPAddress" : "127.0.0.1",
      "comment" : "",
      "_katalonRequestInformation" : {
        "name" : "21",
        "testObjectId" : "Object Repository/VoGrow/Field/FieldPost",
        "harId" : "1424df7c-6ff1-4b6b-a959-7f82c58fe1d2"
      },
      "time" : 30
    } ],
    "comment" : ""
  }
}