{
  "log" : {
    "version" : "1.2",
    "creator" : {
      "name" : "BrowserMob Proxy",
      "version" : "2.1.5",
      "comment" : ""
    },
    "pages" : [ {
      "id" : "Page 0",
      "startedDateTime" : "2019-03-28T20:41:44.584Z",
      "title" : "Page 0",
      "pageTimings" : {
        "onLoad" : 2189,
        "comment" : ""
      },
      "comment" : ""
    } ],
    "entries" : [ {
      "pageref" : "Page 0",
      "startedDateTime" : "2019-03-28T20:41:44.586Z",
      "request" : {
        "method" : "POST",
        "url" : "http://localhost:10520/WebAPI/api/admin/v1/users/?",
        "httpVersion" : "HTTP/1.1",
        "cookies" : [ ],
        "headers" : [ {
          "name" : "User-Agent",
          "value" : "Katalon Studio"
        }, {
          "name" : "Content-Type",
          "value" : "application/x-www-form-urlencoded"
        }, {
          "name" : "Authorization",
          "value" : "Bearer eyJ0eXAiOiJKV1QiLCJhbGciOiJIUzI1NiJ9.eyJ1bmlxdWVfbmFtZSI6ImFkbWluIiwicm9sZSI6InVzZXIiLCJzdWIiOiJhZG1pbiIsImlzcyI6IkNyb3BNZXRyaWNzIiwiYXVkIjoiYWxsIiwiZXhwIjoxNTUzODA5NjA0LCJuYmYiOjE1NTM4MDU3MDR9.q9VcjMR3fvz_AzVTIOu1LrelUD_8t1kP_juF-OVcPvY"
        }, {
          "name" : "Host",
          "value" : "localhost:10520"
        }, {
          "name" : "Accept",
          "value" : "text/html, image/gif, image/jpeg, *; q=.2, */*; q=.2"
        }, {
          "name" : "Proxy-Connection",
          "value" : "keep-alive"
        }, {
          "name" : "Content-Length",
          "value" : "296"
        } ],
        "queryString" : [ ],
        "postData" : {
          "mimeType" : "application/x-www-form-urlencoded",
          "params" : [ {
            "name" : "password",
            "value" : "cropmetrics",
            "comment" : ""
          }, {
            "name" : "email",
            "value" : "cropmetricsvo.no.roles@gmail.com",
            "comment" : ""
          }, {
            "name" : "fullname",
            "value" : "test validation",
            "comment" : ""
          }, {
            "name" : "phone",
            "value" : "123",
            "comment" : ""
          }, {
            "name" : "dealer",
            "value" : "dealet test",
            "comment" : ""
          }, {
            "name" : "addressLine1",
            "value" : "address line 1 test validation",
            "comment" : ""
          }, {
            "name" : "addressLine2",
            "value" : "address line 2 test validation",
            "comment" : ""
          }, {
            "name" : "town",
            "value" : "townValidation",
            "comment" : ""
          }, {
            "name" : "state",
            "value" : "stateValidation",
            "comment" : ""
          }, {
            "name" : "zip",
            "value" : "zipValidation",
            "comment" : ""
          }, {
            "name" : "country",
            "value" : "countryValidation",
            "comment" : ""
          }, {
            "name" : "roles",
            "value" : "",
            "comment" : ""
          } ],
          "comment" : ""
        },
        "headersSize" : 544,
        "bodySize" : 296,
        "comment" : ""
      },
      "response" : {
        "status" : 500,
        "statusText" : "Internal Server Error",
        "httpVersion" : "HTTP/1.1",
        "cookies" : [ {
          "name" : ".ASPROLES",
          "value" : "mvTZx19adG5bmJgwcr_Nj0XmSXA6Jf4NwLa2Hx31asjSnvXwLZjjjFC8QBaa5fB6svrwRkdaJuInBIOKyP-NGBFzpL8CZLdRcxcBGbooDHrZ-wxGj_wV2Sg4a6kdc1R7Wu9w1cfPHFCcA226-1OZyvutceC1QGcUq4VJ0RT6o1e2nDiu_jcRnvLOFeB-K-Ve3Qmx6PsjQVUyNui1dsnakTcqSLJovyIh-gke-2Xl6ogBzmTnTdW1e1ugxLHFzAMZQZ-njDUmgg7T9qK1gGPSjByA3flOBYy4bCR-VIHgoYprvPmWfrmBCFjlYPOAJAixOqJXUf-l19oLSyGjsaWDl-W63yqlts1PUpOn6AmJec8UkBbMGqEHl6L7qIl1X0OSSPnaaFcg-nusMVTS3E2cNuCKLRaX7HXEB-Y6FDcF3KmO3ThQSyfRTMC07wa2yEsJupif7S6dsRNM4e_nyLG2fGyvV9LlMO8UPzcCLi266pnos36o0",
          "path" : "/",
          "httpOnly" : true,
          "secure" : false,
          "comment" : ""
        } ],
        "headers" : [ {
          "name" : "Cache-Control",
          "value" : "private"
        }, {
          "name" : "Content-Type",
          "value" : "application/json; charset=utf-8"
        }, {
          "name" : "Server",
          "value" : "Microsoft-IIS/10.0"
        }, {
          "name" : "Set-Cookie",
          "value" : ".ASPROLES=mvTZx19adG5bmJgwcr_Nj0XmSXA6Jf4NwLa2Hx31asjSnvXwLZjjjFC8QBaa5fB6svrwRkdaJuInBIOKyP-NGBFzpL8CZLdRcxcBGbooDHrZ-wxGj_wV2Sg4a6kdc1R7Wu9w1cfPHFCcA226-1OZyvutceC1QGcUq4VJ0RT6o1e2nDiu_jcRnvLOFeB-K-Ve3Qmx6PsjQVUyNui1dsnakTcqSLJovyIh-gke-2Xl6ogBzmTnTdW1e1ugxLHFzAMZQZ-njDUmgg7T9qK1gGPSjByA3flOBYy4bCR-VIHgoYprvPmWfrmBCFjlYPOAJAixOqJXUf-l19oLSyGjsaWDl-W63yqlts1PUpOn6AmJec8UkBbMGqEHl6L7qIl1X0OSSPnaaFcg-nusMVTS3E2cNuCKLRaX7HXEB-Y6FDcF3KmO3ThQSyfRTMC07wa2yEsJupif7S6dsRNM4e_nyLG2fGyvV9LlMO8UPzcCLi266pnos36o0; path=/; HttpOnly"
        }, {
          "name" : "X-SourceFiles",
          "value" : "=?UTF-8?B?RDpcVmlydHVhbE9wdGltaXplci1SZWZhY3RvcmluZ1xDcm9wTWV0cmljcy5Wby5BcGlcQ3JvcE1ldHJpY3MuVm8uQXBpXGFwaVxhZG1pblx2MVx1c2Vyc1w=?="
        }, {
          "name" : "X-Powered-By",
          "value" : "ASP.NET"
        }, {
          "name" : "Date",
          "value" : "Thu, 28 Mar 2019 20:41:46 GMT"
        }, {
          "name" : "Content-Length",
          "value" : "53"
        } ],
        "content" : {
          "size" : 53,
          "mimeType" : "application/json; charset=utf-8",
          "text" : "{\"message\":\"Internal server error in the processing\"}",
          "comment" : ""
        },
        "redirectURL" : "",
        "headersSize" : 907,
        "bodySize" : 53,
        "comment" : ""
      },
      "cache" : { },
      "timings" : {
        "comment" : "",
        "ssl" : -1,
        "send" : 0,
        "receive" : 0,
        "wait" : 2183,
        "connect" : -1,
        "blocked" : -1,
        "dns" : -1
      },
      "serverIPAddress" : "127.0.0.1",
      "comment" : "",
      "_katalonRequestInformation" : {
        "name" : "31",
        "testObjectId" : "Object Repository/VoPro/Account/api_admin_v1_users",
        "harId" : "c5e922f5-0eec-4bb8-aa8f-33d17b7a2b05"
      },
      "time" : 2184
    } ],
    "comment" : ""
  }
}