{
  "log" : {
    "version" : "1.2",
    "creator" : {
      "name" : "BrowserMob Proxy",
      "version" : "2.1.5",
      "comment" : ""
    },
    "pages" : [ {
      "id" : "Page 0",
      "startedDateTime" : "2019-04-09T09:51:03.124Z",
      "title" : "Page 0",
      "pageTimings" : {
        "onLoad" : 3572,
        "comment" : ""
      },
      "comment" : ""
    } ],
    "entries" : [ {
      "pageref" : "Page 0",
      "startedDateTime" : "2019-04-09T09:51:03.125Z",
      "request" : {
        "method" : "PUT",
        "url" : "http://localhost:10520/WebAPI/api/mobile/v1/fields/14?",
        "httpVersion" : "HTTP/1.1",
        "cookies" : [ ],
        "headers" : [ {
          "name" : "User-Agent",
          "value" : "Katalon Studio"
        }, {
          "name" : "Content-Type",
          "value" : "application/json"
        }, {
          "name" : "Authorization",
          "value" : "Bearer eyJ0eXAiOiJKV1QiLCJhbGciOiJIUzI1NiJ9.eyJ1bmlxdWVfbmFtZSI6Implbm55Lm1hbGRvbmFkby50eDFAZ21haWwuY29tIiwicm9sZSI6InVzZXIiLCJzdWIiOiJqZW5ueS5tYWxkb25hZG8udHgxQGdtYWlsLmNvbSIsImlzcyI6IkNyb3BNZXRyaWNzIiwiYXVkIjoiYWxsIiwiZXhwIjoxNTU0ODA3MzYzLCJuYmYiOjE1NTQ4MDM0NjN9.wrdtdr0nY_6yMEgifWo4wwaCD0aiWFgCJX9cqEHU5zY"
        }, {
          "name" : "Host",
          "value" : "localhost:10520"
        }, {
          "name" : "Accept",
          "value" : "text/html, image/gif, image/jpeg, *; q=.2, */*; q=.2"
        }, {
          "name" : "Proxy-Connection",
          "value" : "keep-alive"
        }, {
          "name" : "Content-Length",
          "value" : "368"
        } ],
        "queryString" : [ ],
        "postData" : {
          "mimeType" : "application/json",
          "text" : "{\"field\":{\"name\":\"!@#$%^\",\"boundary\":{\"boundaries\":[{\"boundary\":{\"coords\":[{\"x\":-101.49568751,\"y\":37.14976293},{\"x\":-101.50049403,\"y\":37.14647907},{\"x\":-101.50049403,\"y\":37.14264773},{\"x\":-101.49723246,\"y\":37.1411425},{\"x\":-101.49019435,\"y\":37.14223722},{\"x\":-101.48933604,\"y\":37.14620541},{\"x\":-101.49294093,\"y\":37.14866833},{\"x\":-101.49568751,\"y\":37.14976293}]}}]}}}",
          "comment" : ""
        },
        "headersSize" : 594,
        "bodySize" : 368,
        "comment" : ""
      },
      "response" : {
        "status" : 400,
        "statusText" : "Bad Request",
        "httpVersion" : "HTTP/1.1",
        "cookies" : [ {
          "name" : ".ASPROLES",
          "value" : "pZwMEZe4JsFo842MxDoL4Ws9KfEA43brehBj5mwerouRq_vRxafW3rfsqz8vX7zzo00hXCEMDkvwMiKiBx3J1SgIvYWCKL3Hu-TSmNNhhYakNhPnF8Ks3sfZDlbkGspzGzUaQx-gibyI_MRAeSGzsB03OPMwNmcQA_D0qhdGQtmSlfAZlJRECZ66GqDu3XiJQRZ-csvlNkvix0hTsKM1La-p3ZZAujREUvYbCNOnabGtIcVUWPTcjvfbGY6pXlYddyPh7EKTrHg1tc9GqmmIEJI6TcmVC2XnTYm49XLgvDfUtKJMLIW-PtPLuZYxffWN8GmtD12fMsK9IfrKToSt1SjVY2dz7CvjCqVvEQhVYKm-GbgMsOelDcAwRyq_-1BwYFJ5wrNuTa_x-b6obmdYdRHDb7CeEXwVAHteVzX5IkTEj0Jn-jt_9VHSZBqOQpEztFd2km81Ut79NySo1ZUL_UlHzSXpqnbmgEEbpop4JZqADTbPVzllrZc7tn83eoCxMNrpmYjVAUnHSgSJrd--t4IbKgk1",
          "path" : "/",
          "httpOnly" : true,
          "secure" : false,
          "comment" : ""
        } ],
        "headers" : [ {
          "name" : "Cache-Control",
          "value" : "private"
        }, {
          "name" : "Content-Type",
          "value" : "application/json; charset=utf-8"
        }, {
          "name" : "Server",
          "value" : "Microsoft-IIS/10.0"
        }, {
          "name" : "Set-Cookie",
          "value" : ".ASPROLES=pZwMEZe4JsFo842MxDoL4Ws9KfEA43brehBj5mwerouRq_vRxafW3rfsqz8vX7zzo00hXCEMDkvwMiKiBx3J1SgIvYWCKL3Hu-TSmNNhhYakNhPnF8Ks3sfZDlbkGspzGzUaQx-gibyI_MRAeSGzsB03OPMwNmcQA_D0qhdGQtmSlfAZlJRECZ66GqDu3XiJQRZ-csvlNkvix0hTsKM1La-p3ZZAujREUvYbCNOnabGtIcVUWPTcjvfbGY6pXlYddyPh7EKTrHg1tc9GqmmIEJI6TcmVC2XnTYm49XLgvDfUtKJMLIW-PtPLuZYxffWN8GmtD12fMsK9IfrKToSt1SjVY2dz7CvjCqVvEQhVYKm-GbgMsOelDcAwRyq_-1BwYFJ5wrNuTa_x-b6obmdYdRHDb7CeEXwVAHteVzX5IkTEj0Jn-jt_9VHSZBqOQpEztFd2km81Ut79NySo1ZUL_UlHzSXpqnbmgEEbpop4JZqADTbPVzllrZc7tn83eoCxMNrpmYjVAUnHSgSJrd--t4IbKgk1; path=/; HttpOnly"
        }, {
          "name" : "X-SourceFiles",
          "value" : "=?UTF-8?B?RDpcVmlydHVhbE9wdGltaXplci1SZWZhY3RvcmluZ1xDcm9wTWV0cmljcy5Wby5BcGlcQ3JvcE1ldHJpY3MuVm8uQXBpXGFwaVxtb2JpbGVcdjFcZmllbGRzXDE0?="
        }, {
          "name" : "X-Powered-By",
          "value" : "ASP.NET"
        }, {
          "name" : "Date",
          "value" : "Tue, 09 Apr 2019 09:51:06 GMT"
        }, {
          "name" : "Content-Length",
          "value" : "40"
        } ],
        "content" : {
          "size" : 40,
          "mimeType" : "application/json; charset=utf-8",
          "text" : "{\"message\":\"The field id is not valid.\"}",
          "comment" : ""
        },
        "redirectURL" : "",
        "headersSize" : 944,
        "bodySize" : 40,
        "comment" : ""
      },
      "cache" : { },
      "timings" : {
        "comment" : "",
        "ssl" : -1,
        "connect" : -1,
        "blocked" : -1,
        "dns" : -1,
        "send" : 0,
        "receive" : 0,
        "wait" : 3568
      },
      "serverIPAddress" : "127.0.0.1",
      "comment" : "",
      "_katalonRequestInformation" : {
        "name" : "49",
        "testObjectId" : "Object Repository/VoGrow/Field/FieldPut",
        "harId" : "6b757a6f-7d61-427d-9200-b1b6243dbdbd"
      },
      "time" : 3569
    } ],
    "comment" : ""
  }
}