{
  "log" : {
    "version" : "1.2",
    "creator" : {
      "name" : "BrowserMob Proxy",
      "version" : "2.1.5",
      "comment" : ""
    },
    "pages" : [ {
      "id" : "Page 0",
      "startedDateTime" : "2019-04-11T16:41:41.375Z",
      "title" : "Page 0",
      "pageTimings" : {
        "onLoad" : 26,
        "comment" : ""
      },
      "comment" : ""
    } ],
    "entries" : [ {
      "pageref" : "Page 0",
      "startedDateTime" : "2019-04-11T16:41:41.376Z",
      "request" : {
        "method" : "POST",
        "url" : "http://localhost:10520/WebAPI/api/mobile/v1/fields?",
        "httpVersion" : "HTTP/1.1",
        "cookies" : [ ],
        "headers" : [ {
          "name" : "User-Agent",
          "value" : "Katalon Studio"
        }, {
          "name" : "Content-Type",
          "value" : "application/json"
        }, {
          "name" : "Authorization",
          "value" : "Bearer eyJ0eXAiOiJKV1QiLCJhbGciOiJIUzI1NiJ9.eyJ1bmlxdWVfbmFtZSI6Implbm55Lm1hbGRvbmFkby50eDFAZ21haWwuY29tIiwicm9sZSI6InVzZXIiLCJzdWIiOiJqZW5ueS5tYWxkb25hZG8udHgxQGdtYWlsLmNvbSIsImlzcyI6IkNyb3BNZXRyaWNzIiwiYXVkIjoiYWxsIiwiZXhwIjoxNTU1MDA0ODAxLCJuYmYiOjE1NTUwMDA5MDF9.P-i-w_WVpjSQ5eMzzl-HYHlExu9jK51tRk436nMvTqU"
        }, {
          "name" : "Host",
          "value" : "localhost:10520"
        }, {
          "name" : "Accept",
          "value" : "text/html, image/gif, image/jpeg, *; q=.2, */*; q=.2"
        }, {
          "name" : "Proxy-Connection",
          "value" : "keep-alive"
        }, {
          "name" : "Content-Length",
          "value" : "400"
        } ],
        "queryString" : [ ],
        "postData" : {
          "mimeType" : "application/json",
          "text" : "{\"field\":{\"farm_id\":,\"name\":\"Field by agent not assigned\",\"boundary\":{\"boundaries\":[{\"boundary\":{\"coords\":[{\"x\":-101.49568751,\"y\":37.14976293},{\"x\":-101.50049403,\"y\":37.14647907},{\"x\":-101.50049403,\"y\":37.14264773},{\"x\":-101.49723246,\"y\":37.1411425},{\"x\":-101.49019435,\"y\":37.14223722},{\"x\":-101.48933604,\"y\":37.14620541},{\"x\":-101.49294093,\"y\":37.14866833},{\"x\":-101.49568751,\"y\":37.14976293}]}}]}}}",
          "comment" : ""
        },
        "headersSize" : 592,
        "bodySize" : 400,
        "comment" : ""
      },
      "response" : {
        "status" : 400,
        "statusText" : "Bad Request",
        "httpVersion" : "HTTP/1.1",
        "cookies" : [ {
          "name" : ".ASPROLES",
          "value" : "gG-2uC-DotTA3QkAOdp0vaWCuaERFYZofcp05bHjtC8xpij82QnsHrCSdNaVSXBq0yxata5kQ3Mrm5luXOGP1buNs7-EHUpA2Ke3V3OijV-qBXr2Rl6hnKhdajFrE5VfiqU2olnMMs6eiFV9mEc3CJmB4UkUSB7yOb0qSX1JlFFG6D0LAmJENcH3JtDN4vXShBrOuig0C2xlC13pEP-qHbKFnz0GmysjND5A0sjwI8qEcWdqd4WCVyLWQaBSPv89bHsHuO4EpiPL35FImbBLM-k-Bnc4TmMO_R4mWj2zMb09zGo0b1aWEFwYXrm-ak0b7G94jdWwE_FCqL1zv3SEBHQtu7FFCnvYyCHxOCDM86q55RLR_Bh131ksZjzvasGFTF1rBaraRU47y6XrYqLAZXywYGE7lYLY7hy8tz6BnJkmpI2GDVOn6cGWkAF3dCkgv89rrgAqXDx8oe2vRiQ70VIrbuB00TFTtC-813K7g2jO-jzyeM_rsQoCt9HqtAGB0bzdnLUoZ1RDWrfsXd3nFGgsqHo1",
          "path" : "/",
          "httpOnly" : true,
          "secure" : false,
          "comment" : ""
        } ],
        "headers" : [ {
          "name" : "Cache-Control",
          "value" : "private"
        }, {
          "name" : "Content-Type",
          "value" : "application/json; charset=utf-8"
        }, {
          "name" : "Server",
          "value" : "Microsoft-IIS/10.0"
        }, {
          "name" : "Set-Cookie",
          "value" : ".ASPROLES=gG-2uC-DotTA3QkAOdp0vaWCuaERFYZofcp05bHjtC8xpij82QnsHrCSdNaVSXBq0yxata5kQ3Mrm5luXOGP1buNs7-EHUpA2Ke3V3OijV-qBXr2Rl6hnKhdajFrE5VfiqU2olnMMs6eiFV9mEc3CJmB4UkUSB7yOb0qSX1JlFFG6D0LAmJENcH3JtDN4vXShBrOuig0C2xlC13pEP-qHbKFnz0GmysjND5A0sjwI8qEcWdqd4WCVyLWQaBSPv89bHsHuO4EpiPL35FImbBLM-k-Bnc4TmMO_R4mWj2zMb09zGo0b1aWEFwYXrm-ak0b7G94jdWwE_FCqL1zv3SEBHQtu7FFCnvYyCHxOCDM86q55RLR_Bh131ksZjzvasGFTF1rBaraRU47y6XrYqLAZXywYGE7lYLY7hy8tz6BnJkmpI2GDVOn6cGWkAF3dCkgv89rrgAqXDx8oe2vRiQ70VIrbuB00TFTtC-813K7g2jO-jzyeM_rsQoCt9HqtAGB0bzdnLUoZ1RDWrfsXd3nFGgsqHo1; path=/; HttpOnly"
        }, {
          "name" : "X-SourceFiles",
          "value" : "=?UTF-8?B?RDpcVmlydHVhbE9wdGltaXplci1SZWZhY3RvcmluZ1xDcm9wTWV0cmljcy5Wby5BcGlcQ3JvcE1ldHJpY3MuVm8uQXBpXGFwaVxtb2JpbGVcdjFcZmllbGRz?="
        }, {
          "name" : "X-Powered-By",
          "value" : "ASP.NET"
        }, {
          "name" : "Date",
          "value" : "Thu, 11 Apr 2019 16:41:40 GMT"
        }, {
          "name" : "Content-Length",
          "value" : "37"
        } ],
        "content" : {
          "size" : 37,
          "mimeType" : "application/json; charset=utf-8",
          "text" : "{\"message\":\"The request is invalid.\"}",
          "comment" : ""
        },
        "redirectURL" : "",
        "headersSize" : 940,
        "bodySize" : 37,
        "comment" : ""
      },
      "cache" : { },
      "timings" : {
        "comment" : "",
        "send" : 0,
        "wait" : 22,
        "receive" : 0,
        "connect" : -1,
        "blocked" : -1,
        "dns" : -1,
        "ssl" : -1
      },
      "serverIPAddress" : "127.0.0.1",
      "comment" : "",
      "_katalonRequestInformation" : {
        "name" : "11",
        "testObjectId" : "Object Repository/VoGrow/Field/FieldPost",
        "harId" : "4eecaa4e-3b2f-4283-bdc1-5bd6b58dde5e"
      },
      "time" : 23
    } ],
    "comment" : ""
  }
}