{
  "log" : {
    "version" : "1.2",
    "creator" : {
      "name" : "BrowserMob Proxy",
      "version" : "2.1.5",
      "comment" : ""
    },
    "pages" : [ {
      "id" : "Page 0",
      "startedDateTime" : "2019-04-05T10:04:18.269Z",
      "title" : "Page 0",
      "pageTimings" : {
        "onLoad" : 5098,
        "comment" : ""
      },
      "comment" : ""
    } ],
    "entries" : [ {
      "pageref" : "Page 0",
      "startedDateTime" : "2019-04-05T10:04:18.270Z",
      "request" : {
        "method" : "PUT",
        "url" : "http://localhost:10520/WebAPI/api/mobile/v1/farms/7?",
        "httpVersion" : "HTTP/1.1",
        "cookies" : [ ],
        "headers" : [ {
          "name" : "User-Agent",
          "value" : "Katalon Studio"
        }, {
          "name" : "Content-Type",
          "value" : "application/json"
        }, {
          "name" : "Authorization",
          "value" : "Bearer eyJ0eXAiOiJKV1QiLCJhbGciOiJIUzI1NiJ9.eyJ1bmlxdWVfbmFtZSI6Implbm55Lm1hbGRvbmFkby50eDFAZ21haWwuY29tIiwicm9sZSI6InVzZXIiLCJzdWIiOiJqZW5ueS5tYWxkb25hZG8udHgxQGdtYWlsLmNvbSIsImlzcyI6IkNyb3BNZXRyaWNzIiwiYXVkIjoiYWxsIiwiZXhwIjoxNTU0NDYyNTU4LCJuYmYiOjE1NTQ0NTg2NTh9.7REJIvS4jgzzd0qrga8Uy28tN2nECjcOKxrGvWzeKZs"
        }, {
          "name" : "Host",
          "value" : "localhost:10520"
        }, {
          "name" : "Accept",
          "value" : "text/html, image/gif, image/jpeg, *; q=.2, */*; q=.2"
        }, {
          "name" : "Proxy-Connection",
          "value" : "keep-alive"
        }, {
          "name" : "Content-Length",
          "value" : "16"
        } ],
        "queryString" : [ ],
        "postData" : {
          "mimeType" : "application/json",
          "text" : "{\"name\": \"    \"}",
          "comment" : ""
        },
        "headersSize" : 591,
        "bodySize" : 16,
        "comment" : ""
      },
      "response" : {
        "status" : 400,
        "statusText" : "Bad Request",
        "httpVersion" : "HTTP/1.1",
        "cookies" : [ {
          "name" : ".ASPROLES",
          "value" : "sxGRze-26lQ2SBOsozWvHLwGBWU4L1YBtfOhwgBF-8AvKMUINs6pczTa1E9qCxX1dIUQcyPRvxNNezKpqAWZjIhFlpPdexZYBeFeoQnGf3PQh820b6QumfQbD9KU1CQ1aAp55Jq2YkcUopqBlaXeXwMsB-76qZ7nz-C4fU2lVY1HsoyRMmeqy4xbTcblxhJdpyLdmAJCAEf_7EDA2Gx0tQ8a_Dqz4xYcOZmSGBHzKbNJTq1HGpgCz2Z2tstro42j8ctxyGS1y3REqulrH0ruqKkJ8jz-rdvymrNc7-KyXwV2vNKchLwqSNu6oR8KxecaaFfZMRcrJz1NGZmhD97uBKdVDsJapZu_J5WiovvGGgxJHL4CTRAEVP-K_VzpbULLJ7ft62pnPyGaMkBy1rAaRYZYZCpgn9-X_91Vt84ZF7-qaxQ1pCEoGwrFhZE8qRLZsPMvhv_KzoAfifbf3BDexFO0DI4aYBj7GL0kLV2tn-UpxWIKBxl5KvIUZ7SRbv8vRgbnuU_aKbVkCmdPysLsZP40J901",
          "path" : "/",
          "httpOnly" : true,
          "secure" : false,
          "comment" : ""
        } ],
        "headers" : [ {
          "name" : "Cache-Control",
          "value" : "private"
        }, {
          "name" : "Content-Type",
          "value" : "application/json; charset=utf-8"
        }, {
          "name" : "Server",
          "value" : "Microsoft-IIS/10.0"
        }, {
          "name" : "Set-Cookie",
          "value" : ".ASPROLES=sxGRze-26lQ2SBOsozWvHLwGBWU4L1YBtfOhwgBF-8AvKMUINs6pczTa1E9qCxX1dIUQcyPRvxNNezKpqAWZjIhFlpPdexZYBeFeoQnGf3PQh820b6QumfQbD9KU1CQ1aAp55Jq2YkcUopqBlaXeXwMsB-76qZ7nz-C4fU2lVY1HsoyRMmeqy4xbTcblxhJdpyLdmAJCAEf_7EDA2Gx0tQ8a_Dqz4xYcOZmSGBHzKbNJTq1HGpgCz2Z2tstro42j8ctxyGS1y3REqulrH0ruqKkJ8jz-rdvymrNc7-KyXwV2vNKchLwqSNu6oR8KxecaaFfZMRcrJz1NGZmhD97uBKdVDsJapZu_J5WiovvGGgxJHL4CTRAEVP-K_VzpbULLJ7ft62pnPyGaMkBy1rAaRYZYZCpgn9-X_91Vt84ZF7-qaxQ1pCEoGwrFhZE8qRLZsPMvhv_KzoAfifbf3BDexFO0DI4aYBj7GL0kLV2tn-UpxWIKBxl5KvIUZ7SRbv8vRgbnuU_aKbVkCmdPysLsZP40J901; path=/; HttpOnly"
        }, {
          "name" : "X-SourceFiles",
          "value" : "=?UTF-8?B?RDpcVmlydHVhbE9wdGltaXplci1SZWZhY3RvcmluZ1xDcm9wTWV0cmljcy5Wby5BcGlcQ3JvcE1ldHJpY3MuVm8uQXBpXGFwaVxtb2JpbGVcdjFcZmFybXNcNw==?="
        }, {
          "name" : "X-Powered-By",
          "value" : "ASP.NET"
        }, {
          "name" : "Date",
          "value" : "Fri, 05 Apr 2019 10:04:23 GMT"
        }, {
          "name" : "Content-Length",
          "value" : "45"
        } ],
        "content" : {
          "size" : 45,
          "mimeType" : "application/json; charset=utf-8",
          "text" : "{\"message\":\"The farm name must be provided.\"}",
          "comment" : ""
        },
        "redirectURL" : "",
        "headersSize" : 944,
        "bodySize" : 45,
        "comment" : ""
      },
      "cache" : { },
      "timings" : {
        "comment" : "",
        "send" : 0,
        "receive" : 0,
        "wait" : 5093,
        "ssl" : -1,
        "dns" : -1,
        "blocked" : -1,
        "connect" : -1
      },
      "serverIPAddress" : "127.0.0.1",
      "comment" : "",
      "_katalonRequestInformation" : {
        "name" : "17",
        "testObjectId" : "Object Repository/VoGrow/Farm/FarmPut",
        "harId" : "4ff9565f-931f-4d35-ab1e-9d26cc3fb8ed"
      },
      "time" : 5094
    } ],
    "comment" : ""
  }
}