Suite/Test/Step Name,Browser,Description,Start time,End time,Duration,Status
Auto_User,,,2019-04-09 17:06:40,2019-04-09 17:06:55,15.012s,PASSED
,,,,,,
Test Cases/VoGrow/API/User/Info/1 API_USER_When_user_is_client_only_Expected_status_code_200,,,2019-04-09 17:06:40,2019-04-09 17:06:45,4.995s,PASSED
"tokenUserName = ""jenny.maldonado.tx2@gmail.com""",,,2019-04-09 17:06:41,2019-04-09 17:06:41,0.003s,PASSED
"tokenPassword = ""cropmetrics""",,,2019-04-09 17:06:41,2019-04-09 17:06:41,0.002s,PASSED
"responseToken = sendRequest(findTestObject(""VoPro/Token"", [""usernameToken"":tokenUserName, ""passwordToken"":tokenPassword]))",,,2019-04-09 17:06:41,2019-04-09 17:06:45,3.846s,PASSED
slurper = new groovy.json.JsonSlurper(),,,2019-04-09 17:06:45,2019-04-09 17:06:45,0.021s,PASSED
tokenResult = slurper.parseText(responseToken.getResponseBodyContent()),,,2019-04-09 17:06:45,2019-04-09 17:06:45,0.021s,PASSED
accessToken = access_token,,,2019-04-09 17:06:45,2019-04-09 17:06:45,0.023s,PASSED
"println("".. Current access token generated for admin user : "" + accessToken)",,,2019-04-09 17:06:45,2019-04-09 17:06:45,0.006s,PASSED
"responseUser = sendRequest(findTestObject(""VoGrow/User/User"", [""access_token"":accessToken]))",,,2019-04-09 17:06:45,2019-04-09 17:06:45,0.303s,PASSED
"verifyResponseStatusCode(responseUser, 200)",,,2019-04-09 17:06:45,2019-04-09 17:06:45,0.010s,PASSED
,,,,,,
Test Cases/VoGrow/API/User/Info/2 API_USER_When_user_is_client_only_Expected_response_body_content_with_the_conresponding_grower_data,,,2019-04-09 17:06:45,2019-04-09 17:06:46,1.263s,PASSED
"tokenUserName = ""jenny.maldonado.tx2@gmail.com""",,,2019-04-09 17:06:45,2019-04-09 17:06:45,0.001s,PASSED
"tokenPassword = ""cropmetrics""",,,2019-04-09 17:06:45,2019-04-09 17:06:45,0.002s,PASSED
"responseToken = sendRequest(findTestObject(""VoPro/Token"", [""usernameToken"":tokenUserName, ""passwordToken"":tokenPassword]))",,,2019-04-09 17:06:45,2019-04-09 17:06:46,0.250s,PASSED
slurper = new groovy.json.JsonSlurper(),,,2019-04-09 17:06:46,2019-04-09 17:06:46,0.001s,PASSED
tokenResult = slurper.parseText(responseToken.getResponseBodyContent()),,,2019-04-09 17:06:46,2019-04-09 17:06:46,0.001s,PASSED
accessToken = access_token,,,2019-04-09 17:06:46,2019-04-09 17:06:46,0.002s,PASSED
"println("".. Current access token generated for admin user : "" + accessToken)",,,2019-04-09 17:06:46,2019-04-09 17:06:46,0.002s,PASSED
"responseUser = sendRequest(findTestObject(""VoGrow/User/User"", [""access_token"":accessToken]))",,,2019-04-09 17:06:46,2019-04-09 17:06:46,0.138s,PASSED
slurper1 = new groovy.json.JsonSlurper(),,,2019-04-09 17:06:46,2019-04-09 17:06:46,0.001s,PASSED
responseBodyUser = slurper1.parseText(responseUser.getResponseBodyContent()),,,2019-04-09 17:06:46,2019-04-09 17:06:46,0.001s,PASSED
id = id,,,2019-04-09 17:06:46,2019-04-09 17:06:46,0.001s,PASSED
name = name,,,2019-04-09 17:06:46,2019-04-09 17:06:46,0.000s,PASSED
email = email,,,2019-04-09 17:06:46,2019-04-09 17:06:46,0.001s,PASSED
addressLine1 = address_line1,,,2019-04-09 17:06:46,2019-04-09 17:06:46,0.001s,PASSED
addressLine2 = address_line2,,,2019-04-09 17:06:46,2019-04-09 17:06:46,0.000s,PASSED
town = town,,,2019-04-09 17:06:46,2019-04-09 17:06:46,0.000s,PASSED
state = state,,,2019-04-09 17:06:46,2019-04-09 17:06:46,0.000s,PASSED
zip = zip,,,2019-04-09 17:06:46,2019-04-09 17:06:46,0.001s,PASSED
country = country,,,2019-04-09 17:06:46,2019-04-09 17:06:46,0.002s,PASSED
phone = phone,,,2019-04-09 17:06:46,2019-04-09 17:06:46,0.001s,PASSED
role = role,,,2019-04-09 17:06:46,2019-04-09 17:06:46,0.001s,PASSED
roles = roles,,,2019-04-09 17:06:46,2019-04-09 17:06:46,0.001s,PASSED
"println(""The user id is :  "" + id)",,,2019-04-09 17:06:46,2019-04-09 17:06:46,0.001s,PASSED
"println(""The user name is :  "" + name)",,,2019-04-09 17:06:46,2019-04-09 17:06:46,0.001s,PASSED
"println(""The user email is :  "" + email)",,,2019-04-09 17:06:46,2019-04-09 17:06:46,0.001s,PASSED
"println(""The user address line 1 is :  "" + addressLine1)",,,2019-04-09 17:06:46,2019-04-09 17:06:46,0.001s,PASSED
"println(""The user address line 2 is :  "" + addressLine2)",,,2019-04-09 17:06:46,2019-04-09 17:06:46,0.001s,PASSED
"println(""The user town is :  "" + town)",,,2019-04-09 17:06:46,2019-04-09 17:06:46,0.001s,PASSED
"println(""The user state is :  "" + state)",,,2019-04-09 17:06:46,2019-04-09 17:06:46,0.000s,PASSED
"println(""The user zip is :  "" + zip)",,,2019-04-09 17:06:46,2019-04-09 17:06:46,0.001s,PASSED
"println(""The user country is :  "" + country)",,,2019-04-09 17:06:46,2019-04-09 17:06:46,0.001s,PASSED
"println(""The user phone is :  "" + phone)",,,2019-04-09 17:06:46,2019-04-09 17:06:46,0.002s,PASSED
"println(""The user role is :  "" + role)",,,2019-04-09 17:06:46,2019-04-09 17:06:46,0.001s,PASSED
"println(""The user roles is :  "" + roles)",,,2019-04-09 17:06:46,2019-04-09 17:06:46,0.001s,PASSED
"idDB = ""4""",,,2019-04-09 17:06:46,2019-04-09 17:06:46,0.002s,PASSED
"nameDB = ""grower without agent""",,,2019-04-09 17:06:46,2019-04-09 17:06:46,0.000s,PASSED
"emailDB = ""jenny.maldonado.tx2@gmail.com""",,,2019-04-09 17:06:46,2019-04-09 17:06:46,0.000s,PASSED
"addressLine1DB = ""x""",,,2019-04-09 17:06:46,2019-04-09 17:06:46,0.001s,PASSED
"addressLine2DB = """"",,,2019-04-09 17:06:46,2019-04-09 17:06:46,0.000s,PASSED
"townDB = ""x""",,,2019-04-09 17:06:46,2019-04-09 17:06:46,0.001s,PASSED
"stateDB = ""NE""",,,2019-04-09 17:06:46,2019-04-09 17:06:46,0.001s,PASSED
"zipDB = ""x""",,,2019-04-09 17:06:46,2019-04-09 17:06:46,0.001s,PASSED
"countryDB = ""USA""",,,2019-04-09 17:06:46,2019-04-09 17:06:46,0.001s,PASSED
"phoneDB = """"",,,2019-04-09 17:06:46,2019-04-09 17:06:46,0.001s,PASSED
"roleDB = ""Client""",,,2019-04-09 17:06:46,2019-04-09 17:06:46,0.001s,PASSED
"rolesDB = ""Client""",,,2019-04-09 17:06:46,2019-04-09 17:06:46,0.001s,PASSED
"verifyElementPropertyValue(responseUser, ""id"", idDB)",,,2019-04-09 17:06:46,2019-04-09 17:06:46,0.037s,PASSED
"verifyElementPropertyValue(responseUser, ""name"", nameDB)",,,2019-04-09 17:06:46,2019-04-09 17:06:46,0.027s,PASSED
"verifyElementPropertyValue(responseUser, ""email"", emailDB)",,,2019-04-09 17:06:46,2019-04-09 17:06:46,0.029s,PASSED
"verifyElementPropertyValue(responseUser, ""address_line1"", addressLine1DB)",,,2019-04-09 17:06:46,2019-04-09 17:06:46,0.025s,PASSED
"verifyElementPropertyValue(responseUser, ""address_line2"", addressLine2DB)",,,2019-04-09 17:06:46,2019-04-09 17:06:46,0.024s,PASSED
"verifyElementPropertyValue(responseUser, ""town"", townDB)",,,2019-04-09 17:06:46,2019-04-09 17:06:46,0.028s,PASSED
"verifyElementPropertyValue(responseUser, ""state"", stateDB)",,,2019-04-09 17:06:46,2019-04-09 17:06:46,0.035s,PASSED
"verifyElementPropertyValue(responseUser, ""zip"", zipDB)",,,2019-04-09 17:06:46,2019-04-09 17:06:46,0.020s,PASSED
"verifyElementPropertyValue(responseUser, ""country"", countryDB)",,,2019-04-09 17:06:46,2019-04-09 17:06:46,0.018s,PASSED
"verifyElementPropertyValue(responseUser, ""phone"", phoneDB)",,,2019-04-09 17:06:46,2019-04-09 17:06:46,0.018s,PASSED
"verifyElementPropertyValue(responseUser, ""role"", roleDB)",,,2019-04-09 17:06:46,2019-04-09 17:06:46,0.026s,PASSED
"verifyElementPropertyValue(responseUser, ""roles"", rolesDB)",,,2019-04-09 17:06:46,2019-04-09 17:06:46,0.031s,PASSED
,,,,,,
Test Cases/VoGrow/API/User/Info/3 API_USER_When_user_is_agent_only_Expected_status_code_200,,,2019-04-09 17:06:46,2019-04-09 17:06:47,0.451s,PASSED
"tokenUserName = ""jenny.maldonado.tx1@gmail.com""",,,2019-04-09 17:06:47,2019-04-09 17:06:47,0.001s,PASSED
"tokenPassword = ""cropmetrics""",,,2019-04-09 17:06:47,2019-04-09 17:06:47,0.001s,PASSED
"responseToken = sendRequest(findTestObject(""VoPro/Token"", [""usernameToken"":tokenUserName, ""passwordToken"":tokenPassword]))",,,2019-04-09 17:06:47,2019-04-09 17:06:47,0.134s,PASSED
slurper = new groovy.json.JsonSlurper(),,,2019-04-09 17:06:47,2019-04-09 17:06:47,0.001s,PASSED
tokenResult = slurper.parseText(responseToken.getResponseBodyContent()),,,2019-04-09 17:06:47,2019-04-09 17:06:47,0.003s,PASSED
accessToken = access_token,,,2019-04-09 17:06:47,2019-04-09 17:06:47,0.001s,PASSED
"println("".. Current access token generated for admin user : "" + accessToken)",,,2019-04-09 17:06:47,2019-04-09 17:06:47,0.001s,PASSED
"responseUser = sendRequest(findTestObject(""VoGrow/User/User"", [""access_token"":accessToken]))",,,2019-04-09 17:06:47,2019-04-09 17:06:47,0.046s,PASSED
"verifyResponseStatusCode(responseUser, 200)",,,2019-04-09 17:06:47,2019-04-09 17:06:47,0.003s,PASSED
,,,,,,
Test Cases/VoGrow/API/User/Info/4 API_USER_When_user_is_agent_only_Expected_response_body_content_with_the_conresponding_agent_data,,,2019-04-09 17:06:47,2019-04-09 17:06:48,1.147s,PASSED
"tokenUserName = ""jenny.maldonado.tx1@gmail.com""",,,2019-04-09 17:06:47,2019-04-09 17:06:47,0.001s,PASSED
"tokenPassword = ""cropmetrics""",,,2019-04-09 17:06:47,2019-04-09 17:06:47,0.001s,PASSED
"responseToken = sendRequest(findTestObject(""VoPro/Token"", [""usernameToken"":tokenUserName, ""passwordToken"":tokenPassword]))",,,2019-04-09 17:06:47,2019-04-09 17:06:47,0.177s,PASSED
slurper = new groovy.json.JsonSlurper(),,,2019-04-09 17:06:47,2019-04-09 17:06:47,0.001s,PASSED
tokenResult = slurper.parseText(responseToken.getResponseBodyContent()),,,2019-04-09 17:06:47,2019-04-09 17:06:47,0.001s,PASSED
accessToken = access_token,,,2019-04-09 17:06:47,2019-04-09 17:06:47,0.000s,PASSED
"println("".. Current access token generated for admin user : "" + accessToken)",,,2019-04-09 17:06:47,2019-04-09 17:06:47,0.001s,PASSED
"responseUser = sendRequest(findTestObject(""VoGrow/User/User"", [""access_token"":accessToken]))",,,2019-04-09 17:06:47,2019-04-09 17:06:47,0.127s,PASSED
"verifyResponseStatusCode(responseUser, 200)",,,2019-04-09 17:06:47,2019-04-09 17:06:47,0.003s,PASSED
slurper1 = new groovy.json.JsonSlurper(),,,2019-04-09 17:06:47,2019-04-09 17:06:47,0.001s,PASSED
responseBodyUser = slurper1.parseText(responseUser.getResponseBodyContent()),,,2019-04-09 17:06:47,2019-04-09 17:06:47,0.000s,PASSED
id = id,,,2019-04-09 17:06:47,2019-04-09 17:06:47,0.000s,PASSED
name = name,,,2019-04-09 17:06:47,2019-04-09 17:06:47,0.000s,PASSED
email = email,,,2019-04-09 17:06:47,2019-04-09 17:06:47,0.000s,PASSED
addressLine1 = address_line1,,,2019-04-09 17:06:47,2019-04-09 17:06:47,0.000s,PASSED
addressLine2 = address_line2,,,2019-04-09 17:06:47,2019-04-09 17:06:47,0.000s,PASSED
town = town,,,2019-04-09 17:06:47,2019-04-09 17:06:47,0.001s,PASSED
state = state,,,2019-04-09 17:06:47,2019-04-09 17:06:47,0.001s,PASSED
zip = zip,,,2019-04-09 17:06:47,2019-04-09 17:06:47,0.001s,PASSED
country = country,,,2019-04-09 17:06:47,2019-04-09 17:06:47,0.000s,PASSED
phone = phone,,,2019-04-09 17:06:47,2019-04-09 17:06:47,0.001s,PASSED
role = role,,,2019-04-09 17:06:47,2019-04-09 17:06:47,0.001s,PASSED
roles = roles,,,2019-04-09 17:06:47,2019-04-09 17:06:47,0.001s,PASSED
"println(""The user id is :  "" + id)",,,2019-04-09 17:06:47,2019-04-09 17:06:47,0.001s,PASSED
"println(""The user name is :  "" + name)",,,2019-04-09 17:06:47,2019-04-09 17:06:47,0.001s,PASSED
"println(""The user email is :  "" + email)",,,2019-04-09 17:06:47,2019-04-09 17:06:47,0.001s,PASSED
"println(""The user address line 1 is :  "" + addressLine1)",,,2019-04-09 17:06:47,2019-04-09 17:06:47,0.001s,PASSED
"println(""The user address line 2 is :  "" + addressLine2)",,,2019-04-09 17:06:47,2019-04-09 17:06:47,0.001s,PASSED
"println(""The user town is :  "" + town)",,,2019-04-09 17:06:47,2019-04-09 17:06:47,0.000s,PASSED
"println(""The user state is :  "" + state)",,,2019-04-09 17:06:47,2019-04-09 17:06:47,0.001s,PASSED
"println(""The user zip is :  "" + zip)",,,2019-04-09 17:06:47,2019-04-09 17:06:47,0.001s,PASSED
"println(""The user country is :  "" + country)",,,2019-04-09 17:06:47,2019-04-09 17:06:47,0.001s,PASSED
"println(""The user phone is :  "" + phone)",,,2019-04-09 17:06:47,2019-04-09 17:06:47,0.001s,PASSED
"println(""The user role is :  "" + role)",,,2019-04-09 17:06:47,2019-04-09 17:06:47,0.012s,PASSED
"println(""The user roles is :  "" + roles)",,,2019-04-09 17:06:47,2019-04-09 17:06:47,0.001s,PASSED
"idDB = ""2""",,,2019-04-09 17:06:47,2019-04-09 17:06:47,0.001s,PASSED
"nameDB = ""Agent account""",,,2019-04-09 17:06:47,2019-04-09 17:06:47,0.001s,PASSED
"emailDB = ""jenny.maldonado.tx1@gmail.com""",,,2019-04-09 17:06:47,2019-04-09 17:06:47,0.001s,PASSED
"addressLine1DB = ""x""",,,2019-04-09 17:06:47,2019-04-09 17:06:47,0.001s,PASSED
"addressLine2DB = """"",,,2019-04-09 17:06:47,2019-04-09 17:06:47,0.001s,PASSED
"townDB = ""x""",,,2019-04-09 17:06:47,2019-04-09 17:06:47,0.000s,PASSED
"stateDB = ""NE""",,,2019-04-09 17:06:47,2019-04-09 17:06:47,0.000s,PASSED
"zipDB = ""x""",,,2019-04-09 17:06:47,2019-04-09 17:06:47,0.001s,PASSED
"countryDB = ""USA""",,,2019-04-09 17:06:47,2019-04-09 17:06:47,0.001s,PASSED
"phoneDB = """"",,,2019-04-09 17:06:47,2019-04-09 17:06:47,0.001s,PASSED
"roleDB = ""Agent""",,,2019-04-09 17:06:47,2019-04-09 17:06:47,0.000s,PASSED
"rolesDB = ""Client,Agent""",,,2019-04-09 17:06:47,2019-04-09 17:06:47,0.000s,PASSED
"verifyElementPropertyValue(responseUser, ""id"", idDB)",,,2019-04-09 17:06:47,2019-04-09 17:06:47,0.019s,PASSED
"verifyElementPropertyValue(responseUser, ""name"", nameDB)",,,2019-04-09 17:06:47,2019-04-09 17:06:47,0.025s,PASSED
"verifyElementPropertyValue(responseUser, ""email"", emailDB)",,,2019-04-09 17:06:47,2019-04-09 17:06:48,0.025s,PASSED
"verifyElementPropertyValue(responseUser, ""address_line1"", addressLine1DB)",,,2019-04-09 17:06:48,2019-04-09 17:06:48,0.073s,PASSED
"verifyElementPropertyValue(responseUser, ""address_line2"", addressLine2DB)",,,2019-04-09 17:06:48,2019-04-09 17:06:48,0.023s,PASSED
"verifyElementPropertyValue(responseUser, ""town"", townDB)",,,2019-04-09 17:06:48,2019-04-09 17:06:48,0.045s,PASSED
"verifyElementPropertyValue(responseUser, ""state"", stateDB)",,,2019-04-09 17:06:48,2019-04-09 17:06:48,0.030s,PASSED
"verifyElementPropertyValue(responseUser, ""zip"", zipDB)",,,2019-04-09 17:06:48,2019-04-09 17:06:48,0.030s,PASSED
"verifyElementPropertyValue(responseUser, ""country"", countryDB)",,,2019-04-09 17:06:48,2019-04-09 17:06:48,0.018s,PASSED
"verifyElementPropertyValue(responseUser, ""phone"", phoneDB)",,,2019-04-09 17:06:48,2019-04-09 17:06:48,0.039s,PASSED
"verifyElementPropertyValue(responseUser, ""role"", roleDB)",,,2019-04-09 17:06:48,2019-04-09 17:06:48,0.042s,PASSED
"verifyElementPropertyValue(responseUser, ""roles"", rolesDB)",,,2019-04-09 17:06:48,2019-04-09 17:06:48,0.031s,PASSED
,,,,,,
Test Cases/VoGrow/API/User/Info/5 API_USER_When_user_token_is_wrong_Expected_status_code_401,,,2019-04-09 17:06:48,2019-04-09 17:06:51,3.592s,PASSED
"accessToken = ""testInvalidToken""",,,2019-04-09 17:06:48,2019-04-09 17:06:48,0.001s,PASSED
"responseUser = sendRequest(findTestObject(""VoGrow/User/User"", [""access_token"":accessToken]))",,,2019-04-09 17:06:48,2019-04-09 17:06:51,3.333s,PASSED
"verifyResponseStatusCode(responseUser, 401)",,,2019-04-09 17:06:51,2019-04-09 17:06:51,0.002s,PASSED
,,,,,,
Test Cases/VoGrow/API/User/Info/6 API_USER_When_user_token_is_wrong_Expected_properly_error_message_is_displayed,,,2019-04-09 17:06:51,2019-04-09 17:06:54,2.184s,PASSED
"accessToken = ""testInvalidToken""",,,2019-04-09 17:06:52,2019-04-09 17:06:52,0.000s,PASSED
"responseUser = sendRequest(findTestObject(""VoGrow/User/User"", [""access_token"":accessToken]))",,,2019-04-09 17:06:52,2019-04-09 17:06:54,1.908s,PASSED
"verifyResponseStatusCode(responseUser, 401)",,,2019-04-09 17:06:54,2019-04-09 17:06:54,0.004s,PASSED
slurper1 = new groovy.json.JsonSlurper(),,,2019-04-09 17:06:54,2019-04-09 17:06:54,0.001s,PASSED
UserResult = slurper1.parseText(responseUser.getResponseBodyContent()),,,2019-04-09 17:06:54,2019-04-09 17:06:54,0.001s,PASSED
messageResponse = message,,,2019-04-09 17:06:54,2019-04-09 17:06:54,0.000s,PASSED
"messageExpected = ""Authorization has been denied for this request.""",,,2019-04-09 17:06:54,2019-04-09 17:06:54,0.000s,PASSED
"println(""Error message response: "" + messageResponse)",,,2019-04-09 17:06:54,2019-04-09 17:06:54,0.001s,PASSED
"println(""Error message expected: "" + messageExpected)",,,2019-04-09 17:06:54,2019-04-09 17:06:54,0.000s,PASSED
"verifyElementPropertyValue(responseUser, ""message"", messageExpected)",,,2019-04-09 17:06:54,2019-04-09 17:06:54,0.018s,PASSED
,,,,,,
Test Cases/VoGrow/API/User/Info/7 API_USER_When_user_has_admin_role_Expected_status_code_401,,,2019-04-09 17:06:54,2019-04-09 17:06:54,0.446s,PASSED
"tokenUserName = ""admin""",,,2019-04-09 17:06:54,2019-04-09 17:06:54,0.001s,PASSED
"tokenPassword = ""cropmetricsvo""",,,2019-04-09 17:06:54,2019-04-09 17:06:54,0.001s,PASSED
"responseToken = sendRequest(findTestObject(""VoPro/Token"", [""usernameToken"":tokenUserName, ""passwordToken"":tokenPassword]))",,,2019-04-09 17:06:54,2019-04-09 17:06:54,0.171s,PASSED
slurper = new groovy.json.JsonSlurper(),,,2019-04-09 17:06:54,2019-04-09 17:06:54,0.000s,PASSED
tokenResult = slurper.parseText(responseToken.getResponseBodyContent()),,,2019-04-09 17:06:54,2019-04-09 17:06:54,0.000s,PASSED
accessToken = access_token,,,2019-04-09 17:06:54,2019-04-09 17:06:54,0.000s,PASSED
"println("".. Current access token generated for admin user : "" + accessToken)",,,2019-04-09 17:06:54,2019-04-09 17:06:54,0.000s,PASSED
"responseUser = sendRequest(findTestObject(""VoGrow/User/User"", [""access_token"":accessToken]))",,,2019-04-09 17:06:54,2019-04-09 17:06:54,0.030s,PASSED
"verifyResponseStatusCode(responseUser, 401)",,,2019-04-09 17:06:54,2019-04-09 17:06:54,0.002s,PASSED
,,,,,,
Test Cases/VoGrow/API/User/Info/8 API_USER_When_user_has_admin_role_Expected_properly_error_message_is_displayed,,,2019-04-09 17:06:54,2019-04-09 17:06:54,0.366s,PASSED
"tokenUserName = ""admin""",,,2019-04-09 17:06:54,2019-04-09 17:06:54,0.001s,PASSED
"tokenPassword = ""cropmetricsvo""",,,2019-04-09 17:06:54,2019-04-09 17:06:54,0.001s,PASSED
"responseToken = sendRequest(findTestObject(""VoPro/Token"", [""usernameToken"":tokenUserName, ""passwordToken"":tokenPassword]))",,,2019-04-09 17:06:54,2019-04-09 17:06:54,0.127s,PASSED
slurper = new groovy.json.JsonSlurper(),,,2019-04-09 17:06:54,2019-04-09 17:06:54,0.000s,PASSED
tokenResult = slurper.parseText(responseToken.getResponseBodyContent()),,,2019-04-09 17:06:54,2019-04-09 17:06:54,0.000s,PASSED
accessToken = access_token,,,2019-04-09 17:06:54,2019-04-09 17:06:54,0.000s,PASSED
"println("".. Current access token generated for admin user : "" + accessToken)",,,2019-04-09 17:06:54,2019-04-09 17:06:54,0.003s,PASSED
"responseUser = sendRequest(findTestObject(""VoGrow/User/User"", [""access_token"":accessToken]))",,,2019-04-09 17:06:54,2019-04-09 17:06:54,0.032s,PASSED
"verifyResponseStatusCode(responseUser, 401)",,,2019-04-09 17:06:54,2019-04-09 17:06:54,0.001s,PASSED
slurper1 = new groovy.json.JsonSlurper(),,,2019-04-09 17:06:54,2019-04-09 17:06:54,0.000s,PASSED
UserResult = slurper1.parseText(responseUser.getResponseBodyContent()),,,2019-04-09 17:06:54,2019-04-09 17:06:54,0.001s,PASSED
messageResponse = message,,,2019-04-09 17:06:54,2019-04-09 17:06:54,0.000s,PASSED
"messageExpected = ""Authorization has been denied for this request.""",,,2019-04-09 17:06:54,2019-04-09 17:06:54,0.001s,PASSED
"println(""Error message response: "" + messageResponse)",,,2019-04-09 17:06:54,2019-04-09 17:06:54,0.001s,PASSED
"println(""Error message expected: "" + messageExpected)",,,2019-04-09 17:06:54,2019-04-09 17:06:54,0.000s,PASSED
"verifyElementPropertyValue(responseUser, ""message"", messageExpected)",,,2019-04-09 17:06:54,2019-04-09 17:06:54,0.017s,PASSED
