{
  "log" : {
    "version" : "1.2",
    "creator" : {
      "name" : "BrowserMob Proxy",
      "version" : "2.1.5",
      "comment" : ""
    },
    "pages" : [ {
      "id" : "Page 0",
      "startedDateTime" : "2019-03-26T13:20:06.835Z",
      "title" : "Page 0",
      "pageTimings" : {
        "onLoad" : 1494,
        "comment" : ""
      },
      "comment" : ""
    } ],
    "entries" : [ {
      "pageref" : "Page 0",
      "startedDateTime" : "2019-03-26T13:20:06.836Z",
      "request" : {
        "method" : "POST",
        "url" : "http://localhost:10520/WebAPI/api/Account/AdministrativeRegister/?",
        "httpVersion" : "HTTP/1.1",
        "cookies" : [ ],
        "headers" : [ {
          "name" : "User-Agent",
          "value" : "Katalon Studio"
        }, {
          "name" : "Content-Type",
          "value" : "application/x-www-form-urlencoded"
        }, {
          "name" : "Authorization",
          "value" : "Bearer eyJ0eXAiOiJKV1QiLCJhbGciOiJIUzI1NiJ9.eyJ1bmlxdWVfbmFtZSI6ImFkbWluIiwicm9sZSI6InVzZXIiLCJzdWIiOiJhZG1pbiIsImlzcyI6IkNyb3BNZXRyaWNzIiwiYXVkIjoiYWxsIiwiZXhwIjoxNTUzNjEwMzA2LCJuYmYiOjE1NTM2MDY0MDZ9.i8XcVwA4XTZq8DNJCo0mvMFfimZEzjVv9eF_qyTSaNo"
        }, {
          "name" : "Host",
          "value" : "localhost:10520"
        }, {
          "name" : "Accept",
          "value" : "text/html, image/gif, image/jpeg, *; q=.2, */*; q=.2"
        }, {
          "name" : "Proxy-Connection",
          "value" : "keep-alive"
        }, {
          "name" : "Content-Length",
          "value" : "393"
        } ],
        "queryString" : [ ],
        "postData" : {
          "mimeType" : "application/x-www-form-urlencoded",
          "params" : [ {
            "name" : "username",
            "value" : "kusernoconfirmpassword",
            "comment" : ""
          }, {
            "name" : "password",
            "value" : "cropmetrics",
            "comment" : ""
          }, {
            "name" : "confirmPassword",
            "value" : "",
            "comment" : ""
          }, {
            "name" : "email",
            "value" : "cropmetricsvo@gmail.com",
            "comment" : ""
          }, {
            "name" : "fullname",
            "value" : "test validation",
            "comment" : ""
          }, {
            "name" : "phone",
            "value" : "123",
            "comment" : ""
          }, {
            "name" : "dealer",
            "value" : "dealer test validation",
            "comment" : ""
          }, {
            "name" : "addressLine1",
            "value" : "address line 1 test validation",
            "comment" : ""
          }, {
            "name" : "addressLine2",
            "value" : "address line 1 test validation",
            "comment" : ""
          }, {
            "name" : "town",
            "value" : "townValidation",
            "comment" : ""
          }, {
            "name" : "state",
            "value" : "stateValidation",
            "comment" : ""
          }, {
            "name" : "zip",
            "value" : "zipValidation",
            "comment" : ""
          }, {
            "name" : "country",
            "value" : "countryValidation",
            "comment" : ""
          }, {
            "name" : "roles",
            "value" : "Client",
            "comment" : ""
          }, {
            "name" : "modifierUsername",
            "value" : "admin",
            "comment" : ""
          }, {
            "name" : "modifierUserId",
            "value" : "1",
            "comment" : ""
          } ],
          "comment" : ""
        },
        "headersSize" : 560,
        "bodySize" : 393,
        "comment" : ""
      },
      "response" : {
        "status" : 200,
        "statusText" : "OK",
        "httpVersion" : "HTTP/1.1",
        "cookies" : [ {
          "name" : ".ASPROLES",
          "value" : "eYVajIP3YQuX40RNnmntg9Jj_Tu0vLm4OCoLu4ROGMpuxlOGxFt79w0qyONpjcy3sbmrcnpMwZLg7Vl2YE3LNm6t2fh43NfZ917RxeLqRFgAYZrUcatL06NBg8GMdK0mQ-jjjmHBfbjTh7BDfT63U3P29PBylpNMsgYRFwhxaGJ8PfK3SL3JrNjOvGfg0pebm2sk5UY1C-JuH7Zp6MhH6yPzWCBC_-PdYvvK_Aun9LxZ0rCly0N2h-SY7jDegOxeVFsf2j1GiC9eshsvb-RmSDgPckrMWWnJJtbZZUrnt00y7yACOD_E8WD531kpgFIh6vuzcjXHiYfayLLkWOD4M-XZ4RmvMBnYHFO3jc_dRXj9Ccc3vzbL55RQdrwVcaajQEbgJlB_8xr6fXhXuDYMQKR8OuQQiMv3wpU5ixrRf8pXs_rFnmoSn8PJrFQ2qOUlib0EyHVGrs32LQSGI9Uay3WOi5duy0d6bYNq5M7cGM5nTQU20",
          "path" : "/",
          "httpOnly" : true,
          "secure" : false,
          "comment" : ""
        } ],
        "headers" : [ {
          "name" : "Cache-Control",
          "value" : "private"
        }, {
          "name" : "Content-Type",
          "value" : "application/json; charset=utf-8"
        }, {
          "name" : "Server",
          "value" : "Microsoft-IIS/10.0"
        }, {
          "name" : "Set-Cookie",
          "value" : ".ASPROLES=eYVajIP3YQuX40RNnmntg9Jj_Tu0vLm4OCoLu4ROGMpuxlOGxFt79w0qyONpjcy3sbmrcnpMwZLg7Vl2YE3LNm6t2fh43NfZ917RxeLqRFgAYZrUcatL06NBg8GMdK0mQ-jjjmHBfbjTh7BDfT63U3P29PBylpNMsgYRFwhxaGJ8PfK3SL3JrNjOvGfg0pebm2sk5UY1C-JuH7Zp6MhH6yPzWCBC_-PdYvvK_Aun9LxZ0rCly0N2h-SY7jDegOxeVFsf2j1GiC9eshsvb-RmSDgPckrMWWnJJtbZZUrnt00y7yACOD_E8WD531kpgFIh6vuzcjXHiYfayLLkWOD4M-XZ4RmvMBnYHFO3jc_dRXj9Ccc3vzbL55RQdrwVcaajQEbgJlB_8xr6fXhXuDYMQKR8OuQQiMv3wpU5ixrRf8pXs_rFnmoSn8PJrFQ2qOUlib0EyHVGrs32LQSGI9Uay3WOi5duy0d6bYNq5M7cGM5nTQU20; path=/; HttpOnly"
        }, {
          "name" : "X-SourceFiles",
          "value" : "=?UTF-8?B?RDpcVmlydHVhbE9wdGltaXplci1SZWZhY3RvcmluZ1xDcm9wTWV0cmljcy5Wby5BcGlcQ3JvcE1ldHJpY3MuVm8uQXBpXGFwaVxBY2NvdW50XEFkbWluaXN0cmF0aXZlUmVnaXN0ZXJc?="
        }, {
          "name" : "X-Powered-By",
          "value" : "ASP.NET"
        }, {
          "name" : "Date",
          "value" : "Tue, 26 Mar 2019 13:20:08 GMT"
        }, {
          "name" : "Content-Length",
          "value" : "8"
        } ],
        "content" : {
          "size" : 8,
          "mimeType" : "application/json; charset=utf-8",
          "text" : "{\"id\":3}",
          "comment" : ""
        },
        "redirectURL" : "",
        "headersSize" : 907,
        "bodySize" : 8,
        "comment" : ""
      },
      "cache" : { },
      "timings" : {
        "comment" : "",
        "receive" : 1,
        "wait" : 1488,
        "connect" : -1,
        "blocked" : -1,
        "dns" : -1,
        "send" : 0,
        "ssl" : -1
      },
      "serverIPAddress" : "127.0.0.1",
      "comment" : "",
      "_katalonRequestInformation" : {
        "name" : "9",
        "testObjectId" : "Object Repository/VoPro/Account/AdministrativeRegister",
        "harId" : "56a66a3a-f96e-4971-882f-d0700f31e839"
      },
      "time" : 1489
    } ],
    "comment" : ""
  }
}