{
  "log" : {
    "version" : "1.2",
    "creator" : {
      "name" : "BrowserMob Proxy",
      "version" : "2.1.5",
      "comment" : ""
    },
    "pages" : [ {
      "id" : "Page 0",
      "startedDateTime" : "2019-04-05T19:25:41.583Z",
      "title" : "Page 0",
      "pageTimings" : {
        "onLoad" : 4737,
        "comment" : ""
      },
      "comment" : ""
    } ],
    "entries" : [ {
      "pageref" : "Page 0",
      "startedDateTime" : "2019-04-05T19:25:41.584Z",
      "request" : {
        "method" : "PUT",
        "url" : "http://localhost:10520/WebAPI/api/mobile/v1/farms/7?",
        "httpVersion" : "HTTP/1.1",
        "cookies" : [ ],
        "headers" : [ {
          "name" : "User-Agent",
          "value" : "Katalon Studio"
        }, {
          "name" : "Content-Type",
          "value" : "application/json"
        }, {
          "name" : "Authorization",
          "value" : "Bearer eyJ0eXAiOiJKV1QiLCJhbGciOiJIUzI1NiJ9.eyJ1bmlxdWVfbmFtZSI6Implbm55Lm1hbGRvbmFkby50eDFAZ21haWwuY29tIiwicm9sZSI6InVzZXIiLCJzdWIiOiJqZW5ueS5tYWxkb25hZG8udHgxQGdtYWlsLmNvbSIsImlzcyI6IkNyb3BNZXRyaWNzIiwiYXVkIjoiYWxsIiwiZXhwIjoxNTU0NDk2MjQxLCJuYmYiOjE1NTQ0OTIzNDF9.e6F70w7t5cTROq5PdXSxHYV5sN_VcmmDWe95auIwKgU"
        }, {
          "name" : "Host",
          "value" : "localhost:10520"
        }, {
          "name" : "Accept",
          "value" : "text/html, image/gif, image/jpeg, *; q=.2, */*; q=.2"
        }, {
          "name" : "Proxy-Connection",
          "value" : "keep-alive"
        }, {
          "name" : "Content-Length",
          "value" : "12"
        } ],
        "queryString" : [ ],
        "postData" : {
          "mimeType" : "application/json",
          "text" : "{\"name\": \"\"}",
          "comment" : ""
        },
        "headersSize" : 591,
        "bodySize" : 12,
        "comment" : ""
      },
      "response" : {
        "status" : 400,
        "statusText" : "Bad Request",
        "httpVersion" : "HTTP/1.1",
        "cookies" : [ {
          "name" : ".ASPROLES",
          "value" : "ztUZ-ydHNwOm8ouBQs2RJVzoeIVbN9v4IiC-buKlhDwFlkENHnwuRaRyyeOLmEp_ENS66I2heks2XTjM4khKIYjOu3rR_DhOHr9YBeAFZZU_8LvGw2QpIlZVcsA1_96jYtf_0QUvEn5m5tR_g2XlulsXo50pAmFR7VI8QF7rx4VYAGuYDagooHEtAP2TD-osh3CTbblKjDKsJKMJmA0CUkTk1M7dRHsegnXUHhjGj9ubq9qhS5LCAyuYVhK2elIbyMFVVm87W2dAhcq6ao14g2LHJVaQDB9usmuvw0L1v5vvJSZ-hCY2spLI8hCQ4eLinob8EXqyXCjPiOG9RpNLIphBZeKKKGLmd2A0aS3GWk7-Ijbad3m_FUtz6IId1QkrPQxJZShtL_x3Y0Axpr6TQm1k4iS6rLIoDzZ8hzXL7gKu9ezpg7HCViIpvyFC6r2etyNAN9uFd72yKVM0-2mM1nqroQ3Ziks-8hXH0P9CeY8wu6kEQBlwPQUnZqSe7F_4rfdzPyL_Y6ovwAOdLBsxQ7OSfCk1",
          "path" : "/",
          "httpOnly" : true,
          "secure" : false,
          "comment" : ""
        } ],
        "headers" : [ {
          "name" : "Cache-Control",
          "value" : "private"
        }, {
          "name" : "Content-Type",
          "value" : "application/json; charset=utf-8"
        }, {
          "name" : "Server",
          "value" : "Microsoft-IIS/10.0"
        }, {
          "name" : "Set-Cookie",
          "value" : ".ASPROLES=ztUZ-ydHNwOm8ouBQs2RJVzoeIVbN9v4IiC-buKlhDwFlkENHnwuRaRyyeOLmEp_ENS66I2heks2XTjM4khKIYjOu3rR_DhOHr9YBeAFZZU_8LvGw2QpIlZVcsA1_96jYtf_0QUvEn5m5tR_g2XlulsXo50pAmFR7VI8QF7rx4VYAGuYDagooHEtAP2TD-osh3CTbblKjDKsJKMJmA0CUkTk1M7dRHsegnXUHhjGj9ubq9qhS5LCAyuYVhK2elIbyMFVVm87W2dAhcq6ao14g2LHJVaQDB9usmuvw0L1v5vvJSZ-hCY2spLI8hCQ4eLinob8EXqyXCjPiOG9RpNLIphBZeKKKGLmd2A0aS3GWk7-Ijbad3m_FUtz6IId1QkrPQxJZShtL_x3Y0Axpr6TQm1k4iS6rLIoDzZ8hzXL7gKu9ezpg7HCViIpvyFC6r2etyNAN9uFd72yKVM0-2mM1nqroQ3Ziks-8hXH0P9CeY8wu6kEQBlwPQUnZqSe7F_4rfdzPyL_Y6ovwAOdLBsxQ7OSfCk1; path=/; HttpOnly"
        }, {
          "name" : "X-SourceFiles",
          "value" : "=?UTF-8?B?RDpcVmlydHVhbE9wdGltaXplci1SZWZhY3RvcmluZ1xDcm9wTWV0cmljcy5Wby5BcGlcQ3JvcE1ldHJpY3MuVm8uQXBpXGFwaVxtb2JpbGVcdjFcZmFybXNcNw==?="
        }, {
          "name" : "X-Powered-By",
          "value" : "ASP.NET"
        }, {
          "name" : "Date",
          "value" : "Fri, 05 Apr 2019 19:25:46 GMT"
        }, {
          "name" : "Content-Length",
          "value" : "45"
        } ],
        "content" : {
          "size" : 45,
          "mimeType" : "application/json; charset=utf-8",
          "text" : "{\"message\":\"The farm name must be provided.\"}",
          "comment" : ""
        },
        "redirectURL" : "",
        "headersSize" : 944,
        "bodySize" : 45,
        "comment" : ""
      },
      "cache" : { },
      "timings" : {
        "comment" : "",
        "ssl" : -1,
        "receive" : 1,
        "send" : 0,
        "connect" : -1,
        "blocked" : -1,
        "wait" : 4732,
        "dns" : -1
      },
      "serverIPAddress" : "127.0.0.1",
      "comment" : "",
      "_katalonRequestInformation" : {
        "name" : "21",
        "testObjectId" : "Object Repository/VoGrow/Farm/FarmPut",
        "harId" : "d85fc79e-2906-4084-b4bf-1aa96b7d98c9"
      },
      "time" : 4734
    } ],
    "comment" : ""
  }
}