{
  "log" : {
    "version" : "1.2",
    "creator" : {
      "name" : "BrowserMob Proxy",
      "version" : "2.1.5",
      "comment" : ""
    },
    "pages" : [ {
      "id" : "Page 0",
      "startedDateTime" : "2019-03-29T20:33:30.479Z",
      "title" : "Page 0",
      "pageTimings" : {
        "onLoad" : 1891,
        "comment" : ""
      },
      "comment" : ""
    } ],
    "entries" : [ {
      "pageref" : "Page 0",
      "startedDateTime" : "2019-03-29T20:33:30.479Z",
      "request" : {
        "method" : "PUT",
        "url" : "http://localhost:10520/WebAPI/api/admin/v1/users/14?",
        "httpVersion" : "HTTP/1.1",
        "cookies" : [ ],
        "headers" : [ {
          "name" : "User-Agent",
          "value" : "Katalon Studio"
        }, {
          "name" : "Content-Type",
          "value" : "application/x-www-form-urlencoded"
        }, {
          "name" : "Authorization",
          "value" : "Bearer eyJ0eXAiOiJKV1QiLCJhbGciOiJIUzI1NiJ9.eyJ1bmlxdWVfbmFtZSI6ImFkbWluIiwicm9sZSI6InVzZXIiLCJzdWIiOiJhZG1pbiIsImlzcyI6IkNyb3BNZXRyaWNzIiwiYXVkIjoiYWxsIiwiZXhwIjoxNTUzODk1NTEwLCJuYmYiOjE1NTM4OTE2MTB9.klvRSVtBX4l3xwkL_m5Piyj1jS3M_8g8I2nrp25ZomE"
        }, {
          "name" : "Host",
          "value" : "localhost:10520"
        }, {
          "name" : "Accept",
          "value" : "text/html, image/gif, image/jpeg, *; q=.2, */*; q=.2"
        }, {
          "name" : "Proxy-Connection",
          "value" : "keep-alive"
        }, {
          "name" : "Content-Length",
          "value" : "303"
        } ],
        "queryString" : [ ],
        "postData" : {
          "mimeType" : "application/x-www-form-urlencoded",
          "params" : [ {
            "name" : "password",
            "value" : "cropmetrics",
            "comment" : ""
          }, {
            "name" : "email",
            "value" : "cropmetricsvo.passwithsymbols@gmail.com",
            "comment" : ""
          }, {
            "name" : "fullname",
            "value" : "test validation",
            "comment" : ""
          }, {
            "name" : "phone",
            "value" : "123",
            "comment" : ""
          }, {
            "name" : "dealer",
            "value" : "x",
            "comment" : ""
          }, {
            "name" : "addressLine1",
            "value" : "address line 1 test validation",
            "comment" : ""
          }, {
            "name" : "addressLine2",
            "value" : "address line 2 test validation",
            "comment" : ""
          }, {
            "name" : "town",
            "value" : "townValidation",
            "comment" : ""
          }, {
            "name" : "state",
            "value" : "stateValidation",
            "comment" : ""
          }, {
            "name" : "zip",
            "value" : "",
            "comment" : ""
          }, {
            "name" : "country",
            "value" : "countryValidation",
            "comment" : ""
          }, {
            "name" : "roles",
            "value" : "Client",
            "comment" : ""
          }, {
            "name" : "userProfileId",
            "value" : "14",
            "comment" : ""
          } ],
          "comment" : ""
        },
        "headersSize" : 545,
        "bodySize" : 303,
        "comment" : ""
      },
      "response" : {
        "status" : 200,
        "statusText" : "OK",
        "httpVersion" : "HTTP/1.1",
        "cookies" : [ {
          "name" : ".ASPROLES",
          "value" : "oM7OddVTtSdXjDEF5by6dMsutwa2pELJSiv_UMmctIcRiA_YYJr0MM28ZGfZGd85XI5vr_1CsFOj-bF30kvmpNcT4dZ_PQpmy9P9IbyyXuYT28COVyyqucgaylnLgsm5vAdl-HaulxPaZf3OhaKsae4KOyLLT7jDBs3uGAMEFq1nmR1u-a1iyAzhPDMc2yG17tYmcV0Xxfa5nVulOVskVMhleSX_FeSDbKOM_aa9NeGRWPDhWhhXDKJwpcxZKz48tk07Nt9_6NXflwEOJUzvkx7SkSFpwtTH1o5T-Nr64GP2eJOkH41sMpV9x7QnuAJdJYAG5s-3yiyEMckaRey7uH_vm4NhNxfG3Lr7tvhZuWklwqWzHzDiSJLmLIdO9gGhkrcHNHJQY4sjxC5TLtvUqsyxAsVuZ6HvmyLLKmswXwbyOqlYvTYemgrVG3mC_Bu8ZKoNCfTkURdpVN0-8YDtCGoTomSv6GSFVCdRqPzcy81dWKBT0",
          "path" : "/",
          "httpOnly" : true,
          "secure" : false,
          "comment" : ""
        } ],
        "headers" : [ {
          "name" : "Cache-Control",
          "value" : "private"
        }, {
          "name" : "Server",
          "value" : "Microsoft-IIS/10.0"
        }, {
          "name" : "Set-Cookie",
          "value" : ".ASPROLES=oM7OddVTtSdXjDEF5by6dMsutwa2pELJSiv_UMmctIcRiA_YYJr0MM28ZGfZGd85XI5vr_1CsFOj-bF30kvmpNcT4dZ_PQpmy9P9IbyyXuYT28COVyyqucgaylnLgsm5vAdl-HaulxPaZf3OhaKsae4KOyLLT7jDBs3uGAMEFq1nmR1u-a1iyAzhPDMc2yG17tYmcV0Xxfa5nVulOVskVMhleSX_FeSDbKOM_aa9NeGRWPDhWhhXDKJwpcxZKz48tk07Nt9_6NXflwEOJUzvkx7SkSFpwtTH1o5T-Nr64GP2eJOkH41sMpV9x7QnuAJdJYAG5s-3yiyEMckaRey7uH_vm4NhNxfG3Lr7tvhZuWklwqWzHzDiSJLmLIdO9gGhkrcHNHJQY4sjxC5TLtvUqsyxAsVuZ6HvmyLLKmswXwbyOqlYvTYemgrVG3mC_Bu8ZKoNCfTkURdpVN0-8YDtCGoTomSv6GSFVCdRqPzcy81dWKBT0; path=/; HttpOnly"
        }, {
          "name" : "X-SourceFiles",
          "value" : "=?UTF-8?B?RDpcVmlydHVhbE9wdGltaXplci1SZWZhY3RvcmluZ1xDcm9wTWV0cmljcy5Wby5BcGlcQ3JvcE1ldHJpY3MuVm8uQXBpXGFwaVxhZG1pblx2MVx1c2Vyc1wxNA==?="
        }, {
          "name" : "X-Powered-By",
          "value" : "ASP.NET"
        }, {
          "name" : "Date",
          "value" : "Fri, 29 Mar 2019 20:33:32 GMT"
        }, {
          "name" : "Content-Length",
          "value" : "0"
        } ],
        "content" : {
          "size" : 0,
          "mimeType" : "",
          "text" : "",
          "encoding" : "base64",
          "comment" : ""
        },
        "redirectURL" : "",
        "headersSize" : 844,
        "bodySize" : 0,
        "comment" : ""
      },
      "cache" : { },
      "timings" : {
        "comment" : "",
        "ssl" : -1,
        "send" : 0,
        "wait" : 1890,
        "connect" : -1,
        "blocked" : -1,
        "receive" : 0,
        "dns" : -1
      },
      "serverIPAddress" : "127.0.0.1",
      "comment" : "",
      "_katalonRequestInformation" : {
        "name" : "121",
        "testObjectId" : "Object Repository/VoPro/Account/api_admin_v1_users_userprofileid",
        "harId" : "7ab03dc6-91da-4461-9cc4-846eed03c799"
      },
      "time" : 1891
    } ],
    "comment" : ""
  }
}