{
  "log" : {
    "version" : "1.2",
    "creator" : {
      "name" : "BrowserMob Proxy",
      "version" : "2.1.5",
      "comment" : ""
    },
    "pages" : [ {
      "id" : "Page 0",
      "startedDateTime" : "2019-03-28T20:24:50.429Z",
      "title" : "Page 0",
      "pageTimings" : {
        "onLoad" : 98,
        "comment" : ""
      },
      "comment" : ""
    } ],
    "entries" : [ {
      "pageref" : "Page 0",
      "startedDateTime" : "2019-03-28T20:24:50.430Z",
      "request" : {
        "method" : "POST",
        "url" : "http://localhost:10520/WebAPI/api/admin/v1/users/?",
        "httpVersion" : "HTTP/1.1",
        "cookies" : [ ],
        "headers" : [ {
          "name" : "User-Agent",
          "value" : "Katalon Studio"
        }, {
          "name" : "Content-Type",
          "value" : "application/x-www-form-urlencoded"
        }, {
          "name" : "Authorization",
          "value" : "Bearer eyJ0eXAiOiJKV1QiLCJhbGciOiJIUzI1NiJ9.eyJ1bmlxdWVfbmFtZSI6ImNyb3BtZXRyaWNzdm8uY2xpZW50QGdtYWlsLmNvbSIsInJvbGUiOiJ1c2VyIiwic3ViIjoiY3JvcG1ldHJpY3N2by5jbGllbnRAZ21haWwuY29tIiwiaXNzIjoiQ3JvcE1ldHJpY3MiLCJhdWQiOiJhbGwiLCJleHAiOjE1NTM4MDg1OTAsIm5iZiI6MTU1MzgwNDY5MH0.lnwcspWqhkkVIonjh7YzqoLxQKdntytBBTXfZOHVlGs"
        }, {
          "name" : "Host",
          "value" : "localhost:10520"
        }, {
          "name" : "Accept",
          "value" : "text/html, image/gif, image/jpeg, *; q=.2, */*; q=.2"
        }, {
          "name" : "Proxy-Connection",
          "value" : "keep-alive"
        }, {
          "name" : "Content-Length",
          "value" : "272"
        } ],
        "queryString" : [ ],
        "postData" : {
          "mimeType" : "application/x-www-form-urlencoded",
          "params" : [ {
            "name" : "password",
            "value" : "cropmetrics",
            "comment" : ""
          }, {
            "name" : "email",
            "value" : "cropmetricsvo.clientbyclient@gmail.com",
            "comment" : ""
          }, {
            "name" : "fullname",
            "value" : "test validation",
            "comment" : ""
          }, {
            "name" : "phone",
            "value" : "123",
            "comment" : ""
          }, {
            "name" : "dealer",
            "value" : "x",
            "comment" : ""
          }, {
            "name" : "addressLine1",
            "value" : "address line 1 test validation",
            "comment" : ""
          }, {
            "name" : "addressLine2",
            "value" : "address line 2 test validation",
            "comment" : ""
          }, {
            "name" : "town",
            "value" : "townValidation",
            "comment" : ""
          }, {
            "name" : "state",
            "value" : "stateValidation",
            "comment" : ""
          }, {
            "name" : "zip",
            "value" : "xx",
            "comment" : ""
          }, {
            "name" : "country",
            "value" : "xx",
            "comment" : ""
          }, {
            "name" : "roles",
            "value" : "Client",
            "comment" : ""
          } ],
          "comment" : ""
        },
        "headersSize" : 611,
        "bodySize" : 272,
        "comment" : ""
      },
      "response" : {
        "status" : 401,
        "statusText" : "Unauthorized",
        "httpVersion" : "HTTP/1.1",
        "cookies" : [ {
          "name" : ".ASPROLES",
          "value" : "RszWlNh9mmhAY0lKPAjmLgARPXU2HsQc6fTmzng1la6AunhA9bO4rKT8J6u0jKYIMvrMQthYtaUZSb5NqhH3arV6sDpYT89KakbMVdM3s31Leuy543WTZn92Wup1syebKC_qBAbRvsP2iezB1_nnQAvBUlyHeq-Oohzd1G1dtayuGp8Sk0mPO76RtD6knQBfSC0uTN407v_wt0_JJSiB-7qd5aidqHbB2GASyrmqkVPyKPPBphglOmXfslNz6nFmsyVfM43h5oCqJwO0cLPh51kXfbv_M8CMLRSC8O67fqMh_renJ-cmDGEswxQVLbf3Rf8K76XlAF3mSKwnCPz-3HNmwukJsrU-kgoFTM8zuRZuHeH37dFuPlDgr_JATS-P6Y3dqEQnjn_nfPuhR1kk8bu-YiqQEWQ5VH55l4F145wWFGzIGrTgn44PnEig7E_IXA4LCMCJ1VK3cCBzKRD0CdgNxj6nFn3I5vD1ydMjOMC8nyKXQBIYDjdytKc9YffSKDRULw2",
          "path" : "/",
          "httpOnly" : true,
          "secure" : false,
          "comment" : ""
        } ],
        "headers" : [ {
          "name" : "Cache-Control",
          "value" : "private"
        }, {
          "name" : "Content-Type",
          "value" : "application/json; charset=utf-8"
        }, {
          "name" : "Server",
          "value" : "Microsoft-IIS/10.0"
        }, {
          "name" : "Set-Cookie",
          "value" : ".ASPROLES=RszWlNh9mmhAY0lKPAjmLgARPXU2HsQc6fTmzng1la6AunhA9bO4rKT8J6u0jKYIMvrMQthYtaUZSb5NqhH3arV6sDpYT89KakbMVdM3s31Leuy543WTZn92Wup1syebKC_qBAbRvsP2iezB1_nnQAvBUlyHeq-Oohzd1G1dtayuGp8Sk0mPO76RtD6knQBfSC0uTN407v_wt0_JJSiB-7qd5aidqHbB2GASyrmqkVPyKPPBphglOmXfslNz6nFmsyVfM43h5oCqJwO0cLPh51kXfbv_M8CMLRSC8O67fqMh_renJ-cmDGEswxQVLbf3Rf8K76XlAF3mSKwnCPz-3HNmwukJsrU-kgoFTM8zuRZuHeH37dFuPlDgr_JATS-P6Y3dqEQnjn_nfPuhR1kk8bu-YiqQEWQ5VH55l4F145wWFGzIGrTgn44PnEig7E_IXA4LCMCJ1VK3cCBzKRD0CdgNxj6nFn3I5vD1ydMjOMC8nyKXQBIYDjdytKc9YffSKDRULw2; path=/; HttpOnly"
        }, {
          "name" : "X-SourceFiles",
          "value" : "=?UTF-8?B?RDpcVmlydHVhbE9wdGltaXplci1SZWZhY3RvcmluZ1xDcm9wTWV0cmljcy5Wby5BcGlcQ3JvcE1ldHJpY3MuVm8uQXBpXGFwaVxhZG1pblx2MVx1c2Vyc1w=?="
        }, {
          "name" : "X-Powered-By",
          "value" : "ASP.NET"
        }, {
          "name" : "Date",
          "value" : "Thu, 28 Mar 2019 20:24:50 GMT"
        }, {
          "name" : "Content-Length",
          "value" : "61"
        } ],
        "content" : {
          "size" : 61,
          "mimeType" : "application/json; charset=utf-8",
          "text" : "{\"message\":\"Authorization has been denied for this request.\"}",
          "comment" : ""
        },
        "redirectURL" : "",
        "headersSize" : 920,
        "bodySize" : 61,
        "comment" : ""
      },
      "cache" : { },
      "timings" : {
        "comment" : "",
        "wait" : 92,
        "dns" : -1,
        "blocked" : -1,
        "connect" : -1,
        "receive" : 0,
        "send" : 0,
        "ssl" : -1
      },
      "serverIPAddress" : "127.0.0.1",
      "comment" : "",
      "_katalonRequestInformation" : {
        "name" : "115",
        "testObjectId" : "Object Repository/VoPro/Account/api_admin_v1_users",
        "harId" : "ea464a6a-8c4a-4b38-917f-bd9c131e411f"
      },
      "time" : 92
    } ],
    "comment" : ""
  }
}