{
  "log" : {
    "version" : "1.2",
    "creator" : {
      "name" : "BrowserMob Proxy",
      "version" : "2.1.5",
      "comment" : ""
    },
    "pages" : [ {
      "id" : "Page 0",
      "startedDateTime" : "2019-03-29T21:45:21.990Z",
      "title" : "Page 0",
      "pageTimings" : {
        "onLoad" : 2160,
        "comment" : ""
      },
      "comment" : ""
    } ],
    "entries" : [ {
      "pageref" : "Page 0",
      "startedDateTime" : "2019-03-29T21:45:21.991Z",
      "request" : {
        "method" : "POST",
        "url" : "http://localhost:10520/WebAPI/api/admin/v1/users/?",
        "httpVersion" : "HTTP/1.1",
        "cookies" : [ ],
        "headers" : [ {
          "name" : "User-Agent",
          "value" : "Katalon Studio"
        }, {
          "name" : "Content-Type",
          "value" : "application/x-www-form-urlencoded"
        }, {
          "name" : "Authorization",
          "value" : "Bearer eyJ0eXAiOiJKV1QiLCJhbGciOiJIUzI1NiJ9.eyJ1bmlxdWVfbmFtZSI6ImFkbWluIiwicm9sZSI6InVzZXIiLCJzdWIiOiJhZG1pbiIsImlzcyI6IkNyb3BNZXRyaWNzIiwiYXVkIjoiYWxsIiwiZXhwIjoxNTUzODk5ODIxLCJuYmYiOjE1NTM4OTU5MjF9.h0cV8Ui3XAzcdFjqVoJT0kBjS23a9VkS4bAsUGunxJw"
        }, {
          "name" : "Host",
          "value" : "localhost:10520"
        }, {
          "name" : "Accept",
          "value" : "text/html, image/gif, image/jpeg, *; q=.2, */*; q=.2"
        }, {
          "name" : "Proxy-Connection",
          "value" : "keep-alive"
        }, {
          "name" : "Content-Length",
          "value" : "657"
        } ],
        "queryString" : [ ],
        "postData" : {
          "mimeType" : "application/x-www-form-urlencoded",
          "params" : [ {
            "name" : "password",
            "value" : "cropmetrics",
            "comment" : ""
          }, {
            "name" : "email",
            "value" : "cropmetricsvo.addressline2long@gmail.com",
            "comment" : ""
          }, {
            "name" : "fullname",
            "value" : "x",
            "comment" : ""
          }, {
            "name" : "phone",
            "value" : "1",
            "comment" : ""
          }, {
            "name" : "dealer",
            "value" : "xx",
            "comment" : ""
          }, {
            "name" : "addressLine1",
            "value" : "xx",
            "comment" : ""
          }, {
            "name" : "addressLine2",
            "value" : "16 API_ACNT_When_new_account_have_long_addressline2_attribute_Expected_status_code_20016 API_ACNT_When_new_account_have_long_addressline2_attribute_Expected_status_code_20016 API_ACNT_When_new_account_have_long_addressline2_attribute_Expected_status_code_20016 API_ACNT_When_new_account_have_long_addressline2_attribute_Expected_status_code_20016 API_ACNT_When_new_account_have_long_addressline2_attribute_Expected_status_code_200",
            "comment" : ""
          }, {
            "name" : "town",
            "value" : "townValidation",
            "comment" : ""
          }, {
            "name" : "state",
            "value" : "stateValidation",
            "comment" : ""
          }, {
            "name" : "zip",
            "value" : "zipValidation",
            "comment" : ""
          }, {
            "name" : "country",
            "value" : "countryValidation",
            "comment" : ""
          }, {
            "name" : "roles",
            "value" : "Client",
            "comment" : ""
          } ],
          "comment" : ""
        },
        "headersSize" : 544,
        "bodySize" : 657,
        "comment" : ""
      },
      "response" : {
        "status" : 200,
        "statusText" : "OK",
        "httpVersion" : "HTTP/1.1",
        "cookies" : [ {
          "name" : ".ASPROLES",
          "value" : "tuZX6w70l5ecZDpsf7HfH98qzmOrrIVctRyG8Wm-3zDFvUEdC_zPlblKFb9FzWy4Rq9we3lSmdzmsmB5E2-ty51Of_navt5MhEcc0JGn1Cv_pwuEAdKl7v1SmdWWWyIIGIoEF_PlXyQ9ePWqXn5CcmFFTiigYYRHYpVoCyp1J-ECkekcjKocJWG2_QHuYYABqBR8ay5oW1q1SRWnEy-ucIfJublA1ggX6OEE8_uD0cde1C8TMVkg3C9d8EcVamqEPwquvZlj1l74xia7O-O5ehVhkcG7Kii8fg6HLsirIH7XZJ5b_uP4Ayrt3lLCJpnz2RGvuUXXafl4n8dGapOHBFfMzPheGHcFOeG8HpqTNaNI-IEk_CMYlTZdIrQooSq42kD52nsJWaz9KQzX4i8GXYQaf19XHYjlLh51VSylAk0ADpU1Ke4Bv-Ycca7WV1sYMG0GCjoorzIKyri46Sqm2pMvI-9oII8VIIAzy5wOUdpszx3g0",
          "path" : "/",
          "httpOnly" : true,
          "secure" : false,
          "comment" : ""
        } ],
        "headers" : [ {
          "name" : "Cache-Control",
          "value" : "private"
        }, {
          "name" : "Content-Type",
          "value" : "application/json; charset=utf-8"
        }, {
          "name" : "Server",
          "value" : "Microsoft-IIS/10.0"
        }, {
          "name" : "Set-Cookie",
          "value" : ".ASPROLES=tuZX6w70l5ecZDpsf7HfH98qzmOrrIVctRyG8Wm-3zDFvUEdC_zPlblKFb9FzWy4Rq9we3lSmdzmsmB5E2-ty51Of_navt5MhEcc0JGn1Cv_pwuEAdKl7v1SmdWWWyIIGIoEF_PlXyQ9ePWqXn5CcmFFTiigYYRHYpVoCyp1J-ECkekcjKocJWG2_QHuYYABqBR8ay5oW1q1SRWnEy-ucIfJublA1ggX6OEE8_uD0cde1C8TMVkg3C9d8EcVamqEPwquvZlj1l74xia7O-O5ehVhkcG7Kii8fg6HLsirIH7XZJ5b_uP4Ayrt3lLCJpnz2RGvuUXXafl4n8dGapOHBFfMzPheGHcFOeG8HpqTNaNI-IEk_CMYlTZdIrQooSq42kD52nsJWaz9KQzX4i8GXYQaf19XHYjlLh51VSylAk0ADpU1Ke4Bv-Ycca7WV1sYMG0GCjoorzIKyri46Sqm2pMvI-9oII8VIIAzy5wOUdpszx3g0; path=/; HttpOnly"
        }, {
          "name" : "X-SourceFiles",
          "value" : "=?UTF-8?B?RDpcVmlydHVhbE9wdGltaXplci1SZWZhY3RvcmluZ1xDcm9wTWV0cmljcy5Wby5BcGlcQ3JvcE1ldHJpY3MuVm8uQXBpXGFwaVxhZG1pblx2MVx1c2Vyc1w=?="
        }, {
          "name" : "X-Powered-By",
          "value" : "ASP.NET"
        }, {
          "name" : "Date",
          "value" : "Fri, 29 Mar 2019 21:45:24 GMT"
        }, {
          "name" : "Content-Length",
          "value" : "9"
        } ],
        "content" : {
          "size" : 9,
          "mimeType" : "application/json; charset=utf-8",
          "text" : "{\"id\":23}",
          "comment" : ""
        },
        "redirectURL" : "",
        "headersSize" : 887,
        "bodySize" : 9,
        "comment" : ""
      },
      "cache" : { },
      "timings" : {
        "comment" : "",
        "send" : 0,
        "wait" : 2155,
        "receive" : 0,
        "blocked" : -1,
        "dns" : -1,
        "connect" : -1,
        "ssl" : -1
      },
      "serverIPAddress" : "127.0.0.1",
      "comment" : "",
      "_katalonRequestInformation" : {
        "name" : "67",
        "testObjectId" : "Object Repository/VoPro/Account/api_admin_v1_users",
        "harId" : "357fdc5f-eff6-46b0-af27-174a8418d977"
      },
      "time" : 2156
    } ],
    "comment" : ""
  }
}