{
  "log" : {
    "version" : "1.2",
    "creator" : {
      "name" : "BrowserMob Proxy",
      "version" : "2.1.5",
      "comment" : ""
    },
    "pages" : [ {
      "id" : "Page 0",
      "startedDateTime" : "2019-03-29T16:39:50.471Z",
      "title" : "Page 0",
      "pageTimings" : {
        "onLoad" : 3144,
        "comment" : ""
      },
      "comment" : ""
    } ],
    "entries" : [ {
      "pageref" : "Page 0",
      "startedDateTime" : "2019-03-29T16:39:50.471Z",
      "request" : {
        "method" : "POST",
        "url" : "http://localhost:10520/WebAPI/api/admin/v1/users/?",
        "httpVersion" : "HTTP/1.1",
        "cookies" : [ ],
        "headers" : [ {
          "name" : "User-Agent",
          "value" : "Katalon Studio"
        }, {
          "name" : "Content-Type",
          "value" : "application/x-www-form-urlencoded"
        }, {
          "name" : "Authorization",
          "value" : "Bearer eyJ0eXAiOiJKV1QiLCJhbGciOiJIUzI1NiJ9.eyJ1bmlxdWVfbmFtZSI6ImFkbWluIiwicm9sZSI6InVzZXIiLCJzdWIiOiJhZG1pbiIsImlzcyI6IkNyb3BNZXRyaWNzIiwiYXVkIjoiYWxsIiwiZXhwIjoxNTUzODgxNDkwLCJuYmYiOjE1NTM4Nzc1OTB9.d55b5nY3-Y_DvVVI4AH3uYCriZeADVHamT_Vn6oz1nI"
        }, {
          "name" : "Host",
          "value" : "localhost:10520"
        }, {
          "name" : "Accept",
          "value" : "text/html, image/gif, image/jpeg, *; q=.2, */*; q=.2"
        }, {
          "name" : "Proxy-Connection",
          "value" : "keep-alive"
        }, {
          "name" : "Content-Length",
          "value" : "315"
        } ],
        "queryString" : [ ],
        "postData" : {
          "mimeType" : "application/x-www-form-urlencoded",
          "params" : [ {
            "name" : "password",
            "value" : "cropmetrics",
            "comment" : ""
          }, {
            "name" : "email",
            "value" : "cropmetricsvo.pass6chars@gmail.com",
            "comment" : ""
          }, {
            "name" : "fullname",
            "value" : "test validation",
            "comment" : ""
          }, {
            "name" : "phone",
            "value" : "123",
            "comment" : ""
          }, {
            "name" : "dealer",
            "value" : "dealer test validation",
            "comment" : ""
          }, {
            "name" : "addressLine1",
            "value" : "address line 1 test validation",
            "comment" : ""
          }, {
            "name" : "addressLine2",
            "value" : "address line 1 test validation",
            "comment" : ""
          }, {
            "name" : "town",
            "value" : "townValidation",
            "comment" : ""
          }, {
            "name" : "state",
            "value" : "stateValidation",
            "comment" : ""
          }, {
            "name" : "zip",
            "value" : "zipValidation",
            "comment" : ""
          }, {
            "name" : "country",
            "value" : "countryValidation",
            "comment" : ""
          }, {
            "name" : "roles",
            "value" : "Client",
            "comment" : ""
          } ],
          "comment" : ""
        },
        "headersSize" : 544,
        "bodySize" : 315,
        "comment" : ""
      },
      "response" : {
        "status" : 400,
        "statusText" : "Bad Request",
        "httpVersion" : "HTTP/1.1",
        "cookies" : [ {
          "name" : ".ASPROLES",
          "value" : "26rH8ZquiGPQ32HfOwxbMaN3Sqpk5cizDZSCfAqQqMBawR5g7zzd5Aycs8eN3OxJGuAFFp7asRkGVeYyyvx9WhLz8N13qDBTlE4z9HUfAv8FWp8Kzlx4JmQEBActhGIBdZPW_IhaP9LdxL2GJFQc5t91Vwc0Inq46wLFJBJ2CoXTKrHZh06OeL0wNsbCF5dfn7bF8IfGFIXxNQR4QkZd8Dr91pu2u7Ie1oUjMVwEYnP1ZBmIX_8ZEI8wZWYtFaUMNSKQUdssVCH_FvnsFa_dKCRHCqQH3uCWpe9aA58UUOsfKdziABMHPxu7qQkR0XL0gO2rSotnB2kbmb6Yq1Al-DCRTcldiSomOnkv18oRYNoxuH3ur8qXhtkrruR74bUYQ1UzsKaoAtvQSTZzdpLKH4eIFoDq-sxL_-z2CqREGDfyC8NrwCxVy0fSYt6NmgAA1-8s-xXH7gqwmeiprEzyznk_5J9NRz-hV1sR97EOaeEbrbkr0",
          "path" : "/",
          "httpOnly" : true,
          "secure" : false,
          "comment" : ""
        } ],
        "headers" : [ {
          "name" : "Cache-Control",
          "value" : "private"
        }, {
          "name" : "Content-Type",
          "value" : "application/json; charset=utf-8"
        }, {
          "name" : "Server",
          "value" : "Microsoft-IIS/10.0"
        }, {
          "name" : "Set-Cookie",
          "value" : ".ASPROLES=26rH8ZquiGPQ32HfOwxbMaN3Sqpk5cizDZSCfAqQqMBawR5g7zzd5Aycs8eN3OxJGuAFFp7asRkGVeYyyvx9WhLz8N13qDBTlE4z9HUfAv8FWp8Kzlx4JmQEBActhGIBdZPW_IhaP9LdxL2GJFQc5t91Vwc0Inq46wLFJBJ2CoXTKrHZh06OeL0wNsbCF5dfn7bF8IfGFIXxNQR4QkZd8Dr91pu2u7Ie1oUjMVwEYnP1ZBmIX_8ZEI8wZWYtFaUMNSKQUdssVCH_FvnsFa_dKCRHCqQH3uCWpe9aA58UUOsfKdziABMHPxu7qQkR0XL0gO2rSotnB2kbmb6Yq1Al-DCRTcldiSomOnkv18oRYNoxuH3ur8qXhtkrruR74bUYQ1UzsKaoAtvQSTZzdpLKH4eIFoDq-sxL_-z2CqREGDfyC8NrwCxVy0fSYt6NmgAA1-8s-xXH7gqwmeiprEzyznk_5J9NRz-hV1sR97EOaeEbrbkr0; path=/; HttpOnly"
        }, {
          "name" : "X-SourceFiles",
          "value" : "=?UTF-8?B?RDpcVmlydHVhbE9wdGltaXplci1SZWZhY3RvcmluZ1xDcm9wTWV0cmljcy5Wby5BcGlcQ3JvcE1ldHJpY3MuVm8uQXBpXGFwaVxhZG1pblx2MVx1c2Vyc1w=?="
        }, {
          "name" : "X-Powered-By",
          "value" : "ASP.NET"
        }, {
          "name" : "Date",
          "value" : "Fri, 29 Mar 2019 16:39:53 GMT"
        }, {
          "name" : "Content-Length",
          "value" : "71"
        } ],
        "content" : {
          "size" : 71,
          "mimeType" : "application/json; charset=utf-8",
          "text" : "{\"message\":\"Name cropmetricsvo.pass6chars@gmail.com is already taken.\"}",
          "comment" : ""
        },
        "redirectURL" : "",
        "headersSize" : 897,
        "bodySize" : 71,
        "comment" : ""
      },
      "cache" : { },
      "timings" : {
        "comment" : "",
        "ssl" : -1,
        "wait" : 3131,
        "connect" : -1,
        "send" : 0,
        "blocked" : -1,
        "receive" : 0,
        "dns" : -1
      },
      "serverIPAddress" : "127.0.0.1",
      "comment" : "",
      "_katalonRequestInformation" : {
        "name" : "47",
        "testObjectId" : "Object Repository/VoPro/Account/api_admin_v1_users",
        "harId" : "6b008dd0-8d75-4a66-b113-b442631d9622"
      },
      "time" : 3132
    } ],
    "comment" : ""
  }
}