{
  "log" : {
    "version" : "1.2",
    "creator" : {
      "name" : "BrowserMob Proxy",
      "version" : "2.1.5",
      "comment" : ""
    },
    "pages" : [ {
      "id" : "Page 0",
      "startedDateTime" : "2019-03-28T21:19:40.936Z",
      "title" : "Page 0",
      "pageTimings" : {
        "onLoad" : 1241,
        "comment" : ""
      },
      "comment" : ""
    } ],
    "entries" : [ {
      "pageref" : "Page 0",
      "startedDateTime" : "2019-03-28T21:19:40.937Z",
      "request" : {
        "method" : "POST",
        "url" : "http://localhost:10520/WebAPI/api/admin/v1/users/?",
        "httpVersion" : "HTTP/1.1",
        "cookies" : [ ],
        "headers" : [ {
          "name" : "User-Agent",
          "value" : "Katalon Studio"
        }, {
          "name" : "Content-Type",
          "value" : "application/x-www-form-urlencoded"
        }, {
          "name" : "Authorization",
          "value" : "Bearer eyJ0eXAiOiJKV1QiLCJhbGciOiJIUzI1NiJ9.eyJ1bmlxdWVfbmFtZSI6ImFkbWluIiwicm9sZSI6InVzZXIiLCJzdWIiOiJhZG1pbiIsImlzcyI6IkNyb3BNZXRyaWNzIiwiYXVkIjoiYWxsIiwiZXhwIjoxNTUzODExODgwLCJuYmYiOjE1NTM4MDc5ODB9.47NRsFJrhEqyeNjBS2fk1sBr_bN6DG3MNkCqcjvtwtU"
        }, {
          "name" : "Host",
          "value" : "localhost:10520"
        }, {
          "name" : "Accept",
          "value" : "text/html, image/gif, image/jpeg, *; q=.2, */*; q=.2"
        }, {
          "name" : "Proxy-Connection",
          "value" : "keep-alive"
        }, {
          "name" : "Content-Length",
          "value" : "300"
        } ],
        "queryString" : [ ],
        "postData" : {
          "mimeType" : "application/x-www-form-urlencoded",
          "params" : [ {
            "name" : "password",
            "value" : "cropmetrics",
            "comment" : ""
          }, {
            "name" : "email",
            "value" : "cropmetricsvo.phonesymbols@gmail.com",
            "comment" : ""
          }, {
            "name" : "fullname",
            "value" : "x",
            "comment" : ""
          }, {
            "name" : "phone",
            "value" : "!@#$%^&",
            "comment" : ""
          }, {
            "name" : "dealer",
            "value" : "x",
            "comment" : ""
          }, {
            "name" : "addressLine1",
            "value" : "address line 1 test validation",
            "comment" : ""
          }, {
            "name" : "addressLine2",
            "value" : "address line 2 test validation",
            "comment" : ""
          }, {
            "name" : "town",
            "value" : "townValidation",
            "comment" : ""
          }, {
            "name" : "state",
            "value" : "stateValidation",
            "comment" : ""
          }, {
            "name" : "zip",
            "value" : "zipValidation",
            "comment" : ""
          }, {
            "name" : "country",
            "value" : "countryValidation",
            "comment" : ""
          }, {
            "name" : "roles",
            "value" : "Client",
            "comment" : ""
          } ],
          "comment" : ""
        },
        "headersSize" : 544,
        "bodySize" : 300,
        "comment" : ""
      },
      "response" : {
        "status" : 200,
        "statusText" : "OK",
        "httpVersion" : "HTTP/1.1",
        "cookies" : [ {
          "name" : ".ASPROLES",
          "value" : "jUttwxpB5vu-W8gbFsJWHLVIg5AcelmGOIUGy3L25o2zXL_TWeRENK91iruobkJvqo6ZtANX2fDTONWcKJBWwLaOKcHRoS3BlLeQkriCG8Ia47h7g_ywLn6Zz-V7gOQNPIaqMvusnXtItzQOhdnyV59fsLVJ3LcD6pR4vNKi0N4HmN-GoBOVlPWqog3xXaF5DeF2RyR5ImxyNxPGjoA7YQ1hgc2uwkgtniNnVv-QDJ2HSfjEiHI-hZAukgZLxUr3Au7nCGb2nRYcPSkeELad1kcCJcA-bOpT2WjOI_b9WNmPV5j1uIb3Dd783ThPbvksUnb2jCh_zIVviOLnLQKuuZ8TcW9UufPH9M_9K5jZOA9MPDLXE597PFsIKRE_A1i2XRvvIB-9X1f9JJlWAjHqYFTH2V24v3FeQarAbelNhJc29NbN7DEZfJblqug4RRSXP5UsUuI5dJ-SYOuvi3z2zivbr3VMQOKN0gPfD2DRga69EqJj0",
          "path" : "/",
          "httpOnly" : true,
          "secure" : false,
          "comment" : ""
        } ],
        "headers" : [ {
          "name" : "Cache-Control",
          "value" : "private"
        }, {
          "name" : "Content-Type",
          "value" : "application/json; charset=utf-8"
        }, {
          "name" : "Server",
          "value" : "Microsoft-IIS/10.0"
        }, {
          "name" : "Set-Cookie",
          "value" : ".ASPROLES=jUttwxpB5vu-W8gbFsJWHLVIg5AcelmGOIUGy3L25o2zXL_TWeRENK91iruobkJvqo6ZtANX2fDTONWcKJBWwLaOKcHRoS3BlLeQkriCG8Ia47h7g_ywLn6Zz-V7gOQNPIaqMvusnXtItzQOhdnyV59fsLVJ3LcD6pR4vNKi0N4HmN-GoBOVlPWqog3xXaF5DeF2RyR5ImxyNxPGjoA7YQ1hgc2uwkgtniNnVv-QDJ2HSfjEiHI-hZAukgZLxUr3Au7nCGb2nRYcPSkeELad1kcCJcA-bOpT2WjOI_b9WNmPV5j1uIb3Dd783ThPbvksUnb2jCh_zIVviOLnLQKuuZ8TcW9UufPH9M_9K5jZOA9MPDLXE597PFsIKRE_A1i2XRvvIB-9X1f9JJlWAjHqYFTH2V24v3FeQarAbelNhJc29NbN7DEZfJblqug4RRSXP5UsUuI5dJ-SYOuvi3z2zivbr3VMQOKN0gPfD2DRga69EqJj0; path=/; HttpOnly"
        }, {
          "name" : "X-SourceFiles",
          "value" : "=?UTF-8?B?RDpcVmlydHVhbE9wdGltaXplci1SZWZhY3RvcmluZ1xDcm9wTWV0cmljcy5Wby5BcGlcQ3JvcE1ldHJpY3MuVm8uQXBpXGFwaVxhZG1pblx2MVx1c2Vyc1w=?="
        }, {
          "name" : "X-Powered-By",
          "value" : "ASP.NET"
        }, {
          "name" : "Date",
          "value" : "Thu, 28 Mar 2019 21:19:42 GMT"
        }, {
          "name" : "Content-Length",
          "value" : "9"
        } ],
        "content" : {
          "size" : 9,
          "mimeType" : "application/json; charset=utf-8",
          "text" : "{\"id\":19}",
          "comment" : ""
        },
        "redirectURL" : "",
        "headersSize" : 887,
        "bodySize" : 9,
        "comment" : ""
      },
      "cache" : { },
      "timings" : {
        "comment" : "",
        "connect" : -1,
        "send" : 0,
        "receive" : 1,
        "dns" : -1,
        "blocked" : -1,
        "wait" : 1237,
        "ssl" : -1
      },
      "serverIPAddress" : "127.0.0.1",
      "comment" : "",
      "_katalonRequestInformation" : {
        "name" : "57",
        "testObjectId" : "Object Repository/VoPro/Account/api_admin_v1_users",
        "harId" : "1c893817-a7a9-4ce5-99c5-f1d9af0e3f34"
      },
      "time" : 1239
    } ],
    "comment" : ""
  }
}