{
  "log" : {
    "version" : "1.2",
    "creator" : {
      "name" : "BrowserMob Proxy",
      "version" : "2.1.5",
      "comment" : ""
    },
    "pages" : [ {
      "id" : "Page 0",
      "startedDateTime" : "2019-04-01T13:34:41.563Z",
      "title" : "Page 0",
      "pageTimings" : {
        "onLoad" : 1870,
        "comment" : ""
      },
      "comment" : ""
    } ],
    "entries" : [ {
      "pageref" : "Page 0",
      "startedDateTime" : "2019-04-01T13:34:41.564Z",
      "request" : {
        "method" : "POST",
        "url" : "http://localhost:10520/WebAPI/api/admin/v1/users/?",
        "httpVersion" : "HTTP/1.1",
        "cookies" : [ ],
        "headers" : [ {
          "name" : "User-Agent",
          "value" : "Katalon Studio"
        }, {
          "name" : "Content-Type",
          "value" : "application/x-www-form-urlencoded"
        }, {
          "name" : "Authorization",
          "value" : "Bearer eyJ0eXAiOiJKV1QiLCJhbGciOiJIUzI1NiJ9.eyJ1bmlxdWVfbmFtZSI6ImFkbWluIiwicm9sZSI6InVzZXIiLCJzdWIiOiJhZG1pbiIsImlzcyI6IkNyb3BNZXRyaWNzIiwiYXVkIjoiYWxsIiwiZXhwIjoxNTU0MTI5NTgxLCJuYmYiOjE1NTQxMjU2ODF9.LGjnuWDxGhTw6RKceTIc7xkhcml0dDB6Db5fveg6cGY"
        }, {
          "name" : "Host",
          "value" : "localhost:10520"
        }, {
          "name" : "Accept",
          "value" : "text/html, image/gif, image/jpeg, *; q=.2, */*; q=.2"
        }, {
          "name" : "Proxy-Connection",
          "value" : "keep-alive"
        }, {
          "name" : "Content-Length",
          "value" : "287"
        } ],
        "queryString" : [ ],
        "postData" : {
          "mimeType" : "application/x-www-form-urlencoded",
          "params" : [ {
            "name" : "password",
            "value" : "cropmetrics",
            "comment" : ""
          }, {
            "name" : "email",
            "value" : "cropmetricsvo.no.country@gmail.com",
            "comment" : ""
          }, {
            "name" : "fullname",
            "value" : "test validation",
            "comment" : ""
          }, {
            "name" : "phone",
            "value" : "123",
            "comment" : ""
          }, {
            "name" : "dealer",
            "value" : "dealet test",
            "comment" : ""
          }, {
            "name" : "addressLine1",
            "value" : "address line 1 test validation",
            "comment" : ""
          }, {
            "name" : "addressLine2",
            "value" : "address line 2 test validation",
            "comment" : ""
          }, {
            "name" : "town",
            "value" : "townValidation",
            "comment" : ""
          }, {
            "name" : "state",
            "value" : "stateValidation",
            "comment" : ""
          }, {
            "name" : "zip",
            "value" : "zipValidation",
            "comment" : ""
          }, {
            "name" : "country",
            "value" : "",
            "comment" : ""
          }, {
            "name" : "roles",
            "value" : "Client",
            "comment" : ""
          } ],
          "comment" : ""
        },
        "headersSize" : 544,
        "bodySize" : 287,
        "comment" : ""
      },
      "response" : {
        "status" : 200,
        "statusText" : "OK",
        "httpVersion" : "HTTP/1.1",
        "cookies" : [ {
          "name" : ".ASPROLES",
          "value" : "Y2WQDqPQRaG2YHy57Gj0rLu56ZqbKfT1atlQa0EvDro94pqGqoUCreNoOgCrlayP3X68k54rnVxKj1QrhRc7vuNgbzONaYjdWQ8miXHjE-ZShijzfvJcDI_0He6mvnWDzPuEgOKFzRZrYSMna-ZUA6BKY6Y1y-TorelrIUKALS958FTOTBKohImM5N3G2h1avKUJyMAwdHmtJPcn_EbinUWxXEe991R56TXaADItY54cRM6F-rrC1snlOf3LAYNuxueI67buK2delHJGD04AHv8WTqZbk8jwnGAMKj-ZE_rH7Ask150pgRE6Q01KcCR2rbI2CE2m9nfejU6Z1FBSY2cLgNGf1HfjKa4DRk7yOZot0KZvodKNoA7kjLWWGQMXH6pNshl8Z7Wi0ZgjRE2HcJyHHffmBfwPQhcO_BgO-BupI_vAKS1QpSdcF3nxTLT_KWp8z91kI_f5UwWkZPjOfZiTUxNBIWLafAm4SYSq_1KY-CMA0",
          "path" : "/",
          "httpOnly" : true,
          "secure" : false,
          "comment" : ""
        } ],
        "headers" : [ {
          "name" : "Cache-Control",
          "value" : "private"
        }, {
          "name" : "Content-Type",
          "value" : "application/json; charset=utf-8"
        }, {
          "name" : "Server",
          "value" : "Microsoft-IIS/10.0"
        }, {
          "name" : "Set-Cookie",
          "value" : ".ASPROLES=Y2WQDqPQRaG2YHy57Gj0rLu56ZqbKfT1atlQa0EvDro94pqGqoUCreNoOgCrlayP3X68k54rnVxKj1QrhRc7vuNgbzONaYjdWQ8miXHjE-ZShijzfvJcDI_0He6mvnWDzPuEgOKFzRZrYSMna-ZUA6BKY6Y1y-TorelrIUKALS958FTOTBKohImM5N3G2h1avKUJyMAwdHmtJPcn_EbinUWxXEe991R56TXaADItY54cRM6F-rrC1snlOf3LAYNuxueI67buK2delHJGD04AHv8WTqZbk8jwnGAMKj-ZE_rH7Ask150pgRE6Q01KcCR2rbI2CE2m9nfejU6Z1FBSY2cLgNGf1HfjKa4DRk7yOZot0KZvodKNoA7kjLWWGQMXH6pNshl8Z7Wi0ZgjRE2HcJyHHffmBfwPQhcO_BgO-BupI_vAKS1QpSdcF3nxTLT_KWp8z91kI_f5UwWkZPjOfZiTUxNBIWLafAm4SYSq_1KY-CMA0; path=/; HttpOnly"
        }, {
          "name" : "X-SourceFiles",
          "value" : "=?UTF-8?B?RDpcVmlydHVhbE9wdGltaXplci1SZWZhY3RvcmluZ1xDcm9wTWV0cmljcy5Wby5BcGlcQ3JvcE1ldHJpY3MuVm8uQXBpXGFwaVxhZG1pblx2MVx1c2Vyc1w=?="
        }, {
          "name" : "X-Powered-By",
          "value" : "ASP.NET"
        }, {
          "name" : "Date",
          "value" : "Mon, 01 Apr 2019 13:34:43 GMT"
        }, {
          "name" : "Content-Length",
          "value" : "9"
        } ],
        "content" : {
          "size" : 9,
          "mimeType" : "application/json; charset=utf-8",
          "text" : "{\"id\":12}",
          "comment" : ""
        },
        "redirectURL" : "",
        "headersSize" : 887,
        "bodySize" : 9,
        "comment" : ""
      },
      "cache" : { },
      "timings" : {
        "comment" : "",
        "ssl" : -1,
        "wait" : 1865,
        "receive" : 0,
        "send" : 0,
        "dns" : -1,
        "blocked" : -1,
        "connect" : -1
      },
      "serverIPAddress" : "127.0.0.1",
      "comment" : "",
      "_katalonRequestInformation" : {
        "name" : "29",
        "testObjectId" : "Object Repository/VoPro/Account/api_admin_v1_users",
        "harId" : "b7bea1e9-9f1f-4610-82d7-ff0ab8c97d42"
      },
      "time" : 1867
    } ],
    "comment" : ""
  }
}