{
  "log" : {
    "version" : "1.2",
    "creator" : {
      "name" : "BrowserMob Proxy",
      "version" : "2.1.5",
      "comment" : ""
    },
    "pages" : [ {
      "id" : "Page 0",
      "startedDateTime" : "2019-04-09T21:27:10.700Z",
      "title" : "Page 0",
      "pageTimings" : {
        "onLoad" : 4664,
        "comment" : ""
      },
      "comment" : ""
    } ],
    "entries" : [ {
      "pageref" : "Page 0",
      "startedDateTime" : "2019-04-09T21:27:10.700Z",
      "request" : {
        "method" : "PUT",
        "url" : "http://localhost:10520/WebAPI/api/mobile/v1/fields/3?",
        "httpVersion" : "HTTP/1.1",
        "cookies" : [ ],
        "headers" : [ {
          "name" : "User-Agent",
          "value" : "Katalon Studio"
        }, {
          "name" : "Content-Type",
          "value" : "application/json"
        }, {
          "name" : "Authorization",
          "value" : "Bearer eyJ0eXAiOiJKV1QiLCJhbGciOiJIUzI1NiJ9.eyJ1bmlxdWVfbmFtZSI6Implbm55Lm1hbGRvbmFkby50eDFAZ21haWwuY29tIiwicm9sZSI6InVzZXIiLCJzdWIiOiJqZW5ueS5tYWxkb25hZG8udHgxQGdtYWlsLmNvbSIsImlzcyI6IkNyb3BNZXRyaWNzIiwiYXVkIjoiYWxsIiwiZXhwIjoxNTU0ODQ5MTMwLCJuYmYiOjE1NTQ4NDUyMzB9.uD1cnLW7-fxsXCc1pfe8lgX--W39lWebcvpOYlBOfec"
        }, {
          "name" : "Host",
          "value" : "localhost:10520"
        }, {
          "name" : "Accept",
          "value" : "text/html, image/gif, image/jpeg, *; q=.2, */*; q=.2"
        }, {
          "name" : "Proxy-Connection",
          "value" : "keep-alive"
        }, {
          "name" : "Content-Length",
          "value" : "98"
        } ],
        "queryString" : [ ],
        "postData" : {
          "mimeType" : "application/json",
          "text" : "{\"field\":{\"name\":\"Field whit sno coords in boundary\",\"boundary\":{\"boundaries\":[{\"boundary\":{}}]}}}",
          "comment" : ""
        },
        "headersSize" : 592,
        "bodySize" : 98,
        "comment" : ""
      },
      "response" : {
        "status" : 400,
        "statusText" : "Bad Request",
        "httpVersion" : "HTTP/1.1",
        "cookies" : [ {
          "name" : ".ASPROLES",
          "value" : "dNp-dvtMQJmZjXL0hbjDniUX0nTW27lU7Et7dpx2iP2wipZaHFy0RTLKm_9azLfj4IgdgfTMIsR_jfe5-m_ED6Q_bf5-sTVt8RwIATTEhbpm8Str9eoQN_bgiEh0Hg3L5W3PfjNcNjxZqA_T90jeF3RKXkudwm5ZtO8f0QOL8jSDIbkonfeCaRA0WM7R4THF9REqSLu0ML5-vK-9Kox6vW3xaa8GXZWvMU5BoqeTnhOdVX_5LlD2pPXzL3ktYxvsdMTBu1NzJC7f8W6BzjpKt4QzaowzV32RTKhEYbTAVKA8Krt5rwyR24BLaH0Xh6LWqGBRuEueFKp_ODdcPteL1EAhunZ3i8Skm37-FdSXu5ntXU4PlEsZV8UUAtAgPGmKQAD6c_jouPJsHvsxMwiaNzhML6xLe4DzLvZ2WdPL7wRUxx5y4ziXzsiKQXSpNcA4Pv8U5QgE0FUXF6H7Tj88VEs0C4eo3wCnVc9NEAcaW-dYSCxlgQkuQkPlAZXzcVyO3eU1sLb4ugnZOBcpw0qHe7h28Dc1",
          "path" : "/",
          "httpOnly" : true,
          "secure" : false,
          "comment" : ""
        } ],
        "headers" : [ {
          "name" : "Cache-Control",
          "value" : "private"
        }, {
          "name" : "Content-Type",
          "value" : "application/json; charset=utf-8"
        }, {
          "name" : "Server",
          "value" : "Microsoft-IIS/10.0"
        }, {
          "name" : "Set-Cookie",
          "value" : ".ASPROLES=dNp-dvtMQJmZjXL0hbjDniUX0nTW27lU7Et7dpx2iP2wipZaHFy0RTLKm_9azLfj4IgdgfTMIsR_jfe5-m_ED6Q_bf5-sTVt8RwIATTEhbpm8Str9eoQN_bgiEh0Hg3L5W3PfjNcNjxZqA_T90jeF3RKXkudwm5ZtO8f0QOL8jSDIbkonfeCaRA0WM7R4THF9REqSLu0ML5-vK-9Kox6vW3xaa8GXZWvMU5BoqeTnhOdVX_5LlD2pPXzL3ktYxvsdMTBu1NzJC7f8W6BzjpKt4QzaowzV32RTKhEYbTAVKA8Krt5rwyR24BLaH0Xh6LWqGBRuEueFKp_ODdcPteL1EAhunZ3i8Skm37-FdSXu5ntXU4PlEsZV8UUAtAgPGmKQAD6c_jouPJsHvsxMwiaNzhML6xLe4DzLvZ2WdPL7wRUxx5y4ziXzsiKQXSpNcA4Pv8U5QgE0FUXF6H7Tj88VEs0C4eo3wCnVc9NEAcaW-dYSCxlgQkuQkPlAZXzcVyO3eU1sLb4ugnZOBcpw0qHe7h28Dc1; path=/; HttpOnly"
        }, {
          "name" : "X-SourceFiles",
          "value" : "=?UTF-8?B?RDpcVmlydHVhbE9wdGltaXplci1SZWZhY3RvcmluZ1xDcm9wTWV0cmljcy5Wby5BcGlcQ3JvcE1ldHJpY3MuVm8uQXBpXGFwaVxtb2JpbGVcdjFcZmllbGRzXDM=?="
        }, {
          "name" : "X-Powered-By",
          "value" : "ASP.NET"
        }, {
          "name" : "Date",
          "value" : "Tue, 09 Apr 2019 21:27:15 GMT"
        }, {
          "name" : "Content-Length",
          "value" : "59"
        } ],
        "content" : {
          "size" : 59,
          "mimeType" : "application/json; charset=utf-8",
          "text" : "{\"message\":\"The Boundary is not a valid geojson geometry.\"}",
          "comment" : ""
        },
        "redirectURL" : "",
        "headersSize" : 944,
        "bodySize" : 59,
        "comment" : ""
      },
      "cache" : { },
      "timings" : {
        "comment" : "",
        "send" : 0,
        "connect" : -1,
        "blocked" : -1,
        "dns" : -1,
        "receive" : 0,
        "wait" : 4663,
        "ssl" : -1
      },
      "serverIPAddress" : "127.0.0.1",
      "comment" : "",
      "_katalonRequestInformation" : {
        "name" : "83",
        "testObjectId" : "Object Repository/VoGrow/Field/FieldPut",
        "harId" : "56ca0dcd-78bd-4152-bf61-dccc769500ae"
      },
      "time" : 4664
    } ],
    "comment" : ""
  }
}