{
  "log" : {
    "version" : "1.2",
    "creator" : {
      "name" : "BrowserMob Proxy",
      "version" : "2.1.5",
      "comment" : ""
    },
    "pages" : [ {
      "id" : "Page 0",
      "startedDateTime" : "2019-04-01T13:34:30.153Z",
      "title" : "Page 0",
      "pageTimings" : {
        "onLoad" : 1823,
        "comment" : ""
      },
      "comment" : ""
    } ],
    "entries" : [ {
      "pageref" : "Page 0",
      "startedDateTime" : "2019-04-01T13:34:30.155Z",
      "request" : {
        "method" : "POST",
        "url" : "http://localhost:10520/WebAPI/api/admin/v1/users/?",
        "httpVersion" : "HTTP/1.1",
        "cookies" : [ ],
        "headers" : [ {
          "name" : "User-Agent",
          "value" : "Katalon Studio"
        }, {
          "name" : "Content-Type",
          "value" : "application/x-www-form-urlencoded"
        }, {
          "name" : "Authorization",
          "value" : "Bearer eyJ0eXAiOiJKV1QiLCJhbGciOiJIUzI1NiJ9.eyJ1bmlxdWVfbmFtZSI6ImFkbWluIiwicm9sZSI6InVzZXIiLCJzdWIiOiJhZG1pbiIsImlzcyI6IkNyb3BNZXRyaWNzIiwiYXVkIjoiYWxsIiwiZXhwIjoxNTU0MTI5NTcwLCJuYmYiOjE1NTQxMjU2NzB9.0aFQG_xCILsthM8NY_HaoYIvNuL1_dIGxJ-xPIyplbM"
        }, {
          "name" : "Host",
          "value" : "localhost:10520"
        }, {
          "name" : "Accept",
          "value" : "text/html, image/gif, image/jpeg, *; q=.2, */*; q=.2"
        }, {
          "name" : "Proxy-Connection",
          "value" : "keep-alive"
        }, {
          "name" : "Content-Length",
          "value" : "279"
        } ],
        "queryString" : [ ],
        "postData" : {
          "mimeType" : "application/x-www-form-urlencoded",
          "params" : [ {
            "name" : "password",
            "value" : "cropmetrics",
            "comment" : ""
          }, {
            "name" : "email",
            "value" : "cropmetricsvo.no.addressline1@gmail.com",
            "comment" : ""
          }, {
            "name" : "fullname",
            "value" : "test validation",
            "comment" : ""
          }, {
            "name" : "phone",
            "value" : "123",
            "comment" : ""
          }, {
            "name" : "dealer",
            "value" : "dealet test",
            "comment" : ""
          }, {
            "name" : "addressLine1",
            "value" : "",
            "comment" : ""
          }, {
            "name" : "addressLine2",
            "value" : "address line 2 test validation",
            "comment" : ""
          }, {
            "name" : "town",
            "value" : "townValidation",
            "comment" : ""
          }, {
            "name" : "state",
            "value" : "stateValidation",
            "comment" : ""
          }, {
            "name" : "zip",
            "value" : "zipValidation",
            "comment" : ""
          }, {
            "name" : "country",
            "value" : "countryValidation",
            "comment" : ""
          }, {
            "name" : "roles",
            "value" : "Client",
            "comment" : ""
          } ],
          "comment" : ""
        },
        "headersSize" : 544,
        "bodySize" : 279,
        "comment" : ""
      },
      "response" : {
        "status" : 200,
        "statusText" : "OK",
        "httpVersion" : "HTTP/1.1",
        "cookies" : [ {
          "name" : ".ASPROLES",
          "value" : "CzZoUyuPCo5HL5uVQScURK5UkNVBkglR3j7l45_7vCguFkIuctL1XUcRLy63ZmeBQ6Hp6v1waNU8fYlJAYKPmpPF5k7R3TDLvlOyd-EPZqirkaQhQmuZMLYWrpnPQKG9LQwr5EqamqtnPjjpX-7Gb4nIT0BpanPJggHEWpxsyKQ0fqWNOj6-ojKtT66w1WENouc3cPcln5ZkfdK1NRNxMaoF4Ob3er5PfFw-BX0BQ8bZxpedItjmVxDpgEjhdUKs5G6fZ0DhpLTcxiQaFyHrLp6r-VtjQVvAYanGrPlnXK_MLbgsOeZOVkKgnuM37CkBuALT7-TCb-P0_3PDMrbTDjgCMnnunrZqL8ThlT-EoNcncv0b1QCZkNaVFqMvdjftQ1mssg49AbuD5ob36kZjfAgaIubxeZ8MONOrRD8Q9tysHtUBgVXRigBLhTv1jZZwJ99B_22P18HxXCW9zmpA9uPysUHDJT0KCMCTwOceOojzRv6a0",
          "path" : "/",
          "httpOnly" : true,
          "secure" : false,
          "comment" : ""
        } ],
        "headers" : [ {
          "name" : "Cache-Control",
          "value" : "private"
        }, {
          "name" : "Content-Type",
          "value" : "application/json; charset=utf-8"
        }, {
          "name" : "Server",
          "value" : "Microsoft-IIS/10.0"
        }, {
          "name" : "Set-Cookie",
          "value" : ".ASPROLES=CzZoUyuPCo5HL5uVQScURK5UkNVBkglR3j7l45_7vCguFkIuctL1XUcRLy63ZmeBQ6Hp6v1waNU8fYlJAYKPmpPF5k7R3TDLvlOyd-EPZqirkaQhQmuZMLYWrpnPQKG9LQwr5EqamqtnPjjpX-7Gb4nIT0BpanPJggHEWpxsyKQ0fqWNOj6-ojKtT66w1WENouc3cPcln5ZkfdK1NRNxMaoF4Ob3er5PfFw-BX0BQ8bZxpedItjmVxDpgEjhdUKs5G6fZ0DhpLTcxiQaFyHrLp6r-VtjQVvAYanGrPlnXK_MLbgsOeZOVkKgnuM37CkBuALT7-TCb-P0_3PDMrbTDjgCMnnunrZqL8ThlT-EoNcncv0b1QCZkNaVFqMvdjftQ1mssg49AbuD5ob36kZjfAgaIubxeZ8MONOrRD8Q9tysHtUBgVXRigBLhTv1jZZwJ99B_22P18HxXCW9zmpA9uPysUHDJT0KCMCTwOceOojzRv6a0; path=/; HttpOnly"
        }, {
          "name" : "X-SourceFiles",
          "value" : "=?UTF-8?B?RDpcVmlydHVhbE9wdGltaXplci1SZWZhY3RvcmluZ1xDcm9wTWV0cmljcy5Wby5BcGlcQ3JvcE1ldHJpY3MuVm8uQXBpXGFwaVxhZG1pblx2MVx1c2Vyc1w=?="
        }, {
          "name" : "X-Powered-By",
          "value" : "ASP.NET"
        }, {
          "name" : "Date",
          "value" : "Mon, 01 Apr 2019 13:34:31 GMT"
        }, {
          "name" : "Content-Length",
          "value" : "8"
        } ],
        "content" : {
          "size" : 8,
          "mimeType" : "application/json; charset=utf-8",
          "text" : "{\"id\":7}",
          "comment" : ""
        },
        "redirectURL" : "",
        "headersSize" : 887,
        "bodySize" : 8,
        "comment" : ""
      },
      "cache" : { },
      "timings" : {
        "comment" : "",
        "ssl" : -1,
        "wait" : 1817,
        "receive" : 0,
        "send" : 0,
        "dns" : -1,
        "blocked" : -1,
        "connect" : -1
      },
      "serverIPAddress" : "127.0.0.1",
      "comment" : "",
      "_katalonRequestInformation" : {
        "name" : "19",
        "testObjectId" : "Object Repository/VoPro/Account/api_admin_v1_users",
        "harId" : "f2c8a953-0267-4a7a-a60d-dadbd60815e5"
      },
      "time" : 1818
    } ],
    "comment" : ""
  }
}