{
  "log" : {
    "version" : "1.2",
    "creator" : {
      "name" : "BrowserMob Proxy",
      "version" : "2.1.5",
      "comment" : ""
    },
    "pages" : [ {
      "id" : "Page 0",
      "startedDateTime" : "2019-04-05T19:37:08.621Z",
      "title" : "Page 0",
      "pageTimings" : {
        "onLoad" : 35,
        "comment" : ""
      },
      "comment" : ""
    } ],
    "entries" : [ {
      "pageref" : "Page 0",
      "startedDateTime" : "2019-04-05T19:37:08.622Z",
      "request" : {
        "method" : "POST",
        "url" : "http://localhost:10520/WebAPI/api/mobile/v1/fields?",
        "httpVersion" : "HTTP/1.1",
        "cookies" : [ ],
        "headers" : [ {
          "name" : "User-Agent",
          "value" : "Katalon Studio"
        }, {
          "name" : "Content-Type",
          "value" : "application/json"
        }, {
          "name" : "Authorization",
          "value" : "Bearer eyJ0eXAiOiJKV1QiLCJhbGciOiJIUzI1NiJ9.eyJ1bmlxdWVfbmFtZSI6Implbm55Lm1hbGRvbmFkby50eDFAZ21haWwuY29tIiwicm9sZSI6InVzZXIiLCJzdWIiOiJqZW5ueS5tYWxkb25hZG8udHgxQGdtYWlsLmNvbSIsImlzcyI6IkNyb3BNZXRyaWNzIiwiYXVkIjoiYWxsIiwiZXhwIjoxNTU0NDk2OTI4LCJuYmYiOjE1NTQ0OTMwMjh9.VQKeePS8UnC0bvSFLSjsb0Okuq5wxkao3NcnV8ogFWg"
        }, {
          "name" : "Host",
          "value" : "localhost:10520"
        }, {
          "name" : "Accept",
          "value" : "text/html, image/gif, image/jpeg, *; q=.2, */*; q=.2"
        }, {
          "name" : "Proxy-Connection",
          "value" : "keep-alive"
        }, {
          "name" : "Content-Length",
          "value" : "400"
        } ],
        "queryString" : [ ],
        "postData" : {
          "mimeType" : "application/json",
          "text" : "{\"field\":{\"farm_id\":7,\"name\":\"Field whit invalid spaces values on boundary\",\"boundary\":{\"boundaries\":[{\"boundary\":{\"coords\":[{\"x\":\" \",\"y\":\" \"},{\"x\":-101.50049403,\"y\":37.14647907},{\"x\":-101.50049403,\"y\":37.14264773},{\"x\":-101.49723246,\"y\":37.1411425},{\"x\":-101.49019435,\"y\":37.14223722},{\"x\":-101.48933604,\"y\":37.14620541},{\"x\":-101.49294093,\"y\":37.14866833},{\"x\":-101.49568751,\"y\":37.14976293}]}}]}}}",
          "comment" : ""
        },
        "headersSize" : 592,
        "bodySize" : 400,
        "comment" : ""
      },
      "response" : {
        "status" : 400,
        "statusText" : "Bad Request",
        "httpVersion" : "HTTP/1.1",
        "cookies" : [ {
          "name" : ".ASPROLES",
          "value" : "0ui9T1f5E9rDbBfGpfo7g2SgcMK4c7W2EFUxHgNyQ5pGDBq_tjxJS6bSBPa7pDgQoQmkOQW7NnecH5y-biaJiDTPOlfJQj1psDZjpNwa6urK8Q8sakJrQXjnwL9b5bpVTQGm-1JOLzpCBsLh3UHEptzIMLkxhSlaWu9evl84XBrVZCqFL2-ckD82iVqpC3Pj5nO7nuTk4heCrpQjWXvk9FbzPcztLFFZLydGNLT18vYIF-vKw5_iLEfSw_T-jicK4apNw82o4ZXfoIgzYosxDyPKtmRriEeFCra6mAXFkWLrT4y3292pGZ-EmocSQPAOTbLRZO2C1QcZXt6pgPaL_rAAOk69r7joz1CXGKcZxDKEUlj8Z3qqMEUTCI9q77s81AL1_njV_Uq5AYikNwPMEHWzBEggtbzesbfD5i1nRhr4SPZMnvUT2LCEFZr3VdFhaxRV856R_K2PqWfaPgG0I8HVlIFh1Fm0CwhrkAalJwcUIrhpwcmn7a3XfnFjlD8LKVnc_1L_Rorzs1V3RbE9HzaNNIE1",
          "path" : "/",
          "httpOnly" : true,
          "secure" : false,
          "comment" : ""
        } ],
        "headers" : [ {
          "name" : "Cache-Control",
          "value" : "private"
        }, {
          "name" : "Content-Type",
          "value" : "application/json; charset=utf-8"
        }, {
          "name" : "Server",
          "value" : "Microsoft-IIS/10.0"
        }, {
          "name" : "Set-Cookie",
          "value" : ".ASPROLES=0ui9T1f5E9rDbBfGpfo7g2SgcMK4c7W2EFUxHgNyQ5pGDBq_tjxJS6bSBPa7pDgQoQmkOQW7NnecH5y-biaJiDTPOlfJQj1psDZjpNwa6urK8Q8sakJrQXjnwL9b5bpVTQGm-1JOLzpCBsLh3UHEptzIMLkxhSlaWu9evl84XBrVZCqFL2-ckD82iVqpC3Pj5nO7nuTk4heCrpQjWXvk9FbzPcztLFFZLydGNLT18vYIF-vKw5_iLEfSw_T-jicK4apNw82o4ZXfoIgzYosxDyPKtmRriEeFCra6mAXFkWLrT4y3292pGZ-EmocSQPAOTbLRZO2C1QcZXt6pgPaL_rAAOk69r7joz1CXGKcZxDKEUlj8Z3qqMEUTCI9q77s81AL1_njV_Uq5AYikNwPMEHWzBEggtbzesbfD5i1nRhr4SPZMnvUT2LCEFZr3VdFhaxRV856R_K2PqWfaPgG0I8HVlIFh1Fm0CwhrkAalJwcUIrhpwcmn7a3XfnFjlD8LKVnc_1L_Rorzs1V3RbE9HzaNNIE1; path=/; HttpOnly"
        }, {
          "name" : "X-SourceFiles",
          "value" : "=?UTF-8?B?RDpcVmlydHVhbE9wdGltaXplci1SZWZhY3RvcmluZ1xDcm9wTWV0cmljcy5Wby5BcGlcQ3JvcE1ldHJpY3MuVm8uQXBpXGFwaVxtb2JpbGVcdjFcZmllbGRz?="
        }, {
          "name" : "X-Powered-By",
          "value" : "ASP.NET"
        }, {
          "name" : "Date",
          "value" : "Fri, 05 Apr 2019 19:37:08 GMT"
        }, {
          "name" : "Content-Length",
          "value" : "37"
        } ],
        "content" : {
          "size" : 37,
          "mimeType" : "application/json; charset=utf-8",
          "text" : "{\"message\":\"The request is invalid.\"}",
          "comment" : ""
        },
        "redirectURL" : "",
        "headersSize" : 940,
        "bodySize" : 37,
        "comment" : ""
      },
      "cache" : { },
      "timings" : {
        "comment" : "",
        "ssl" : -1,
        "connect" : -1,
        "blocked" : -1,
        "send" : 0,
        "dns" : -1,
        "receive" : 0,
        "wait" : 31
      },
      "serverIPAddress" : "127.0.0.1",
      "comment" : "",
      "_katalonRequestInformation" : {
        "name" : "100",
        "testObjectId" : "Object Repository/VoGrow/Field/FieldPost",
        "harId" : "77776a62-42dd-43e2-a610-e7aceda9acf4"
      },
      "time" : 32
    } ],
    "comment" : ""
  }
}