{
  "log" : {
    "version" : "1.2",
    "creator" : {
      "name" : "BrowserMob Proxy",
      "version" : "2.1.5",
      "comment" : ""
    },
    "pages" : [ {
      "id" : "Page 0",
      "startedDateTime" : "2019-03-29T21:03:09.307Z",
      "title" : "Page 0",
      "pageTimings" : {
        "onLoad" : 3706,
        "comment" : ""
      },
      "comment" : ""
    } ],
    "entries" : [ {
      "pageref" : "Page 0",
      "startedDateTime" : "2019-03-29T21:03:09.307Z",
      "request" : {
        "method" : "PUT",
        "url" : "http://localhost:10520/WebAPI/api/admin/v1/users/31?",
        "httpVersion" : "HTTP/1.1",
        "cookies" : [ ],
        "headers" : [ {
          "name" : "User-Agent",
          "value" : "Katalon Studio"
        }, {
          "name" : "Content-Type",
          "value" : "application/x-www-form-urlencoded"
        }, {
          "name" : "Authorization",
          "value" : "Bearer eyJ0eXAiOiJKV1QiLCJhbGciOiJIUzI1NiJ9.eyJ1bmlxdWVfbmFtZSI6ImFkbWluIiwicm9sZSI6InVzZXIiLCJzdWIiOiJhZG1pbiIsImlzcyI6IkNyb3BNZXRyaWNzIiwiYXVkIjoiYWxsIiwiZXhwIjoxNTUzODk3Mjg5LCJuYmYiOjE1NTM4OTMzODl9.W99sWdKi55J7xTr3c1cVtlMzZNmBofGWhLKzoHpT00c"
        }, {
          "name" : "Host",
          "value" : "localhost:10520"
        }, {
          "name" : "Accept",
          "value" : "text/html, image/gif, image/jpeg, *; q=.2, */*; q=.2"
        }, {
          "name" : "Proxy-Connection",
          "value" : "keep-alive"
        }, {
          "name" : "Content-Length",
          "value" : "298"
        } ],
        "queryString" : [ ],
        "postData" : {
          "mimeType" : "application/x-www-form-urlencoded",
          "params" : [ {
            "name" : "password",
            "value" : "cropmetrics",
            "comment" : ""
          }, {
            "name" : "email",
            "value" : "cropmetricsvo.zipchar@gmail.com",
            "comment" : ""
          }, {
            "name" : "fullname",
            "value" : "test validation",
            "comment" : ""
          }, {
            "name" : "phone",
            "value" : "123",
            "comment" : ""
          }, {
            "name" : "dealer",
            "value" : "x",
            "comment" : ""
          }, {
            "name" : "addressLine1",
            "value" : "address line 1 test validation",
            "comment" : ""
          }, {
            "name" : "addressLine2",
            "value" : "address line 2 test validation",
            "comment" : ""
          }, {
            "name" : "town",
            "value" : "townValidation",
            "comment" : ""
          }, {
            "name" : "state",
            "value" : "stateValidation",
            "comment" : ""
          }, {
            "name" : "zip",
            "value" : "ten",
            "comment" : ""
          }, {
            "name" : "country",
            "value" : "countryValidation",
            "comment" : ""
          }, {
            "name" : "roles",
            "value" : "Client",
            "comment" : ""
          }, {
            "name" : "userProfileId",
            "value" : "31",
            "comment" : ""
          } ],
          "comment" : ""
        },
        "headersSize" : 545,
        "bodySize" : 298,
        "comment" : ""
      },
      "response" : {
        "status" : 200,
        "statusText" : "OK",
        "httpVersion" : "HTTP/1.1",
        "cookies" : [ {
          "name" : ".ASPROLES",
          "value" : "zx7phICEsztkJuyT0bKP7mAWF7qaueuWtzV71Kve-f1ddvdiB5W8HSdVgvYaKiKJgdL7lznyFY__HFMRRXoqqYR1dHTbx7cVuD-jIMtG_AOtBqkb4uHWkyvP9j6KTlIJG-HrPwXmB42pb0EGXkD3850GAsmmcr7ECqyXz1gPJcbNp7Usr1zrJqolLbQ8OzbtdjiwLs5RkQJ71lK8x5hr6J2ttSAvuG6CxNfPmSQLVa2chMfWRpD5TXofPHDp3boc9TmsDMOmFo0Fre1jzOIU7CrXk4AkYsHCSTod1nGxajGiJDEhoOTwYa1J8FcZstin8pEkhoMi-MbvErbbUimlM6pfoaNdVMLUb-dHmjfzTb-DdJ68RF6mDZONBtduXeb2omhCXUsPukPlnp-06PIHj8nhz-WZDHAQ0jmgfArkPRAXtTM4w7GyTWwg66Y7vx58vrxdreH9jYd0WazcuzMV3iENH_hxTyVuVK17DXq95WPWD-Jb0",
          "path" : "/",
          "httpOnly" : true,
          "secure" : false,
          "comment" : ""
        } ],
        "headers" : [ {
          "name" : "Cache-Control",
          "value" : "private"
        }, {
          "name" : "Server",
          "value" : "Microsoft-IIS/10.0"
        }, {
          "name" : "Set-Cookie",
          "value" : ".ASPROLES=zx7phICEsztkJuyT0bKP7mAWF7qaueuWtzV71Kve-f1ddvdiB5W8HSdVgvYaKiKJgdL7lznyFY__HFMRRXoqqYR1dHTbx7cVuD-jIMtG_AOtBqkb4uHWkyvP9j6KTlIJG-HrPwXmB42pb0EGXkD3850GAsmmcr7ECqyXz1gPJcbNp7Usr1zrJqolLbQ8OzbtdjiwLs5RkQJ71lK8x5hr6J2ttSAvuG6CxNfPmSQLVa2chMfWRpD5TXofPHDp3boc9TmsDMOmFo0Fre1jzOIU7CrXk4AkYsHCSTod1nGxajGiJDEhoOTwYa1J8FcZstin8pEkhoMi-MbvErbbUimlM6pfoaNdVMLUb-dHmjfzTb-DdJ68RF6mDZONBtduXeb2omhCXUsPukPlnp-06PIHj8nhz-WZDHAQ0jmgfArkPRAXtTM4w7GyTWwg66Y7vx58vrxdreH9jYd0WazcuzMV3iENH_hxTyVuVK17DXq95WPWD-Jb0; path=/; HttpOnly"
        }, {
          "name" : "X-SourceFiles",
          "value" : "=?UTF-8?B?RDpcVmlydHVhbE9wdGltaXplci1SZWZhY3RvcmluZ1xDcm9wTWV0cmljcy5Wby5BcGlcQ3JvcE1ldHJpY3MuVm8uQXBpXGFwaVxhZG1pblx2MVx1c2Vyc1wzMQ==?="
        }, {
          "name" : "X-Powered-By",
          "value" : "ASP.NET"
        }, {
          "name" : "Date",
          "value" : "Fri, 29 Mar 2019 21:03:13 GMT"
        }, {
          "name" : "Content-Length",
          "value" : "0"
        } ],
        "content" : {
          "size" : 0,
          "mimeType" : "",
          "text" : "",
          "encoding" : "base64",
          "comment" : ""
        },
        "redirectURL" : "",
        "headersSize" : 844,
        "bodySize" : 0,
        "comment" : ""
      },
      "cache" : { },
      "timings" : {
        "comment" : "",
        "dns" : -1,
        "wait" : 3706,
        "send" : 0,
        "receive" : 0,
        "connect" : -1,
        "blocked" : -1,
        "ssl" : -1
      },
      "serverIPAddress" : "127.0.0.1",
      "comment" : "",
      "_katalonRequestInformation" : {
        "name" : "53",
        "testObjectId" : "Object Repository/VoPro/Account/api_admin_v1_users_userprofileid",
        "harId" : "e147f591-bfff-46b1-9c5d-f2ba5e5bcd2f"
      },
      "time" : 3707
    } ],
    "comment" : ""
  }
}