{
  "log" : {
    "version" : "1.2",
    "creator" : {
      "name" : "BrowserMob Proxy",
      "version" : "2.1.5",
      "comment" : ""
    },
    "pages" : [ {
      "id" : "Page 0",
      "startedDateTime" : "2019-03-28T19:23:54.944Z",
      "title" : "Page 0",
      "pageTimings" : {
        "onLoad" : 1331,
        "comment" : ""
      },
      "comment" : ""
    } ],
    "entries" : [ {
      "pageref" : "Page 0",
      "startedDateTime" : "2019-03-28T19:23:54.951Z",
      "request" : {
        "method" : "POST",
        "url" : "http://localhost:10520/WebAPI/api/admin/v1/users/?",
        "httpVersion" : "HTTP/1.1",
        "cookies" : [ ],
        "headers" : [ {
          "name" : "User-Agent",
          "value" : "Katalon Studio"
        }, {
          "name" : "Content-Type",
          "value" : "application/x-www-form-urlencoded"
        }, {
          "name" : "Authorization",
          "value" : "Bearer eyJ0eXAiOiJKV1QiLCJhbGciOiJIUzI1NiJ9.eyJ1bmlxdWVfbmFtZSI6ImFkbWluIiwicm9sZSI6InVzZXIiLCJzdWIiOiJhZG1pbiIsImlzcyI6IkNyb3BNZXRyaWNzIiwiYXVkIjoiYWxsIiwiZXhwIjoxNTUzODA0OTM0LCJuYmYiOjE1NTM4MDEwMzR9.q9ICPLw2qqzHnSzpln_Ofe12KTIepe5rTtxGqo8oGxg"
        }, {
          "name" : "Host",
          "value" : "localhost:10520"
        }, {
          "name" : "Accept",
          "value" : "text/html, image/gif, image/jpeg, *; q=.2, */*; q=.2"
        }, {
          "name" : "Proxy-Connection",
          "value" : "keep-alive"
        }, {
          "name" : "Content-Length",
          "value" : "326"
        } ],
        "queryString" : [ ],
        "postData" : {
          "mimeType" : "application/x-www-form-urlencoded",
          "params" : [ {
            "name" : "password",
            "value" : "cropmetrics",
            "comment" : ""
          }, {
            "name" : "email",
            "value" : "cropmetricsvo.phone.space@gmail.com",
            "comment" : ""
          }, {
            "name" : "fullname",
            "value" : "test validation",
            "comment" : ""
          }, {
            "name" : "phone",
            "value" : "one five nine",
            "comment" : ""
          }, {
            "name" : "dealer",
            "value" : "dealer test validation",
            "comment" : ""
          }, {
            "name" : "addressLine1",
            "value" : "address line 1 test validation",
            "comment" : ""
          }, {
            "name" : "addressLine2",
            "value" : "address line 1 test validation",
            "comment" : ""
          }, {
            "name" : "town",
            "value" : "townValidation",
            "comment" : ""
          }, {
            "name" : "state",
            "value" : "stateValidation",
            "comment" : ""
          }, {
            "name" : "zip",
            "value" : "zipValidation",
            "comment" : ""
          }, {
            "name" : "country",
            "value" : "countryValidation",
            "comment" : ""
          }, {
            "name" : "roles",
            "value" : "Client",
            "comment" : ""
          } ],
          "comment" : ""
        },
        "headersSize" : 544,
        "bodySize" : 326,
        "comment" : ""
      },
      "response" : {
        "status" : 200,
        "statusText" : "OK",
        "httpVersion" : "HTTP/1.1",
        "cookies" : [ {
          "name" : ".ASPROLES",
          "value" : "B3b8bpm3bDqzEOFQLlJR0j97TiwMaQxZ8pHweZSjs8f5UJxf60RygOmM3eEu-zgP_didlurX4B7Lk30E00MBLhfiZDAJnVDZlJlo1Jpl3Hr7Ggs6FGibyRWJeXkdGoNVBHpQw7sYec7hThl5NtElVMnqY8dliXV_iC5z6RpDKku8ZLXp-gyO6xz8oXHkioIhU-ff8w2xXwzZe7Os_RbqLcVa6Gpn9aOLEB8zTeqX-UvUfPIdP1DJ7RykJGMglBcLRT9_u8I_vrPiObNlVE8k3B30iaWIV9jadWGP7c3odzamsM3jWiaWz2DS5Ih_4wplDivRhOBgAWo93J77lDURn8gtjTr8PBKyza-JhU0ttVmhryV9J2oGJCZiamRDIwMFN80VYS7LAXr1sYokTM4sh80h-qcqQfQWSeLH5KtTf1Z3pLvXrAzWS6HAOC9o8jWdGjOWvdZsB3J9rQGGiZ7oLw3lgSeqxH_F83DVBtxOe-oysPxq0",
          "path" : "/",
          "httpOnly" : true,
          "secure" : false,
          "comment" : ""
        } ],
        "headers" : [ {
          "name" : "Cache-Control",
          "value" : "private"
        }, {
          "name" : "Content-Type",
          "value" : "application/json; charset=utf-8"
        }, {
          "name" : "Server",
          "value" : "Microsoft-IIS/10.0"
        }, {
          "name" : "Set-Cookie",
          "value" : ".ASPROLES=B3b8bpm3bDqzEOFQLlJR0j97TiwMaQxZ8pHweZSjs8f5UJxf60RygOmM3eEu-zgP_didlurX4B7Lk30E00MBLhfiZDAJnVDZlJlo1Jpl3Hr7Ggs6FGibyRWJeXkdGoNVBHpQw7sYec7hThl5NtElVMnqY8dliXV_iC5z6RpDKku8ZLXp-gyO6xz8oXHkioIhU-ff8w2xXwzZe7Os_RbqLcVa6Gpn9aOLEB8zTeqX-UvUfPIdP1DJ7RykJGMglBcLRT9_u8I_vrPiObNlVE8k3B30iaWIV9jadWGP7c3odzamsM3jWiaWz2DS5Ih_4wplDivRhOBgAWo93J77lDURn8gtjTr8PBKyza-JhU0ttVmhryV9J2oGJCZiamRDIwMFN80VYS7LAXr1sYokTM4sh80h-qcqQfQWSeLH5KtTf1Z3pLvXrAzWS6HAOC9o8jWdGjOWvdZsB3J9rQGGiZ7oLw3lgSeqxH_F83DVBtxOe-oysPxq0; path=/; HttpOnly"
        }, {
          "name" : "X-SourceFiles",
          "value" : "=?UTF-8?B?RDpcVmlydHVhbE9wdGltaXplci1SZWZhY3RvcmluZ1xDcm9wTWV0cmljcy5Wby5BcGlcQ3JvcE1ldHJpY3MuVm8uQXBpXGFwaVxhZG1pblx2MVx1c2Vyc1w=?="
        }, {
          "name" : "X-Powered-By",
          "value" : "ASP.NET"
        }, {
          "name" : "Date",
          "value" : "Thu, 28 Mar 2019 19:23:56 GMT"
        }, {
          "name" : "Content-Length",
          "value" : "8"
        } ],
        "content" : {
          "size" : 8,
          "mimeType" : "application/json; charset=utf-8",
          "text" : "{\"id\":6}",
          "comment" : ""
        },
        "redirectURL" : "",
        "headersSize" : 887,
        "bodySize" : 8,
        "comment" : ""
      },
      "cache" : { },
      "timings" : {
        "comment" : "",
        "ssl" : -1,
        "wait" : 1319,
        "receive" : 0,
        "send" : 0,
        "connect" : -1,
        "blocked" : -1,
        "dns" : -1
      },
      "serverIPAddress" : "127.0.0.1",
      "comment" : "",
      "_katalonRequestInformation" : {
        "name" : "15",
        "testObjectId" : "Object Repository/VoPro/Account/api_admin_v1_users",
        "harId" : "c5cc98f2-13d6-4995-800c-3776cf5da635"
      },
      "time" : 1320
    } ],
    "comment" : ""
  }
}