{
  "log" : {
    "version" : "1.2",
    "creator" : {
      "name" : "BrowserMob Proxy",
      "version" : "2.1.5",
      "comment" : ""
    },
    "pages" : [ {
      "id" : "Page 0",
      "startedDateTime" : "2019-03-29T13:22:28.609Z",
      "title" : "Page 0",
      "pageTimings" : {
        "onLoad" : 38,
        "comment" : ""
      },
      "comment" : ""
    } ],
    "entries" : [ {
      "pageref" : "Page 0",
      "startedDateTime" : "2019-03-29T13:22:28.626Z",
      "request" : {
        "method" : "POST",
        "url" : "http://localhost:10520/WebAPI/api/admin/v1/users/?",
        "httpVersion" : "HTTP/1.1",
        "cookies" : [ ],
        "headers" : [ {
          "name" : "User-Agent",
          "value" : "Katalon Studio"
        }, {
          "name" : "Content-Type",
          "value" : "application/x-www-form-urlencoded"
        }, {
          "name" : "Authorization",
          "value" : "Bearer eyJ0eXAiOiJKV1QiLCJhbGciOiJIUzI1NiJ9.eyJ1bmlxdWVfbmFtZSI6ImFkbWluIiwicm9sZSI6InVzZXIiLCJzdWIiOiJhZG1pbiIsImlzcyI6IkNyb3BNZXRyaWNzIiwiYXVkIjoiYWxsIiwiZXhwIjoxNTUzODY5NjQ4LCJuYmYiOjE1NTM4NjU3NDh9.IoOCr-Oeetgziuhcc3FQxTD6-59B7fNIYRKjdpFMR1Q"
        }, {
          "name" : "Host",
          "value" : "localhost:10520"
        }, {
          "name" : "Accept",
          "value" : "text/html, image/gif, image/jpeg, *; q=.2, */*; q=.2"
        }, {
          "name" : "Proxy-Connection",
          "value" : "keep-alive"
        }, {
          "name" : "Content-Length",
          "value" : "298"
        } ],
        "queryString" : [ ],
        "postData" : {
          "mimeType" : "application/x-www-form-urlencoded",
          "params" : [ {
            "name" : "password",
            "value" : "cropmetrics",
            "comment" : ""
          }, {
            "name" : "email",
            "value" : "cropmetricsvo emailwrongformat gmail.com",
            "comment" : ""
          }, {
            "name" : "fullname",
            "value" : "test validation",
            "comment" : ""
          }, {
            "name" : "phone",
            "value" : "123",
            "comment" : ""
          }, {
            "name" : "dealer",
            "value" : "x",
            "comment" : ""
          }, {
            "name" : "addressLine1",
            "value" : "address line 1 test validation",
            "comment" : ""
          }, {
            "name" : "addressLine2",
            "value" : "address line 1 test validation",
            "comment" : ""
          }, {
            "name" : "town",
            "value" : "townValidation",
            "comment" : ""
          }, {
            "name" : "state",
            "value" : "stateValidation",
            "comment" : ""
          }, {
            "name" : "zip",
            "value" : "zipValidation",
            "comment" : ""
          }, {
            "name" : "country",
            "value" : "countryValidation",
            "comment" : ""
          }, {
            "name" : "roles",
            "value" : "Client",
            "comment" : ""
          } ],
          "comment" : ""
        },
        "headersSize" : 544,
        "bodySize" : 298,
        "comment" : ""
      },
      "response" : {
        "status" : 400,
        "statusText" : "Bad Request",
        "httpVersion" : "HTTP/1.1",
        "cookies" : [ {
          "name" : ".ASPROLES",
          "value" : "5P52liUVXAi-mEBuFC5XcFNRKGUh0nJSa0XyY5jb8oTqytCLp1CyCOJkCaWFTHbtNIRo2rWB5p_3xh33DOvzXAkS4vnPgbFUKbhnOWV3ZJ9F0oPYsmNHAiLYnswmv2nz5Rt4E2ASFipUE7y5U378z5aDHUmYDVw2G961uyvxl38w0LTMd-GcDkC82u8PdTqAdFwFn8c1AHTRzDjkR6zV5z5y_CgF6RwrwlzF2t-jR0rDGfWI-M2dSRUKqCS7LJqe7WqQE6nkavRxm9bkgWNoPK1tFIfSBxh45gF3JjpRuzUv0WNHLqYoZ_JoOZ__UkdKSkeS1npDK6oIk4_UMp3qdG-z35V7ulwPLMQRIkBrGdsdvJHtc288uebsrxbvsSaCf5g1vGCFHiHk2JH4LGSD4FFu_ygys6ACZ3dpETrJVtGQEUEJ0i4naEKAPSSwgflPCdqVBQO5D1P7eKFXZ1inEC3DlR4TvasjjGga4-OtAKc7rCsB0",
          "path" : "/",
          "httpOnly" : true,
          "secure" : false,
          "comment" : ""
        } ],
        "headers" : [ {
          "name" : "Cache-Control",
          "value" : "private"
        }, {
          "name" : "Content-Type",
          "value" : "application/json; charset=utf-8"
        }, {
          "name" : "Server",
          "value" : "Microsoft-IIS/10.0"
        }, {
          "name" : "Set-Cookie",
          "value" : ".ASPROLES=5P52liUVXAi-mEBuFC5XcFNRKGUh0nJSa0XyY5jb8oTqytCLp1CyCOJkCaWFTHbtNIRo2rWB5p_3xh33DOvzXAkS4vnPgbFUKbhnOWV3ZJ9F0oPYsmNHAiLYnswmv2nz5Rt4E2ASFipUE7y5U378z5aDHUmYDVw2G961uyvxl38w0LTMd-GcDkC82u8PdTqAdFwFn8c1AHTRzDjkR6zV5z5y_CgF6RwrwlzF2t-jR0rDGfWI-M2dSRUKqCS7LJqe7WqQE6nkavRxm9bkgWNoPK1tFIfSBxh45gF3JjpRuzUv0WNHLqYoZ_JoOZ__UkdKSkeS1npDK6oIk4_UMp3qdG-z35V7ulwPLMQRIkBrGdsdvJHtc288uebsrxbvsSaCf5g1vGCFHiHk2JH4LGSD4FFu_ygys6ACZ3dpETrJVtGQEUEJ0i4naEKAPSSwgflPCdqVBQO5D1P7eKFXZ1inEC3DlR4TvasjjGga4-OtAKc7rCsB0; path=/; HttpOnly"
        }, {
          "name" : "X-SourceFiles",
          "value" : "=?UTF-8?B?RDpcVmlydHVhbE9wdGltaXplci1SZWZhY3RvcmluZ1xDcm9wTWV0cmljcy5Wby5BcGlcQ3JvcE1ldHJpY3MuVm8uQXBpXGFwaVxhZG1pblx2MVx1c2Vyc1w=?="
        }, {
          "name" : "X-Powered-By",
          "value" : "ASP.NET"
        }, {
          "name" : "Date",
          "value" : "Fri, 29 Mar 2019 13:22:28 GMT"
        }, {
          "name" : "Content-Length",
          "value" : "127"
        } ],
        "content" : {
          "size" : 127,
          "mimeType" : "application/json; charset=utf-8",
          "text" : "{\"message\":\"The request is invalid. The Email provided is not a valid email address. cropmetricsvo emailwrongformat gmail.com\"}",
          "comment" : ""
        },
        "redirectURL" : "",
        "headersSize" : 898,
        "bodySize" : 127,
        "comment" : ""
      },
      "cache" : { },
      "timings" : {
        "comment" : "",
        "ssl" : -1,
        "receive" : 0,
        "wait" : 32,
        "connect" : -1,
        "send" : 0,
        "dns" : -1,
        "blocked" : -1
      },
      "serverIPAddress" : "127.0.0.1",
      "comment" : "",
      "_katalonRequestInformation" : {
        "name" : "19",
        "testObjectId" : "Object Repository/VoPro/Account/api_admin_v1_users",
        "harId" : "d4a481c6-5be4-4680-a034-0b6decab603a"
      },
      "time" : 33
    } ],
    "comment" : ""
  }
}