{
  "log" : {
    "version" : "1.2",
    "creator" : {
      "name" : "BrowserMob Proxy",
      "version" : "2.1.5",
      "comment" : ""
    },
    "pages" : [ {
      "id" : "Page 0",
      "startedDateTime" : "2019-04-24T20:28:19.546Z",
      "title" : "Page 0",
      "pageTimings" : {
        "onLoad" : 2170,
        "comment" : ""
      },
      "comment" : ""
    } ],
    "entries" : [ {
      "pageref" : "Page 0",
      "startedDateTime" : "2019-04-24T20:28:19.551Z",
      "request" : {
        "method" : "POST",
        "url" : "http://localhost:10520/WebAPI/api/mobile/v1/fields?",
        "httpVersion" : "HTTP/1.1",
        "cookies" : [ ],
        "headers" : [ {
          "name" : "User-Agent",
          "value" : "Katalon Studio"
        }, {
          "name" : "Content-Type",
          "value" : "application/json"
        }, {
          "name" : "Authorization",
          "value" : "Bearer eyJ0eXAiOiJKV1QiLCJhbGciOiJIUzI1NiJ9.eyJ1bmlxdWVfbmFtZSI6Implbm55Lm1hbGRvbmFkby50eDFAZ21haWwuY29tIiwicm9sZSI6InVzZXIiLCJzdWIiOiJqZW5ueS5tYWxkb25hZG8udHgxQGdtYWlsLmNvbSIsImlzcyI6IkNyb3BNZXRyaWNzIiwiYXVkIjoiYWxsIiwiZXhwIjoxNTU2MTQxNTk5LCJuYmYiOjE1NTYxMzc2OTl9.AjEaYDLo3UamLILdn77Ny8opjAb7GQtEWsmIwBphjF4"
        }, {
          "name" : "Host",
          "value" : "localhost:10520"
        }, {
          "name" : "Accept",
          "value" : "text/html, image/gif, image/jpeg, *; q=.2, */*; q=.2"
        }, {
          "name" : "Proxy-Connection",
          "value" : "keep-alive"
        }, {
          "name" : "Content-Length",
          "value" : "396"
        } ],
        "queryString" : [ ],
        "postData" : {
          "mimeType" : "application/json",
          "text" : "{\"field\":{\"farm_id\":3,\"name\":\"Field created by agent\",\"boundary\":{\"boundaries\":[{\"boundary\":{\"coords\":[{\"x\":-101.49568751,\"y\":37.14976293},{\"x\":-101.50049403,\"y\":37.14647907},{\"x\":-101.50049403,\"y\":37.14264773},{\"x\":-101.49723246,\"y\":37.1411425},{\"x\":-101.49019435,\"y\":37.14223722},{\"x\":-101.48933604,\"y\":37.14620541},{\"x\":-101.49294093,\"y\":37.14866833},{\"x\":-101.49568751,\"y\":37.14976293}]}}]}}}",
          "comment" : ""
        },
        "headersSize" : 592,
        "bodySize" : 396,
        "comment" : ""
      },
      "response" : {
        "status" : 201,
        "statusText" : "Created",
        "httpVersion" : "HTTP/1.1",
        "cookies" : [ {
          "name" : ".ASPROLES",
          "value" : "PI86VUS73U1UAQWkFfBf_jmw3wKgMcuoc3-ShoFwcQRw4Zj07fzJO-a5q4uaZFqcRYfvSyUYoTktOAFGfTTQpxQpaXUUphQys_KeRDhS1xotNJ3ph0qP-tVPNFd82_651YX5PlWg5jnrOO73a6VE1RT_SV4zujk7VWMMRM0idxb9ccrAyaTENsEThIDkBIcKlQhGmYUKraf7gPbSaw5QRZqmo5AM-FKejUx2BKijKpN8Lv5jS79wq25-N7TjlI9JQ0hJbSQZ11gVgw2EHMNFrFwtV_2tFw5j-V2gB-JPj5hgxeWIT4-coUoSCc2NcFY1DCEMNl5JEAp-r5UgFs16cbA-72tN68k4TsF8YFsz86HTEX8gXlJZRUUiN8CgqezTnP2A8oES99Z-0jBeGDyc1UcONoc2h2YrGD_mfYzH0L_QUd1jbIPnNA4utPnlRQHxlzNbe50_S8iPA6wwUxB7DFTu9WCWQvdt3b1P8GfAQl_cdhk5rpWJv09PY__JOc4A3R9cGS5F5c_6KebxX8MVpL5s4mI1",
          "path" : "/",
          "httpOnly" : true,
          "secure" : false,
          "comment" : ""
        } ],
        "headers" : [ {
          "name" : "Cache-Control",
          "value" : "private"
        }, {
          "name" : "Content-Type",
          "value" : "application/json; charset=utf-8"
        }, {
          "name" : "Location",
          "value" : "api/mobile/v1/fields/2"
        }, {
          "name" : "Server",
          "value" : "Microsoft-IIS/10.0"
        }, {
          "name" : "Set-Cookie",
          "value" : ".ASPROLES=PI86VUS73U1UAQWkFfBf_jmw3wKgMcuoc3-ShoFwcQRw4Zj07fzJO-a5q4uaZFqcRYfvSyUYoTktOAFGfTTQpxQpaXUUphQys_KeRDhS1xotNJ3ph0qP-tVPNFd82_651YX5PlWg5jnrOO73a6VE1RT_SV4zujk7VWMMRM0idxb9ccrAyaTENsEThIDkBIcKlQhGmYUKraf7gPbSaw5QRZqmo5AM-FKejUx2BKijKpN8Lv5jS79wq25-N7TjlI9JQ0hJbSQZ11gVgw2EHMNFrFwtV_2tFw5j-V2gB-JPj5hgxeWIT4-coUoSCc2NcFY1DCEMNl5JEAp-r5UgFs16cbA-72tN68k4TsF8YFsz86HTEX8gXlJZRUUiN8CgqezTnP2A8oES99Z-0jBeGDyc1UcONoc2h2YrGD_mfYzH0L_QUd1jbIPnNA4utPnlRQHxlzNbe50_S8iPA6wwUxB7DFTu9WCWQvdt3b1P8GfAQl_cdhk5rpWJv09PY__JOc4A3R9cGS5F5c_6KebxX8MVpL5s4mI1; path=/; HttpOnly"
        }, {
          "name" : "X-SourceFiles",
          "value" : "=?UTF-8?B?RDpcVmlydHVhbE9wdGltaXplci1SZWZhY3RvcmluZ1xDcm9wTWV0cmljcy5Wby5BcGlcQ3JvcE1ldHJpY3MuVm8uQXBpXGFwaVxtb2JpbGVcdjFcZmllbGRz?="
        }, {
          "name" : "X-Powered-By",
          "value" : "ASP.NET"
        }, {
          "name" : "Date",
          "value" : "Wed, 24 Apr 2019 20:28:21 GMT"
        }, {
          "name" : "Content-Length",
          "value" : "429"
        } ],
        "content" : {
          "size" : 429,
          "mimeType" : "application/json; charset=utf-8",
          "text" : "{\"field\":{\"id\":2,\"farm_id\":3,\"name\":\"Field created by agent\",\"boundary\":{\"boundaries\":[{\"boundary\":{\"coords\":[{\"x\":-101.49568751,\"y\":37.14976293},{\"x\":-101.49294093,\"y\":37.14866833},{\"x\":-101.48933604,\"y\":37.14620541},{\"x\":-101.49019435,\"y\":37.14223722},{\"x\":-101.49723246,\"y\":37.1411425},{\"x\":-101.50049403,\"y\":37.14264773},{\"x\":-101.50049403,\"y\":37.14647907},{\"x\":-101.49568751,\"y\":37.14976293}]},\"holes\":null}]}},\"probe\":null}",
          "comment" : ""
        },
        "redirectURL" : "",
        "headersSize" : 971,
        "bodySize" : 429,
        "comment" : ""
      },
      "cache" : { },
      "timings" : {
        "comment" : "",
        "ssl" : -1,
        "receive" : 1,
        "send" : 0,
        "wait" : 2158,
        "connect" : -1,
        "blocked" : -1,
        "dns" : -1
      },
      "serverIPAddress" : "127.0.0.1",
      "comment" : "",
      "_katalonRequestInformation" : {
        "name" : "3",
        "testObjectId" : "Object Repository/VoGrow/Field/FieldPost",
        "harId" : "83fbf85b-5df6-4135-99d8-0ecf4db2ebaf"
      },
      "time" : 2160
    } ],
    "comment" : ""
  }
}