{
  "log" : {
    "version" : "1.2",
    "creator" : {
      "name" : "BrowserMob Proxy",
      "version" : "2.1.5",
      "comment" : ""
    },
    "pages" : [ {
      "id" : "Page 0",
      "startedDateTime" : "2019-03-29T22:38:09.458Z",
      "title" : "Page 0",
      "pageTimings" : {
        "onLoad" : 1831,
        "comment" : ""
      },
      "comment" : ""
    } ],
    "entries" : [ {
      "pageref" : "Page 0",
      "startedDateTime" : "2019-03-29T22:38:09.459Z",
      "request" : {
        "method" : "POST",
        "url" : "http://localhost:10520/WebAPI/api/admin/v1/users/?",
        "httpVersion" : "HTTP/1.1",
        "cookies" : [ ],
        "headers" : [ {
          "name" : "User-Agent",
          "value" : "Katalon Studio"
        }, {
          "name" : "Content-Type",
          "value" : "application/x-www-form-urlencoded"
        }, {
          "name" : "Authorization",
          "value" : "Bearer eyJ0eXAiOiJKV1QiLCJhbGciOiJIUzI1NiJ9.eyJ1bmlxdWVfbmFtZSI6ImFkbWluIiwicm9sZSI6InVzZXIiLCJzdWIiOiJhZG1pbiIsImlzcyI6IkNyb3BNZXRyaWNzIiwiYXVkIjoiYWxsIiwiZXhwIjoxNTUzOTAyOTg5LCJuYmYiOjE1NTM4OTkwODl9.1bIe5gNWK3b6zhi_hy6jR6GdP9ZzTMPQzOXDsXT3CVQ"
        }, {
          "name" : "Host",
          "value" : "localhost:10520"
        }, {
          "name" : "Accept",
          "value" : "text/html, image/gif, image/jpeg, *; q=.2, */*; q=.2"
        }, {
          "name" : "Proxy-Connection",
          "value" : "keep-alive"
        }, {
          "name" : "Content-Length",
          "value" : "280"
        } ],
        "queryString" : [ ],
        "postData" : {
          "mimeType" : "application/x-www-form-urlencoded",
          "params" : [ {
            "name" : "password",
            "value" : "cropmetrics",
            "comment" : ""
          }, {
            "name" : "email",
            "value" : "cropmetricsvo.addressline1symbols@gmail.com",
            "comment" : ""
          }, {
            "name" : "fullname",
            "value" : "x",
            "comment" : ""
          }, {
            "name" : "phone",
            "value" : "1",
            "comment" : ""
          }, {
            "name" : "dealer",
            "value" : "xx",
            "comment" : ""
          }, {
            "name" : "addressLine1",
            "value" : "!@#$%^&*",
            "comment" : ""
          }, {
            "name" : "addressLine2",
            "value" : "address line 2 test validation",
            "comment" : ""
          }, {
            "name" : "town",
            "value" : "townValidation",
            "comment" : ""
          }, {
            "name" : "state",
            "value" : "stateValidation",
            "comment" : ""
          }, {
            "name" : "zip",
            "value" : "zipValidation",
            "comment" : ""
          }, {
            "name" : "country",
            "value" : "countryValidation",
            "comment" : ""
          }, {
            "name" : "roles",
            "value" : "Client",
            "comment" : ""
          } ],
          "comment" : ""
        },
        "headersSize" : 544,
        "bodySize" : 280,
        "comment" : ""
      },
      "response" : {
        "status" : 200,
        "statusText" : "OK",
        "httpVersion" : "HTTP/1.1",
        "cookies" : [ {
          "name" : ".ASPROLES",
          "value" : "4b7ZvOgChtIw2dKS2QLdWDYdhIrN2ehDXhBoDVv-facTLMhWM-ifDtWX3fyhuM22ED_SmbzutmEZX1zDrUqvwu0u4ZzMevmJIHFA2G6HC-X48PLrqr_SnQzZUXd9KOMritBMuCdDfa73xwUk-3pDL_T1j1BQIildGgoZkHrLakObIZEjnoCo_7hEOhxkUgVzckBOKaa5FOV3y5Z70h0h021l3_b8jIxrjzFIzU5cF_WW7VITKnMZ1WOvhhjdQfr6QEpOd2aKJrS6AhS5Ufw83n9tI2ZAYHa6nC2ry4nhTMu39wnyliW8eQet0EBu1HDKG5FNfEVfThYwU7y5z4V0lKNrrej_uHNRST0Xf06-VsxqXeETd9d4K9u4aps5Fcddt8VxqrSm2vkIeETiIpciyw2q88lT5XTgS3ReXMB6DIhEICuEgwBVTzIij8ncc-9VKijTwPkgbHZPjQDjyc0B85-t60cBMXk5NglZZcBAy1r4WfN40",
          "path" : "/",
          "httpOnly" : true,
          "secure" : false,
          "comment" : ""
        } ],
        "headers" : [ {
          "name" : "Cache-Control",
          "value" : "private"
        }, {
          "name" : "Content-Type",
          "value" : "application/json; charset=utf-8"
        }, {
          "name" : "Server",
          "value" : "Microsoft-IIS/10.0"
        }, {
          "name" : "Set-Cookie",
          "value" : ".ASPROLES=4b7ZvOgChtIw2dKS2QLdWDYdhIrN2ehDXhBoDVv-facTLMhWM-ifDtWX3fyhuM22ED_SmbzutmEZX1zDrUqvwu0u4ZzMevmJIHFA2G6HC-X48PLrqr_SnQzZUXd9KOMritBMuCdDfa73xwUk-3pDL_T1j1BQIildGgoZkHrLakObIZEjnoCo_7hEOhxkUgVzckBOKaa5FOV3y5Z70h0h021l3_b8jIxrjzFIzU5cF_WW7VITKnMZ1WOvhhjdQfr6QEpOd2aKJrS6AhS5Ufw83n9tI2ZAYHa6nC2ry4nhTMu39wnyliW8eQet0EBu1HDKG5FNfEVfThYwU7y5z4V0lKNrrej_uHNRST0Xf06-VsxqXeETd9d4K9u4aps5Fcddt8VxqrSm2vkIeETiIpciyw2q88lT5XTgS3ReXMB6DIhEICuEgwBVTzIij8ncc-9VKijTwPkgbHZPjQDjyc0B85-t60cBMXk5NglZZcBAy1r4WfN40; path=/; HttpOnly"
        }, {
          "name" : "X-SourceFiles",
          "value" : "=?UTF-8?B?RDpcVmlydHVhbE9wdGltaXplci1SZWZhY3RvcmluZ1xDcm9wTWV0cmljcy5Wby5BcGlcQ3JvcE1ldHJpY3MuVm8uQXBpXGFwaVxhZG1pblx2MVx1c2Vyc1w=?="
        }, {
          "name" : "X-Powered-By",
          "value" : "ASP.NET"
        }, {
          "name" : "Date",
          "value" : "Fri, 29 Mar 2019 22:38:11 GMT"
        }, {
          "name" : "Content-Length",
          "value" : "9"
        } ],
        "content" : {
          "size" : 9,
          "mimeType" : "application/json; charset=utf-8",
          "text" : "{\"id\":22}",
          "comment" : ""
        },
        "redirectURL" : "",
        "headersSize" : 887,
        "bodySize" : 9,
        "comment" : ""
      },
      "cache" : { },
      "timings" : {
        "comment" : "",
        "ssl" : -1,
        "wait" : 1826,
        "receive" : 0,
        "send" : 0,
        "connect" : -1,
        "dns" : -1,
        "blocked" : -1
      },
      "serverIPAddress" : "127.0.0.1",
      "comment" : "",
      "_katalonRequestInformation" : {
        "name" : "65",
        "testObjectId" : "Object Repository/VoPro/Account/api_admin_v1_users",
        "harId" : "afac8198-654d-4681-9dad-3875f7f8d48e"
      },
      "time" : 1827
    } ],
    "comment" : ""
  }
}