{
  "log" : {
    "version" : "1.2",
    "creator" : {
      "name" : "BrowserMob Proxy",
      "version" : "2.1.5",
      "comment" : ""
    },
    "pages" : [ {
      "id" : "Page 0",
      "startedDateTime" : "2019-03-29T22:14:26.295Z",
      "title" : "Page 0",
      "pageTimings" : {
        "onLoad" : 1864,
        "comment" : ""
      },
      "comment" : ""
    } ],
    "entries" : [ {
      "pageref" : "Page 0",
      "startedDateTime" : "2019-03-29T22:14:26.296Z",
      "request" : {
        "method" : "PUT",
        "url" : "http://localhost:10520/WebAPI/api/admin/v1/users/38?",
        "httpVersion" : "HTTP/1.1",
        "cookies" : [ ],
        "headers" : [ {
          "name" : "User-Agent",
          "value" : "Katalon Studio"
        }, {
          "name" : "Content-Type",
          "value" : "application/x-www-form-urlencoded"
        }, {
          "name" : "Authorization",
          "value" : "Bearer eyJ0eXAiOiJKV1QiLCJhbGciOiJIUzI1NiJ9.eyJ1bmlxdWVfbmFtZSI6ImFkbWluIiwicm9sZSI6InVzZXIiLCJzdWIiOiJhZG1pbiIsImlzcyI6IkNyb3BNZXRyaWNzIiwiYXVkIjoiYWxsIiwiZXhwIjoxNTUzOTAxNTY2LCJuYmYiOjE1NTM4OTc2NjZ9.9VLmufptGdpvnaCRMfO8SgsuEVsERYEJlMr-QavOn5Y"
        }, {
          "name" : "Host",
          "value" : "localhost:10520"
        }, {
          "name" : "Accept",
          "value" : "text/html, image/gif, image/jpeg, *; q=.2, */*; q=.2"
        }, {
          "name" : "Proxy-Connection",
          "value" : "keep-alive"
        }, {
          "name" : "Content-Length",
          "value" : "304"
        } ],
        "queryString" : [ ],
        "postData" : {
          "mimeType" : "application/x-www-form-urlencoded",
          "params" : [ {
            "name" : "password",
            "value" : "cropmetrics",
            "comment" : ""
          }, {
            "name" : "email",
            "value" : "cropmetricsvo.countrysymbonls@gmail.com",
            "comment" : ""
          }, {
            "name" : "fullname",
            "value" : "test validation",
            "comment" : ""
          }, {
            "name" : "phone",
            "value" : "123",
            "comment" : ""
          }, {
            "name" : "dealer",
            "value" : "x",
            "comment" : ""
          }, {
            "name" : "addressLine1",
            "value" : "address line 1 test validation",
            "comment" : ""
          }, {
            "name" : "addressLine2",
            "value" : "address line 2 test validation",
            "comment" : ""
          }, {
            "name" : "town",
            "value" : "townValidation",
            "comment" : ""
          }, {
            "name" : "state",
            "value" : "stateValidation",
            "comment" : ""
          }, {
            "name" : "zip",
            "value" : "123457",
            "comment" : ""
          }, {
            "name" : "country",
            "value" : "!!!!",
            "comment" : ""
          }, {
            "name" : "roles",
            "value" : "Client",
            "comment" : ""
          }, {
            "name" : "userProfileId",
            "value" : "38",
            "comment" : ""
          } ],
          "comment" : ""
        },
        "headersSize" : 545,
        "bodySize" : 304,
        "comment" : ""
      },
      "response" : {
        "status" : 200,
        "statusText" : "OK",
        "httpVersion" : "HTTP/1.1",
        "cookies" : [ {
          "name" : ".ASPROLES",
          "value" : "TpJuAwWTtZP1Rv3C6J6hmke2f-gjVxtteZsKEjL9b0MTwl0_Ke_Va7Ik9bbRLGSIutkIXjVZgDc84EqWVSK6JCqgllR30qrgN7SLQaXoPt4RVZBQ9SPDaujOVYXK1k7B9zdZHtpFvdryjCyhkX5TKgnT953za9WFepk1pG3zW4EvxjqfTh0f0aCIUDplt3NtbwxRrOn6aCAsBGYBY9XPRxXQV38PsDlZxbHLNHPLESwgagdmUZSg7_iwBLH-oZYjDEHfIl8c3AkjRz7Mnhdxh3wdyqJvspwLPjBwERdHHOKeiaTFJsNFJarL5a0eeRFuUulLFWkMAVVIjD22OZAZukOFMsggv3FcPVMhLbNHLwsmXTA8CwI4xtX1Yr2NvJJESeDUuVcHwHz630-W7KLOiqiOJWpKevV8a6XixeCr_HJtTfALVDlc0rMAGzlDQ5YkKs0YHghHvD3Jewd_vAe58PmlZnoTcfTLN1Xyt3z8LEQwiGfL0",
          "path" : "/",
          "httpOnly" : true,
          "secure" : false,
          "comment" : ""
        } ],
        "headers" : [ {
          "name" : "Cache-Control",
          "value" : "private"
        }, {
          "name" : "Server",
          "value" : "Microsoft-IIS/10.0"
        }, {
          "name" : "Set-Cookie",
          "value" : ".ASPROLES=TpJuAwWTtZP1Rv3C6J6hmke2f-gjVxtteZsKEjL9b0MTwl0_Ke_Va7Ik9bbRLGSIutkIXjVZgDc84EqWVSK6JCqgllR30qrgN7SLQaXoPt4RVZBQ9SPDaujOVYXK1k7B9zdZHtpFvdryjCyhkX5TKgnT953za9WFepk1pG3zW4EvxjqfTh0f0aCIUDplt3NtbwxRrOn6aCAsBGYBY9XPRxXQV38PsDlZxbHLNHPLESwgagdmUZSg7_iwBLH-oZYjDEHfIl8c3AkjRz7Mnhdxh3wdyqJvspwLPjBwERdHHOKeiaTFJsNFJarL5a0eeRFuUulLFWkMAVVIjD22OZAZukOFMsggv3FcPVMhLbNHLwsmXTA8CwI4xtX1Yr2NvJJESeDUuVcHwHz630-W7KLOiqiOJWpKevV8a6XixeCr_HJtTfALVDlc0rMAGzlDQ5YkKs0YHghHvD3Jewd_vAe58PmlZnoTcfTLN1Xyt3z8LEQwiGfL0; path=/; HttpOnly"
        }, {
          "name" : "X-SourceFiles",
          "value" : "=?UTF-8?B?RDpcVmlydHVhbE9wdGltaXplci1SZWZhY3RvcmluZ1xDcm9wTWV0cmljcy5Wby5BcGlcQ3JvcE1ldHJpY3MuVm8uQXBpXGFwaVxhZG1pblx2MVx1c2Vyc1wzOA==?="
        }, {
          "name" : "X-Powered-By",
          "value" : "ASP.NET"
        }, {
          "name" : "Date",
          "value" : "Fri, 29 Mar 2019 22:14:28 GMT"
        }, {
          "name" : "Content-Length",
          "value" : "0"
        } ],
        "content" : {
          "size" : 0,
          "mimeType" : "",
          "text" : "",
          "encoding" : "base64",
          "comment" : ""
        },
        "redirectURL" : "",
        "headersSize" : 844,
        "bodySize" : 0,
        "comment" : ""
      },
      "cache" : { },
      "timings" : {
        "comment" : "",
        "connect" : -1,
        "wait" : 1860,
        "receive" : 0,
        "dns" : -1,
        "send" : 0,
        "blocked" : -1,
        "ssl" : -1
      },
      "serverIPAddress" : "127.0.0.1",
      "comment" : "",
      "_katalonRequestInformation" : {
        "name" : "67",
        "testObjectId" : "Object Repository/VoPro/Account/api_admin_v1_users_userprofileid",
        "harId" : "6ee208ce-a079-4006-b26d-722f33f4118c"
      },
      "time" : 1861
    } ],
    "comment" : ""
  }
}