{
  "log" : {
    "version" : "1.2",
    "creator" : {
      "name" : "BrowserMob Proxy",
      "version" : "2.1.5",
      "comment" : ""
    },
    "pages" : [ {
      "id" : "Page 0",
      "startedDateTime" : "2019-04-04T00:29:44.260Z",
      "title" : "Page 0",
      "pageTimings" : {
        "onLoad" : 5695,
        "comment" : ""
      },
      "comment" : ""
    } ],
    "entries" : [ {
      "pageref" : "Page 0",
      "startedDateTime" : "2019-04-04T00:29:44.261Z",
      "request" : {
        "method" : "POST",
        "url" : "http://localhost:10520/WebAPI/api/mobile/v1/farms/?",
        "httpVersion" : "HTTP/1.1",
        "cookies" : [ ],
        "headers" : [ {
          "name" : "User-Agent",
          "value" : "Katalon Studio"
        }, {
          "name" : "Content-Type",
          "value" : "application/json"
        }, {
          "name" : "Authorization",
          "value" : "Bearer eyJ0eXAiOiJKV1QiLCJhbGciOiJIUzI1NiJ9.eyJ1bmlxdWVfbmFtZSI6Implbm55Lm1hbGRvbmFkby50eEBnbWFpbC5jb20iLCJyb2xlIjoidXNlciIsInN1YiI6Implbm55Lm1hbGRvbmFkby50eEBnbWFpbC5jb20iLCJpc3MiOiJDcm9wTWV0cmljcyIsImF1ZCI6ImFsbCIsImV4cCI6MTU1NDM0MTY4NCwibmJmIjoxNTU0MzM3Nzg0fQ.6bHWkqHiJUL8iKQ_S0My84NPqbIw_FgzDd4Ge1AQEDk"
        }, {
          "name" : "Host",
          "value" : "localhost:10520"
        }, {
          "name" : "Accept",
          "value" : "text/html, image/gif, image/jpeg, *; q=.2, */*; q=.2"
        }, {
          "name" : "Proxy-Connection",
          "value" : "keep-alive"
        }, {
          "name" : "Content-Length",
          "value" : "76"
        } ],
        "queryString" : [ ],
        "postData" : {
          "mimeType" : "application/json",
          "text" : "{\"name\": \"New Farm with userID different of the user token\", \"user_id\": \"4\"}",
          "comment" : ""
        },
        "headersSize" : 589,
        "bodySize" : 76,
        "comment" : ""
      },
      "response" : {
        "status" : 400,
        "statusText" : "Bad Request",
        "httpVersion" : "HTTP/1.1",
        "cookies" : [ {
          "name" : ".ASPROLES",
          "value" : "ff3DCmZFd7Vs2RwWPINAbofQ1bxADkhBzcGbFjF7IWQlqsJepA_bJ3_VjCvD7wm539m9xTc8rSY4doM-GfHz_haenPo5FXZVKMQ4bGVY8yNmPUYy80i4JTdAzTnuQ4nConI6jlD56VaHOag1qJ4wx66MV7_osXyoXvDywgUINOIYxyB-VwriV1_EDKXKwxAQ_0eIlOUbbgnAeT4vFjecWb5NibQoOv1Mb1K-is7EdAUdKPQiWOY1ASTNg4LgyGrK2EIrfHfjrI6PiPQqwkIfSELtTpd-rLGbpT7bxu3Ei2ZwdBNpWCSfl1aQiYN92AmTfI6CdtV_tIGE62yOsi1kPf2YUpXPdUsbZqqfUp1m6bRQHTCGuUA9Hu1pdAe2lpXV2EwepUapeKS7jnyqi4FFmCHXA30aK8RftOADV3ddqnZDO3QaaqJHBviHw09Hz0Dh54eBDT6P45JL-p0dYCW75wc2BbVoqlLpNsX-S-wRJmwJJROHupnvwa380LKIZccXHDWm2g2",
          "path" : "/",
          "httpOnly" : true,
          "secure" : false,
          "comment" : ""
        } ],
        "headers" : [ {
          "name" : "Cache-Control",
          "value" : "private"
        }, {
          "name" : "Content-Type",
          "value" : "application/json; charset=utf-8"
        }, {
          "name" : "Server",
          "value" : "Microsoft-IIS/10.0"
        }, {
          "name" : "Set-Cookie",
          "value" : ".ASPROLES=ff3DCmZFd7Vs2RwWPINAbofQ1bxADkhBzcGbFjF7IWQlqsJepA_bJ3_VjCvD7wm539m9xTc8rSY4doM-GfHz_haenPo5FXZVKMQ4bGVY8yNmPUYy80i4JTdAzTnuQ4nConI6jlD56VaHOag1qJ4wx66MV7_osXyoXvDywgUINOIYxyB-VwriV1_EDKXKwxAQ_0eIlOUbbgnAeT4vFjecWb5NibQoOv1Mb1K-is7EdAUdKPQiWOY1ASTNg4LgyGrK2EIrfHfjrI6PiPQqwkIfSELtTpd-rLGbpT7bxu3Ei2ZwdBNpWCSfl1aQiYN92AmTfI6CdtV_tIGE62yOsi1kPf2YUpXPdUsbZqqfUp1m6bRQHTCGuUA9Hu1pdAe2lpXV2EwepUapeKS7jnyqi4FFmCHXA30aK8RftOADV3ddqnZDO3QaaqJHBviHw09Hz0Dh54eBDT6P45JL-p0dYCW75wc2BbVoqlLpNsX-S-wRJmwJJROHupnvwa380LKIZccXHDWm2g2; path=/; HttpOnly"
        }, {
          "name" : "X-SourceFiles",
          "value" : "=?UTF-8?B?RDpcVmlydHVhbE9wdGltaXplci1SZWZhY3RvcmluZ1xDcm9wTWV0cmljcy5Wby5BcGlcQ3JvcE1ldHJpY3MuVm8uQXBpXGFwaVxtb2JpbGVcdjFcZmFybXNc?="
        }, {
          "name" : "X-Powered-By",
          "value" : "ASP.NET"
        }, {
          "name" : "Date",
          "value" : "Thu, 04 Apr 2019 00:29:49 GMT"
        }, {
          "name" : "Content-Length",
          "value" : "57"
        } ],
        "content" : {
          "size" : 57,
          "mimeType" : "application/json; charset=utf-8",
          "text" : "{\"message\":\"The request is not valid for a grower role.\"}",
          "comment" : ""
        },
        "redirectURL" : "",
        "headersSize" : 919,
        "bodySize" : 57,
        "comment" : ""
      },
      "cache" : { },
      "timings" : {
        "comment" : "",
        "ssl" : -1,
        "send" : 0,
        "receive" : 0,
        "wait" : 5689,
        "blocked" : -1,
        "dns" : -1,
        "connect" : -1
      },
      "serverIPAddress" : "127.0.0.1",
      "comment" : "",
      "_katalonRequestInformation" : {
        "name" : "49",
        "testObjectId" : "Object Repository/VoGrow/Farm/FarmPost",
        "harId" : "dd678567-cd6a-4ee4-ae93-f50ab14a0e8d"
      },
      "time" : 5690
    } ],
    "comment" : ""
  }
}