{
  "log" : {
    "version" : "1.2",
    "creator" : {
      "name" : "BrowserMob Proxy",
      "version" : "2.1.5",
      "comment" : ""
    },
    "pages" : [ {
      "id" : "Page 0",
      "startedDateTime" : "2019-04-24T20:24:05.822Z",
      "title" : "Page 0",
      "pageTimings" : {
        "onLoad" : 3541,
        "comment" : ""
      },
      "comment" : ""
    } ],
    "entries" : [ {
      "pageref" : "Page 0",
      "startedDateTime" : "2019-04-24T20:24:05.824Z",
      "request" : {
        "method" : "POST",
        "url" : "http://localhost:10520/WebAPI/api/mobile/v1/farms/?",
        "httpVersion" : "HTTP/1.1",
        "cookies" : [ ],
        "headers" : [ {
          "name" : "User-Agent",
          "value" : "Katalon Studio"
        }, {
          "name" : "Content-Type",
          "value" : "application/json"
        }, {
          "name" : "Authorization",
          "value" : "Bearer eyJ0eXAiOiJKV1QiLCJhbGciOiJIUzI1NiJ9.eyJ1bmlxdWVfbmFtZSI6Implbm55Lm1hbGRvbmFkby50eDFAZ21haWwuY29tIiwicm9sZSI6InVzZXIiLCJzdWIiOiJqZW5ueS5tYWxkb25hZG8udHgxQGdtYWlsLmNvbSIsImlzcyI6IkNyb3BNZXRyaWNzIiwiYXVkIjoiYWxsIiwiZXhwIjoxNTU2MTQxMzQ1LCJuYmYiOjE1NTYxMzc0NDV9.WcmJ_6zbxoCt9VAPg5pkXrV7AwVVM45YBmYo_gH-Bu8"
        }, {
          "name" : "Host",
          "value" : "localhost:10520"
        }, {
          "name" : "Accept",
          "value" : "text/html, image/gif, image/jpeg, *; q=.2, */*; q=.2"
        }, {
          "name" : "Proxy-Connection",
          "value" : "keep-alive"
        }, {
          "name" : "Content-Length",
          "value" : "30"
        } ],
        "queryString" : [ ],
        "postData" : {
          "mimeType" : "application/json",
          "text" : "{\"name\": \"    \", \"user_id\": 2}",
          "comment" : ""
        },
        "headersSize" : 591,
        "bodySize" : 30,
        "comment" : ""
      },
      "response" : {
        "status" : 400,
        "statusText" : "Bad Request",
        "httpVersion" : "HTTP/1.1",
        "cookies" : [ {
          "name" : ".ASPROLES",
          "value" : "_8O6c4zH0qiOunuzpodZQk_FbdhO79ACFaoku2GuKS4G86R9NkKt9Sku2lrH9Sfa0-AC2VgmzoxcS9XkFbVMbc33RixkS7xhkkrmXavw7SqaHNLe0ZibxFbHArjmywbg6TVNkAGjIwQVsxrOaSI1o3f2e1Vt-GcFSMDO6pNpfMLHs8DUFkNwC9mBEczIjEUhFi8DlQbTK7EqEouC9T2FAfbkDBI_9eO9d1-FuKLmoIK74PL0AwLRt6G_qkPZyaeGs2YDQy6jVEhwo63S3sjNGHU7U85HXKNOdNfln9KV8ZjfIe34vlIMwkHjelAI9YNmtE3DoyvFnheBd962ep7fTYs8wMAGhypGZ5X8DUC289gwz_VxtdxORyRk-HfhPZebm2-W3LLi5XHfT_RFva5qjV3v3tBRqHYjKtcRkNFpZX2Dg6B6-q_dWyYaL5281LyC6UyQH5JYLBUEtuE7qJLRjQbB2rAMApK2rPF1b74TNrluh4JQr73Ge4x6SoQhLB3YBhAANR_BqTz_NBycRxIZ6IzFh181",
          "path" : "/",
          "httpOnly" : true,
          "secure" : false,
          "comment" : ""
        } ],
        "headers" : [ {
          "name" : "Cache-Control",
          "value" : "private"
        }, {
          "name" : "Content-Type",
          "value" : "application/json; charset=utf-8"
        }, {
          "name" : "Server",
          "value" : "Microsoft-IIS/10.0"
        }, {
          "name" : "Set-Cookie",
          "value" : ".ASPROLES=_8O6c4zH0qiOunuzpodZQk_FbdhO79ACFaoku2GuKS4G86R9NkKt9Sku2lrH9Sfa0-AC2VgmzoxcS9XkFbVMbc33RixkS7xhkkrmXavw7SqaHNLe0ZibxFbHArjmywbg6TVNkAGjIwQVsxrOaSI1o3f2e1Vt-GcFSMDO6pNpfMLHs8DUFkNwC9mBEczIjEUhFi8DlQbTK7EqEouC9T2FAfbkDBI_9eO9d1-FuKLmoIK74PL0AwLRt6G_qkPZyaeGs2YDQy6jVEhwo63S3sjNGHU7U85HXKNOdNfln9KV8ZjfIe34vlIMwkHjelAI9YNmtE3DoyvFnheBd962ep7fTYs8wMAGhypGZ5X8DUC289gwz_VxtdxORyRk-HfhPZebm2-W3LLi5XHfT_RFva5qjV3v3tBRqHYjKtcRkNFpZX2Dg6B6-q_dWyYaL5281LyC6UyQH5JYLBUEtuE7qJLRjQbB2rAMApK2rPF1b74TNrluh4JQr73Ge4x6SoQhLB3YBhAANR_BqTz_NBycRxIZ6IzFh181; path=/; HttpOnly"
        }, {
          "name" : "X-SourceFiles",
          "value" : "=?UTF-8?B?RDpcVmlydHVhbE9wdGltaXplci1SZWZhY3RvcmluZ1xDcm9wTWV0cmljcy5Wby5BcGlcQ3JvcE1ldHJpY3MuVm8uQXBpXGFwaVxtb2JpbGVcdjFcZmFybXNc?="
        }, {
          "name" : "X-Powered-By",
          "value" : "ASP.NET"
        }, {
          "name" : "Date",
          "value" : "Wed, 24 Apr 2019 20:24:09 GMT"
        }, {
          "name" : "Content-Length",
          "value" : "45"
        } ],
        "content" : {
          "size" : 45,
          "mimeType" : "application/json; charset=utf-8",
          "text" : "{\"message\":\"The farm name must be provided.\"}",
          "comment" : ""
        },
        "redirectURL" : "",
        "headersSize" : 940,
        "bodySize" : 45,
        "comment" : ""
      },
      "cache" : { },
      "timings" : {
        "comment" : "",
        "ssl" : -1,
        "blocked" : -1,
        "connect" : -1,
        "receive" : 1,
        "dns" : -1,
        "send" : 0,
        "wait" : 3535
      },
      "serverIPAddress" : "127.0.0.1",
      "comment" : "",
      "_katalonRequestInformation" : {
        "name" : "13",
        "testObjectId" : "Object Repository/VoGrow/Farm/FarmPost",
        "harId" : "effef8a8-f550-441d-8c06-0b31375babf4"
      },
      "time" : 3537
    } ],
    "comment" : ""
  }
}