{
  "log" : {
    "version" : "1.2",
    "creator" : {
      "name" : "BrowserMob Proxy",
      "version" : "2.1.5",
      "comment" : ""
    },
    "pages" : [ {
      "id" : "Page 0",
      "startedDateTime" : "2019-04-11T16:03:51.406Z",
      "title" : "Page 0",
      "pageTimings" : {
        "onLoad" : 3269,
        "comment" : ""
      },
      "comment" : ""
    } ],
    "entries" : [ {
      "pageref" : "Page 0",
      "startedDateTime" : "2019-04-11T16:03:51.408Z",
      "request" : {
        "method" : "POST",
        "url" : "http://localhost:10520/WebAPI/api/mobile/v1/farms/?",
        "httpVersion" : "HTTP/1.1",
        "cookies" : [ ],
        "headers" : [ {
          "name" : "User-Agent",
          "value" : "Katalon Studio"
        }, {
          "name" : "Content-Type",
          "value" : "application/json"
        }, {
          "name" : "Authorization",
          "value" : "Bearer eyJ0eXAiOiJKV1QiLCJhbGciOiJIUzI1NiJ9.eyJ1bmlxdWVfbmFtZSI6Implbm55Lm1hbGRvbmFkby50eDFAZ21haWwuY29tIiwicm9sZSI6InVzZXIiLCJzdWIiOiJqZW5ueS5tYWxkb25hZG8udHgxQGdtYWlsLmNvbSIsImlzcyI6IkNyb3BNZXRyaWNzIiwiYXVkIjoiYWxsIiwiZXhwIjoxNTU1MDAyNTMxLCJuYmYiOjE1NTQ5OTg2MzF9.IMN6N8geDml2s3atgUoxnQdOBbV24vym6yEDiCBmxnc"
        }, {
          "name" : "Host",
          "value" : "localhost:10520"
        }, {
          "name" : "Accept",
          "value" : "text/html, image/gif, image/jpeg, *; q=.2, */*; q=.2"
        }, {
          "name" : "Proxy-Connection",
          "value" : "keep-alive"
        }, {
          "name" : "Content-Length",
          "value" : "33"
        } ],
        "queryString" : [ ],
        "postData" : {
          "mimeType" : "application/json",
          "text" : "{\"name\": \"!@#$%^&\", \"user_id\": 2}",
          "comment" : ""
        },
        "headersSize" : 591,
        "bodySize" : 33,
        "comment" : ""
      },
      "response" : {
        "status" : 400,
        "statusText" : "Bad Request",
        "httpVersion" : "HTTP/1.1",
        "cookies" : [ {
          "name" : ".ASPROLES",
          "value" : "DhDPbaDaOqq12Tvrvl-PnaBmqQL1Mxtulkszztax365cBirNrO6TkATjtGy-yYzc4f2dsUrd7WqfyRGLgPrQgVA3TnGL7DFfOIBDhUrF-vTMYRiIul6NcdDD5XB_lPM_NKsrNsHr-gZ24WZzHhx-bfQF1EpFh5yvKylxT1PFpoznSVEf3zAtM_6jc4KSVQsDNYBoqi6LTy1W9PYE8oUhLGDdBv2DSy70wCqNlX68pqX_aUe84NYiZ9XEz5ivCzEUSOQbyKBaFbCNiAAQGCYkgm5nUMZrIehGulFFDB4oC9pa6LUGciTNfqrt8aYbFlKOn05FfTVBBn0_9sh3LFs2HYF9Ks4RC6qv95eAPf3t4qYIwiE-DXlbrmzsEOtzzE3pXszMUxSHq7Jl7tdoIt8WCtCeFdh7JSqkMD2i4lWFLTFsxrv7Ho_VfkGrxoor5jVxEVmn4zGQWLj3Ecuj2L0t25zqVRTA73RSZkHXCmedaxcrFh4-KfHl9n3xx9yMKwdXT-dJwuLjRx9SFvC7oIY_xKLyGSc1",
          "path" : "/",
          "httpOnly" : true,
          "secure" : false,
          "comment" : ""
        } ],
        "headers" : [ {
          "name" : "Cache-Control",
          "value" : "private"
        }, {
          "name" : "Content-Type",
          "value" : "application/json; charset=utf-8"
        }, {
          "name" : "Server",
          "value" : "Microsoft-IIS/10.0"
        }, {
          "name" : "Set-Cookie",
          "value" : ".ASPROLES=DhDPbaDaOqq12Tvrvl-PnaBmqQL1Mxtulkszztax365cBirNrO6TkATjtGy-yYzc4f2dsUrd7WqfyRGLgPrQgVA3TnGL7DFfOIBDhUrF-vTMYRiIul6NcdDD5XB_lPM_NKsrNsHr-gZ24WZzHhx-bfQF1EpFh5yvKylxT1PFpoznSVEf3zAtM_6jc4KSVQsDNYBoqi6LTy1W9PYE8oUhLGDdBv2DSy70wCqNlX68pqX_aUe84NYiZ9XEz5ivCzEUSOQbyKBaFbCNiAAQGCYkgm5nUMZrIehGulFFDB4oC9pa6LUGciTNfqrt8aYbFlKOn05FfTVBBn0_9sh3LFs2HYF9Ks4RC6qv95eAPf3t4qYIwiE-DXlbrmzsEOtzzE3pXszMUxSHq7Jl7tdoIt8WCtCeFdh7JSqkMD2i4lWFLTFsxrv7Ho_VfkGrxoor5jVxEVmn4zGQWLj3Ecuj2L0t25zqVRTA73RSZkHXCmedaxcrFh4-KfHl9n3xx9yMKwdXT-dJwuLjRx9SFvC7oIY_xKLyGSc1; path=/; HttpOnly"
        }, {
          "name" : "X-SourceFiles",
          "value" : "=?UTF-8?B?RDpcVmlydHVhbE9wdGltaXplci1SZWZhY3RvcmluZ1xDcm9wTWV0cmljcy5Wby5BcGlcQ3JvcE1ldHJpY3MuVm8uQXBpXGFwaVxtb2JpbGVcdjFcZmFybXNc?="
        }, {
          "name" : "X-Powered-By",
          "value" : "ASP.NET"
        }, {
          "name" : "Date",
          "value" : "Thu, 11 Apr 2019 16:03:54 GMT"
        }, {
          "name" : "Content-Length",
          "value" : "97"
        } ],
        "content" : {
          "size" : 97,
          "mimeType" : "application/json; charset=utf-8",
          "text" : "{\"message\":\"The farm name must contain only alphanumeric characters, apostrophes and/or spaces.\"}",
          "comment" : ""
        },
        "redirectURL" : "",
        "headersSize" : 940,
        "bodySize" : 97,
        "comment" : ""
      },
      "cache" : { },
      "timings" : {
        "comment" : "",
        "ssl" : -1,
        "send" : 0,
        "dns" : -1,
        "blocked" : -1,
        "connect" : -1,
        "wait" : 3195,
        "receive" : 0
      },
      "serverIPAddress" : "127.0.0.1",
      "comment" : "",
      "_katalonRequestInformation" : {
        "name" : "21",
        "testObjectId" : "Object Repository/VoGrow/Farm/FarmPost",
        "harId" : "550f47a4-4574-4114-82fe-4e7cb1363765"
      },
      "time" : 3196
    } ],
    "comment" : ""
  }
}