{
  "log" : {
    "version" : "1.2",
    "creator" : {
      "name" : "BrowserMob Proxy",
      "version" : "2.1.5",
      "comment" : ""
    },
    "pages" : [ {
      "id" : "Page 0",
      "startedDateTime" : "2019-03-27T19:53:30.442Z",
      "title" : "Page 0",
      "pageTimings" : {
        "onLoad" : 38,
        "comment" : ""
      },
      "comment" : ""
    } ],
    "entries" : [ {
      "pageref" : "Page 0",
      "startedDateTime" : "2019-03-27T19:53:30.444Z",
      "request" : {
        "method" : "POST",
        "url" : "http://localhost:10520/WebAPI/api/Account/AdministrativeRegister/?",
        "httpVersion" : "HTTP/1.1",
        "cookies" : [ ],
        "headers" : [ {
          "name" : "User-Agent",
          "value" : "Katalon Studio"
        }, {
          "name" : "Content-Type",
          "value" : "application/x-www-form-urlencoded"
        }, {
          "name" : "Authorization",
          "value" : "Bearer eyJ0eXAiOiJKV1QiLCJhbGciOiJIUzI1NiJ9.eyJ1bmlxdWVfbmFtZSI6ImFkbWluIiwicm9sZSI6InVzZXIiLCJzdWIiOiJhZG1pbiIsImlzcyI6IkNyb3BNZXRyaWNzIiwiYXVkIjoiYWxsIiwiZXhwIjoxNTUzNzIwMzEwLCJuYmYiOjE1NTM3MTY0MTB9.Hr2k7HIbZpjL_1EMQZgQ0yw_o53On07HGeMakRNxwW8"
        }, {
          "name" : "Host",
          "value" : "localhost:10520"
        }, {
          "name" : "Accept",
          "value" : "text/html, image/gif, image/jpeg, *; q=.2, */*; q=.2"
        }, {
          "name" : "Proxy-Connection",
          "value" : "keep-alive"
        }, {
          "name" : "Content-Length",
          "value" : "389"
        } ],
        "queryString" : [ ],
        "postData" : {
          "mimeType" : "application/x-www-form-urlencoded",
          "params" : [ {
            "name" : "username",
            "value" : "kuserlesspass",
            "comment" : ""
          }, {
            "name" : "password",
            "value" : "lessp",
            "comment" : ""
          }, {
            "name" : "confirmPassword",
            "value" : "cropmetrics",
            "comment" : ""
          }, {
            "name" : "email",
            "value" : "cropmetricsvo@gmail.com",
            "comment" : ""
          }, {
            "name" : "fullname",
            "value" : "test validation",
            "comment" : ""
          }, {
            "name" : "phone",
            "value" : "123",
            "comment" : ""
          }, {
            "name" : "dealer",
            "value" : "dealer test validation",
            "comment" : ""
          }, {
            "name" : "addressLine1",
            "value" : "address line 1 test validation",
            "comment" : ""
          }, {
            "name" : "addressLine2",
            "value" : "address line 1 test validation",
            "comment" : ""
          }, {
            "name" : "town",
            "value" : "townValidation",
            "comment" : ""
          }, {
            "name" : "state",
            "value" : "stateValidation",
            "comment" : ""
          }, {
            "name" : "zip",
            "value" : "zipValidation",
            "comment" : ""
          }, {
            "name" : "country",
            "value" : "countryValidation",
            "comment" : ""
          }, {
            "name" : "roles",
            "value" : "Client",
            "comment" : ""
          }, {
            "name" : "modifierUsername",
            "value" : "admin",
            "comment" : ""
          }, {
            "name" : "modifierUserId",
            "value" : "1",
            "comment" : ""
          } ],
          "comment" : ""
        },
        "headersSize" : 560,
        "bodySize" : 389,
        "comment" : ""
      },
      "response" : {
        "status" : 400,
        "statusText" : "Bad Request",
        "httpVersion" : "HTTP/1.1",
        "cookies" : [ {
          "name" : ".ASPROLES",
          "value" : "75xQVBZ7yZWawgmgDSE1qvXIecX82yjHhYQVCd12dEF4_kAcyeMr5EWCpDIXPXQKbn6EYJjuILtkAsze-KmL23MRafIpR_6xyiMxicmTuQwX8cp6i__Y0S8uKM16rNoFtdlWXIZYL4Armu8z50xHP9hZQgMgUGDvyh9ejQ8rS_azOwhWTyJ3hJ7je2W2xv1-uVzdVDG2NpRmvQy-RNv_aMM3QjncdP5X3A_tnTEJxHCa5M3jrTWqkRrWxAV3cA1B9DysI6QSkRbvIN5BSSxH3u-NtzjPX61aYM7-DO1-QORCUOuods7VgdEKjwH2CooqWtyV51uw9CjvwEsPIJszp42V_h-vbB2NS-MOTCk5VE4FrCbTbWxZSsOcwK4Ty5f3F1D7VOE-mkYUSx6xYk2quFFQGeKu8fP7DDjbdrOF00MzOQwVKrpnY6J8bt0RVpzOMDOoE49HIrBM1AF9KqwQaetCGcuA7d-attYxwMM2aTTksIKO0",
          "path" : "/",
          "httpOnly" : true,
          "secure" : false,
          "comment" : ""
        } ],
        "headers" : [ {
          "name" : "Cache-Control",
          "value" : "private"
        }, {
          "name" : "Content-Type",
          "value" : "application/json; charset=utf-8"
        }, {
          "name" : "Server",
          "value" : "Microsoft-IIS/10.0"
        }, {
          "name" : "Set-Cookie",
          "value" : ".ASPROLES=75xQVBZ7yZWawgmgDSE1qvXIecX82yjHhYQVCd12dEF4_kAcyeMr5EWCpDIXPXQKbn6EYJjuILtkAsze-KmL23MRafIpR_6xyiMxicmTuQwX8cp6i__Y0S8uKM16rNoFtdlWXIZYL4Armu8z50xHP9hZQgMgUGDvyh9ejQ8rS_azOwhWTyJ3hJ7je2W2xv1-uVzdVDG2NpRmvQy-RNv_aMM3QjncdP5X3A_tnTEJxHCa5M3jrTWqkRrWxAV3cA1B9DysI6QSkRbvIN5BSSxH3u-NtzjPX61aYM7-DO1-QORCUOuods7VgdEKjwH2CooqWtyV51uw9CjvwEsPIJszp42V_h-vbB2NS-MOTCk5VE4FrCbTbWxZSsOcwK4Ty5f3F1D7VOE-mkYUSx6xYk2quFFQGeKu8fP7DDjbdrOF00MzOQwVKrpnY6J8bt0RVpzOMDOoE49HIrBM1AF9KqwQaetCGcuA7d-attYxwMM2aTTksIKO0; path=/; HttpOnly"
        }, {
          "name" : "X-SourceFiles",
          "value" : "=?UTF-8?B?RDpcVmlydHVhbE9wdGltaXplci1SZWZhY3RvcmluZ1xDcm9wTWV0cmljcy5Wby5BcGlcQ3JvcE1ldHJpY3MuVm8uQXBpXGFwaVxBY2NvdW50XEFkbWluaXN0cmF0aXZlUmVnaXN0ZXJc?="
        }, {
          "name" : "X-Powered-By",
          "value" : "ASP.NET"
        }, {
          "name" : "Date",
          "value" : "Wed, 27 Mar 2019 19:53:29 GMT"
        }, {
          "name" : "Content-Length",
          "value" : "105"
        } ],
        "content" : {
          "size" : 105,
          "mimeType" : "application/json; charset=utf-8",
          "text" : "{\"message\":\"The request is invalid.\",\"modelState\":{\"error\":[\"Passwords must be at least 6 characters.\"]}}",
          "comment" : ""
        },
        "redirectURL" : "",
        "headersSize" : 918,
        "bodySize" : 105,
        "comment" : ""
      },
      "cache" : { },
      "timings" : {
        "comment" : "",
        "ssl" : -1,
        "send" : 0,
        "receive" : 0,
        "wait" : 32,
        "connect" : -1,
        "blocked" : -1,
        "dns" : -1
      },
      "serverIPAddress" : "127.0.0.1",
      "comment" : "",
      "_katalonRequestInformation" : {
        "name" : "43",
        "testObjectId" : "Object Repository/VoPro/Account/AdministrativeRegister",
        "harId" : "8022ab45-5639-4c67-8062-18ba8e08ba15"
      },
      "time" : 33
    } ],
    "comment" : ""
  }
}