{
  "log" : {
    "version" : "1.2",
    "creator" : {
      "name" : "BrowserMob Proxy",
      "version" : "2.1.5",
      "comment" : ""
    },
    "pages" : [ {
      "id" : "Page 0",
      "startedDateTime" : "2019-03-29T22:38:47.910Z",
      "title" : "Page 0",
      "pageTimings" : {
        "onLoad" : 22,
        "comment" : ""
      },
      "comment" : ""
    } ],
    "entries" : [ {
      "pageref" : "Page 0",
      "startedDateTime" : "2019-03-29T22:38:47.911Z",
      "request" : {
        "method" : "POST",
        "url" : "http://localhost:10520/WebAPI/api/admin/v1/users/?",
        "httpVersion" : "HTTP/1.1",
        "cookies" : [ ],
        "headers" : [ {
          "name" : "User-Agent",
          "value" : "Katalon Studio"
        }, {
          "name" : "Content-Type",
          "value" : "application/x-www-form-urlencoded"
        }, {
          "name" : "Authorization",
          "value" : "Bearer eyJ0eXAiOiJKV1QiLCJhbGciOiJIUzI1NiJ9.eyJ1bmlxdWVfbmFtZSI6ImFkbWluIiwicm9sZSI6InVzZXIiLCJzdWIiOiJhZG1pbiIsImlzcyI6IkNyb3BNZXRyaWNzIiwiYXVkIjoiYWxsIiwiZXhwIjoxNTUzOTAzMDI3LCJuYmYiOjE1NTM4OTkxMjd9.Rut9fhUSJRyKPMorGqIpExgDySmSFCWn3toKeUpQDZs"
        }, {
          "name" : "Host",
          "value" : "localhost:10520"
        }, {
          "name" : "Accept",
          "value" : "text/html, image/gif, image/jpeg, *; q=.2, */*; q=.2"
        }, {
          "name" : "Proxy-Connection",
          "value" : "keep-alive"
        }, {
          "name" : "Content-Length",
          "value" : "263"
        } ],
        "queryString" : [ ],
        "postData" : {
          "mimeType" : "application/x-www-form-urlencoded",
          "params" : [ {
            "name" : "password",
            "value" : "cropmetrics",
            "comment" : ""
          }, {
            "name" : "email",
            "value" : "cropmetricsvo.rolenumber@gmail.com",
            "comment" : ""
          }, {
            "name" : "fullname",
            "value" : "test validation",
            "comment" : ""
          }, {
            "name" : "phone",
            "value" : "123",
            "comment" : ""
          }, {
            "name" : "dealer",
            "value" : "x",
            "comment" : ""
          }, {
            "name" : "addressLine1",
            "value" : "address line 1 test validation",
            "comment" : ""
          }, {
            "name" : "addressLine2",
            "value" : "address line 2 test validation",
            "comment" : ""
          }, {
            "name" : "town",
            "value" : "townValidation",
            "comment" : ""
          }, {
            "name" : "state",
            "value" : "stateValidation",
            "comment" : ""
          }, {
            "name" : "zip",
            "value" : "xx",
            "comment" : ""
          }, {
            "name" : "country",
            "value" : "xx",
            "comment" : ""
          }, {
            "name" : "roles",
            "value" : "1",
            "comment" : ""
          } ],
          "comment" : ""
        },
        "headersSize" : 544,
        "bodySize" : 263,
        "comment" : ""
      },
      "response" : {
        "status" : 400,
        "statusText" : "Bad Request",
        "httpVersion" : "HTTP/1.1",
        "cookies" : [ {
          "name" : ".ASPROLES",
          "value" : "y1b4JOU8bwO_mLw1_9DG3GliagRSW6A8NaSgDEtXbVCwXoGGVkOBZHj_61t4XHkqL0BqFGEry0bE9oKc5ZVQ9HQ4R32wRTVOnrWaKltE9e64hCtVco__9cekbgTGDjhW2-09pqvz2ndnr1_ckWXFZ3wNabKXUuT4rSJMHgYkPUuWhUkJKSfONmcLhu2qWJNdTsMPD3sea3cdeeNcMMV1mw7MbDF9GYw6T5IJtC4UrUgAxs1jWeuP8wUjvM33mQHB93A1YqmFPGalePOoD8VWjIGuslEnU4DDrFedcC0yvV9ZHM4-eoPNEjAIpcfanvIaNd76C7VrXvefRJBGHIgpuriQHFn0zTIasY4tDAj12c6m03WrynIfUsIqFbziUBSZhQaU4P7tVmyWuHOuSi7SDoaOWHa_O2XCYDST7UH7ntBMm78-IVKkmdIVqnxO4DjDF1n1k9KedGOm8THI88U3a9CRCjkRsF8oEuOkwFdbmMg4sTUK0",
          "path" : "/",
          "httpOnly" : true,
          "secure" : false,
          "comment" : ""
        } ],
        "headers" : [ {
          "name" : "Cache-Control",
          "value" : "private"
        }, {
          "name" : "Content-Type",
          "value" : "application/json; charset=utf-8"
        }, {
          "name" : "Server",
          "value" : "Microsoft-IIS/10.0"
        }, {
          "name" : "Set-Cookie",
          "value" : ".ASPROLES=y1b4JOU8bwO_mLw1_9DG3GliagRSW6A8NaSgDEtXbVCwXoGGVkOBZHj_61t4XHkqL0BqFGEry0bE9oKc5ZVQ9HQ4R32wRTVOnrWaKltE9e64hCtVco__9cekbgTGDjhW2-09pqvz2ndnr1_ckWXFZ3wNabKXUuT4rSJMHgYkPUuWhUkJKSfONmcLhu2qWJNdTsMPD3sea3cdeeNcMMV1mw7MbDF9GYw6T5IJtC4UrUgAxs1jWeuP8wUjvM33mQHB93A1YqmFPGalePOoD8VWjIGuslEnU4DDrFedcC0yvV9ZHM4-eoPNEjAIpcfanvIaNd76C7VrXvefRJBGHIgpuriQHFn0zTIasY4tDAj12c6m03WrynIfUsIqFbziUBSZhQaU4P7tVmyWuHOuSi7SDoaOWHa_O2XCYDST7UH7ntBMm78-IVKkmdIVqnxO4DjDF1n1k9KedGOm8THI88U3a9CRCjkRsF8oEuOkwFdbmMg4sTUK0; path=/; HttpOnly"
        }, {
          "name" : "X-SourceFiles",
          "value" : "=?UTF-8?B?RDpcVmlydHVhbE9wdGltaXplci1SZWZhY3RvcmluZ1xDcm9wTWV0cmljcy5Wby5BcGlcQ3JvcE1ldHJpY3MuVm8uQXBpXGFwaVxhZG1pblx2MVx1c2Vyc1w=?="
        }, {
          "name" : "X-Powered-By",
          "value" : "ASP.NET"
        }, {
          "name" : "Date",
          "value" : "Fri, 29 Mar 2019 22:38:47 GMT"
        }, {
          "name" : "Content-Length",
          "value" : "85"
        } ],
        "content" : {
          "size" : 85,
          "mimeType" : "application/json; charset=utf-8",
          "text" : "{\"message\":\"The request is invalid. The role  1 requested to assign is not a valid.\"}",
          "comment" : ""
        },
        "redirectURL" : "",
        "headersSize" : 897,
        "bodySize" : 85,
        "comment" : ""
      },
      "cache" : { },
      "timings" : {
        "comment" : "",
        "ssl" : -1,
        "wait" : 17,
        "receive" : 0,
        "send" : 0,
        "connect" : -1,
        "dns" : -1,
        "blocked" : -1
      },
      "serverIPAddress" : "127.0.0.1",
      "comment" : "",
      "_katalonRequestInformation" : {
        "name" : "101",
        "testObjectId" : "Object Repository/VoPro/Account/api_admin_v1_users",
        "harId" : "58fbdeef-a837-4508-a541-cafd35ca8bcd"
      },
      "time" : 18
    } ],
    "comment" : ""
  }
}