{
  "log" : {
    "version" : "1.2",
    "creator" : {
      "name" : "BrowserMob Proxy",
      "version" : "2.1.5",
      "comment" : ""
    },
    "pages" : [ {
      "id" : "Page 0",
      "startedDateTime" : "2019-03-29T19:40:43.995Z",
      "title" : "Page 0",
      "pageTimings" : {
        "onLoad" : 2769,
        "comment" : ""
      },
      "comment" : ""
    } ],
    "entries" : [ {
      "pageref" : "Page 0",
      "startedDateTime" : "2019-03-29T19:40:43.996Z",
      "request" : {
        "method" : "POST",
        "url" : "http://localhost:10520/WebAPI/api/admin/v1/users/?",
        "httpVersion" : "HTTP/1.1",
        "cookies" : [ ],
        "headers" : [ {
          "name" : "User-Agent",
          "value" : "Katalon Studio"
        }, {
          "name" : "Content-Type",
          "value" : "application/x-www-form-urlencoded"
        }, {
          "name" : "Authorization",
          "value" : "Bearer eyJ0eXAiOiJKV1QiLCJhbGciOiJIUzI1NiJ9.eyJ1bmlxdWVfbmFtZSI6ImFkbWluIiwicm9sZSI6InVzZXIiLCJzdWIiOiJhZG1pbiIsImlzcyI6IkNyb3BNZXRyaWNzIiwiYXVkIjoiYWxsIiwiZXhwIjoxNTUzODkyMzQzLCJuYmYiOjE1NTM4ODg0NDN9.7YS39kfrXkArwKmjpMf0Y96KtmxMzG6Wf8sTJwxaKpk"
        }, {
          "name" : "Host",
          "value" : "localhost:10520"
        }, {
          "name" : "Accept",
          "value" : "text/html, image/gif, image/jpeg, *; q=.2, */*; q=.2"
        }, {
          "name" : "Proxy-Connection",
          "value" : "keep-alive"
        }, {
          "name" : "Content-Length",
          "value" : "306"
        } ],
        "queryString" : [ ],
        "postData" : {
          "mimeType" : "application/x-www-form-urlencoded",
          "params" : [ {
            "name" : "password",
            "value" : "cropmetrics",
            "comment" : ""
          }, {
            "name" : "email",
            "value" : "cropmetricsvo.zipsymbol@gmail.com",
            "comment" : ""
          }, {
            "name" : "fullname",
            "value" : "test validation",
            "comment" : ""
          }, {
            "name" : "phone",
            "value" : "123",
            "comment" : ""
          }, {
            "name" : "dealer",
            "value" : "x",
            "comment" : ""
          }, {
            "name" : "addressLine1",
            "value" : "address line 1 test validation",
            "comment" : ""
          }, {
            "name" : "addressLine2",
            "value" : "address line 12 test validation",
            "comment" : ""
          }, {
            "name" : "town",
            "value" : "townValidation",
            "comment" : ""
          }, {
            "name" : "state",
            "value" : "stateValidation",
            "comment" : ""
          }, {
            "name" : "zip",
            "value" : "!@#$%^&*(",
            "comment" : ""
          }, {
            "name" : "country",
            "value" : "countryValidation",
            "comment" : ""
          }, {
            "name" : "roles",
            "value" : "Client",
            "comment" : ""
          } ],
          "comment" : ""
        },
        "headersSize" : 544,
        "bodySize" : 306,
        "comment" : ""
      },
      "response" : {
        "status" : 200,
        "statusText" : "OK",
        "httpVersion" : "HTTP/1.1",
        "cookies" : [ {
          "name" : ".ASPROLES",
          "value" : "ovuAZmj3pAm4lRM4OwDIJAv9e6MjYie8ldNHyFuk29dSJR9bmvILhVxiaW0xcxkspDVTGQYzDBXbyCdtwEOqwsIj2kD_XRWDb03iTYkWcY87fUtA2IZekTYm1PFB66bxrOxRroIMkh-MITeRGPsgrzII3jFj4gPvMmZPgWHf35BqfeNxKQLM3Zx5iqZWtyaEdRzZXTolJLCHu_eCXVWoPhyc1aQJSrA_4CGAqEGhpMIqSo0L_kDeDUTOcHfPIXLxeHUORbKwXO-HXmwF2Ffv49kUceXr3rvn-HAQO3-9E-a_JLP8Jnrzy7pfmTsYgrGWOTa2Kg6jtxkVxf9K5dXmQsy0ZK5wG_M1GED4oXTgzFwDP6N05jNijSPVPhmhdjfEN9ATl3cJbOuBT1x7jF21PFjcLVxLLQbTa6y1qNJ-S5jgQvRXGKZOTWkKhnURy2AC6V5bsGG-ihJSiFV7PSUUlTQQkF21FH6-sJ81pOp7pf2xPgdJ0",
          "path" : "/",
          "httpOnly" : true,
          "secure" : false,
          "comment" : ""
        } ],
        "headers" : [ {
          "name" : "Cache-Control",
          "value" : "private"
        }, {
          "name" : "Content-Type",
          "value" : "application/json; charset=utf-8"
        }, {
          "name" : "Server",
          "value" : "Microsoft-IIS/10.0"
        }, {
          "name" : "Set-Cookie",
          "value" : ".ASPROLES=ovuAZmj3pAm4lRM4OwDIJAv9e6MjYie8ldNHyFuk29dSJR9bmvILhVxiaW0xcxkspDVTGQYzDBXbyCdtwEOqwsIj2kD_XRWDb03iTYkWcY87fUtA2IZekTYm1PFB66bxrOxRroIMkh-MITeRGPsgrzII3jFj4gPvMmZPgWHf35BqfeNxKQLM3Zx5iqZWtyaEdRzZXTolJLCHu_eCXVWoPhyc1aQJSrA_4CGAqEGhpMIqSo0L_kDeDUTOcHfPIXLxeHUORbKwXO-HXmwF2Ffv49kUceXr3rvn-HAQO3-9E-a_JLP8Jnrzy7pfmTsYgrGWOTa2Kg6jtxkVxf9K5dXmQsy0ZK5wG_M1GED4oXTgzFwDP6N05jNijSPVPhmhdjfEN9ATl3cJbOuBT1x7jF21PFjcLVxLLQbTa6y1qNJ-S5jgQvRXGKZOTWkKhnURy2AC6V5bsGG-ihJSiFV7PSUUlTQQkF21FH6-sJ81pOp7pf2xPgdJ0; path=/; HttpOnly"
        }, {
          "name" : "X-SourceFiles",
          "value" : "=?UTF-8?B?RDpcVmlydHVhbE9wdGltaXplci1SZWZhY3RvcmluZ1xDcm9wTWV0cmljcy5Wby5BcGlcQ3JvcE1ldHJpY3MuVm8uQXBpXGFwaVxhZG1pblx2MVx1c2Vyc1w=?="
        }, {
          "name" : "X-Powered-By",
          "value" : "ASP.NET"
        }, {
          "name" : "Date",
          "value" : "Fri, 29 Mar 2019 19:40:46 GMT"
        }, {
          "name" : "Content-Length",
          "value" : "9"
        } ],
        "content" : {
          "size" : 9,
          "mimeType" : "application/json; charset=utf-8",
          "text" : "{\"id\":33}",
          "comment" : ""
        },
        "redirectURL" : "",
        "headersSize" : 887,
        "bodySize" : 9,
        "comment" : ""
      },
      "cache" : { },
      "timings" : {
        "comment" : "",
        "ssl" : -1,
        "send" : 0,
        "receive" : 0,
        "wait" : 2764,
        "connect" : -1,
        "blocked" : -1,
        "dns" : -1
      },
      "serverIPAddress" : "127.0.0.1",
      "comment" : "",
      "_katalonRequestInformation" : {
        "name" : "87",
        "testObjectId" : "Object Repository/VoPro/Account/api_admin_v1_users",
        "harId" : "ab64cda2-c32a-4741-b3c7-f8899635fb2f"
      },
      "time" : 2765
    } ],
    "comment" : ""
  }
}