{
  "log" : {
    "version" : "1.2",
    "creator" : {
      "name" : "BrowserMob Proxy",
      "version" : "2.1.5",
      "comment" : ""
    },
    "pages" : [ {
      "id" : "Page 0",
      "startedDateTime" : "2019-03-29T21:49:37.980Z",
      "title" : "Page 0",
      "pageTimings" : {
        "onLoad" : 1838,
        "comment" : ""
      },
      "comment" : ""
    } ],
    "entries" : [ {
      "pageref" : "Page 0",
      "startedDateTime" : "2019-03-29T21:49:37.981Z",
      "request" : {
        "method" : "PUT",
        "url" : "http://localhost:10520/WebAPI/api/admin/v1/users/38?",
        "httpVersion" : "HTTP/1.1",
        "cookies" : [ ],
        "headers" : [ {
          "name" : "User-Agent",
          "value" : "Katalon Studio"
        }, {
          "name" : "Content-Type",
          "value" : "application/x-www-form-urlencoded"
        }, {
          "name" : "Authorization",
          "value" : "Bearer eyJ0eXAiOiJKV1QiLCJhbGciOiJIUzI1NiJ9.eyJ1bmlxdWVfbmFtZSI6ImFkbWluIiwicm9sZSI6InVzZXIiLCJzdWIiOiJhZG1pbiIsImlzcyI6IkNyb3BNZXRyaWNzIiwiYXVkIjoiYWxsIiwiZXhwIjoxNTUzOTAwMDc3LCJuYmYiOjE1NTM4OTYxNzd9.E215pW1Q8maC6iaZgOGFxKoFzuImt7zLjFnucyGzwDc"
        }, {
          "name" : "Host",
          "value" : "localhost:10520"
        }, {
          "name" : "Accept",
          "value" : "text/html, image/gif, image/jpeg, *; q=.2, */*; q=.2"
        }, {
          "name" : "Proxy-Connection",
          "value" : "keep-alive"
        }, {
          "name" : "Content-Length",
          "value" : "304"
        } ],
        "queryString" : [ ],
        "postData" : {
          "mimeType" : "application/x-www-form-urlencoded",
          "params" : [ {
            "name" : "password",
            "value" : "cropmetrics",
            "comment" : ""
          }, {
            "name" : "email",
            "value" : "cropmetricsvo.countrysymbonls@gmail.com",
            "comment" : ""
          }, {
            "name" : "fullname",
            "value" : "test validation",
            "comment" : ""
          }, {
            "name" : "phone",
            "value" : "123",
            "comment" : ""
          }, {
            "name" : "dealer",
            "value" : "x",
            "comment" : ""
          }, {
            "name" : "addressLine1",
            "value" : "address line 1 test validation",
            "comment" : ""
          }, {
            "name" : "addressLine2",
            "value" : "address line 2 test validation",
            "comment" : ""
          }, {
            "name" : "town",
            "value" : "townValidation",
            "comment" : ""
          }, {
            "name" : "state",
            "value" : "stateValidation",
            "comment" : ""
          }, {
            "name" : "zip",
            "value" : "123457",
            "comment" : ""
          }, {
            "name" : "country",
            "value" : "!!!!",
            "comment" : ""
          }, {
            "name" : "roles",
            "value" : "Client",
            "comment" : ""
          }, {
            "name" : "userProfileId",
            "value" : "38",
            "comment" : ""
          } ],
          "comment" : ""
        },
        "headersSize" : 545,
        "bodySize" : 304,
        "comment" : ""
      },
      "response" : {
        "status" : 200,
        "statusText" : "OK",
        "httpVersion" : "HTTP/1.1",
        "cookies" : [ {
          "name" : ".ASPROLES",
          "value" : "qpSqlNKdwSGZpt6FEdDK-VCpiHNd2a-eZkoQGKCcFUASyN3Cl22OSJRAoTyrzc3kAdmTcDiHlF8tWPGidBWMMWsp13zM7wqBLVf3pgpJhRkAQ_kjWb0n46-a8KFt0R59dNgG82Tfq2nxGF-yVQh7pvFxwpmy_xt6uT3sD1B3R4hJp3IhWL6690URdCT8l0UvkNFPxEKtKRoN3o9bD7F6Aaky4fFKbVei9hYYO07ItLcI6Z9e0EoqdFmezRS_0Q1xrrRscAKlBs0SFDpCW1zaRHHOEqce_lJoP3Fz1UQ5yOeE61r41GPJGZWF-qurxU6jnmn3TS2LEGeN4pZOUHZbIHn3UUfCAQEr_45on47dMlg1lH5yBb3UCY5AxnHed6B4unNJIaGUWMmrvvMJqjgAWrx1rXvM0fYO89SVbfUqKsLoWFdTtsljzNJps6guo83ZBW2c8QxRr1U8oTlBFASxX4jisHJW9-6bXZb4h7hOq87-J0Y80",
          "path" : "/",
          "httpOnly" : true,
          "secure" : false,
          "comment" : ""
        } ],
        "headers" : [ {
          "name" : "Cache-Control",
          "value" : "private"
        }, {
          "name" : "Server",
          "value" : "Microsoft-IIS/10.0"
        }, {
          "name" : "Set-Cookie",
          "value" : ".ASPROLES=qpSqlNKdwSGZpt6FEdDK-VCpiHNd2a-eZkoQGKCcFUASyN3Cl22OSJRAoTyrzc3kAdmTcDiHlF8tWPGidBWMMWsp13zM7wqBLVf3pgpJhRkAQ_kjWb0n46-a8KFt0R59dNgG82Tfq2nxGF-yVQh7pvFxwpmy_xt6uT3sD1B3R4hJp3IhWL6690URdCT8l0UvkNFPxEKtKRoN3o9bD7F6Aaky4fFKbVei9hYYO07ItLcI6Z9e0EoqdFmezRS_0Q1xrrRscAKlBs0SFDpCW1zaRHHOEqce_lJoP3Fz1UQ5yOeE61r41GPJGZWF-qurxU6jnmn3TS2LEGeN4pZOUHZbIHn3UUfCAQEr_45on47dMlg1lH5yBb3UCY5AxnHed6B4unNJIaGUWMmrvvMJqjgAWrx1rXvM0fYO89SVbfUqKsLoWFdTtsljzNJps6guo83ZBW2c8QxRr1U8oTlBFASxX4jisHJW9-6bXZb4h7hOq87-J0Y80; path=/; HttpOnly"
        }, {
          "name" : "X-SourceFiles",
          "value" : "=?UTF-8?B?RDpcVmlydHVhbE9wdGltaXplci1SZWZhY3RvcmluZ1xDcm9wTWV0cmljcy5Wby5BcGlcQ3JvcE1ldHJpY3MuVm8uQXBpXGFwaVxhZG1pblx2MVx1c2Vyc1wzOA==?="
        }, {
          "name" : "X-Powered-By",
          "value" : "ASP.NET"
        }, {
          "name" : "Date",
          "value" : "Fri, 29 Mar 2019 21:49:39 GMT"
        }, {
          "name" : "Content-Length",
          "value" : "0"
        } ],
        "content" : {
          "size" : 0,
          "mimeType" : "",
          "text" : "",
          "encoding" : "base64",
          "comment" : ""
        },
        "redirectURL" : "",
        "headersSize" : 844,
        "bodySize" : 0,
        "comment" : ""
      },
      "cache" : { },
      "timings" : {
        "comment" : "",
        "ssl" : -1,
        "receive" : 0,
        "send" : 0,
        "wait" : 1834,
        "dns" : -1,
        "connect" : -1,
        "blocked" : -1
      },
      "serverIPAddress" : "127.0.0.1",
      "comment" : "",
      "_katalonRequestInformation" : {
        "name" : "67",
        "testObjectId" : "Object Repository/VoPro/Account/api_admin_v1_users_userprofileid",
        "harId" : "d7cdb9b7-1887-424d-a582-140e7f948e1e"
      },
      "time" : 1835
    } ],
    "comment" : ""
  }
}