{
  "log" : {
    "version" : "1.2",
    "creator" : {
      "name" : "BrowserMob Proxy",
      "version" : "2.1.5",
      "comment" : ""
    },
    "pages" : [ {
      "id" : "Page 0",
      "startedDateTime" : "2019-03-29T22:37:48.993Z",
      "title" : "Page 0",
      "pageTimings" : {
        "onLoad" : 1852,
        "comment" : ""
      },
      "comment" : ""
    } ],
    "entries" : [ {
      "pageref" : "Page 0",
      "startedDateTime" : "2019-03-29T22:37:48.994Z",
      "request" : {
        "method" : "POST",
        "url" : "http://localhost:10520/WebAPI/api/admin/v1/users/?",
        "httpVersion" : "HTTP/1.1",
        "cookies" : [ ],
        "headers" : [ {
          "name" : "User-Agent",
          "value" : "Katalon Studio"
        }, {
          "name" : "Content-Type",
          "value" : "application/x-www-form-urlencoded"
        }, {
          "name" : "Authorization",
          "value" : "Bearer eyJ0eXAiOiJKV1QiLCJhbGciOiJIUzI1NiJ9.eyJ1bmlxdWVfbmFtZSI6ImFkbWluIiwicm9sZSI6InVzZXIiLCJzdWIiOiJhZG1pbiIsImlzcyI6IkNyb3BNZXRyaWNzIiwiYXVkIjoiYWxsIiwiZXhwIjoxNTUzOTAyOTY4LCJuYmYiOjE1NTM4OTkwNjh9.QdQV8WvkHjVDJZrkX2bFGgnRrtyoYLAzYAjMtoRhEwU"
        }, {
          "name" : "Host",
          "value" : "localhost:10520"
        }, {
          "name" : "Accept",
          "value" : "text/html, image/gif, image/jpeg, *; q=.2, */*; q=.2"
        }, {
          "name" : "Proxy-Connection",
          "value" : "keep-alive"
        }, {
          "name" : "Content-Length",
          "value" : "289"
        } ],
        "queryString" : [ ],
        "postData" : {
          "mimeType" : "application/x-www-form-urlencoded",
          "params" : [ {
            "name" : "password",
            "value" : "123456",
            "comment" : ""
          }, {
            "name" : "email",
            "value" : "cropmetricsvo.pass6chars@gmail.com",
            "comment" : ""
          }, {
            "name" : "fullname",
            "value" : "test validation",
            "comment" : ""
          }, {
            "name" : "phone",
            "value" : "123",
            "comment" : ""
          }, {
            "name" : "dealer",
            "value" : "x",
            "comment" : ""
          }, {
            "name" : "addressLine1",
            "value" : "address line 1 test validation",
            "comment" : ""
          }, {
            "name" : "addressLine2",
            "value" : "address line 2 test validation",
            "comment" : ""
          }, {
            "name" : "town",
            "value" : "townValidation",
            "comment" : ""
          }, {
            "name" : "state",
            "value" : "stateValidation",
            "comment" : ""
          }, {
            "name" : "zip",
            "value" : "zipValidation",
            "comment" : ""
          }, {
            "name" : "country",
            "value" : "countryValidation",
            "comment" : ""
          }, {
            "name" : "roles",
            "value" : "Client",
            "comment" : ""
          } ],
          "comment" : ""
        },
        "headersSize" : 544,
        "bodySize" : 289,
        "comment" : ""
      },
      "response" : {
        "status" : 200,
        "statusText" : "OK",
        "httpVersion" : "HTTP/1.1",
        "cookies" : [ {
          "name" : ".ASPROLES",
          "value" : "phJil6eJe37tU5BdhR_hi4BGhCHdr2qvyNs5RhGrbMs9c0OaJZXZ-r-qLPByDqPvWzaIIFxgpHrlRCNU-IkUN4QE4Z4urwyUrbRe3V9uUt2pcz-oVtJ9Tczr6YLSd-cUE6W1-X0db1nH4pxIvMqcUHEhIw-bBXHaDXnpffZZIZaZDIZPDj7SdpANJnq1b3RoPck1MmzQidC0v9DWABMBtX9G7p37mbfJ_d2YnYj3esLtuyl8VFuc6vkA7LxYZUJ4bNUtEYa0lXOpvrGNVwvcSffpgL4dt7DXVAJepcGptNoSNYj80jBdIgTE7v7hEt5hhx1WJ-LuBRdscZiaQpGKiBKXfqmfHyBUQc2oOKA2cRvDigJ7V7k8DhPZDqL-V1k9hA37d9c6fH8cG9gJoKrWQg6nefNvdt-u1dhbw0qqr2UvhW93ArVfYPC7_eyMD4qw0IMUiM2QmzBrMSJuBrdytllsbbWo86MMhPSeCnVUoNyrbmJX0",
          "path" : "/",
          "httpOnly" : true,
          "secure" : false,
          "comment" : ""
        } ],
        "headers" : [ {
          "name" : "Cache-Control",
          "value" : "private"
        }, {
          "name" : "Content-Type",
          "value" : "application/json; charset=utf-8"
        }, {
          "name" : "Server",
          "value" : "Microsoft-IIS/10.0"
        }, {
          "name" : "Set-Cookie",
          "value" : ".ASPROLES=phJil6eJe37tU5BdhR_hi4BGhCHdr2qvyNs5RhGrbMs9c0OaJZXZ-r-qLPByDqPvWzaIIFxgpHrlRCNU-IkUN4QE4Z4urwyUrbRe3V9uUt2pcz-oVtJ9Tczr6YLSd-cUE6W1-X0db1nH4pxIvMqcUHEhIw-bBXHaDXnpffZZIZaZDIZPDj7SdpANJnq1b3RoPck1MmzQidC0v9DWABMBtX9G7p37mbfJ_d2YnYj3esLtuyl8VFuc6vkA7LxYZUJ4bNUtEYa0lXOpvrGNVwvcSffpgL4dt7DXVAJepcGptNoSNYj80jBdIgTE7v7hEt5hhx1WJ-LuBRdscZiaQpGKiBKXfqmfHyBUQc2oOKA2cRvDigJ7V7k8DhPZDqL-V1k9hA37d9c6fH8cG9gJoKrWQg6nefNvdt-u1dhbw0qqr2UvhW93ArVfYPC7_eyMD4qw0IMUiM2QmzBrMSJuBrdytllsbbWo86MMhPSeCnVUoNyrbmJX0; path=/; HttpOnly"
        }, {
          "name" : "X-SourceFiles",
          "value" : "=?UTF-8?B?RDpcVmlydHVhbE9wdGltaXplci1SZWZhY3RvcmluZ1xDcm9wTWV0cmljcy5Wby5BcGlcQ3JvcE1ldHJpY3MuVm8uQXBpXGFwaVxhZG1pblx2MVx1c2Vyc1w=?="
        }, {
          "name" : "X-Powered-By",
          "value" : "ASP.NET"
        }, {
          "name" : "Date",
          "value" : "Fri, 29 Mar 2019 22:37:50 GMT"
        }, {
          "name" : "Content-Length",
          "value" : "9"
        } ],
        "content" : {
          "size" : 9,
          "mimeType" : "application/json; charset=utf-8",
          "text" : "{\"id\":15}",
          "comment" : ""
        },
        "redirectURL" : "",
        "headersSize" : 887,
        "bodySize" : 9,
        "comment" : ""
      },
      "cache" : { },
      "timings" : {
        "comment" : "",
        "ssl" : -1,
        "wait" : 1846,
        "receive" : 1,
        "send" : 0,
        "connect" : -1,
        "dns" : -1,
        "blocked" : -1
      },
      "serverIPAddress" : "127.0.0.1",
      "comment" : "",
      "_katalonRequestInformation" : {
        "name" : "45",
        "testObjectId" : "Object Repository/VoPro/Account/api_admin_v1_users",
        "harId" : "142ad14d-8ab5-4544-882f-0c9b0a307252"
      },
      "time" : 1848
    } ],
    "comment" : ""
  }
}