{
  "log" : {
    "version" : "1.2",
    "creator" : {
      "name" : "BrowserMob Proxy",
      "version" : "2.1.5",
      "comment" : ""
    },
    "pages" : [ {
      "id" : "Page 0",
      "startedDateTime" : "2019-03-28T21:51:28.159Z",
      "title" : "Page 0",
      "pageTimings" : {
        "onLoad" : 1264,
        "comment" : ""
      },
      "comment" : ""
    } ],
    "entries" : [ {
      "pageref" : "Page 0",
      "startedDateTime" : "2019-03-28T21:51:28.161Z",
      "request" : {
        "method" : "POST",
        "url" : "http://localhost:10520/WebAPI/api/admin/v1/users/?",
        "httpVersion" : "HTTP/1.1",
        "cookies" : [ ],
        "headers" : [ {
          "name" : "User-Agent",
          "value" : "Katalon Studio"
        }, {
          "name" : "Content-Type",
          "value" : "application/x-www-form-urlencoded"
        }, {
          "name" : "Authorization",
          "value" : "Bearer eyJ0eXAiOiJKV1QiLCJhbGciOiJIUzI1NiJ9.eyJ1bmlxdWVfbmFtZSI6ImFkbWluIiwicm9sZSI6InVzZXIiLCJzdWIiOiJhZG1pbiIsImlzcyI6IkNyb3BNZXRyaWNzIiwiYXVkIjoiYWxsIiwiZXhwIjoxNTUzODEzNzg4LCJuYmYiOjE1NTM4MDk4ODh9.H-KOZeFTyhR8vbVmsLAMbse0zugnlWJ4oEpi4IsLAx4"
        }, {
          "name" : "Host",
          "value" : "localhost:10520"
        }, {
          "name" : "Accept",
          "value" : "text/html, image/gif, image/jpeg, *; q=.2, */*; q=.2"
        }, {
          "name" : "Proxy-Connection",
          "value" : "keep-alive"
        }, {
          "name" : "Content-Length",
          "value" : "731"
        } ],
        "queryString" : [ ],
        "postData" : {
          "mimeType" : "application/x-www-form-urlencoded",
          "params" : [ {
            "name" : "password",
            "value" : "cropmetrics",
            "comment" : ""
          }, {
            "name" : "email",
            "value" : "cropmetricsvo.townlong@gmail.com",
            "comment" : ""
          }, {
            "name" : "fullname",
            "value" : "x",
            "comment" : ""
          }, {
            "name" : "phone",
            "value" : "1",
            "comment" : ""
          }, {
            "name" : "dealer",
            "value" : "xx",
            "comment" : ""
          }, {
            "name" : "addressLine1",
            "value" : "address line 1 test validation",
            "comment" : ""
          }, {
            "name" : "addressLine2",
            "value" : "address line 2 test validation",
            "comment" : ""
          }, {
            "name" : "town",
            "value" : "18 API_ACNT_When_new_account_have_long_town_attribute_Expected_status_code_20018 API_ACNT_When_new_account_have_long_town_attribute_Expected_status_code_20018 API_ACNT_When_new_account_have_long_town_attribute_Expected_status_code_20018 API_ACNT_When_new_account_have_long_town_attribute_Expected_status_code_20018 API_ACNT_When_new_account_have_long_town_attribute_Expected_status_code_20018 API_ACNT_When_new_account_have_long_town_attribute_Expected_status_code_200",
            "comment" : ""
          }, {
            "name" : "state",
            "value" : "stateValidation",
            "comment" : ""
          }, {
            "name" : "zip",
            "value" : "zipValidation",
            "comment" : ""
          }, {
            "name" : "country",
            "value" : "countryValidation",
            "comment" : ""
          }, {
            "name" : "roles",
            "value" : "Client",
            "comment" : ""
          } ],
          "comment" : ""
        },
        "headersSize" : 544,
        "bodySize" : 731,
        "comment" : ""
      },
      "response" : {
        "status" : 200,
        "statusText" : "OK",
        "httpVersion" : "HTTP/1.1",
        "cookies" : [ {
          "name" : ".ASPROLES",
          "value" : "oVXYrjL429n25dVaOGxG-ZWWrotEWMQGoUrosJc1w3XrTWaqI-971v6ErO4xHiQMRskRYik_W9dngiU7cg7zTi3KRQH09RnINuF4d3Tmy9enFXEm39C661NVJSuNF7H-US_2ETYqZRrQx4iAnhP1ctweD80JcfJ6cR-pNyDeGj18zBvo3klrgddTFW-WoFlPJYWrAGN8YKgldBJ1FtHelaaoSxLvL-G31sBxjvdPcLpWNc_wEjFBHTkisQ8QjYIcTP8XrR9QH7sKFBa2j4tAr1_Ml_zgODds6wW9RE5auf1egBI6I2i28kkv_vN2_9p77ZZI_NCAzNvfCK6Ci-I1V0SmFHNRwHblNoHeVh-BaloMbG_cNLNnSidZ6V3DCk8ZYe96VEDJY2NEVheQ50pRAV_UJg_DNarimG_8s0uUGNCpqFBPlKhS5UqasBWnpmHI8HeyAQl7tINnV34lxUteOI8Qiu6ikNjnhoGjGEV1loUpJlCf0",
          "path" : "/",
          "httpOnly" : true,
          "secure" : false,
          "comment" : ""
        } ],
        "headers" : [ {
          "name" : "Cache-Control",
          "value" : "private"
        }, {
          "name" : "Content-Type",
          "value" : "application/json; charset=utf-8"
        }, {
          "name" : "Server",
          "value" : "Microsoft-IIS/10.0"
        }, {
          "name" : "Set-Cookie",
          "value" : ".ASPROLES=oVXYrjL429n25dVaOGxG-ZWWrotEWMQGoUrosJc1w3XrTWaqI-971v6ErO4xHiQMRskRYik_W9dngiU7cg7zTi3KRQH09RnINuF4d3Tmy9enFXEm39C661NVJSuNF7H-US_2ETYqZRrQx4iAnhP1ctweD80JcfJ6cR-pNyDeGj18zBvo3klrgddTFW-WoFlPJYWrAGN8YKgldBJ1FtHelaaoSxLvL-G31sBxjvdPcLpWNc_wEjFBHTkisQ8QjYIcTP8XrR9QH7sKFBa2j4tAr1_Ml_zgODds6wW9RE5auf1egBI6I2i28kkv_vN2_9p77ZZI_NCAzNvfCK6Ci-I1V0SmFHNRwHblNoHeVh-BaloMbG_cNLNnSidZ6V3DCk8ZYe96VEDJY2NEVheQ50pRAV_UJg_DNarimG_8s0uUGNCpqFBPlKhS5UqasBWnpmHI8HeyAQl7tINnV34lxUteOI8Qiu6ikNjnhoGjGEV1loUpJlCf0; path=/; HttpOnly"
        }, {
          "name" : "X-SourceFiles",
          "value" : "=?UTF-8?B?RDpcVmlydHVhbE9wdGltaXplci1SZWZhY3RvcmluZ1xDcm9wTWV0cmljcy5Wby5BcGlcQ3JvcE1ldHJpY3MuVm8uQXBpXGFwaVxhZG1pblx2MVx1c2Vyc1w=?="
        }, {
          "name" : "X-Powered-By",
          "value" : "ASP.NET"
        }, {
          "name" : "Date",
          "value" : "Thu, 28 Mar 2019 21:51:29 GMT"
        }, {
          "name" : "Content-Length",
          "value" : "9"
        } ],
        "content" : {
          "size" : 9,
          "mimeType" : "application/json; charset=utf-8",
          "text" : "{\"id\":26}",
          "comment" : ""
        },
        "redirectURL" : "",
        "headersSize" : 887,
        "bodySize" : 9,
        "comment" : ""
      },
      "cache" : { },
      "timings" : {
        "comment" : "",
        "blocked" : -1,
        "wait" : 1259,
        "receive" : 0,
        "dns" : -1,
        "send" : 0,
        "connect" : -1,
        "ssl" : -1
      },
      "serverIPAddress" : "127.0.0.1",
      "comment" : "",
      "_katalonRequestInformation" : {
        "name" : "71",
        "testObjectId" : "Object Repository/VoPro/Account/api_admin_v1_users",
        "harId" : "b952218b-47e6-4940-a4c8-ef70981d2570"
      },
      "time" : 1261
    } ],
    "comment" : ""
  }
}