{
  "log" : {
    "version" : "1.2",
    "creator" : {
      "name" : "BrowserMob Proxy",
      "version" : "2.1.5",
      "comment" : ""
    },
    "pages" : [ {
      "id" : "Page 0",
      "startedDateTime" : "2019-04-24T20:28:40.454Z",
      "title" : "Page 0",
      "pageTimings" : {
        "onLoad" : 71,
        "comment" : ""
      },
      "comment" : ""
    } ],
    "entries" : [ {
      "pageref" : "Page 0",
      "startedDateTime" : "2019-04-24T20:28:40.455Z",
      "request" : {
        "method" : "POST",
        "url" : "http://localhost:10520/WebAPI/api/mobile/v1/fields?",
        "httpVersion" : "HTTP/1.1",
        "cookies" : [ ],
        "headers" : [ {
          "name" : "User-Agent",
          "value" : "Katalon Studio"
        }, {
          "name" : "Content-Type",
          "value" : "application/json"
        }, {
          "name" : "Authorization",
          "value" : "Bearer eyJ0eXAiOiJKV1QiLCJhbGciOiJIUzI1NiJ9.eyJ1bmlxdWVfbmFtZSI6Implbm55Lm1hbGRvbmFkby50eDFAZ21haWwuY29tIiwicm9sZSI6InVzZXIiLCJzdWIiOiJqZW5ueS5tYWxkb25hZG8udHgxQGdtYWlsLmNvbSIsImlzcyI6IkNyb3BNZXRyaWNzIiwiYXVkIjoiYWxsIiwiZXhwIjoxNTU2MTQxNjIwLCJuYmYiOjE1NTYxMzc3MjB9.tUfkSMsijHxt_sDB4K_lvIA1zXMOSumCHhttALvi4f8"
        }, {
          "name" : "Host",
          "value" : "localhost:10520"
        }, {
          "name" : "Accept",
          "value" : "text/html, image/gif, image/jpeg, *; q=.2, */*; q=.2"
        }, {
          "name" : "Proxy-Connection",
          "value" : "keep-alive"
        }, {
          "name" : "Content-Length",
          "value" : "409"
        } ],
        "queryString" : [ ],
        "postData" : {
          "mimeType" : "application/json",
          "text" : "{\"field\":{\"farm_id\":\"!@#$%^&\",\"name\":\"Field by agent not assigned\",\"boundary\":{\"boundaries\":[{\"boundary\":{\"coords\":[{\"x\":-101.49568751,\"y\":37.14976293},{\"x\":-101.50049403,\"y\":37.14647907},{\"x\":-101.50049403,\"y\":37.14264773},{\"x\":-101.49723246,\"y\":37.1411425},{\"x\":-101.49019435,\"y\":37.14223722},{\"x\":-101.48933604,\"y\":37.14620541},{\"x\":-101.49294093,\"y\":37.14866833},{\"x\":-101.49568751,\"y\":37.14976293}]}}]}}}",
          "comment" : ""
        },
        "headersSize" : 592,
        "bodySize" : 409,
        "comment" : ""
      },
      "response" : {
        "status" : 400,
        "statusText" : "Bad Request",
        "httpVersion" : "HTTP/1.1",
        "cookies" : [ {
          "name" : ".ASPROLES",
          "value" : "eaCs9KBppdXXhW-05vn-FpblUaFVTOEcZJxDoTKsQbP7HH0wSAzZWT12e6CVpeEkCfeL7CTUQjsV6X6IPNdAJYBQOiVHi4Wni0LJBj_mEPG7QakgWdWNMsFsYJD-VTjdRt6Gs85152-sc43yrblYBr53Yf6zk5-b3Z62RdmHQl1z7DzOyOM_u92nBXVmTaSAalRnrghX90K9a2cgLqxotQzFUXcItT5yfxGRMsIlE95-wQKKYb4wwvyHEGutfn5PAfRk1hTBM9IloYp2FGcKimlc6F1nl8Rjtg5JvTK1lpBt0FQRqrL7It6vKDs3T0jTYKhu_s-ds90rTYv91Gmi_-u6FpYkBWhPbMW65926-0YD4PlhCU2yFXkefBwl71ssRT86-yDyQyQjbuKJhHG0JA6ziLvtpwmMvZunTlMnzDsWMD5MzbwPCGihgOr6pgJ758RVeispR0uM9DDGh5LGy15e-oyOQDb_RQChg9GbWiD8PcXPkEY8KHpcEfP3Olut7byuHJN7sLMr-9XurVrQFFfvbuE1",
          "path" : "/",
          "httpOnly" : true,
          "secure" : false,
          "comment" : ""
        } ],
        "headers" : [ {
          "name" : "Cache-Control",
          "value" : "private"
        }, {
          "name" : "Content-Type",
          "value" : "application/json; charset=utf-8"
        }, {
          "name" : "Server",
          "value" : "Microsoft-IIS/10.0"
        }, {
          "name" : "Set-Cookie",
          "value" : ".ASPROLES=eaCs9KBppdXXhW-05vn-FpblUaFVTOEcZJxDoTKsQbP7HH0wSAzZWT12e6CVpeEkCfeL7CTUQjsV6X6IPNdAJYBQOiVHi4Wni0LJBj_mEPG7QakgWdWNMsFsYJD-VTjdRt6Gs85152-sc43yrblYBr53Yf6zk5-b3Z62RdmHQl1z7DzOyOM_u92nBXVmTaSAalRnrghX90K9a2cgLqxotQzFUXcItT5yfxGRMsIlE95-wQKKYb4wwvyHEGutfn5PAfRk1hTBM9IloYp2FGcKimlc6F1nl8Rjtg5JvTK1lpBt0FQRqrL7It6vKDs3T0jTYKhu_s-ds90rTYv91Gmi_-u6FpYkBWhPbMW65926-0YD4PlhCU2yFXkefBwl71ssRT86-yDyQyQjbuKJhHG0JA6ziLvtpwmMvZunTlMnzDsWMD5MzbwPCGihgOr6pgJ758RVeispR0uM9DDGh5LGy15e-oyOQDb_RQChg9GbWiD8PcXPkEY8KHpcEfP3Olut7byuHJN7sLMr-9XurVrQFFfvbuE1; path=/; HttpOnly"
        }, {
          "name" : "X-SourceFiles",
          "value" : "=?UTF-8?B?RDpcVmlydHVhbE9wdGltaXplci1SZWZhY3RvcmluZ1xDcm9wTWV0cmljcy5Wby5BcGlcQ3JvcE1ldHJpY3MuVm8uQXBpXGFwaVxtb2JpbGVcdjFcZmllbGRz?="
        }, {
          "name" : "X-Powered-By",
          "value" : "ASP.NET"
        }, {
          "name" : "Date",
          "value" : "Wed, 24 Apr 2019 20:28:39 GMT"
        }, {
          "name" : "Content-Length",
          "value" : "37"
        } ],
        "content" : {
          "size" : 37,
          "mimeType" : "application/json; charset=utf-8",
          "text" : "{\"message\":\"The request is invalid.\"}",
          "comment" : ""
        },
        "redirectURL" : "",
        "headersSize" : 940,
        "bodySize" : 37,
        "comment" : ""
      },
      "cache" : { },
      "timings" : {
        "comment" : "",
        "ssl" : -1,
        "receive" : 0,
        "send" : 0,
        "wait" : 66,
        "connect" : -1,
        "blocked" : -1,
        "dns" : -1
      },
      "serverIPAddress" : "127.0.0.1",
      "comment" : "",
      "_katalonRequestInformation" : {
        "name" : "23",
        "testObjectId" : "Object Repository/VoGrow/Field/FieldPost",
        "harId" : "4c91a64e-6933-46ca-ae8f-ee82e2ce4b9a"
      },
      "time" : 67
    } ],
    "comment" : ""
  }
}