{
  "log" : {
    "version" : "1.2",
    "creator" : {
      "name" : "BrowserMob Proxy",
      "version" : "2.1.5",
      "comment" : ""
    },
    "pages" : [ {
      "id" : "Page 0",
      "startedDateTime" : "2019-04-09T09:50:08.818Z",
      "title" : "Page 0",
      "pageTimings" : {
        "onLoad" : 3360,
        "comment" : ""
      },
      "comment" : ""
    } ],
    "entries" : [ {
      "pageref" : "Page 0",
      "startedDateTime" : "2019-04-09T09:50:08.820Z",
      "request" : {
        "method" : "PUT",
        "url" : "http://localhost:10520/WebAPI/api/mobile/v1/fields/1?",
        "httpVersion" : "HTTP/1.1",
        "cookies" : [ ],
        "headers" : [ {
          "name" : "User-Agent",
          "value" : "Katalon Studio"
        }, {
          "name" : "Content-Type",
          "value" : "application/json"
        }, {
          "name" : "Authorization",
          "value" : "Bearer eyJ0eXAiOiJKV1QiLCJhbGciOiJIUzI1NiJ9.eyJ1bmlxdWVfbmFtZSI6Implbm55Lm1hbGRvbmFkby50eDFAZ21haWwuY29tIiwicm9sZSI6InVzZXIiLCJzdWIiOiJqZW5ueS5tYWxkb25hZG8udHgxQGdtYWlsLmNvbSIsImlzcyI6IkNyb3BNZXRyaWNzIiwiYXVkIjoiYWxsIiwiZXhwIjoxNTU0ODA3MzA4LCJuYmYiOjE1NTQ4MDM0MDh9.2_jKqepyBnueaBZlyVPHCKyiUS_DKxhnEoO8Y79NI0Q"
        }, {
          "name" : "Host",
          "value" : "localhost:10520"
        }, {
          "name" : "Accept",
          "value" : "text/html, image/gif, image/jpeg, *; q=.2, */*; q=.2"
        }, {
          "name" : "Proxy-Connection",
          "value" : "keep-alive"
        }, {
          "name" : "Content-Length",
          "value" : "397"
        } ],
        "queryString" : [ ],
        "postData" : {
          "mimeType" : "application/json",
          "text" : "{\"field\":{\"name\":\"Field updated by agent not assigned\",\"boundary\":{\"boundaries\":[{\"boundary\":{\"coords\":[{\"x\":-101.49568751,\"y\":37.14976293},{\"x\":-101.50049403,\"y\":37.14647907},{\"x\":-101.50049403,\"y\":37.14264773},{\"x\":-101.49723246,\"y\":37.1411425},{\"x\":-101.49019435,\"y\":37.14223722},{\"x\":-101.48933604,\"y\":37.14620541},{\"x\":-101.49294093,\"y\":37.14866833},{\"x\":-101.49568751,\"y\":37.14976293}]}}]}}}",
          "comment" : ""
        },
        "headersSize" : 593,
        "bodySize" : 397,
        "comment" : ""
      },
      "response" : {
        "status" : 400,
        "statusText" : "Bad Request",
        "httpVersion" : "HTTP/1.1",
        "cookies" : [ {
          "name" : ".ASPROLES",
          "value" : "YyFkfeTdVxq059fCe-PxG2TcUdjo5XjPBM1ulVd9W6DKqcpHNxjHaoycbQ8Q3GwHP-V1jNeo-girhk-7Uu1UcgK3jSfbUhZ7A-FKa4-nJnxV7wdtnKiuZATPRTK0ev8z07YZr0NTkxnJT9HHFqRrVde251XWR0hDOl_rtX4gU4jkWUF85t9TLR0rjsRhfazHLs5lwEGb-j-X2OJuS7LTbeHMCbMNQvnAcMnVqItOU3HbwBTMOIyswTK_YH3Y8EQTQFmC8iHB1HuM3LwnpKqgDQG9AN_i6-UdJiUYsabIJ1L2eosKTs-QLhEZWExY4MRHW4YvLEFbJBBLKoeS6vC_RMbjdhMF5cu9kx7PGVDvt3Nv1jxOdUnzO6OLTAGuPSYL3rEcmQNaP168kN1Tk7S20-vXNniAKSLjlMTKWWc5OPFro6n9Nh2l3q1keZ3gFW9_J-0Ww1QcMocxZ2BuspGd8WcV_apyYkwA5fwfzw1Ihkatwuh28TRIMPi4j80w5cK-32nyNbNqpUfe52CfBES16hP7ptE1",
          "path" : "/",
          "httpOnly" : true,
          "secure" : false,
          "comment" : ""
        } ],
        "headers" : [ {
          "name" : "Cache-Control",
          "value" : "private"
        }, {
          "name" : "Content-Type",
          "value" : "application/json; charset=utf-8"
        }, {
          "name" : "Server",
          "value" : "Microsoft-IIS/10.0"
        }, {
          "name" : "Set-Cookie",
          "value" : ".ASPROLES=YyFkfeTdVxq059fCe-PxG2TcUdjo5XjPBM1ulVd9W6DKqcpHNxjHaoycbQ8Q3GwHP-V1jNeo-girhk-7Uu1UcgK3jSfbUhZ7A-FKa4-nJnxV7wdtnKiuZATPRTK0ev8z07YZr0NTkxnJT9HHFqRrVde251XWR0hDOl_rtX4gU4jkWUF85t9TLR0rjsRhfazHLs5lwEGb-j-X2OJuS7LTbeHMCbMNQvnAcMnVqItOU3HbwBTMOIyswTK_YH3Y8EQTQFmC8iHB1HuM3LwnpKqgDQG9AN_i6-UdJiUYsabIJ1L2eosKTs-QLhEZWExY4MRHW4YvLEFbJBBLKoeS6vC_RMbjdhMF5cu9kx7PGVDvt3Nv1jxOdUnzO6OLTAGuPSYL3rEcmQNaP168kN1Tk7S20-vXNniAKSLjlMTKWWc5OPFro6n9Nh2l3q1keZ3gFW9_J-0Ww1QcMocxZ2BuspGd8WcV_apyYkwA5fwfzw1Ihkatwuh28TRIMPi4j80w5cK-32nyNbNqpUfe52CfBES16hP7ptE1; path=/; HttpOnly"
        }, {
          "name" : "X-SourceFiles",
          "value" : "=?UTF-8?B?RDpcVmlydHVhbE9wdGltaXplci1SZWZhY3RvcmluZ1xDcm9wTWV0cmljcy5Wby5BcGlcQ3JvcE1ldHJpY3MuVm8uQXBpXGFwaVxtb2JpbGVcdjFcZmllbGRzXDE=?="
        }, {
          "name" : "X-Powered-By",
          "value" : "ASP.NET"
        }, {
          "name" : "Date",
          "value" : "Tue, 09 Apr 2019 09:50:12 GMT"
        }, {
          "name" : "Content-Length",
          "value" : "82"
        } ],
        "content" : {
          "size" : 82,
          "mimeType" : "application/json; charset=utf-8",
          "text" : "{\"message\":\"The modifier doesn't have permissions to modify the field requested.\"}",
          "comment" : ""
        },
        "redirectURL" : "",
        "headersSize" : 944,
        "bodySize" : 82,
        "comment" : ""
      },
      "cache" : { },
      "timings" : {
        "comment" : "",
        "ssl" : -1,
        "connect" : -1,
        "blocked" : -1,
        "dns" : -1,
        "send" : 0,
        "receive" : 0,
        "wait" : 3353
      },
      "serverIPAddress" : "127.0.0.1",
      "comment" : "",
      "_katalonRequestInformation" : {
        "name" : "7",
        "testObjectId" : "Object Repository/VoGrow/Field/FieldPut",
        "harId" : "eb27d6f0-ec73-4f7c-b1f1-67b0b0030a6e"
      },
      "time" : 3355
    } ],
    "comment" : ""
  }
}