{
  "log" : {
    "version" : "1.2",
    "creator" : {
      "name" : "BrowserMob Proxy",
      "version" : "2.1.5",
      "comment" : ""
    },
    "pages" : [ {
      "id" : "Page 0",
      "startedDateTime" : "2019-04-11T16:39:44.957Z",
      "title" : "Page 0",
      "pageTimings" : {
        "onLoad" : 3290,
        "comment" : ""
      },
      "comment" : ""
    } ],
    "entries" : [ {
      "pageref" : "Page 0",
      "startedDateTime" : "2019-04-11T16:39:44.959Z",
      "request" : {
        "method" : "POST",
        "url" : "http://localhost:10520/WebAPI/api/mobile/v1/farms/?",
        "httpVersion" : "HTTP/1.1",
        "cookies" : [ ],
        "headers" : [ {
          "name" : "User-Agent",
          "value" : "Katalon Studio"
        }, {
          "name" : "Content-Type",
          "value" : "application/json"
        }, {
          "name" : "Authorization",
          "value" : "Bearer eyJ0eXAiOiJKV1QiLCJhbGciOiJIUzI1NiJ9.eyJ1bmlxdWVfbmFtZSI6Implbm55Lm1hbGRvbmFkby50eEBnbWFpbC5jb20iLCJyb2xlIjoidXNlciIsInN1YiI6Implbm55Lm1hbGRvbmFkby50eEBnbWFpbC5jb20iLCJpc3MiOiJDcm9wTWV0cmljcyIsImF1ZCI6ImFsbCIsImV4cCI6MTU1NTAwNDY4NCwibmJmIjoxNTU1MDAwNzg0fQ.mqE7EUyOV7BiiSLnxNG4cpwPb3H3egQvH1JgTDkKGzI"
        }, {
          "name" : "Host",
          "value" : "localhost:10520"
        }, {
          "name" : "Accept",
          "value" : "text/html, image/gif, image/jpeg, *; q=.2, */*; q=.2"
        }, {
          "name" : "Proxy-Connection",
          "value" : "keep-alive"
        }, {
          "name" : "Content-Length",
          "value" : "76"
        } ],
        "queryString" : [ ],
        "postData" : {
          "mimeType" : "application/json",
          "text" : "{\"name\": \"New Farm with userID different of the user token\", \"user_id\": \"4\"}",
          "comment" : ""
        },
        "headersSize" : 589,
        "bodySize" : 76,
        "comment" : ""
      },
      "response" : {
        "status" : 400,
        "statusText" : "Bad Request",
        "httpVersion" : "HTTP/1.1",
        "cookies" : [ {
          "name" : ".ASPROLES",
          "value" : "3TaWkcN3aNIXvnbiiQacVJLRkOGzL-_j5a-2gFRh-1yX_eKz5rcLRHO_ksqp7hYAjSOi33qrtm18OS6ZH4GUIpyz2aVoPgWFqmzW1wrpEydo1iJwN3V2RHepCmW5VzBqiLjekZpLSoY_3fjHOArb1q7PG5jbUFzW5XnKNBVbMw734tf9FSl52dGAnxaBdO7nr6xRgB83MWzywPLzVbsxOSdU9c4zh1_Ymh_C3ogGsBi2VqHN1XL8Mj7RMvRRpBpGJpwUZtWYzlo7XPWSe6yHU8dL0Orq90o1r1KJ4O7vzhukShHsv23mIO7IthFxwVhjBS-0dGF-gdvxMmWzRbkxCvKZD2ugHburUQtma3UpWlC3lvSpG0lVZF7Sunv2ASlH7qLdKg_56f-3dxG-20eTzgi8kH-ojPUTDbRIwyq6o5-52kfcXHeMKSOEq-V0xRfFmYW3lL8x-bVq4p6IFhleU18NcVdsAph1m9nXbZ4PKV6JbPqqz8HIzFkLC_t9ofN61pCOjA2",
          "path" : "/",
          "httpOnly" : true,
          "secure" : false,
          "comment" : ""
        } ],
        "headers" : [ {
          "name" : "Cache-Control",
          "value" : "private"
        }, {
          "name" : "Content-Type",
          "value" : "application/json; charset=utf-8"
        }, {
          "name" : "Server",
          "value" : "Microsoft-IIS/10.0"
        }, {
          "name" : "Set-Cookie",
          "value" : ".ASPROLES=3TaWkcN3aNIXvnbiiQacVJLRkOGzL-_j5a-2gFRh-1yX_eKz5rcLRHO_ksqp7hYAjSOi33qrtm18OS6ZH4GUIpyz2aVoPgWFqmzW1wrpEydo1iJwN3V2RHepCmW5VzBqiLjekZpLSoY_3fjHOArb1q7PG5jbUFzW5XnKNBVbMw734tf9FSl52dGAnxaBdO7nr6xRgB83MWzywPLzVbsxOSdU9c4zh1_Ymh_C3ogGsBi2VqHN1XL8Mj7RMvRRpBpGJpwUZtWYzlo7XPWSe6yHU8dL0Orq90o1r1KJ4O7vzhukShHsv23mIO7IthFxwVhjBS-0dGF-gdvxMmWzRbkxCvKZD2ugHburUQtma3UpWlC3lvSpG0lVZF7Sunv2ASlH7qLdKg_56f-3dxG-20eTzgi8kH-ojPUTDbRIwyq6o5-52kfcXHeMKSOEq-V0xRfFmYW3lL8x-bVq4p6IFhleU18NcVdsAph1m9nXbZ4PKV6JbPqqz8HIzFkLC_t9ofN61pCOjA2; path=/; HttpOnly"
        }, {
          "name" : "X-SourceFiles",
          "value" : "=?UTF-8?B?RDpcVmlydHVhbE9wdGltaXplci1SZWZhY3RvcmluZ1xDcm9wTWV0cmljcy5Wby5BcGlcQ3JvcE1ldHJpY3MuVm8uQXBpXGFwaVxtb2JpbGVcdjFcZmFybXNc?="
        }, {
          "name" : "X-Powered-By",
          "value" : "ASP.NET"
        }, {
          "name" : "Date",
          "value" : "Thu, 11 Apr 2019 16:39:48 GMT"
        }, {
          "name" : "Content-Length",
          "value" : "57"
        } ],
        "content" : {
          "size" : 57,
          "mimeType" : "application/json; charset=utf-8",
          "text" : "{\"message\":\"The request is not valid for a grower role.\"}",
          "comment" : ""
        },
        "redirectURL" : "",
        "headersSize" : 919,
        "bodySize" : 57,
        "comment" : ""
      },
      "cache" : { },
      "timings" : {
        "comment" : "",
        "ssl" : -1,
        "send" : 0,
        "wait" : 3285,
        "receive" : 0,
        "connect" : -1,
        "dns" : -1,
        "blocked" : -1
      },
      "serverIPAddress" : "127.0.0.1",
      "comment" : "",
      "_katalonRequestInformation" : {
        "name" : "51",
        "testObjectId" : "Object Repository/VoGrow/Farm/FarmPost",
        "harId" : "454a2f81-f9e1-4e33-8891-0954dbf141a6"
      },
      "time" : 3286
    } ],
    "comment" : ""
  }
}