{
  "log" : {
    "version" : "1.2",
    "creator" : {
      "name" : "BrowserMob Proxy",
      "version" : "2.1.5",
      "comment" : ""
    },
    "pages" : [ {
      "id" : "Page 0",
      "startedDateTime" : "2019-03-29T22:10:07.278Z",
      "title" : "Page 0",
      "pageTimings" : {
        "onLoad" : 1952,
        "comment" : ""
      },
      "comment" : ""
    } ],
    "entries" : [ {
      "pageref" : "Page 0",
      "startedDateTime" : "2019-03-29T22:10:07.279Z",
      "request" : {
        "method" : "POST",
        "url" : "http://localhost:10520/WebAPI/api/admin/v1/users/?",
        "httpVersion" : "HTTP/1.1",
        "cookies" : [ ],
        "headers" : [ {
          "name" : "User-Agent",
          "value" : "Katalon Studio"
        }, {
          "name" : "Content-Type",
          "value" : "application/x-www-form-urlencoded"
        }, {
          "name" : "Authorization",
          "value" : "Bearer eyJ0eXAiOiJKV1QiLCJhbGciOiJIUzI1NiJ9.eyJ1bmlxdWVfbmFtZSI6ImFkbWluIiwicm9sZSI6InVzZXIiLCJzdWIiOiJhZG1pbiIsImlzcyI6IkNyb3BNZXRyaWNzIiwiYXVkIjoiYWxsIiwiZXhwIjoxNTUzOTAxMzA3LCJuYmYiOjE1NTM4OTc0MDd9.i6Yq4ZlKdQhx9RyZqbDayHI9oSrEqYyayIF3urECyts"
        }, {
          "name" : "Host",
          "value" : "localhost:10520"
        }, {
          "name" : "Accept",
          "value" : "text/html, image/gif, image/jpeg, *; q=.2, */*; q=.2"
        }, {
          "name" : "Proxy-Connection",
          "value" : "keep-alive"
        }, {
          "name" : "Content-Length",
          "value" : "300"
        } ],
        "queryString" : [ ],
        "postData" : {
          "mimeType" : "application/x-www-form-urlencoded",
          "params" : [ {
            "name" : "password",
            "value" : "cropmetrics",
            "comment" : ""
          }, {
            "name" : "email",
            "value" : "cropmetricsvo.phonesymbols@gmail.com",
            "comment" : ""
          }, {
            "name" : "fullname",
            "value" : "x",
            "comment" : ""
          }, {
            "name" : "phone",
            "value" : "!@#$%^&",
            "comment" : ""
          }, {
            "name" : "dealer",
            "value" : "x",
            "comment" : ""
          }, {
            "name" : "addressLine1",
            "value" : "address line 1 test validation",
            "comment" : ""
          }, {
            "name" : "addressLine2",
            "value" : "address line 2 test validation",
            "comment" : ""
          }, {
            "name" : "town",
            "value" : "townValidation",
            "comment" : ""
          }, {
            "name" : "state",
            "value" : "stateValidation",
            "comment" : ""
          }, {
            "name" : "zip",
            "value" : "zipValidation",
            "comment" : ""
          }, {
            "name" : "country",
            "value" : "countryValidation",
            "comment" : ""
          }, {
            "name" : "roles",
            "value" : "Client",
            "comment" : ""
          } ],
          "comment" : ""
        },
        "headersSize" : 544,
        "bodySize" : 300,
        "comment" : ""
      },
      "response" : {
        "status" : 200,
        "statusText" : "OK",
        "httpVersion" : "HTTP/1.1",
        "cookies" : [ {
          "name" : ".ASPROLES",
          "value" : "zNl3y63NBp9xPLuAk11OVa2CFWPBflWfrS6rzgGk_v-_rLaV2e7KCK_nxERbM52keuT0LozSnzSKX6IYdQXj-jjBtonNAa2LWddkEd_EFuhxW-oR2KCS9p4kclUCisbYw6gdlL3ptiu0H7cg2ADASa3gOdp4e6e3hm1PqSxwUH_gyJbsE7kGZogcq-Tput2lPhao1wm5RcSpPPBkQtaT8cW9XE1O1_xRmvhaH1-vL6QCZtPA6QxXqCd_3ifAslc_ZcULXtQN8GqMIs63p3-2bb6FeMGMzU-fKGnQOsbT-ic9-CJ15Mcf-czhxdbo4tNBPOEJ17nETSotT13g7-mbGFqvR08ozb16Tp_LGsfjMP01VprklFbY4EUSxznQjYjFDCfaGrTwRu1Q7x38c1ojRnlBRI0r4z5kJow-71DtGRll797Qa7fHS5W-yQkXEacvqV8G6rV2yEjFUbmk5gTRr-ec120-Uz0_8-nPUc00oUl3e_lC0",
          "path" : "/",
          "httpOnly" : true,
          "secure" : false,
          "comment" : ""
        } ],
        "headers" : [ {
          "name" : "Cache-Control",
          "value" : "private"
        }, {
          "name" : "Content-Type",
          "value" : "application/json; charset=utf-8"
        }, {
          "name" : "Server",
          "value" : "Microsoft-IIS/10.0"
        }, {
          "name" : "Set-Cookie",
          "value" : ".ASPROLES=zNl3y63NBp9xPLuAk11OVa2CFWPBflWfrS6rzgGk_v-_rLaV2e7KCK_nxERbM52keuT0LozSnzSKX6IYdQXj-jjBtonNAa2LWddkEd_EFuhxW-oR2KCS9p4kclUCisbYw6gdlL3ptiu0H7cg2ADASa3gOdp4e6e3hm1PqSxwUH_gyJbsE7kGZogcq-Tput2lPhao1wm5RcSpPPBkQtaT8cW9XE1O1_xRmvhaH1-vL6QCZtPA6QxXqCd_3ifAslc_ZcULXtQN8GqMIs63p3-2bb6FeMGMzU-fKGnQOsbT-ic9-CJ15Mcf-czhxdbo4tNBPOEJ17nETSotT13g7-mbGFqvR08ozb16Tp_LGsfjMP01VprklFbY4EUSxznQjYjFDCfaGrTwRu1Q7x38c1ojRnlBRI0r4z5kJow-71DtGRll797Qa7fHS5W-yQkXEacvqV8G6rV2yEjFUbmk5gTRr-ec120-Uz0_8-nPUc00oUl3e_lC0; path=/; HttpOnly"
        }, {
          "name" : "X-SourceFiles",
          "value" : "=?UTF-8?B?RDpcVmlydHVhbE9wdGltaXplci1SZWZhY3RvcmluZ1xDcm9wTWV0cmljcy5Wby5BcGlcQ3JvcE1ldHJpY3MuVm8uQXBpXGFwaVxhZG1pblx2MVx1c2Vyc1w=?="
        }, {
          "name" : "X-Powered-By",
          "value" : "ASP.NET"
        }, {
          "name" : "Date",
          "value" : "Fri, 29 Mar 2019 22:10:09 GMT"
        }, {
          "name" : "Content-Length",
          "value" : "9"
        } ],
        "content" : {
          "size" : 9,
          "mimeType" : "application/json; charset=utf-8",
          "text" : "{\"id\":18}",
          "comment" : ""
        },
        "redirectURL" : "",
        "headersSize" : 887,
        "bodySize" : 9,
        "comment" : ""
      },
      "cache" : { },
      "timings" : {
        "comment" : "",
        "ssl" : -1,
        "connect" : -1,
        "send" : 0,
        "receive" : 0,
        "wait" : 1946,
        "dns" : -1,
        "blocked" : -1
      },
      "serverIPAddress" : "127.0.0.1",
      "comment" : "",
      "_katalonRequestInformation" : {
        "name" : "57",
        "testObjectId" : "Object Repository/VoPro/Account/api_admin_v1_users",
        "harId" : "c96a1a0b-3049-4370-be95-8c7e9dcf1ec9"
      },
      "time" : 1947
    } ],
    "comment" : ""
  }
}