{
  "log" : {
    "version" : "1.2",
    "creator" : {
      "name" : "BrowserMob Proxy",
      "version" : "2.1.5",
      "comment" : ""
    },
    "pages" : [ {
      "id" : "Page 0",
      "startedDateTime" : "2019-03-29T18:59:52.614Z",
      "title" : "Page 0",
      "pageTimings" : {
        "onLoad" : 2230,
        "comment" : ""
      },
      "comment" : ""
    } ],
    "entries" : [ {
      "pageref" : "Page 0",
      "startedDateTime" : "2019-03-29T18:59:52.616Z",
      "request" : {
        "method" : "PUT",
        "url" : "http://localhost:10520/WebAPI/api/admin/v1/users/26?",
        "httpVersion" : "HTTP/1.1",
        "cookies" : [ ],
        "headers" : [ {
          "name" : "User-Agent",
          "value" : "Katalon Studio"
        }, {
          "name" : "Content-Type",
          "value" : "application/x-www-form-urlencoded"
        }, {
          "name" : "Authorization",
          "value" : "Bearer eyJ0eXAiOiJKV1QiLCJhbGciOiJIUzI1NiJ9.eyJ1bmlxdWVfbmFtZSI6ImFkbWluIiwicm9sZSI6InVzZXIiLCJzdWIiOiJhZG1pbiIsImlzcyI6IkNyb3BNZXRyaWNzIiwiYXVkIjoiYWxsIiwiZXhwIjoxNTUzODg5ODkyLCJuYmYiOjE1NTM4ODU5OTJ9.cZSx5B_lARmCSz0IELrCqslEEsSPMs2hMDfMMotRXgY"
        }, {
          "name" : "Host",
          "value" : "localhost:10520"
        }, {
          "name" : "Accept",
          "value" : "text/html, image/gif, image/jpeg, *; q=.2, */*; q=.2"
        }, {
          "name" : "Proxy-Connection",
          "value" : "keep-alive"
        }, {
          "name" : "Content-Length",
          "value" : "526"
        } ],
        "queryString" : [ ],
        "postData" : {
          "mimeType" : "application/x-www-form-urlencoded",
          "params" : [ {
            "name" : "password",
            "value" : "cropmetrics",
            "comment" : ""
          }, {
            "name" : "email",
            "value" : "cropmetricsvo.townlong@gmail.com",
            "comment" : ""
          }, {
            "name" : "fullname",
            "value" : "x",
            "comment" : ""
          }, {
            "name" : "phone",
            "value" : "1",
            "comment" : ""
          }, {
            "name" : "dealer",
            "value" : "xx",
            "comment" : ""
          }, {
            "name" : "addressLine1",
            "value" : "address line 1 test validation",
            "comment" : ""
          }, {
            "name" : "addressLine2",
            "value" : "address line 2 test validation",
            "comment" : ""
          }, {
            "name" : "town",
            "value" : "18 API_ACNT_When_account_updated_have_long_town_attribute_Expected_status_code_20018 API_ACNT_When_account_updated_have_long_town_attribute_Expected_status_code_20018 API_ACNT_When_account_updated_have_long_town_attribute_Expected_status_code_200",
            "comment" : ""
          }, {
            "name" : "state",
            "value" : "stateValidation",
            "comment" : ""
          }, {
            "name" : "zip",
            "value" : "zipValidation",
            "comment" : ""
          }, {
            "name" : "country",
            "value" : "countryValidation",
            "comment" : ""
          }, {
            "name" : "roles",
            "value" : "Client",
            "comment" : ""
          }, {
            "name" : "userProfileId",
            "value" : "26",
            "comment" : ""
          } ],
          "comment" : ""
        },
        "headersSize" : 545,
        "bodySize" : 526,
        "comment" : ""
      },
      "response" : {
        "status" : 200,
        "statusText" : "OK",
        "httpVersion" : "HTTP/1.1",
        "cookies" : [ {
          "name" : ".ASPROLES",
          "value" : "iR2I748ozYPLYgjOswetNF5j3vhyTN-tEkNYVe99rUoMamf-iQNeNvxnUvYtfIRlDQRGwcrZQpRrUtzRoBESMfAJRxDz83JKVDUH8VvpfMXLwYThzpFSr8h-ynrffHAqdI6BKusWMcS6mgRn-jmQpDErq86MDLs3V6YWvwsy-_TMIUkIGCiwvbRTkK6U52nlmXjl26XWc1rxRHjlAxvK1vsYxO85MzrDwimwQ0ZcVf31GKIasbxfjo4Kf344lbfxDPWbZHqt4ofkvyaL81AB-jwwzro8KHz37X2Ja9rbcyyTmN0ak6LjG8CS4vXQ5xvX67XbD01ex1jYClbDh2OsxrWq-qdDCLzhKrum7gpXDd8HYC0yogNSs96-dQ1CZHYovKri8P5xrcOnFQh1o0R1Bh9GVG4IHSyULX4qLP9BEMD-wNfJldZVtDplx3X1JCYoW1TeDF27bgOHjKXus3Vlvk2kZlSpoywf2Lp8z4p9RxWvv0Ll0",
          "path" : "/",
          "httpOnly" : true,
          "secure" : false,
          "comment" : ""
        } ],
        "headers" : [ {
          "name" : "Cache-Control",
          "value" : "private"
        }, {
          "name" : "Server",
          "value" : "Microsoft-IIS/10.0"
        }, {
          "name" : "Set-Cookie",
          "value" : ".ASPROLES=iR2I748ozYPLYgjOswetNF5j3vhyTN-tEkNYVe99rUoMamf-iQNeNvxnUvYtfIRlDQRGwcrZQpRrUtzRoBESMfAJRxDz83JKVDUH8VvpfMXLwYThzpFSr8h-ynrffHAqdI6BKusWMcS6mgRn-jmQpDErq86MDLs3V6YWvwsy-_TMIUkIGCiwvbRTkK6U52nlmXjl26XWc1rxRHjlAxvK1vsYxO85MzrDwimwQ0ZcVf31GKIasbxfjo4Kf344lbfxDPWbZHqt4ofkvyaL81AB-jwwzro8KHz37X2Ja9rbcyyTmN0ak6LjG8CS4vXQ5xvX67XbD01ex1jYClbDh2OsxrWq-qdDCLzhKrum7gpXDd8HYC0yogNSs96-dQ1CZHYovKri8P5xrcOnFQh1o0R1Bh9GVG4IHSyULX4qLP9BEMD-wNfJldZVtDplx3X1JCYoW1TeDF27bgOHjKXus3Vlvk2kZlSpoywf2Lp8z4p9RxWvv0Ll0; path=/; HttpOnly"
        }, {
          "name" : "X-SourceFiles",
          "value" : "=?UTF-8?B?RDpcVmlydHVhbE9wdGltaXplci1SZWZhY3RvcmluZ1xDcm9wTWV0cmljcy5Wby5BcGlcQ3JvcE1ldHJpY3MuVm8uQXBpXGFwaVxhZG1pblx2MVx1c2Vyc1wyNg==?="
        }, {
          "name" : "X-Powered-By",
          "value" : "ASP.NET"
        }, {
          "name" : "Date",
          "value" : "Fri, 29 Mar 2019 18:59:54 GMT"
        }, {
          "name" : "Content-Length",
          "value" : "0"
        } ],
        "content" : {
          "size" : 0,
          "mimeType" : "",
          "text" : "",
          "encoding" : "base64",
          "comment" : ""
        },
        "redirectURL" : "",
        "headersSize" : 844,
        "bodySize" : 0,
        "comment" : ""
      },
      "cache" : { },
      "timings" : {
        "comment" : "",
        "ssl" : -1,
        "wait" : 2224,
        "send" : 0,
        "receive" : 0,
        "dns" : -1,
        "blocked" : -1,
        "connect" : -1
      },
      "serverIPAddress" : "127.0.0.1",
      "comment" : "",
      "_katalonRequestInformation" : {
        "name" : "41",
        "testObjectId" : "Object Repository/VoPro/Account/api_admin_v1_users_userprofileid",
        "harId" : "7bc7f4cb-f889-4bcd-a7f5-7c7fe5ce2af1"
      },
      "time" : 2225
    } ],
    "comment" : ""
  }
}