{
  "log" : {
    "version" : "1.2",
    "creator" : {
      "name" : "BrowserMob Proxy",
      "version" : "2.1.5",
      "comment" : ""
    },
    "pages" : [ {
      "id" : "Page 0",
      "startedDateTime" : "2019-03-29T22:37:46.372Z",
      "title" : "Page 0",
      "pageTimings" : {
        "onLoad" : 2325,
        "comment" : ""
      },
      "comment" : ""
    } ],
    "entries" : [ {
      "pageref" : "Page 0",
      "startedDateTime" : "2019-03-29T22:37:46.373Z",
      "request" : {
        "method" : "POST",
        "url" : "http://localhost:10520/WebAPI/api/admin/v1/users/?",
        "httpVersion" : "HTTP/1.1",
        "cookies" : [ ],
        "headers" : [ {
          "name" : "User-Agent",
          "value" : "Katalon Studio"
        }, {
          "name" : "Content-Type",
          "value" : "application/x-www-form-urlencoded"
        }, {
          "name" : "Authorization",
          "value" : "Bearer eyJ0eXAiOiJKV1QiLCJhbGciOiJIUzI1NiJ9.eyJ1bmlxdWVfbmFtZSI6ImFkbWluIiwicm9sZSI6InVzZXIiLCJzdWIiOiJhZG1pbiIsImlzcyI6IkNyb3BNZXRyaWNzIiwiYXVkIjoiYWxsIiwiZXhwIjoxNTUzOTAyOTY2LCJuYmYiOjE1NTM4OTkwNjZ9.MQVzcFvuOBJkNBQFLMg2ujXZQtzWJWyVXXxYTUNvhrc"
        }, {
          "name" : "Host",
          "value" : "localhost:10520"
        }, {
          "name" : "Accept",
          "value" : "text/html, image/gif, image/jpeg, *; q=.2, */*; q=.2"
        }, {
          "name" : "Proxy-Connection",
          "value" : "keep-alive"
        }, {
          "name" : "Content-Length",
          "value" : "306"
        } ],
        "queryString" : [ ],
        "postData" : {
          "mimeType" : "application/x-www-form-urlencoded",
          "params" : [ {
            "name" : "password",
            "value" : "!@#$%^",
            "comment" : ""
          }, {
            "name" : "email",
            "value" : "cropmetricsvo.passwithsymbols@gmail.com",
            "comment" : ""
          }, {
            "name" : "fullname",
            "value" : "test validation",
            "comment" : ""
          }, {
            "name" : "phone",
            "value" : "123",
            "comment" : ""
          }, {
            "name" : "dealer",
            "value" : "x",
            "comment" : ""
          }, {
            "name" : "addressLine1",
            "value" : "address line 1 test validation",
            "comment" : ""
          }, {
            "name" : "addressLine2",
            "value" : "address line 2 test validation",
            "comment" : ""
          }, {
            "name" : "town",
            "value" : "townValidation",
            "comment" : ""
          }, {
            "name" : "state",
            "value" : "stateValidation",
            "comment" : ""
          }, {
            "name" : "zip",
            "value" : "zipValidation",
            "comment" : ""
          }, {
            "name" : "country",
            "value" : "countryValidation",
            "comment" : ""
          }, {
            "name" : "roles",
            "value" : "Client",
            "comment" : ""
          } ],
          "comment" : ""
        },
        "headersSize" : 544,
        "bodySize" : 306,
        "comment" : ""
      },
      "response" : {
        "status" : 200,
        "statusText" : "OK",
        "httpVersion" : "HTTP/1.1",
        "cookies" : [ {
          "name" : ".ASPROLES",
          "value" : "61ii7PMWKcjiQWFRwbWXkRolVBxA8OAjw62plEn0yfn5RxOoZ-IddcG1JH3uh6eeC6RCt0eaTNmQuB0_eYSaEZHRhIAVShQp4b8E4QXolckKRra9VK-SGCJcQ5WTHJw5mD2uuaqlzk8VDzLYH1uM-TGEe2Nrx8ZRYozl37cyPgpp8yIEFRTZAfYqoD_ph_HslN076c6ET9slpvF4BDIySW56FG6pn9AXEIzZ3hTHF2Sf1B3zXBgZzGQPo9ljjsHFxnF4v5JL1ouKh5zeQoMclV2hzxs1LT1sR4qrpF7hmiVPe2BD-uwCU2v40I4gGtYGuJAVUHhmvOyoUe09GN1PmSRZAcR8PjO1NuYyB1YvC6ZYnocd7Cfe7uq4zgGAISO_x9YBh58WTkLY91Ev0_lMLnjBXCpJQs-r4QDK6hHMv4v__5NTzsbnXeiLk-GB5Z0mwBZO--PSNTNq4yZDLXtGiu_s9SYXpt1SVXj9OEkxjgv-g1WY0",
          "path" : "/",
          "httpOnly" : true,
          "secure" : false,
          "comment" : ""
        } ],
        "headers" : [ {
          "name" : "Cache-Control",
          "value" : "private"
        }, {
          "name" : "Content-Type",
          "value" : "application/json; charset=utf-8"
        }, {
          "name" : "Server",
          "value" : "Microsoft-IIS/10.0"
        }, {
          "name" : "Set-Cookie",
          "value" : ".ASPROLES=61ii7PMWKcjiQWFRwbWXkRolVBxA8OAjw62plEn0yfn5RxOoZ-IddcG1JH3uh6eeC6RCt0eaTNmQuB0_eYSaEZHRhIAVShQp4b8E4QXolckKRra9VK-SGCJcQ5WTHJw5mD2uuaqlzk8VDzLYH1uM-TGEe2Nrx8ZRYozl37cyPgpp8yIEFRTZAfYqoD_ph_HslN076c6ET9slpvF4BDIySW56FG6pn9AXEIzZ3hTHF2Sf1B3zXBgZzGQPo9ljjsHFxnF4v5JL1ouKh5zeQoMclV2hzxs1LT1sR4qrpF7hmiVPe2BD-uwCU2v40I4gGtYGuJAVUHhmvOyoUe09GN1PmSRZAcR8PjO1NuYyB1YvC6ZYnocd7Cfe7uq4zgGAISO_x9YBh58WTkLY91Ev0_lMLnjBXCpJQs-r4QDK6hHMv4v__5NTzsbnXeiLk-GB5Z0mwBZO--PSNTNq4yZDLXtGiu_s9SYXpt1SVXj9OEkxjgv-g1WY0; path=/; HttpOnly"
        }, {
          "name" : "X-SourceFiles",
          "value" : "=?UTF-8?B?RDpcVmlydHVhbE9wdGltaXplci1SZWZhY3RvcmluZ1xDcm9wTWV0cmljcy5Wby5BcGlcQ3JvcE1ldHJpY3MuVm8uQXBpXGFwaVxhZG1pblx2MVx1c2Vyc1w=?="
        }, {
          "name" : "X-Powered-By",
          "value" : "ASP.NET"
        }, {
          "name" : "Date",
          "value" : "Fri, 29 Mar 2019 22:37:48 GMT"
        }, {
          "name" : "Content-Length",
          "value" : "9"
        } ],
        "content" : {
          "size" : 9,
          "mimeType" : "application/json; charset=utf-8",
          "text" : "{\"id\":14}",
          "comment" : ""
        },
        "redirectURL" : "",
        "headersSize" : 887,
        "bodySize" : 9,
        "comment" : ""
      },
      "cache" : { },
      "timings" : {
        "comment" : "",
        "ssl" : -1,
        "wait" : 2320,
        "receive" : 0,
        "send" : 0,
        "connect" : -1,
        "dns" : -1,
        "blocked" : -1
      },
      "serverIPAddress" : "127.0.0.1",
      "comment" : "",
      "_katalonRequestInformation" : {
        "name" : "43",
        "testObjectId" : "Object Repository/VoPro/Account/api_admin_v1_users",
        "harId" : "3e27c08e-ece4-4472-87a7-0b5d5a21c54c"
      },
      "time" : 2321
    } ],
    "comment" : ""
  }
}