{
  "log" : {
    "version" : "1.2",
    "creator" : {
      "name" : "BrowserMob Proxy",
      "version" : "2.1.5",
      "comment" : ""
    },
    "pages" : [ {
      "id" : "Page 0",
      "startedDateTime" : "2019-03-29T22:32:06.323Z",
      "title" : "Page 0",
      "pageTimings" : {
        "onLoad" : 1847,
        "comment" : ""
      },
      "comment" : ""
    } ],
    "entries" : [ {
      "pageref" : "Page 0",
      "startedDateTime" : "2019-03-29T22:32:06.324Z",
      "request" : {
        "method" : "PUT",
        "url" : "http://localhost:10520/WebAPI/api/admin/v1/users/14?",
        "httpVersion" : "HTTP/1.1",
        "cookies" : [ ],
        "headers" : [ {
          "name" : "User-Agent",
          "value" : "Katalon Studio"
        }, {
          "name" : "Content-Type",
          "value" : "application/x-www-form-urlencoded"
        }, {
          "name" : "Authorization",
          "value" : "Bearer eyJ0eXAiOiJKV1QiLCJhbGciOiJIUzI1NiJ9.eyJ1bmlxdWVfbmFtZSI6ImFkbWluIiwicm9sZSI6InVzZXIiLCJzdWIiOiJhZG1pbiIsImlzcyI6IkNyb3BNZXRyaWNzIiwiYXVkIjoiYWxsIiwiZXhwIjoxNTUzOTAyNjI2LCJuYmYiOjE1NTM4OTg3MjZ9.a4cldoDOIm1wtmJxrG0-V8I2Pv5jKkJYw7geWGxfxOY"
        }, {
          "name" : "Host",
          "value" : "localhost:10520"
        }, {
          "name" : "Accept",
          "value" : "text/html, image/gif, image/jpeg, *; q=.2, */*; q=.2"
        }, {
          "name" : "Proxy-Connection",
          "value" : "keep-alive"
        }, {
          "name" : "Content-Length",
          "value" : "286"
        } ],
        "queryString" : [ ],
        "postData" : {
          "mimeType" : "application/x-www-form-urlencoded",
          "params" : [ {
            "name" : "password",
            "value" : "cropmetrics",
            "comment" : ""
          }, {
            "name" : "email",
            "value" : "cropmetricsvo.passwithsymbols@gmail.com",
            "comment" : ""
          }, {
            "name" : "fullname",
            "value" : "test validation",
            "comment" : ""
          }, {
            "name" : "phone",
            "value" : "123",
            "comment" : ""
          }, {
            "name" : "dealer",
            "value" : "x",
            "comment" : ""
          }, {
            "name" : "addressLine1",
            "value" : "address line 1 test validation",
            "comment" : ""
          }, {
            "name" : "addressLine2",
            "value" : "",
            "comment" : ""
          }, {
            "name" : "town",
            "value" : "townValidation",
            "comment" : ""
          }, {
            "name" : "state",
            "value" : "stateValidation",
            "comment" : ""
          }, {
            "name" : "zip",
            "value" : "zipValidation",
            "comment" : ""
          }, {
            "name" : "country",
            "value" : "countryValidation",
            "comment" : ""
          }, {
            "name" : "roles",
            "value" : "Client",
            "comment" : ""
          }, {
            "name" : "userProfileId",
            "value" : "14",
            "comment" : ""
          } ],
          "comment" : ""
        },
        "headersSize" : 545,
        "bodySize" : 286,
        "comment" : ""
      },
      "response" : {
        "status" : 200,
        "statusText" : "OK",
        "httpVersion" : "HTTP/1.1",
        "cookies" : [ {
          "name" : ".ASPROLES",
          "value" : "MqOfjb1868kCETnqM6_Y36PloIGb7r3v_xQN7M8HpHLGOcw5aU7H4cJiZ-wn5NfIsDFND1aUqJWI7cTP1CD0anNlbQxqzR8qHMf-6hNxf9hssT2cDHtXMw2m2vldIJCrFmaAni6US60TB9wMelgwuVLSxYP65kzjw-vcEDz5_mH_rDO4bJShh6IGuXPkGbGT1avUqCVNswbP3G8TeDf54loLcFQCBO0iuwUJvEImCWLM8iF07TY5IOg5cLg_CSGu_Y7WSOerHKkrPpTXydnHuLxcUWYPboqLjBPEu1E2xbRh3_VKpYHJvX6hdZ6ovwuqe-VduBNjaHPgCh_K5CQDqTlZgMA2aiKXXEYXCAG6U7ML2IOmK8y5--j3Kqu2291-UxqMQDGd_zGqGZTCVXc4axWpdzIEBILlP2jWvbGrB2vhlA7sY0u0aw1Rf6xygIl-cZ3oHRIEb8zqKDih6WqOKsZkXb8oDb9zgGOEDdy2uudvPKN60",
          "path" : "/",
          "httpOnly" : true,
          "secure" : false,
          "comment" : ""
        } ],
        "headers" : [ {
          "name" : "Cache-Control",
          "value" : "private"
        }, {
          "name" : "Server",
          "value" : "Microsoft-IIS/10.0"
        }, {
          "name" : "Set-Cookie",
          "value" : ".ASPROLES=MqOfjb1868kCETnqM6_Y36PloIGb7r3v_xQN7M8HpHLGOcw5aU7H4cJiZ-wn5NfIsDFND1aUqJWI7cTP1CD0anNlbQxqzR8qHMf-6hNxf9hssT2cDHtXMw2m2vldIJCrFmaAni6US60TB9wMelgwuVLSxYP65kzjw-vcEDz5_mH_rDO4bJShh6IGuXPkGbGT1avUqCVNswbP3G8TeDf54loLcFQCBO0iuwUJvEImCWLM8iF07TY5IOg5cLg_CSGu_Y7WSOerHKkrPpTXydnHuLxcUWYPboqLjBPEu1E2xbRh3_VKpYHJvX6hdZ6ovwuqe-VduBNjaHPgCh_K5CQDqTlZgMA2aiKXXEYXCAG6U7ML2IOmK8y5--j3Kqu2291-UxqMQDGd_zGqGZTCVXc4axWpdzIEBILlP2jWvbGrB2vhlA7sY0u0aw1Rf6xygIl-cZ3oHRIEb8zqKDih6WqOKsZkXb8oDb9zgGOEDdy2uudvPKN60; path=/; HttpOnly"
        }, {
          "name" : "X-SourceFiles",
          "value" : "=?UTF-8?B?RDpcVmlydHVhbE9wdGltaXplci1SZWZhY3RvcmluZ1xDcm9wTWV0cmljcy5Wby5BcGlcQ3JvcE1ldHJpY3MuVm8uQXBpXGFwaVxhZG1pblx2MVx1c2Vyc1wxNA==?="
        }, {
          "name" : "X-Powered-By",
          "value" : "ASP.NET"
        }, {
          "name" : "Date",
          "value" : "Fri, 29 Mar 2019 22:32:08 GMT"
        }, {
          "name" : "Content-Length",
          "value" : "0"
        } ],
        "content" : {
          "size" : 0,
          "mimeType" : "",
          "text" : "",
          "encoding" : "base64",
          "comment" : ""
        },
        "redirectURL" : "",
        "headersSize" : 844,
        "bodySize" : 0,
        "comment" : ""
      },
      "cache" : { },
      "timings" : {
        "comment" : "",
        "ssl" : -1,
        "send" : 0,
        "wait" : 1843,
        "receive" : 0,
        "connect" : -1,
        "dns" : -1,
        "blocked" : -1
      },
      "serverIPAddress" : "127.0.0.1",
      "comment" : "",
      "_katalonRequestInformation" : {
        "name" : "101",
        "testObjectId" : "Object Repository/VoPro/Account/api_admin_v1_users_userprofileid",
        "harId" : "ce801b37-6de8-42a6-aeb8-4a43570f6d9b"
      },
      "time" : 1843
    } ],
    "comment" : ""
  }
}