{
  "log" : {
    "version" : "1.2",
    "creator" : {
      "name" : "BrowserMob Proxy",
      "version" : "2.1.5",
      "comment" : ""
    },
    "pages" : [ {
      "id" : "Page 0",
      "startedDateTime" : "2019-03-28T21:18:55.398Z",
      "title" : "Page 0",
      "pageTimings" : {
        "onLoad" : 1381,
        "comment" : ""
      },
      "comment" : ""
    } ],
    "entries" : [ {
      "pageref" : "Page 0",
      "startedDateTime" : "2019-03-28T21:18:55.400Z",
      "request" : {
        "method" : "POST",
        "url" : "http://localhost:10520/WebAPI/api/admin/v1/users/?",
        "httpVersion" : "HTTP/1.1",
        "cookies" : [ ],
        "headers" : [ {
          "name" : "User-Agent",
          "value" : "Katalon Studio"
        }, {
          "name" : "Content-Type",
          "value" : "application/x-www-form-urlencoded"
        }, {
          "name" : "Authorization",
          "value" : "Bearer eyJ0eXAiOiJKV1QiLCJhbGciOiJIUzI1NiJ9.eyJ1bmlxdWVfbmFtZSI6ImFkbWluIiwicm9sZSI6InVzZXIiLCJzdWIiOiJhZG1pbiIsImlzcyI6IkNyb3BNZXRyaWNzIiwiYXVkIjoiYWxsIiwiZXhwIjoxNTUzODExODM1LCJuYmYiOjE1NTM4MDc5MzV9.CD53R21T6fjQMIDRGfpfKZCpU6HzC4xqDce-DjpClc8"
        }, {
          "name" : "Host",
          "value" : "localhost:10520"
        }, {
          "name" : "Accept",
          "value" : "text/html, image/gif, image/jpeg, *; q=.2, */*; q=.2"
        }, {
          "name" : "Proxy-Connection",
          "value" : "keep-alive"
        }, {
          "name" : "Content-Length",
          "value" : "310"
        } ],
        "queryString" : [ ],
        "postData" : {
          "mimeType" : "application/x-www-form-urlencoded",
          "params" : [ {
            "name" : "password",
            "value" : "cropmetrics",
            "comment" : ""
          }, {
            "name" : "email",
            "value" : "cropmetricsvo.no.phone@gmail.com",
            "comment" : ""
          }, {
            "name" : "fullname",
            "value" : "test validation",
            "comment" : ""
          }, {
            "name" : "phone",
            "value" : "",
            "comment" : ""
          }, {
            "name" : "dealer",
            "value" : "dealer test validation",
            "comment" : ""
          }, {
            "name" : "addressLine1",
            "value" : "address line 1 test validation",
            "comment" : ""
          }, {
            "name" : "addressLine2",
            "value" : "address line 1 test validation",
            "comment" : ""
          }, {
            "name" : "town",
            "value" : "townValidation",
            "comment" : ""
          }, {
            "name" : "state",
            "value" : "stateValidation",
            "comment" : ""
          }, {
            "name" : "zip",
            "value" : "zipValidation",
            "comment" : ""
          }, {
            "name" : "country",
            "value" : "countryValidation",
            "comment" : ""
          }, {
            "name" : "roles",
            "value" : "Client",
            "comment" : ""
          } ],
          "comment" : ""
        },
        "headersSize" : 544,
        "bodySize" : 310,
        "comment" : ""
      },
      "response" : {
        "status" : 200,
        "statusText" : "OK",
        "httpVersion" : "HTTP/1.1",
        "cookies" : [ {
          "name" : ".ASPROLES",
          "value" : "t26NytY8D0gaG3WBhzDB2ZaFOVOyJSdwv-v2ZvfWtJnVaMF7eYQcui_gqIZtNokHp6zxV0PxSGhZzRaIvOUsEyXXaPoY_Kgtm1uQK5S7xWW3AiOxRA8MJGpL5GFQ5ceruEwPwoO6FLTHr29VGlujJM7sSVFCcJbPfi-ZKsEFrFKKjSZcEhtTFO_MtLoGBAFhC8HNsduDCIOxM4-dvVB6Te3IidYu6KsUZEj0MCYfnrK4naav-nK9LnKH0xHoqblGCgwTYujXDFzJZMjp6Jrtxg4rd6EZ-hwcVsOqTHO2FyuLr1APEX8bpDu3R61sG1gRFjUDLeIMffvGMP8ZJpJUzxrRWRYuIC0RwkIZmQhYNn86aGDCx4tNqphA3ikZ7wpvXra7nC8tuC1Re1uNsx3tu2MM5734Go2soCJ5MzyaHAR1eP_Y3z5FasgYu5Z3PFi-gC2SlsK8NuiJTrXpZQlCVZkb1lDKB8cdE7-qytlK-Pyzr2O30",
          "path" : "/",
          "httpOnly" : true,
          "secure" : false,
          "comment" : ""
        } ],
        "headers" : [ {
          "name" : "Cache-Control",
          "value" : "private"
        }, {
          "name" : "Content-Type",
          "value" : "application/json; charset=utf-8"
        }, {
          "name" : "Server",
          "value" : "Microsoft-IIS/10.0"
        }, {
          "name" : "Set-Cookie",
          "value" : ".ASPROLES=t26NytY8D0gaG3WBhzDB2ZaFOVOyJSdwv-v2ZvfWtJnVaMF7eYQcui_gqIZtNokHp6zxV0PxSGhZzRaIvOUsEyXXaPoY_Kgtm1uQK5S7xWW3AiOxRA8MJGpL5GFQ5ceruEwPwoO6FLTHr29VGlujJM7sSVFCcJbPfi-ZKsEFrFKKjSZcEhtTFO_MtLoGBAFhC8HNsduDCIOxM4-dvVB6Te3IidYu6KsUZEj0MCYfnrK4naav-nK9LnKH0xHoqblGCgwTYujXDFzJZMjp6Jrtxg4rd6EZ-hwcVsOqTHO2FyuLr1APEX8bpDu3R61sG1gRFjUDLeIMffvGMP8ZJpJUzxrRWRYuIC0RwkIZmQhYNn86aGDCx4tNqphA3ikZ7wpvXra7nC8tuC1Re1uNsx3tu2MM5734Go2soCJ5MzyaHAR1eP_Y3z5FasgYu5Z3PFi-gC2SlsK8NuiJTrXpZQlCVZkb1lDKB8cdE7-qytlK-Pyzr2O30; path=/; HttpOnly"
        }, {
          "name" : "X-SourceFiles",
          "value" : "=?UTF-8?B?RDpcVmlydHVhbE9wdGltaXplci1SZWZhY3RvcmluZ1xDcm9wTWV0cmljcy5Wby5BcGlcQ3JvcE1ldHJpY3MuVm8uQXBpXGFwaVxhZG1pblx2MVx1c2Vyc1w=?="
        }, {
          "name" : "X-Powered-By",
          "value" : "ASP.NET"
        }, {
          "name" : "Date",
          "value" : "Thu, 28 Mar 2019 21:18:56 GMT"
        }, {
          "name" : "Content-Length",
          "value" : "8"
        } ],
        "content" : {
          "size" : 8,
          "mimeType" : "application/json; charset=utf-8",
          "text" : "{\"id\":4}",
          "comment" : ""
        },
        "redirectURL" : "",
        "headersSize" : 887,
        "bodySize" : 8,
        "comment" : ""
      },
      "cache" : { },
      "timings" : {
        "comment" : "",
        "connect" : -1,
        "send" : 0,
        "receive" : 0,
        "dns" : -1,
        "blocked" : -1,
        "wait" : 1375,
        "ssl" : -1
      },
      "serverIPAddress" : "127.0.0.1",
      "comment" : "",
      "_katalonRequestInformation" : {
        "name" : "11",
        "testObjectId" : "Object Repository/VoPro/Account/api_admin_v1_users",
        "harId" : "a44a06a3-557b-462e-b732-b16aea3ced1e"
      },
      "time" : 1377
    } ],
    "comment" : ""
  }
}