{
  "log" : {
    "version" : "1.2",
    "creator" : {
      "name" : "BrowserMob Proxy",
      "version" : "2.1.5",
      "comment" : ""
    },
    "pages" : [ {
      "id" : "Page 0",
      "startedDateTime" : "2019-04-11T16:05:30.263Z",
      "title" : "Page 0",
      "pageTimings" : {
        "onLoad" : 110,
        "comment" : ""
      },
      "comment" : ""
    } ],
    "entries" : [ {
      "pageref" : "Page 0",
      "startedDateTime" : "2019-04-11T16:05:30.264Z",
      "request" : {
        "method" : "PUT",
        "url" : "http://localhost:10520/WebAPI/api/mobile/v1/farms/7?",
        "httpVersion" : "HTTP/1.1",
        "cookies" : [ ],
        "headers" : [ {
          "name" : "User-Agent",
          "value" : "Katalon Studio"
        }, {
          "name" : "Content-Type",
          "value" : "application/json"
        }, {
          "name" : "Authorization",
          "value" : "Bearer eyJ0eXAiOiJKV1QiLCJhbGciOiJIUzI1NiJ9.eyJ1bmlxdWVfbmFtZSI6Implbm55Lm1hbGRvbmFkby50eDFAZ21haWwuY29tIiwicm9sZSI6InVzZXIiLCJzdWIiOiJqZW5ueS5tYWxkb25hZG8udHgxQGdtYWlsLmNvbSIsImlzcyI6IkNyb3BNZXRyaWNzIiwiYXVkIjoiYWxsIiwiZXhwIjoxNTU1MDAyNjMwLCJuYmYiOjE1NTQ5OTg3MzB9.O4Cs1qx9zCHGd0RNJdgUZ2SE_q8eHe8Jswqw_8eUf3g"
        }, {
          "name" : "Host",
          "value" : "localhost:10520"
        }, {
          "name" : "Accept",
          "value" : "text/html, image/gif, image/jpeg, *; q=.2, */*; q=.2"
        }, {
          "name" : "Proxy-Connection",
          "value" : "keep-alive"
        }, {
          "name" : "Content-Length",
          "value" : "22"
        } ],
        "queryString" : [ ],
        "postData" : {
          "mimeType" : "application/json",
          "text" : "{\"name\": \"5555555555\"}",
          "comment" : ""
        },
        "headersSize" : 591,
        "bodySize" : 22,
        "comment" : ""
      },
      "response" : {
        "status" : 200,
        "statusText" : "OK",
        "httpVersion" : "HTTP/1.1",
        "cookies" : [ {
          "name" : ".ASPROLES",
          "value" : "0Fg9P4ILr17s6kx4tB5UQQTXwLKsKkUcyIOQK71iH8MWo4rYEKEMm5D6c3aYbmVak7Fya8mkl1WSDIk5vsxrd45-r67_A9n5E7gpWxCefTZu6iJg309NJmgvXlHJ_i1IX2apFZ3Bu5pLVFaN-uZ7VKQoHH7roVJ89HPKQPD0ehYrlvH4gRaQoaDpnLOtgYNZJ1C68JNNi5Fk8fMyslzQTa8_c-T9N6ePybABx_jExfhwstFOFBK38mPdiDZJjjJCx6YS5KaRO45ajKjsUZ5ujlx8kUQiiDOrHfbGC-tbPteqRxngCZC9PawmXOxHCQTIlq7IDAN6V96gQd35d1IhPcFWUS4K3MCUoVPHGzpFPBoXI9aEkeMyuY1Bf4_HTKK5GWLju5IEDjheAW5o9-yvaD1W32_d15bWwFkvWcszsMi0NjJiApaMAf9VA30ukH5WRUuAkpRnQtckXxWRin0Mpe1erI2R1OSnP3QGAIp2wLxfrBRgPHr7gd9VktDZeT8nGu606YRuQA_s5O6BEmHeAIfHdhk1",
          "path" : "/",
          "httpOnly" : true,
          "secure" : false,
          "comment" : ""
        } ],
        "headers" : [ {
          "name" : "Cache-Control",
          "value" : "private"
        }, {
          "name" : "Content-Type",
          "value" : "application/json; charset=utf-8"
        }, {
          "name" : "Server",
          "value" : "Microsoft-IIS/10.0"
        }, {
          "name" : "Set-Cookie",
          "value" : ".ASPROLES=0Fg9P4ILr17s6kx4tB5UQQTXwLKsKkUcyIOQK71iH8MWo4rYEKEMm5D6c3aYbmVak7Fya8mkl1WSDIk5vsxrd45-r67_A9n5E7gpWxCefTZu6iJg309NJmgvXlHJ_i1IX2apFZ3Bu5pLVFaN-uZ7VKQoHH7roVJ89HPKQPD0ehYrlvH4gRaQoaDpnLOtgYNZJ1C68JNNi5Fk8fMyslzQTa8_c-T9N6ePybABx_jExfhwstFOFBK38mPdiDZJjjJCx6YS5KaRO45ajKjsUZ5ujlx8kUQiiDOrHfbGC-tbPteqRxngCZC9PawmXOxHCQTIlq7IDAN6V96gQd35d1IhPcFWUS4K3MCUoVPHGzpFPBoXI9aEkeMyuY1Bf4_HTKK5GWLju5IEDjheAW5o9-yvaD1W32_d15bWwFkvWcszsMi0NjJiApaMAf9VA30ukH5WRUuAkpRnQtckXxWRin0Mpe1erI2R1OSnP3QGAIp2wLxfrBRgPHr7gd9VktDZeT8nGu606YRuQA_s5O6BEmHeAIfHdhk1; path=/; HttpOnly"
        }, {
          "name" : "X-SourceFiles",
          "value" : "=?UTF-8?B?RDpcVmlydHVhbE9wdGltaXplci1SZWZhY3RvcmluZ1xDcm9wTWV0cmljcy5Wby5BcGlcQ3JvcE1ldHJpY3MuVm8uQXBpXGFwaVxtb2JpbGVcdjFcZmFybXNcNw==?="
        }, {
          "name" : "X-Powered-By",
          "value" : "ASP.NET"
        }, {
          "name" : "Date",
          "value" : "Thu, 11 Apr 2019 16:05:30 GMT"
        }, {
          "name" : "Content-Length",
          "value" : "40"
        } ],
        "content" : {
          "size" : 40,
          "mimeType" : "application/json; charset=utf-8",
          "text" : "{\"id\":7,\"name\":\"5555555555\",\"user_id\":3}",
          "comment" : ""
        },
        "redirectURL" : "",
        "headersSize" : 935,
        "bodySize" : 40,
        "comment" : ""
      },
      "cache" : { },
      "timings" : {
        "comment" : "",
        "send" : 0,
        "receive" : 0,
        "dns" : -1,
        "wait" : 105,
        "connect" : -1,
        "blocked" : -1,
        "ssl" : -1
      },
      "serverIPAddress" : "127.0.0.1",
      "comment" : "",
      "_katalonRequestInformation" : {
        "name" : "29",
        "testObjectId" : "Object Repository/VoGrow/Farm/FarmPut",
        "harId" : "17bf00a6-1ae4-4f6a-ad66-246dcf7ba6b9"
      },
      "time" : 106
    } ],
    "comment" : ""
  }
}