{
  "log" : {
    "version" : "1.2",
    "creator" : {
      "name" : "BrowserMob Proxy",
      "version" : "2.1.5",
      "comment" : ""
    },
    "pages" : [ {
      "id" : "Page 0",
      "startedDateTime" : "2019-04-24T20:33:57.398Z",
      "title" : "Page 0",
      "pageTimings" : {
        "onLoad" : 3365,
        "comment" : ""
      },
      "comment" : ""
    } ],
    "entries" : [ {
      "pageref" : "Page 0",
      "startedDateTime" : "2019-04-24T20:33:57.399Z",
      "request" : {
        "method" : "PUT",
        "url" : "http://localhost:10520/WebAPI/api/mobile/v1/fields/3?",
        "httpVersion" : "HTTP/1.1",
        "cookies" : [ ],
        "headers" : [ {
          "name" : "User-Agent",
          "value" : "Katalon Studio"
        }, {
          "name" : "Content-Type",
          "value" : "application/json"
        }, {
          "name" : "Authorization",
          "value" : "Bearer eyJ0eXAiOiJKV1QiLCJhbGciOiJIUzI1NiJ9.eyJ1bmlxdWVfbmFtZSI6Implbm55Lm1hbGRvbmFkby50eDFAZ21haWwuY29tIiwicm9sZSI6InVzZXIiLCJzdWIiOiJqZW5ueS5tYWxkb25hZG8udHgxQGdtYWlsLmNvbSIsImlzcyI6IkNyb3BNZXRyaWNzIiwiYXVkIjoiYWxsIiwiZXhwIjoxNTU2MTQxOTM3LCJuYmYiOjE1NTYxMzgwMzd9.W6GkzhIl5qK4KBJ4_b8njulZc3GtY2rkMXte_GcxXtg"
        }, {
          "name" : "Host",
          "value" : "localhost:10520"
        }, {
          "name" : "Accept",
          "value" : "text/html, image/gif, image/jpeg, *; q=.2, */*; q=.2"
        }, {
          "name" : "Proxy-Connection",
          "value" : "keep-alive"
        }, {
          "name" : "Content-Length",
          "value" : "377"
        } ],
        "queryString" : [ ],
        "postData" : {
          "mimeType" : "application/json",
          "text" : "{\"field\":{\"name\":\"Field without x value in boundary\",\"boundary\":{\"boundaries\":[{\"boundary\":{\"coords\":[{\"y\":37.14976293},{\"x\":-101.50049403,\"y\":37.14647907},{\"x\":-101.50049403,\"y\":37.14264773},{\"x\":-101.49723246,\"y\":37.1411425},{\"x\":-101.49019435,\"y\":37.14223722},{\"x\":-101.48933604,\"y\":37.14620541},{\"x\":-101.49294093,\"y\":37.14866833},{\"x\":-101.49568751,\"y\":37.14976293}]}}]}}}",
          "comment" : ""
        },
        "headersSize" : 593,
        "bodySize" : 377,
        "comment" : ""
      },
      "response" : {
        "status" : 400,
        "statusText" : "Bad Request",
        "httpVersion" : "HTTP/1.1",
        "cookies" : [ {
          "name" : ".ASPROLES",
          "value" : "CQJoWbj75r18YGvp5aVRpTsY2mR0wCH90TP6-4rt9LmQa5yqEvfbSLblm7rCFtnkIcmycUoqyz4FUcc_kl5uURWGbtiFB2mj8YfcBql3Wk62yxr0_uU_wQCN3jmQYk5ROVqSrlXj3ORIo2Fql-kZO0vVpN-oM_Uj6OlwOvzUk858yLLKAAQQkur_gRmesj3Jbf6xfxunAgUyrbl9KVvbDum7NBdW7dXeNreZ5XPjXVXo3z0_py9ke-tMBxHbNHq5osTXS7xfkO-8lpy9LyRW4lAmKmH5Z8z2RfSZ6FbAwthmJcuEgOmM9H8lwMWA-TsAW1IJVIZw16W-Mrk_jC3chz-FZr0R0k-iBW9-lGYpX51duRiVHHbamqIsJCWaQEbw6oVWyZ7S6mmb4JUSi9CMx7Q8S5tNqwylBuEe5sV54JafrE4v8cQsCI1MB3uhlbKyWLl1F835XJUeg58fgn8CS_zqXSuo5gxvQMhbhrF4aBHqQBQZWut4YQ2nsuAK8MGa8QTnvtqKXOhFPh67f2TxcoqiEQ41",
          "path" : "/",
          "httpOnly" : true,
          "secure" : false,
          "comment" : ""
        } ],
        "headers" : [ {
          "name" : "Cache-Control",
          "value" : "private"
        }, {
          "name" : "Content-Type",
          "value" : "application/json; charset=utf-8"
        }, {
          "name" : "Server",
          "value" : "Microsoft-IIS/10.0"
        }, {
          "name" : "Set-Cookie",
          "value" : ".ASPROLES=CQJoWbj75r18YGvp5aVRpTsY2mR0wCH90TP6-4rt9LmQa5yqEvfbSLblm7rCFtnkIcmycUoqyz4FUcc_kl5uURWGbtiFB2mj8YfcBql3Wk62yxr0_uU_wQCN3jmQYk5ROVqSrlXj3ORIo2Fql-kZO0vVpN-oM_Uj6OlwOvzUk858yLLKAAQQkur_gRmesj3Jbf6xfxunAgUyrbl9KVvbDum7NBdW7dXeNreZ5XPjXVXo3z0_py9ke-tMBxHbNHq5osTXS7xfkO-8lpy9LyRW4lAmKmH5Z8z2RfSZ6FbAwthmJcuEgOmM9H8lwMWA-TsAW1IJVIZw16W-Mrk_jC3chz-FZr0R0k-iBW9-lGYpX51duRiVHHbamqIsJCWaQEbw6oVWyZ7S6mmb4JUSi9CMx7Q8S5tNqwylBuEe5sV54JafrE4v8cQsCI1MB3uhlbKyWLl1F835XJUeg58fgn8CS_zqXSuo5gxvQMhbhrF4aBHqQBQZWut4YQ2nsuAK8MGa8QTnvtqKXOhFPh67f2TxcoqiEQ41; path=/; HttpOnly"
        }, {
          "name" : "X-SourceFiles",
          "value" : "=?UTF-8?B?RDpcVmlydHVhbE9wdGltaXplci1SZWZhY3RvcmluZ1xDcm9wTWV0cmljcy5Wby5BcGlcQ3JvcE1ldHJpY3MuVm8uQXBpXGFwaVxtb2JpbGVcdjFcZmllbGRzXDM=?="
        }, {
          "name" : "X-Powered-By",
          "value" : "ASP.NET"
        }, {
          "name" : "Date",
          "value" : "Wed, 24 Apr 2019 20:34:00 GMT"
        }, {
          "name" : "Content-Length",
          "value" : "119"
        } ],
        "content" : {
          "size" : 119,
          "mimeType" : "application/json; charset=utf-8",
          "text" : "{\"message\":\"The Boundary is not valid. IllegalArgumentException: Points of LinearRing do not form a closed linestring\"}",
          "comment" : ""
        },
        "redirectURL" : "",
        "headersSize" : 945,
        "bodySize" : 119,
        "comment" : ""
      },
      "cache" : { },
      "timings" : {
        "comment" : "",
        "send" : 0,
        "wait" : 3360,
        "receive" : 0,
        "blocked" : -1,
        "connect" : -1,
        "dns" : -1,
        "ssl" : -1
      },
      "serverIPAddress" : "127.0.0.1",
      "comment" : "",
      "_katalonRequestInformation" : {
        "name" : "99",
        "testObjectId" : "Object Repository/VoGrow/Field/FieldPut",
        "harId" : "a0e771b3-6407-46e0-943a-c033f847f376"
      },
      "time" : 3361
    } ],
    "comment" : ""
  }
}