{
  "log" : {
    "version" : "1.2",
    "creator" : {
      "name" : "BrowserMob Proxy",
      "version" : "2.1.5",
      "comment" : ""
    },
    "pages" : [ {
      "id" : "Page 0",
      "startedDateTime" : "2019-04-05T10:00:34.529Z",
      "title" : "Page 0",
      "pageTimings" : {
        "onLoad" : 28,
        "comment" : ""
      },
      "comment" : ""
    } ],
    "entries" : [ {
      "pageref" : "Page 0",
      "startedDateTime" : "2019-04-05T10:00:34.530Z",
      "request" : {
        "method" : "POST",
        "url" : "http://localhost:10520/WebAPI/api/mobile/v1/farms/?",
        "httpVersion" : "HTTP/1.1",
        "cookies" : [ ],
        "headers" : [ {
          "name" : "User-Agent",
          "value" : "Katalon Studio"
        }, {
          "name" : "Content-Type",
          "value" : "application/json"
        }, {
          "name" : "Authorization",
          "value" : "Bearer eyJ0eXAiOiJKV1QiLCJhbGciOiJIUzI1NiJ9.eyJ1bmlxdWVfbmFtZSI6Implbm55Lm1hbGRvbmFkby50eDFAZ21haWwuY29tIiwicm9sZSI6InVzZXIiLCJzdWIiOiJqZW5ueS5tYWxkb25hZG8udHgxQGdtYWlsLmNvbSIsImlzcyI6IkNyb3BNZXRyaWNzIiwiYXVkIjoiYWxsIiwiZXhwIjoxNTU0NDYyMzM0LCJuYmYiOjE1NTQ0NTg0MzR9.GqfsE5FI_hNvgyxi81PsXnA0anQGaW-aSJgKA1-12EE"
        }, {
          "name" : "Host",
          "value" : "localhost:10520"
        }, {
          "name" : "Accept",
          "value" : "text/html, image/gif, image/jpeg, *; q=.2, */*; q=.2"
        }, {
          "name" : "Proxy-Connection",
          "value" : "keep-alive"
        }, {
          "name" : "Content-Length",
          "value" : "154"
        } ],
        "queryString" : [ ],
        "postData" : {
          "mimeType" : "application/json",
          "text" : "{\"name\": \"129 charsWhen new farm has name attribute with more than 128 chars Expected status code 400 API FARM When new farm has name attr\", \"user_id\": 2}",
          "comment" : ""
        },
        "headersSize" : 592,
        "bodySize" : 154,
        "comment" : ""
      },
      "response" : {
        "status" : 201,
        "statusText" : "Created",
        "httpVersion" : "HTTP/1.1",
        "cookies" : [ {
          "name" : ".ASPROLES",
          "value" : "wCn5HLkoueUSpB0A5H53i9LW4Kjh7NVwGr-ySRVj5u6ccK5h9rXOE00KqEOprtwN4ZBiam4G5i850dyPQ8uotnPlz6MSEJW66hDePM_Tdf95MMn-BlUVgF3Dl0k-rFI8fuirzC9gWPcCDzxqBLWJl10kyBUWYkC8cHW3yqtPRSnKtkHw9AWuI1EvbcvAsOdR0ojwfNfCWlxII6Ed0LfZRvpFJoKHLg10XLcOZsB6df_9Ow4AEmNqsDCLEgnu0C61CVIPiaSSlQDq7uWTYmf-tsu1EfXa0rEoox0o4ftGYlSxNUibDf-PhOX3lYKZcvAnYgFPr-7U5cKLs5C43Q6aU07zv4vT0iYAPjhbCe_pOIDwOCQe8pUxwUkB4X5O_LQEjR-qtST61voyUKW5cGf0z1JbzNxwd6LPlbJGkW2KbmMUNxNpR5-n_yRuwwWXqpHgbGV3P-EeoZLK6iMCLW47BN5s2mpbtnCOx1VkcccitIk2P2_pJlSNz2SzS4ErOgFN-__oJKRsNFheGX-CfbOfH8FmR4M1",
          "path" : "/",
          "httpOnly" : true,
          "secure" : false,
          "comment" : ""
        } ],
        "headers" : [ {
          "name" : "Cache-Control",
          "value" : "private"
        }, {
          "name" : "Content-Type",
          "value" : "application/json; charset=utf-8"
        }, {
          "name" : "Location",
          "value" : "api/mobile/v1/farms/3"
        }, {
          "name" : "Server",
          "value" : "Microsoft-IIS/10.0"
        }, {
          "name" : "Set-Cookie",
          "value" : ".ASPROLES=wCn5HLkoueUSpB0A5H53i9LW4Kjh7NVwGr-ySRVj5u6ccK5h9rXOE00KqEOprtwN4ZBiam4G5i850dyPQ8uotnPlz6MSEJW66hDePM_Tdf95MMn-BlUVgF3Dl0k-rFI8fuirzC9gWPcCDzxqBLWJl10kyBUWYkC8cHW3yqtPRSnKtkHw9AWuI1EvbcvAsOdR0ojwfNfCWlxII6Ed0LfZRvpFJoKHLg10XLcOZsB6df_9Ow4AEmNqsDCLEgnu0C61CVIPiaSSlQDq7uWTYmf-tsu1EfXa0rEoox0o4ftGYlSxNUibDf-PhOX3lYKZcvAnYgFPr-7U5cKLs5C43Q6aU07zv4vT0iYAPjhbCe_pOIDwOCQe8pUxwUkB4X5O_LQEjR-qtST61voyUKW5cGf0z1JbzNxwd6LPlbJGkW2KbmMUNxNpR5-n_yRuwwWXqpHgbGV3P-EeoZLK6iMCLW47BN5s2mpbtnCOx1VkcccitIk2P2_pJlSNz2SzS4ErOgFN-__oJKRsNFheGX-CfbOfH8FmR4M1; path=/; HttpOnly"
        }, {
          "name" : "X-SourceFiles",
          "value" : "=?UTF-8?B?RDpcVmlydHVhbE9wdGltaXplci1SZWZhY3RvcmluZ1xDcm9wTWV0cmljcy5Wby5BcGlcQ3JvcE1ldHJpY3MuVm8uQXBpXGFwaVxtb2JpbGVcdjFcZmFybXNc?="
        }, {
          "name" : "X-Powered-By",
          "value" : "ASP.NET"
        }, {
          "name" : "Date",
          "value" : "Fri, 05 Apr 2019 10:00:33 GMT"
        }, {
          "name" : "Content-Length",
          "value" : "158"
        } ],
        "content" : {
          "size" : 158,
          "mimeType" : "application/json; charset=utf-8",
          "text" : "{\"id\":3,\"name\":\"129 charsWhen new farm has name attribute with more than 128 chars Expected status code 400 API FARM When new farm has name attr\",\"user_id\":2}",
          "comment" : ""
        },
        "redirectURL" : "",
        "headersSize" : 970,
        "bodySize" : 158,
        "comment" : ""
      },
      "cache" : { },
      "timings" : {
        "comment" : "",
        "ssl" : -1,
        "send" : 0,
        "wait" : 23,
        "receive" : 1,
        "connect" : -1,
        "dns" : -1,
        "blocked" : -1
      },
      "serverIPAddress" : "127.0.0.1",
      "comment" : "",
      "_katalonRequestInformation" : {
        "name" : "11",
        "testObjectId" : "Object Repository/VoGrow/Farm/FarmPost",
        "harId" : "1c55893d-a6b7-44c1-8739-db5116a0429e"
      },
      "time" : 25
    } ],
    "comment" : ""
  }
}