{
  "log" : {
    "version" : "1.2",
    "creator" : {
      "name" : "BrowserMob Proxy",
      "version" : "2.1.5",
      "comment" : ""
    },
    "pages" : [ {
      "id" : "Page 0",
      "startedDateTime" : "2019-04-04T00:28:52.887Z",
      "title" : "Page 0",
      "pageTimings" : {
        "onLoad" : 86,
        "comment" : ""
      },
      "comment" : ""
    } ],
    "entries" : [ {
      "pageref" : "Page 0",
      "startedDateTime" : "2019-04-04T00:28:52.888Z",
      "request" : {
        "method" : "POST",
        "url" : "http://localhost:10520/WebAPI/api/mobile/v1/farms/?",
        "httpVersion" : "HTTP/1.1",
        "cookies" : [ ],
        "headers" : [ {
          "name" : "User-Agent",
          "value" : "Katalon Studio"
        }, {
          "name" : "Content-Type",
          "value" : "application/json"
        }, {
          "name" : "Authorization",
          "value" : "Bearer eyJ0eXAiOiJKV1QiLCJhbGciOiJIUzI1NiJ9.eyJ1bmlxdWVfbmFtZSI6Implbm55Lm1hbGRvbmFkby50eDFAZ21haWwuY29tIiwicm9sZSI6InVzZXIiLCJzdWIiOiJqZW5ueS5tYWxkb25hZG8udHgxQGdtYWlsLmNvbSIsImlzcyI6IkNyb3BNZXRyaWNzIiwiYXVkIjoiYWxsIiwiZXhwIjoxNTU0MzQxNjMyLCJuYmYiOjE1NTQzMzc3MzJ9.orxlAxf-bvHsSRqAR22M9Ky20YAskPHjGE__f8DhvkI"
        }, {
          "name" : "Host",
          "value" : "localhost:10520"
        }, {
          "name" : "Accept",
          "value" : "text/html, image/gif, image/jpeg, *; q=.2, */*; q=.2"
        }, {
          "name" : "Proxy-Connection",
          "value" : "keep-alive"
        }, {
          "name" : "Content-Length",
          "value" : "154"
        } ],
        "queryString" : [ ],
        "postData" : {
          "mimeType" : "application/json",
          "text" : "{\"name\": \"129 charsWhen new farm has name attribute with more than 128 chars Expected status code 400 API FARM When new farm has name attr\", \"user_id\": 2}",
          "comment" : ""
        },
        "headersSize" : 592,
        "bodySize" : 154,
        "comment" : ""
      },
      "response" : {
        "status" : 201,
        "statusText" : "Created",
        "httpVersion" : "HTTP/1.1",
        "cookies" : [ {
          "name" : ".ASPROLES",
          "value" : "FbQwiNrIcuPoYzMJMlq4zCJepFxsV8X8s5U9LUgIX03QuYNZKZZWkQngL7W910QBFJwE2ZXd5dtxRefbNUbV0tPSM3nodk1WxzmwDMoL2o6zn-R2ECcPXpbt7XccwZX47h_0zG0yoNfgczrWYLOTafzbDxMh7YN4gOfOCzXIRNnhZz2hdRM0TAaa1qfKZibht4s8gvOywatU4hPSSEsF5EucvpaGzeD6otJDcmgZ8Lr_rBoH_C1umaP-G4EQDcEY08nCjEYq_xXozA2imFp1V0bhlQfof5BBJBNkDBREvlHAyIH1vVgOq6MbSNNoM9RWyUqF1qeGzvoUA2o6cCyXh7ayzVPHNXDIXvnyusCf5GP1qaF8osl8XTrfYefi6w1mYCfsfYZPLIOoaoziUTPwghy-MD-nWPgYZpEzO3Vr2MtcABNcT_cvAM2PTwJo_tMnVTs_BNaxRsw2oQ44AQkMnh2Px-CkUbIkU1vZDosoNyaJEprdYOJFE6HwbRIxuD816w0MpQlMqv-yxhVoC-sZku4FImk1",
          "path" : "/",
          "httpOnly" : true,
          "secure" : false,
          "comment" : ""
        } ],
        "headers" : [ {
          "name" : "Cache-Control",
          "value" : "private"
        }, {
          "name" : "Content-Type",
          "value" : "application/json; charset=utf-8"
        }, {
          "name" : "Location",
          "value" : "api/mobile/v1/farms/3"
        }, {
          "name" : "Server",
          "value" : "Microsoft-IIS/10.0"
        }, {
          "name" : "Set-Cookie",
          "value" : ".ASPROLES=FbQwiNrIcuPoYzMJMlq4zCJepFxsV8X8s5U9LUgIX03QuYNZKZZWkQngL7W910QBFJwE2ZXd5dtxRefbNUbV0tPSM3nodk1WxzmwDMoL2o6zn-R2ECcPXpbt7XccwZX47h_0zG0yoNfgczrWYLOTafzbDxMh7YN4gOfOCzXIRNnhZz2hdRM0TAaa1qfKZibht4s8gvOywatU4hPSSEsF5EucvpaGzeD6otJDcmgZ8Lr_rBoH_C1umaP-G4EQDcEY08nCjEYq_xXozA2imFp1V0bhlQfof5BBJBNkDBREvlHAyIH1vVgOq6MbSNNoM9RWyUqF1qeGzvoUA2o6cCyXh7ayzVPHNXDIXvnyusCf5GP1qaF8osl8XTrfYefi6w1mYCfsfYZPLIOoaoziUTPwghy-MD-nWPgYZpEzO3Vr2MtcABNcT_cvAM2PTwJo_tMnVTs_BNaxRsw2oQ44AQkMnh2Px-CkUbIkU1vZDosoNyaJEprdYOJFE6HwbRIxuD816w0MpQlMqv-yxhVoC-sZku4FImk1; path=/; HttpOnly"
        }, {
          "name" : "X-SourceFiles",
          "value" : "=?UTF-8?B?RDpcVmlydHVhbE9wdGltaXplci1SZWZhY3RvcmluZ1xDcm9wTWV0cmljcy5Wby5BcGlcQ3JvcE1ldHJpY3MuVm8uQXBpXGFwaVxtb2JpbGVcdjFcZmFybXNc?="
        }, {
          "name" : "X-Powered-By",
          "value" : "ASP.NET"
        }, {
          "name" : "Date",
          "value" : "Thu, 04 Apr 2019 00:28:52 GMT"
        }, {
          "name" : "Content-Length",
          "value" : "158"
        } ],
        "content" : {
          "size" : 158,
          "mimeType" : "application/json; charset=utf-8",
          "text" : "{\"id\":3,\"name\":\"129 charsWhen new farm has name attribute with more than 128 chars Expected status code 400 API FARM When new farm has name attr\",\"user_id\":2}",
          "comment" : ""
        },
        "redirectURL" : "",
        "headersSize" : 970,
        "bodySize" : 158,
        "comment" : ""
      },
      "cache" : { },
      "timings" : {
        "comment" : "",
        "ssl" : -1,
        "send" : 0,
        "receive" : 1,
        "wait" : 81,
        "blocked" : -1,
        "dns" : -1,
        "connect" : -1
      },
      "serverIPAddress" : "127.0.0.1",
      "comment" : "",
      "_katalonRequestInformation" : {
        "name" : "11",
        "testObjectId" : "Object Repository/VoGrow/Farm/FarmPost",
        "harId" : "f020390e-e25e-4a6f-b7ab-e0cf68106a8c"
      },
      "time" : 82
    } ],
    "comment" : ""
  }
}