{
  "log" : {
    "version" : "1.2",
    "creator" : {
      "name" : "BrowserMob Proxy",
      "version" : "2.1.5",
      "comment" : ""
    },
    "pages" : [ {
      "id" : "Page 0",
      "startedDateTime" : "2019-03-29T22:37:31.895Z",
      "title" : "Page 0",
      "pageTimings" : {
        "onLoad" : 1785,
        "comment" : ""
      },
      "comment" : ""
    } ],
    "entries" : [ {
      "pageref" : "Page 0",
      "startedDateTime" : "2019-03-29T22:37:31.897Z",
      "request" : {
        "method" : "POST",
        "url" : "http://localhost:10520/WebAPI/api/admin/v1/users/?",
        "httpVersion" : "HTTP/1.1",
        "cookies" : [ ],
        "headers" : [ {
          "name" : "User-Agent",
          "value" : "Katalon Studio"
        }, {
          "name" : "Content-Type",
          "value" : "application/x-www-form-urlencoded"
        }, {
          "name" : "Authorization",
          "value" : "Bearer eyJ0eXAiOiJKV1QiLCJhbGciOiJIUzI1NiJ9.eyJ1bmlxdWVfbmFtZSI6ImFkbWluIiwicm9sZSI6InVzZXIiLCJzdWIiOiJhZG1pbiIsImlzcyI6IkNyb3BNZXRyaWNzIiwiYXVkIjoiYWxsIiwiZXhwIjoxNTUzOTAyOTUxLCJuYmYiOjE1NTM4OTkwNTF9.Ga6Gh4meB7NxcPA5i80dsXVOLQxS1-yEMpJIcvSI_D8"
        }, {
          "name" : "Host",
          "value" : "localhost:10520"
        }, {
          "name" : "Accept",
          "value" : "text/html, image/gif, image/jpeg, *; q=.2, */*; q=.2"
        }, {
          "name" : "Proxy-Connection",
          "value" : "keep-alive"
        }, {
          "name" : "Content-Length",
          "value" : "279"
        } ],
        "queryString" : [ ],
        "postData" : {
          "mimeType" : "application/x-www-form-urlencoded",
          "params" : [ {
            "name" : "password",
            "value" : "cropmetrics",
            "comment" : ""
          }, {
            "name" : "email",
            "value" : "cropmetricsvo.no.addressline2@gmail.com",
            "comment" : ""
          }, {
            "name" : "fullname",
            "value" : "test validation",
            "comment" : ""
          }, {
            "name" : "phone",
            "value" : "123",
            "comment" : ""
          }, {
            "name" : "dealer",
            "value" : "dealet test",
            "comment" : ""
          }, {
            "name" : "addressLine1",
            "value" : "address line 1 test validation",
            "comment" : ""
          }, {
            "name" : "addressLine2",
            "value" : "",
            "comment" : ""
          }, {
            "name" : "town",
            "value" : "townValidation",
            "comment" : ""
          }, {
            "name" : "state",
            "value" : "stateValidation",
            "comment" : ""
          }, {
            "name" : "zip",
            "value" : "zipValidation",
            "comment" : ""
          }, {
            "name" : "country",
            "value" : "countryValidation",
            "comment" : ""
          }, {
            "name" : "roles",
            "value" : "Client",
            "comment" : ""
          } ],
          "comment" : ""
        },
        "headersSize" : 544,
        "bodySize" : 279,
        "comment" : ""
      },
      "response" : {
        "status" : 200,
        "statusText" : "OK",
        "httpVersion" : "HTTP/1.1",
        "cookies" : [ {
          "name" : ".ASPROLES",
          "value" : "Hk2Z3rrmWVKeclgUf20EK0cHPkM73JJUM1D7HbgMzGQ9uvolDGVDuKRQh0deJth9EPd_4KUgpvwa9CQNi5Flqjh0O8H9tmbyLjeaK8v6oiz6iEE722OY-VMZHnmEcP7A_0iQGtxn1hfx_INnFf5EgKW7WM0WGXUxvxvs-hXIEu0I_dWCu0kbcRYuUGh0tooxwlYOP4miVYZErbyOUd6uKPST6qwbY2RT5jkkH_Ulyd2mSpxqYi1elDOJRYgEkX9BrjT_zabVcAd-CFM5oHnZQqpyrtFu_L6v66VDUo25VXmKXvFCqXeij5v6eK3IsyGNGrXH039Fm5QvmluYVqwSrm8tMtngEfSqUXn9A0j4Xc_oM86jq4agOE1DJbUTGx6eLWm4ZpKhFfQsgJmyLjHQN6jJJFUm9G-BDsibhYjh72waDkGNH6thBTpGsXqa34gXhCcLdkpgA9Fk5lUMyzKsgEf7fHJ3IYMCN2wFU8CVXCwjh8mV0",
          "path" : "/",
          "httpOnly" : true,
          "secure" : false,
          "comment" : ""
        } ],
        "headers" : [ {
          "name" : "Cache-Control",
          "value" : "private"
        }, {
          "name" : "Content-Type",
          "value" : "application/json; charset=utf-8"
        }, {
          "name" : "Server",
          "value" : "Microsoft-IIS/10.0"
        }, {
          "name" : "Set-Cookie",
          "value" : ".ASPROLES=Hk2Z3rrmWVKeclgUf20EK0cHPkM73JJUM1D7HbgMzGQ9uvolDGVDuKRQh0deJth9EPd_4KUgpvwa9CQNi5Flqjh0O8H9tmbyLjeaK8v6oiz6iEE722OY-VMZHnmEcP7A_0iQGtxn1hfx_INnFf5EgKW7WM0WGXUxvxvs-hXIEu0I_dWCu0kbcRYuUGh0tooxwlYOP4miVYZErbyOUd6uKPST6qwbY2RT5jkkH_Ulyd2mSpxqYi1elDOJRYgEkX9BrjT_zabVcAd-CFM5oHnZQqpyrtFu_L6v66VDUo25VXmKXvFCqXeij5v6eK3IsyGNGrXH039Fm5QvmluYVqwSrm8tMtngEfSqUXn9A0j4Xc_oM86jq4agOE1DJbUTGx6eLWm4ZpKhFfQsgJmyLjHQN6jJJFUm9G-BDsibhYjh72waDkGNH6thBTpGsXqa34gXhCcLdkpgA9Fk5lUMyzKsgEf7fHJ3IYMCN2wFU8CVXCwjh8mV0; path=/; HttpOnly"
        }, {
          "name" : "X-SourceFiles",
          "value" : "=?UTF-8?B?RDpcVmlydHVhbE9wdGltaXplci1SZWZhY3RvcmluZ1xDcm9wTWV0cmljcy5Wby5BcGlcQ3JvcE1ldHJpY3MuVm8uQXBpXGFwaVxhZG1pblx2MVx1c2Vyc1w=?="
        }, {
          "name" : "X-Powered-By",
          "value" : "ASP.NET"
        }, {
          "name" : "Date",
          "value" : "Fri, 29 Mar 2019 22:37:33 GMT"
        }, {
          "name" : "Content-Length",
          "value" : "8"
        } ],
        "content" : {
          "size" : 8,
          "mimeType" : "application/json; charset=utf-8",
          "text" : "{\"id\":8}",
          "comment" : ""
        },
        "redirectURL" : "",
        "headersSize" : 887,
        "bodySize" : 8,
        "comment" : ""
      },
      "cache" : { },
      "timings" : {
        "comment" : "",
        "ssl" : -1,
        "wait" : 1779,
        "receive" : 0,
        "send" : 0,
        "connect" : -1,
        "dns" : -1,
        "blocked" : -1
      },
      "serverIPAddress" : "127.0.0.1",
      "comment" : "",
      "_katalonRequestInformation" : {
        "name" : "21",
        "testObjectId" : "Object Repository/VoPro/Account/api_admin_v1_users",
        "harId" : "982ca685-399a-48be-8d53-a2fa4c9e4120"
      },
      "time" : 1780
    } ],
    "comment" : ""
  }
}