{
  "log" : {
    "version" : "1.2",
    "creator" : {
      "name" : "BrowserMob Proxy",
      "version" : "2.1.5",
      "comment" : ""
    },
    "pages" : [ {
      "id" : "Page 0",
      "startedDateTime" : "2019-03-28T18:59:31.099Z",
      "title" : "Page 0",
      "pageTimings" : {
        "onLoad" : 1281,
        "comment" : ""
      },
      "comment" : ""
    } ],
    "entries" : [ {
      "pageref" : "Page 0",
      "startedDateTime" : "2019-03-28T18:59:31.099Z",
      "request" : {
        "method" : "POST",
        "url" : "http://localhost:10520/WebAPI/api/admin/v1/users/?",
        "httpVersion" : "HTTP/1.1",
        "cookies" : [ ],
        "headers" : [ {
          "name" : "User-Agent",
          "value" : "Katalon Studio"
        }, {
          "name" : "Content-Type",
          "value" : "application/x-www-form-urlencoded"
        }, {
          "name" : "Authorization",
          "value" : "Bearer eyJ0eXAiOiJKV1QiLCJhbGciOiJIUzI1NiJ9.eyJ1bmlxdWVfbmFtZSI6ImFkbWluIiwicm9sZSI6InVzZXIiLCJzdWIiOiJhZG1pbiIsImlzcyI6IkNyb3BNZXRyaWNzIiwiYXVkIjoiYWxsIiwiZXhwIjoxNTUzODAzNDcxLCJuYmYiOjE1NTM3OTk1NzF9.NM2RyGMkWVoylgTQTiIlZkfQ7Zu6eGcmMb4IpyJiAXA"
        }, {
          "name" : "Host",
          "value" : "localhost:10520"
        }, {
          "name" : "Accept",
          "value" : "text/html, image/gif, image/jpeg, *; q=.2, */*; q=.2"
        }, {
          "name" : "Proxy-Connection",
          "value" : "keep-alive"
        }, {
          "name" : "Content-Length",
          "value" : "282"
        } ],
        "queryString" : [ ],
        "postData" : {
          "mimeType" : "application/x-www-form-urlencoded",
          "params" : [ {
            "name" : "password",
            "value" : "cropmetrics",
            "comment" : ""
          }, {
            "name" : "email",
            "value" : "cropmetricsvo.zipchar@gmail.com",
            "comment" : ""
          }, {
            "name" : "fullname",
            "value" : "test validation",
            "comment" : ""
          }, {
            "name" : "phone",
            "value" : "123",
            "comment" : ""
          }, {
            "name" : "dealer",
            "value" : "x",
            "comment" : ""
          }, {
            "name" : "addressLine1",
            "value" : "address line 1 test validation",
            "comment" : ""
          }, {
            "name" : "addressLine2",
            "value" : "address line 2 test validation",
            "comment" : ""
          }, {
            "name" : "town",
            "value" : "townValidation",
            "comment" : ""
          }, {
            "name" : "state",
            "value" : "stateValidation",
            "comment" : ""
          }, {
            "name" : "zip",
            "value" : "nine",
            "comment" : ""
          }, {
            "name" : "country",
            "value" : "countryValidation",
            "comment" : ""
          }, {
            "name" : "roles",
            "value" : "Client",
            "comment" : ""
          } ],
          "comment" : ""
        },
        "headersSize" : 544,
        "bodySize" : 282,
        "comment" : ""
      },
      "response" : {
        "status" : 200,
        "statusText" : "OK",
        "httpVersion" : "HTTP/1.1",
        "cookies" : [ {
          "name" : ".ASPROLES",
          "value" : "Ct22NwS4cgjGBnGMbbkkCVDT2TLxZYRCpz8wpTNEM3TKyiyfXTqK0B7WqTGZjnVutAhV7EK3r-LbgbAD57WTviDlVvkjHK8DOCwBYRcMFk_CAz7-xmohP9Y_CgNfYvWBta8M3qnLqUD1iI0IWhb4-9fkYod37KHcVBV8gTyHIjRssBEpviULB5-EVVATPOFTru6Ur1o-vETpGHpqG2kX-9_uxPDYPWTwnHhGY7h-ACsCJ1Fei3Afn3A1lKQx3JH351ng33qU2AUdW7-amFPgI5ru5OI24nG8jY4cMtw-MxqE2_Wg0Z6I5b0f_1OIhLDINi15h8MIafaIwNppst5QtiDKfMAdl-trxtk7lqffXXu175kTGUrE5Z8va2iUdoRU73ctWhbxLm930SQk-ujBkRehARjTwEDO4qcFpxRrvcRpkG4PcdMXGVxObrwxCQYaI5LG3sv6JCGrl1RUnOmJxzR3oWAdjj0LFFPifbzOtlYlmL_I0",
          "path" : "/",
          "httpOnly" : true,
          "secure" : false,
          "comment" : ""
        } ],
        "headers" : [ {
          "name" : "Cache-Control",
          "value" : "private"
        }, {
          "name" : "Content-Type",
          "value" : "application/json; charset=utf-8"
        }, {
          "name" : "Server",
          "value" : "Microsoft-IIS/10.0"
        }, {
          "name" : "Set-Cookie",
          "value" : ".ASPROLES=Ct22NwS4cgjGBnGMbbkkCVDT2TLxZYRCpz8wpTNEM3TKyiyfXTqK0B7WqTGZjnVutAhV7EK3r-LbgbAD57WTviDlVvkjHK8DOCwBYRcMFk_CAz7-xmohP9Y_CgNfYvWBta8M3qnLqUD1iI0IWhb4-9fkYod37KHcVBV8gTyHIjRssBEpviULB5-EVVATPOFTru6Ur1o-vETpGHpqG2kX-9_uxPDYPWTwnHhGY7h-ACsCJ1Fei3Afn3A1lKQx3JH351ng33qU2AUdW7-amFPgI5ru5OI24nG8jY4cMtw-MxqE2_Wg0Z6I5b0f_1OIhLDINi15h8MIafaIwNppst5QtiDKfMAdl-trxtk7lqffXXu175kTGUrE5Z8va2iUdoRU73ctWhbxLm930SQk-ujBkRehARjTwEDO4qcFpxRrvcRpkG4PcdMXGVxObrwxCQYaI5LG3sv6JCGrl1RUnOmJxzR3oWAdjj0LFFPifbzOtlYlmL_I0; path=/; HttpOnly"
        }, {
          "name" : "X-SourceFiles",
          "value" : "=?UTF-8?B?RDpcVmlydHVhbE9wdGltaXplci1SZWZhY3RvcmluZ1xDcm9wTWV0cmljcy5Wby5BcGlcQ3JvcE1ldHJpY3MuVm8uQXBpXGFwaVxhZG1pblx2MVx1c2Vyc1w=?="
        }, {
          "name" : "X-Powered-By",
          "value" : "ASP.NET"
        }, {
          "name" : "Date",
          "value" : "Thu, 28 Mar 2019 18:59:32 GMT"
        }, {
          "name" : "Content-Length",
          "value" : "9"
        } ],
        "content" : {
          "size" : 9,
          "mimeType" : "application/json; charset=utf-8",
          "text" : "{\"id\":32}",
          "comment" : ""
        },
        "redirectURL" : "",
        "headersSize" : 887,
        "bodySize" : 9,
        "comment" : ""
      },
      "cache" : { },
      "timings" : {
        "comment" : "",
        "ssl" : -1,
        "connect" : -1,
        "blocked" : -1,
        "receive" : 0,
        "dns" : -1,
        "wait" : 1279,
        "send" : 0
      },
      "serverIPAddress" : "127.0.0.1",
      "comment" : "",
      "_katalonRequestInformation" : {
        "name" : "79",
        "testObjectId" : "Object Repository/VoPro/Account/api_admin_v1_users",
        "harId" : "645fe6cf-b76c-43e6-bff9-ee1b8d221f03"
      },
      "time" : 1280
    } ],
    "comment" : ""
  }
}