{
  "log" : {
    "version" : "1.2",
    "creator" : {
      "name" : "BrowserMob Proxy",
      "version" : "2.1.5",
      "comment" : ""
    },
    "pages" : [ {
      "id" : "Page 0",
      "startedDateTime" : "2019-03-29T21:02:44.239Z",
      "title" : "Page 0",
      "pageTimings" : {
        "onLoad" : 2488,
        "comment" : ""
      },
      "comment" : ""
    } ],
    "entries" : [ {
      "pageref" : "Page 0",
      "startedDateTime" : "2019-03-29T21:02:44.239Z",
      "request" : {
        "method" : "PUT",
        "url" : "http://localhost:10520/WebAPI/api/admin/v1/users/23?",
        "httpVersion" : "HTTP/1.1",
        "cookies" : [ ],
        "headers" : [ {
          "name" : "User-Agent",
          "value" : "Katalon Studio"
        }, {
          "name" : "Content-Type",
          "value" : "application/x-www-form-urlencoded"
        }, {
          "name" : "Authorization",
          "value" : "Bearer eyJ0eXAiOiJKV1QiLCJhbGciOiJIUzI1NiJ9.eyJ1bmlxdWVfbmFtZSI6ImFkbWluIiwicm9sZSI6InVzZXIiLCJzdWIiOiJhZG1pbiIsImlzcyI6IkNyb3BNZXRyaWNzIiwiYXVkIjoiYWxsIiwiZXhwIjoxNTUzODk3MjY0LCJuYmYiOjE1NTM4OTMzNjR9.8Ox_kj-NQCaipHLy_vYEtpxY3pqKTz-uSeZErQ7bn_Y"
        }, {
          "name" : "Host",
          "value" : "localhost:10520"
        }, {
          "name" : "Accept",
          "value" : "text/html, image/gif, image/jpeg, *; q=.2, */*; q=.2"
        }, {
          "name" : "Proxy-Connection",
          "value" : "keep-alive"
        }, {
          "name" : "Content-Length",
          "value" : "607"
        } ],
        "queryString" : [ ],
        "postData" : {
          "mimeType" : "application/x-www-form-urlencoded",
          "params" : [ {
            "name" : "password",
            "value" : "cropmetrics",
            "comment" : ""
          }, {
            "name" : "email",
            "value" : "cropmetricsvo.addressline2long@gmail.com",
            "comment" : ""
          }, {
            "name" : "fullname",
            "value" : "x",
            "comment" : ""
          }, {
            "name" : "phone",
            "value" : "1",
            "comment" : ""
          }, {
            "name" : "dealer",
            "value" : "xx",
            "comment" : ""
          }, {
            "name" : "addressLine1",
            "value" : "xx",
            "comment" : ""
          }, {
            "name" : "addressLine2",
            "value" : "16 API_ACNT_When_account_updated_have_long_addressline2_attribute_Expected_status_code_200 16 API_ACNT_When_account_updated_have_long_addressline2_attribute_Expected_status_code_200 16 API_ACNT_When_account_updated_have_long_addressline2_attribute_Expected_status_code_200 16 API_ACNT_When_account_updated_have_long_addressline2_attribute_Expected_status_code_200",
            "comment" : ""
          }, {
            "name" : "town",
            "value" : "townValidation",
            "comment" : ""
          }, {
            "name" : "state",
            "value" : "stateValidation",
            "comment" : ""
          }, {
            "name" : "zip",
            "value" : "zipValidation",
            "comment" : ""
          }, {
            "name" : "country",
            "value" : "countryValidation",
            "comment" : ""
          }, {
            "name" : "roles",
            "value" : "Client",
            "comment" : ""
          }, {
            "name" : "userProfileId",
            "value" : "23",
            "comment" : ""
          } ],
          "comment" : ""
        },
        "headersSize" : 545,
        "bodySize" : 607,
        "comment" : ""
      },
      "response" : {
        "status" : 200,
        "statusText" : "OK",
        "httpVersion" : "HTTP/1.1",
        "cookies" : [ {
          "name" : ".ASPROLES",
          "value" : "iJDBzVVzaZUNb_uXU1LT5lXxkP9cbIrsVdtdEXfKkkYKv6KyUw4x9A1avRPQk8FvZgE_nDvnjEgjcwGEhyOLtsMGCdGmkxzXOUYShb5weQXLcTB0k9N7mZGqFHCX3bomzIWQVNp7LX7FFe-sKBdQjzm62TWokU641tr1lBM5L-smJSoj2icPejFj8HzJ3cw5LJ2alun2O6NRLJfenU6cmwzC1VW3V0uaFPhi8Eud4mIVC_UaHAREYLXgIfEfVlenoW1R_ePiA9_uNSAOQoofaL56s1KHHbm3OWIG-hFisDBgb7lcv6DTu6vuF8qisIcBVCuM6RlMHjbsYMx_a3aYGXXxQ4NItmSeO1cACn7IhhZBjyH3HUUPJTqSc5zTXEAuQgSe_li5WIxB0dtZ0zB5ZTxD-Yf7go2ZNQ_hJSNRKQaLB_HqnrG2CqfWoeciHOXfY7DWJ6eFnBnjM5FDDkG3G02Vrbu92Vpbo0yw88__LKHfbgoE0",
          "path" : "/",
          "httpOnly" : true,
          "secure" : false,
          "comment" : ""
        } ],
        "headers" : [ {
          "name" : "Cache-Control",
          "value" : "private"
        }, {
          "name" : "Server",
          "value" : "Microsoft-IIS/10.0"
        }, {
          "name" : "Set-Cookie",
          "value" : ".ASPROLES=iJDBzVVzaZUNb_uXU1LT5lXxkP9cbIrsVdtdEXfKkkYKv6KyUw4x9A1avRPQk8FvZgE_nDvnjEgjcwGEhyOLtsMGCdGmkxzXOUYShb5weQXLcTB0k9N7mZGqFHCX3bomzIWQVNp7LX7FFe-sKBdQjzm62TWokU641tr1lBM5L-smJSoj2icPejFj8HzJ3cw5LJ2alun2O6NRLJfenU6cmwzC1VW3V0uaFPhi8Eud4mIVC_UaHAREYLXgIfEfVlenoW1R_ePiA9_uNSAOQoofaL56s1KHHbm3OWIG-hFisDBgb7lcv6DTu6vuF8qisIcBVCuM6RlMHjbsYMx_a3aYGXXxQ4NItmSeO1cACn7IhhZBjyH3HUUPJTqSc5zTXEAuQgSe_li5WIxB0dtZ0zB5ZTxD-Yf7go2ZNQ_hJSNRKQaLB_HqnrG2CqfWoeciHOXfY7DWJ6eFnBnjM5FDDkG3G02Vrbu92Vpbo0yw88__LKHfbgoE0; path=/; HttpOnly"
        }, {
          "name" : "X-SourceFiles",
          "value" : "=?UTF-8?B?RDpcVmlydHVhbE9wdGltaXplci1SZWZhY3RvcmluZ1xDcm9wTWV0cmljcy5Wby5BcGlcQ3JvcE1ldHJpY3MuVm8uQXBpXGFwaVxhZG1pblx2MVx1c2Vyc1wyMw==?="
        }, {
          "name" : "X-Powered-By",
          "value" : "ASP.NET"
        }, {
          "name" : "Date",
          "value" : "Fri, 29 Mar 2019 21:02:46 GMT"
        }, {
          "name" : "Content-Length",
          "value" : "0"
        } ],
        "content" : {
          "size" : 0,
          "mimeType" : "",
          "text" : "",
          "encoding" : "base64",
          "comment" : ""
        },
        "redirectURL" : "",
        "headersSize" : 844,
        "bodySize" : 0,
        "comment" : ""
      },
      "cache" : { },
      "timings" : {
        "comment" : "",
        "dns" : -1,
        "wait" : 2489,
        "send" : 0,
        "receive" : 0,
        "connect" : -1,
        "blocked" : -1,
        "ssl" : -1
      },
      "serverIPAddress" : "127.0.0.1",
      "comment" : "",
      "_katalonRequestInformation" : {
        "name" : "37",
        "testObjectId" : "Object Repository/VoPro/Account/api_admin_v1_users_userprofileid",
        "harId" : "ec8761a4-cccd-4d43-b1aa-f313f6c6da4d"
      },
      "time" : 2489
    } ],
    "comment" : ""
  }
}