<svg width="650" height="545" viewBox="0 0 650 545" fill="none" xmlns="http://www.w3.org/2000/svg">
<path d="M408.425 171.576C409.12 172.06 409.933 172.316 410.783 172.316C412.126 172.316 413.377 171.667 414.181 170.516L414.255 170.416L414.328 170.315L414.392 170.224L414.465 170.105L414.812 169.621L414.867 169.529C414.885 169.502 414.903 169.475 414.903 169.475L415.479 168.625L415.534 168.533L415.643 168.387L415.716 168.287L415.789 168.186L416.201 167.556L416.456 167.154H416.466L417.014 166.295L417.16 166.057C419.481 162.357 421.6 158.492 423.446 154.554C424.396 152.508 423.51 150.059 421.472 149.1C420.924 148.835 420.33 148.707 419.727 148.707C418.147 148.707 416.685 149.63 416.009 151.064C413.588 156.217 410.7 161.188 407.429 165.847C406.799 166.743 406.552 167.839 406.744 168.917C406.927 170.004 407.521 170.946 408.425 171.576Z" fill="#010101"/>
<path d="M355.095 12.736C360.531 14.4172 365.848 16.5917 370.919 19.1773C371.504 19.4788 372.134 19.625 372.792 19.625C374.345 19.625 375.743 18.7662 376.456 17.3866C376.959 16.4089 377.05 15.2943 376.712 14.2527C376.374 13.2111 375.652 12.3614 374.674 11.8589C371.001 9.9859 367.182 8.29563 363.254 6.82463L362.194 6.43175C362.166 6.42262 362.139 6.41348 362.112 6.40434L361.454 6.1668L361.344 6.13026C361.317 6.11198 361.28 6.10284 361.207 6.08457L360.796 5.94751L360.695 5.91097L360.586 5.87442L360.366 5.80134L360.266 5.76478L359.636 5.55464L359.526 5.51809L359.078 5.37192L358.978 5.33536L358.85 5.28968L358.749 5.25313L358.603 5.20745L358.484 5.17091L358.384 5.13435L358.128 5.05213L358.027 5.02472L357.781 4.95162L357.662 4.91508L357.543 4.87853C357.15 4.75975 356.739 4.6958 356.328 4.6958C354.519 4.6958 352.948 5.85615 352.408 7.59211C351.714 9.75748 352.929 12.0691 355.095 12.736Z" fill="#010101"/>
<path d="M385.419 28.2499C389.969 31.667 394.254 35.5044 398.165 39.6524C398.941 40.4747 400.029 40.9407 401.152 40.9407C402.203 40.9407 403.208 40.5478 403.976 39.826C405.62 38.2728 405.702 35.6689 404.149 34.0151C403.574 33.403 402.989 32.7908 402.386 32.1878L402.304 32.1056L401.975 31.7767L401.892 31.7036L401.171 30.9726L401.088 30.8904L400.421 30.2417C398.329 28.2225 396.127 26.2764 393.807 24.3943L390.362 21.6807C389.649 21.1417 388.8 20.8584 387.904 20.8584C386.598 20.8584 385.401 21.4614 384.615 22.503C383.957 23.3801 383.683 24.4582 383.829 25.5455C383.976 26.6236 384.542 27.5921 385.419 28.2499Z" fill="#010101"/>
<path d="M307.438 9.73963C307.666 9.73963 307.904 9.72135 308.141 9.67567C316.785 8.17727 325.72 7.83008 334.546 8.65237C335.835 8.77115 337.132 8.91734 338.384 9.0818C340.677 9.37417 342.696 7.75698 342.989 5.53679C343.281 3.29832 341.7 1.23344 339.38 0.922793L338.804 0.849698L338.694 0.831435L337.708 0.712655L337.58 0.694378L337.187 0.648706L337.077 0.63956L336.821 0.612151L336.712 0.60302L336.593 0.593874L335.752 0.511648L335.643 0.502517L335.405 0.475108L335.295 0.465962L335.076 0.447699C331.796 0.146191 328.461 0 325.117 0H324.88C321.344 0.00913661 317.771 0.191874 314.254 0.548202L313.313 0.648706L313.203 0.657837L312.947 0.685246L312.829 0.703523L311.951 0.804026L311.833 0.82229L311.193 0.90453C309.795 1.08726 308.388 1.29739 307.018 1.53494L306.871 1.56237L306.725 1.58978C304.496 1.97351 302.998 4.10234 303.381 6.34081C303.738 8.31432 305.437 9.73963 307.438 9.73963Z" fill="#010101"/>
<path d="M417.022 68.0488C417.68 69.538 419.151 70.4974 420.777 70.4974C421.353 70.4974 421.91 70.3786 422.431 70.1502C423.436 69.7116 424.203 68.8985 424.605 67.8752C424.998 66.8519 424.98 65.7372 424.532 64.7322C422.906 61.041 421.042 57.3955 419.005 53.8961L418.447 52.9551H418.438L418.42 52.9368L418.438 52.9551L418.383 52.8546L418.255 52.6444C418.246 52.6262 418.237 52.6079 418.219 52.5896L418.164 52.4982L418.027 52.279L417.963 52.1785L417.899 52.078L417.835 51.9775L417.78 51.8861L417.643 51.6668L417.57 51.5389L417.497 51.4201L417.424 51.3105L416.127 49.273L416.026 49.1268L415.752 48.7066L415.688 48.6152L415.615 48.5055C414.857 47.3543 413.568 46.6782 412.189 46.6782C411.385 46.6782 410.599 46.9158 409.923 47.3635C408.041 48.6152 407.52 51.1734 408.772 53.0556C411.96 57.7975 414.729 62.8409 417.022 68.0488Z" fill="#010101"/>
<path d="M423.025 81.1055C422.459 82.0466 422.295 83.1522 422.559 84.212C423.93 89.7397 424.834 95.4135 425.246 101.087C425.401 103.225 427.201 104.897 429.339 104.897C429.439 104.897 429.54 104.897 429.631 104.888C430.728 104.806 431.723 104.313 432.445 103.481C433.167 102.65 433.514 101.59 433.432 100.493C433.14 96.4002 432.601 92.2888 431.842 88.2595L431.742 87.7387L431.678 87.154L431.632 87.1357C431.303 85.4911 430.929 83.8374 430.527 82.2202C430.061 80.3929 428.425 79.1138 426.543 79.1138C426.214 79.1138 425.876 79.1595 425.547 79.2325C424.487 79.5066 423.583 80.1736 423.025 81.1055Z" fill="#010101"/>
<path d="M433.185 119.012C433.405 116.756 431.751 114.746 429.494 114.526C427.219 114.289 425.227 115.97 425.008 118.217C424.451 123.9 423.409 129.565 421.911 135.038C421.618 136.098 421.755 137.203 422.304 138.154C422.852 139.104 423.729 139.789 424.789 140.081C425.145 140.182 425.511 140.228 425.876 140.228C427.694 140.228 429.302 139.022 429.823 137.249L429.841 137.185V137.176L429.951 136.783L430.051 136.408L430.061 136.381H430.051L430.243 135.678C430.764 133.667 432.929 121.68 433.185 119.012Z" fill="#010101"/>
<path d="M232.372 164.239C234.418 167.647 236.694 170.982 239.115 174.162C239.9 175.194 241.088 175.779 242.386 175.779C243.29 175.779 244.149 175.487 244.88 174.938C246.68 173.568 247.027 170.982 245.657 169.182C242.203 164.651 239.106 159.799 236.474 154.756C235.762 153.394 234.364 152.554 232.829 152.554C232.171 152.554 231.513 152.718 230.928 153.02C228.927 154.07 228.142 156.546 229.183 158.556C229.658 159.461 230.143 160.366 230.682 161.325L230.947 161.791L231.02 161.928L231.129 162.111L231.193 162.22L231.257 162.33L231.321 162.44L232.372 164.239Z" fill="#010101"/>
<path d="M226.679 74.1701C227.163 74.3619 227.666 74.4533 228.177 74.4533C229.886 74.4533 231.384 73.43 232.006 71.8402C234.08 66.541 236.629 61.3879 239.58 56.5181C240.759 54.5812 240.137 52.0503 238.2 50.8717C237.561 50.4788 236.821 50.2778 236.071 50.2778C234.619 50.2778 233.303 51.0179 232.554 52.2513C231.933 53.2746 231.33 54.3071 230.708 55.4218L230.315 56.1344L230.261 56.2258L229.968 56.7648L229.913 56.8653L229.84 57.0024L229.785 57.1029L229.712 57.2399L229.648 57.3679L229.584 57.4866L229.53 57.5871L229.466 57.7059L228.872 58.848H228.881L228.461 59.6611C226.953 62.6488 225.573 65.737 224.349 68.8617C223.536 70.9631 224.578 73.3386 226.679 74.1701Z" fill="#010101"/>
<path d="M220.923 109.211H221.06C223.289 109.211 225.089 107.466 225.162 105.236C225.226 103.226 225.354 101.18 225.546 99.1697C225.884 95.506 226.432 91.8239 227.163 88.2332C227.62 86.013 226.177 83.8385 223.956 83.3817C221.745 82.934 219.562 84.405 219.114 86.5703C218.904 87.6028 218.703 88.6444 218.511 89.7773L218.447 90.1428L218.438 90.1976L218.42 90.2524L218.383 90.5082C217.972 92.9751 217.643 95.4694 217.405 97.982L217.369 98.3566V98.3931L217.314 98.923C217.195 100.33 217.095 101.737 217.031 103.098V103.135V103.236H217.04L216.958 104.962C216.885 107.237 218.666 109.138 220.923 109.211Z" fill="#010101"/>
<path d="M246.561 44.1211C247.748 44.1211 248.881 43.6095 249.658 42.7141C253.395 38.4199 257.534 34.4181 261.947 30.8091C262.796 30.1147 263.326 29.128 263.436 28.0407C263.546 26.9443 263.226 25.8753 262.531 25.0256C261.746 24.0663 260.585 23.5181 259.352 23.5181C258.411 23.5181 257.497 23.847 256.766 24.4409C252.28 28.1047 248.059 32.1522 244.222 36.4738L243.463 37.3235C241.974 39.0321 242.157 41.6268 243.865 43.1161C244.614 43.7648 245.574 44.1211 246.561 44.1211Z" fill="#010101"/>
<path d="M229.859 138.968C228.123 133.55 226.844 127.94 226.058 122.302C225.748 120.1 223.673 118.492 221.426 118.803C219.187 119.114 217.616 121.188 217.917 123.426C218.128 124.897 218.365 126.386 218.621 127.848L218.831 128.972C219.644 133.184 220.722 137.387 222.029 141.48C222.577 143.189 224.149 144.34 225.939 144.34C226.36 144.34 226.78 144.276 227.191 144.139C228.233 143.801 229.092 143.079 229.594 142.101C230.106 141.133 230.197 140.018 229.859 138.968Z" fill="#010101"/>
<path d="M274.053 21.6803C274.756 21.6803 275.46 21.4975 276.072 21.1503C281.033 18.3454 286.259 15.9516 291.623 14.0329C292.655 13.6674 293.486 12.9182 293.952 11.9223C294.418 10.9265 294.473 9.81179 294.108 8.77935C293.523 7.15303 291.97 6.05664 290.243 6.05664C289.768 6.05664 289.302 6.13887 288.891 6.28506L288.772 6.3216L288.662 6.35815L288.151 6.55001C288.132 6.55001 288.096 6.56828 288.005 6.60483L287.904 6.64138L287.794 6.67792L287.694 6.71448L287.274 6.8698L287.146 6.91548L286.899 7.00684L286.789 7.0434L286.652 7.09821L286.552 7.13475L286.442 7.18044L285.401 7.59159L285.291 7.63727C281.061 9.31841 272.034 13.9872 272.034 13.9872C270.06 15.1019 269.366 17.6144 270.48 19.5788C271.202 20.8854 272.573 21.6803 274.053 21.6803Z" fill="#010101"/>
<path d="M183.5 312.261H468.48C470.709 312.261 472.692 311.11 473.806 309.182C474.921 307.254 474.921 304.943 473.806 303.015L331.321 56.2167C330.206 54.2889 328.214 53.1377 325.985 53.1377C323.756 53.1377 321.764 54.2889 320.649 56.2167L178.173 303.015C177.058 304.943 177.058 307.245 178.173 309.182C179.288 311.11 181.279 312.261 183.5 312.261ZM249.1 239.653C249.119 246.377 249.128 253.339 248.982 260.192C248.954 261.398 248.296 262.741 248.041 262.905C232.91 271.795 214.92 282.229 195.697 292.453L249.091 199.972V233.229L249.1 239.653ZM203.39 300.265C211.677 295.486 219.973 290.708 228.26 285.92C230.617 284.55 232.983 283.179 235.332 281.8C240.649 278.693 246.14 275.495 251.631 272.453C252.682 271.877 254.126 271.722 254.381 271.841C270.553 280.996 286.798 290.388 302.522 299.47L307.392 302.284H199.9L203.39 300.265ZM320.878 228.415C321.07 248.844 321.051 269.538 321.033 289.557L321.024 298.666L318.84 297.423C316.136 295.888 313.514 294.399 310.901 292.892L301.7 287.583C288.507 279.982 274.875 272.133 261.554 264.248C260.238 263.472 259.069 261.654 259.059 260.968C258.868 241.361 258.895 221.416 258.913 202.128L258.922 190.945C259.151 191.055 259.343 191.155 259.516 191.256L265.711 194.828C283.07 204.851 301.015 215.212 318.575 225.546C319.745 226.24 320.878 227.857 320.878 228.415ZM393.24 260.119C393.231 261.562 392.353 263.307 391.933 263.554C374.263 273.961 356.172 284.349 338.676 294.399L331.102 298.757C331.074 298.319 331.047 297.844 331.047 297.387C331.047 290.571 331.047 283.746 331.056 276.93C331.065 261.608 331.074 245.774 331.001 230.086C330.983 227.483 331.568 226.441 333.696 225.235C347.685 217.314 361.828 209.127 375.524 201.206L376.538 200.621C381.536 197.725 386.543 194.837 391.549 191.95C392.116 191.621 392.701 191.311 393.313 190.991C393.322 191.101 393.322 191.21 393.322 191.21L393.331 201.388C393.349 220.639 393.368 240.548 393.24 260.119ZM381.618 186.222C373.815 190.744 366.168 195.175 358.511 199.598L353.112 202.722C344.944 207.446 336.492 212.334 328.013 217.021C326.926 217.624 325.218 217.706 324.852 217.487C307.483 207.601 290.526 197.77 272.582 187.364L263.966 182.366L264.359 182.128C266.798 180.676 269.082 179.305 271.394 177.971L280.512 172.69C293.989 164.888 309.256 156.053 323.957 147.766C324.953 147.208 327.164 147.135 328.023 147.619C345.154 157.286 362.915 167.574 378.594 176.637L388.105 182.138C388.196 182.183 388.279 182.238 388.361 182.293L381.618 186.222ZM344.596 302.403C349.64 299.488 354.683 296.574 359.727 293.668C370.782 287.291 383.308 280.073 395.432 272.974C397.433 271.804 398.512 271.795 400.467 272.946C414.766 281.334 429.165 289.63 443.089 297.643L451.358 302.403H344.596ZM403.199 207.665L403.208 200.475L457.461 294.509L453.222 292.069C447.931 289.027 442.651 285.993 437.37 282.942C434.848 281.489 432.317 280.036 429.786 278.584C421.874 274.052 413.687 269.365 405.757 264.513C404.624 263.819 403.354 261.781 403.345 260.621C403.144 242.914 403.171 224.997 403.199 207.665ZM331.805 76.8655L384.962 168.889L379.69 165.847C364.103 156.847 347.977 147.537 332.18 138.291C331.805 138.072 331.193 137.076 331.193 136.674C331.083 117.56 331.083 97.1031 331.805 76.8655ZM320.896 135.349C320.887 136.683 320.101 138.2 319.8 138.382C303.098 148.222 286.012 158.053 269.457 167.583L266.963 169.017L321.024 75.3488V79.6887C321.024 96.9752 321.033 116.573 320.896 135.349Z" fill="#010101"/>
<path d="M66.9167 452.81H20.0641C17.4693 452.81 15.3496 450.7 15.3496 448.096V423.729C15.3496 421.134 17.4602 419.014 20.0641 419.014H62.6407C65.7015 419.014 68.1866 416.52 68.1866 413.468C68.1866 410.407 65.7015 407.922 62.6407 407.922H20.0641C17.4693 407.922 15.3496 405.812 15.3496 403.208V383.116C15.3496 380.521 17.4602 378.402 20.0641 378.402H64.7787C67.8394 378.402 70.3246 375.917 70.3246 372.856V372.719C70.3246 369.658 67.8394 367.173 64.7787 367.173H7.67482C4.61406 367.173 2.12891 369.658 2.12891 372.719V458.493C2.12891 461.554 4.61406 464.039 7.67482 464.039H66.9167C69.9774 464.039 72.4626 461.554 72.4626 458.493V458.347C72.4626 455.305 69.9774 452.81 66.9167 452.81Z" fill="#010101"/>
<path d="M644.322 367.182H585.081C582.02 367.182 579.535 369.667 579.535 372.728V372.874C579.535 375.935 582.029 378.42 585.081 378.42H631.924C634.519 378.42 636.639 380.531 636.639 383.135V407.502C636.639 410.097 634.528 412.216 631.924 412.216H589.347C586.287 412.216 583.802 414.702 583.802 417.762C583.802 420.823 586.287 423.308 589.347 423.308H631.924C634.519 423.308 636.639 425.419 636.639 428.023V448.114C636.639 450.709 634.528 452.829 631.924 452.829H587.209C584.149 452.829 581.664 455.314 581.664 458.375V458.521C581.664 461.582 584.149 464.067 587.209 464.067H644.322C647.383 464.067 649.868 461.582 649.868 458.521V372.728C649.868 369.667 647.374 367.182 644.322 367.182Z" fill="#010101"/>
<path d="M438.219 452.81H395.03C392.435 452.81 390.316 450.7 390.316 448.096V372.728C390.316 369.667 387.831 367.182 384.77 367.182H382.632C379.571 367.182 377.086 369.667 377.086 372.728V458.503C377.086 461.563 379.571 464.049 382.632 464.049H438.219C441.28 464.049 443.765 461.563 443.765 458.503V458.356C443.765 455.305 441.271 452.81 438.219 452.81Z" fill="#010101"/>
<path d="M287.328 367.356C260.695 367.356 239.022 389.028 239.022 415.662C239.022 442.295 260.685 463.967 287.328 463.967C313.97 463.967 335.633 442.295 335.633 415.662C335.633 389.019 313.961 367.356 287.328 367.356ZM323.929 415.653C323.929 435.835 307.511 452.263 287.319 452.263C267.136 452.263 250.708 435.844 250.708 415.653C250.708 395.47 267.127 379.042 287.319 379.042C307.511 379.051 323.929 395.47 323.929 415.653Z" fill="#010101"/>
<path d="M206.899 366.899C204.806 366.899 202.851 368.023 201.81 369.832L178.648 409.777L165.108 433.221C164.194 434.802 162.559 435.743 160.731 435.743C158.904 435.743 157.269 434.802 156.355 433.221L142.814 409.777L119.945 369.85C118.904 368.023 116.94 366.89 114.838 366.89H114.564C112.435 366.89 110.526 367.986 109.466 369.832C108.406 371.677 108.406 373.879 109.466 375.716L155.633 455.679C156.702 457.525 158.602 458.621 160.731 458.621C162.86 458.621 164.761 457.516 165.83 455.679L211.997 375.716C213.057 373.87 213.057 371.668 211.997 369.832C210.928 368.004 209.027 366.899 206.899 366.899Z" fill="#010101"/>
<path d="M542.734 366.899C540.641 366.899 538.686 368.023 537.645 369.832L514.483 409.777L500.943 433.221C500.029 434.802 498.394 435.743 496.566 435.743C494.739 435.743 493.104 434.802 492.19 433.221L478.649 409.777L455.78 369.85C454.73 368.023 452.774 366.89 450.673 366.89H450.399C448.27 366.89 446.37 367.986 445.301 369.832C444.241 371.677 444.241 373.87 445.301 375.716L491.468 455.679C492.537 457.525 494.437 458.621 496.566 458.621C498.695 458.621 500.596 457.516 501.665 455.679L547.832 375.716C548.892 373.87 548.892 371.668 547.832 369.832C546.772 368.004 544.862 366.899 542.734 366.899Z" fill="#010101"/>
<path d="M26.1947 539.134C26.9256 540.487 26.3865 542.186 25.0343 542.963C22.5674 544.269 19.8082 545 16.9484 545C7.60167 545 0 537.398 0 528.052C0 518.705 7.60167 511.112 16.9484 511.112C19.8082 511.112 22.5674 511.834 25.0343 513.141C26.3865 513.917 26.9256 515.608 26.1947 516.969C25.4181 518.376 23.7278 518.86 22.3207 518.129C20.7218 517.206 18.8306 516.777 16.9484 516.777C10.7538 516.777 5.6647 521.811 5.6647 528.061C5.6647 534.31 10.7538 539.344 16.9484 539.344C18.8397 539.344 20.7218 538.906 22.3207 537.992C23.7278 537.252 25.4181 537.727 26.1947 539.134Z" fill="#010101"/>
<path d="M60.3285 542.184C60.3285 543.728 59.0676 544.989 57.4687 544.989H41.973C40.3741 544.989 39.1133 543.728 39.1133 542.184V513.906C39.1133 512.353 40.3741 511.102 41.973 511.102H57.4687C59.0676 511.102 60.3285 512.362 60.3285 513.906C60.3285 515.505 59.0676 516.766 57.4687 516.766H44.7871V525.236H54.6638C56.217 525.236 57.4687 526.497 57.4687 528.041C57.4687 529.585 56.2079 530.846 54.6638 530.846H44.7871V539.315H57.4687C59.0768 539.325 60.3285 540.585 60.3285 542.184Z" fill="#010101"/>
<path d="M93.212 543.783L78.5934 522.87V542.184C78.5934 543.738 77.2869 544.989 75.7337 544.989C74.1804 544.989 72.9287 543.728 72.9287 542.184V513.906C72.9287 512.454 74.0891 511.102 75.7885 511.102C76.6565 511.102 77.5336 511.54 78.0635 512.308L92.6821 533.221V513.906C92.6821 512.353 93.9429 511.102 95.5418 511.102C97.0951 511.102 98.3468 512.362 98.3468 513.906V542.184C98.3468 543.683 97.0859 544.989 95.5418 544.989C94.619 544.989 93.7419 544.56 93.212 543.783Z" fill="#010101"/>
<path d="M130.689 511.102C132.242 511.102 133.549 512.362 133.549 513.906C133.549 515.505 132.242 516.766 130.689 516.766H125.07V542.184C125.07 543.728 123.764 544.989 122.21 544.989C120.657 544.989 119.396 543.728 119.396 542.184V516.766H113.732C112.178 516.766 110.927 515.505 110.927 513.906C110.927 512.353 112.188 511.102 113.732 511.102H130.689Z" fill="#010101"/>
<path d="M167.584 540.677C167.876 541.161 168.022 541.645 168.022 542.184C168.022 543.107 167.538 544.021 166.67 544.56C166.232 544.852 165.702 544.998 165.218 544.998C164.249 544.998 163.326 544.514 162.796 543.692L156.556 533.715H151.814V542.184C151.814 543.728 150.508 544.989 148.954 544.989C147.401 544.989 146.149 543.728 146.149 542.184V513.906C146.149 512.353 147.41 511.102 148.954 511.102H156.647C156.94 511.102 159.507 511.147 162.166 512.454C165.939 514.345 168.022 517.826 168.022 522.376C168.022 522.668 167.977 525.282 166.67 527.895C165.656 529.877 164.203 531.385 162.413 532.353L167.584 540.677ZM151.805 528.05H156.647C159.069 528.05 160.622 527.228 161.535 525.483C162.312 524.03 162.358 522.486 162.358 522.486C162.358 519.964 161.49 518.42 159.644 517.497C158.191 516.775 156.638 516.775 156.638 516.775H151.796V528.05H151.805Z" fill="#010101"/>
<path d="M179.936 528.052C179.936 518.705 187.2 511.112 196.154 511.112C205.107 511.112 212.417 518.714 212.417 528.052C212.417 537.389 205.107 545 196.154 545C187.2 544.991 179.936 537.389 179.936 528.052ZM185.601 528.052C185.601 534.301 190.343 539.335 196.154 539.335C202.01 539.335 206.752 534.301 206.752 528.052C206.752 521.811 202.01 516.768 196.154 516.768C190.352 516.768 185.601 521.802 185.601 528.052Z" fill="#010101"/>
<path d="M249.521 544.989C247.968 544.989 246.716 543.728 246.716 542.184V513.906C246.716 512.353 247.977 511.102 249.521 511.102H257.753C257.945 511.102 272.134 511.056 272.134 528.05C272.134 545.044 257.945 544.989 257.753 544.989H249.521ZM252.372 539.325H257.744C257.89 539.325 260.065 539.27 262.249 537.872C265.053 536.081 266.461 532.737 266.461 528.041C266.461 523.244 265.008 519.909 262.057 518.118C259.928 516.812 257.799 516.766 257.744 516.766H252.372V539.325Z" fill="#010101"/>
<path d="M305.93 542.184C305.93 543.728 304.669 544.989 303.07 544.989H287.575C285.976 544.989 284.715 543.728 284.715 542.184V513.906C284.715 512.353 285.976 511.102 287.575 511.102H303.07C304.669 511.102 305.93 512.362 305.93 513.906C305.93 515.505 304.669 516.766 303.07 516.766H290.389V525.236H300.265C301.819 525.236 303.07 526.497 303.07 528.041C303.07 529.585 301.809 530.846 300.265 530.846H290.389V539.315H303.07C304.669 539.325 305.93 540.585 305.93 542.184Z" fill="#010101"/>
<path d="M361.417 542.184C361.417 543.728 360.156 544.989 358.557 544.989H343.061C341.463 544.989 340.202 543.728 340.202 542.184V513.906C340.202 512.353 341.463 511.102 343.061 511.102H358.557C360.156 511.102 361.417 512.362 361.417 513.906C361.417 515.505 360.156 516.766 358.557 516.766H345.875V525.236H355.752C357.305 525.236 358.557 526.497 358.557 528.041C358.557 529.585 357.296 530.846 355.752 530.846H345.875V539.315H358.557C360.156 539.325 361.417 540.585 361.417 542.184Z" fill="#010101"/>
<path d="M385.483 543.198L374.199 514.975C374.053 514.637 374.007 514.299 374.007 513.961C374.007 512.509 375.168 511.102 376.821 511.102C377.936 511.102 378.996 511.778 379.434 512.892L388.151 534.583L396.821 512.892C397.26 511.778 398.32 511.102 399.434 511.102C401.125 511.102 402.239 512.509 402.239 513.906C402.239 514.245 402.194 514.628 402.048 514.966L390.764 543.189C390.325 544.258 389.265 544.98 388.151 544.98C386.99 544.989 385.921 544.267 385.483 543.198Z" fill="#010101"/>
<path d="M411.349 528.052C411.349 518.705 418.612 511.112 427.566 511.112C436.52 511.112 443.829 518.714 443.829 528.052C443.829 537.389 436.52 545 427.566 545C418.603 544.991 411.349 537.389 411.349 528.052ZM417.013 528.052C417.013 534.301 421.755 539.335 427.566 539.335C433.423 539.335 438.165 534.301 438.165 528.052C438.165 521.811 433.423 516.768 427.566 516.768C421.755 516.768 417.013 521.802 417.013 528.052Z" fill="#010101"/>
<path d="M459.279 544.991C457.68 544.991 456.419 543.73 456.419 542.186V513.917C456.419 512.364 457.68 511.112 459.279 511.112C460.832 511.112 462.084 512.373 462.084 513.917V539.335H471.961C473.514 539.335 474.821 540.596 474.821 542.195C474.821 543.748 473.514 545 471.961 545H459.279V544.991Z" fill="#010101"/>
<path d="M486.882 538.413C485.529 535.461 485.475 532.602 485.475 532.264V513.917C485.475 512.364 486.735 511.112 488.28 511.112C489.824 511.112 491.084 512.373 491.084 513.917V532.264C491.084 532.985 491.669 539.335 497.471 539.335C502.99 539.335 503.812 533.378 503.812 532.264V513.917C503.812 512.364 505.073 511.112 506.617 511.112C508.17 511.112 509.422 512.373 509.422 513.917V532.264C509.422 532.602 509.422 535.461 508.069 538.413C506.087 542.67 502.313 545 497.471 545C492.647 544.991 488.864 542.67 486.882 538.413Z" fill="#010101"/>
<path d="M548.234 539.134C548.956 540.487 548.426 542.186 547.073 542.963C544.607 544.269 541.847 545 538.988 545C529.641 545 522.039 537.398 522.039 528.052C522.039 518.705 529.641 511.112 538.988 511.112C541.847 511.112 544.607 511.834 547.073 513.141C548.426 513.917 548.965 515.608 548.234 516.969C547.457 518.376 545.767 518.86 544.36 518.129C542.761 517.206 540.87 516.777 538.988 516.777C532.793 516.777 527.704 521.811 527.704 528.061C527.704 534.31 532.793 539.344 538.988 539.344C540.879 539.344 542.761 538.906 544.36 537.992C545.767 537.252 547.457 537.727 548.234 539.134Z" fill="#010101"/>
<path d="M561.162 542.184V513.906C561.162 512.353 562.422 511.102 563.967 511.102C565.52 511.102 566.772 512.362 566.772 513.906V542.184C566.772 543.728 565.511 544.989 563.967 544.989C562.422 544.989 561.162 543.728 561.162 542.184Z" fill="#010101"/>
<path d="M579.372 528.05C579.372 518.703 586.635 511.111 595.589 511.111C604.543 511.111 611.852 518.712 611.852 528.05C611.852 537.388 604.543 544.998 595.589 544.998C586.635 544.989 579.372 537.388 579.372 528.05ZM585.036 528.05C585.036 534.299 589.778 539.334 595.589 539.334C601.446 539.334 606.188 534.299 606.188 528.05C606.188 521.81 601.446 516.766 595.589 516.766C589.778 516.766 585.036 521.801 585.036 528.05ZM588.91 505.528V500.165C588.91 500.092 588.965 500.037 589.038 500.037H602.186C602.259 500.037 602.314 500.092 602.314 500.165V505.528C602.314 505.601 602.259 505.656 602.186 505.656H589.038C588.974 505.656 588.91 505.601 588.91 505.528Z" fill="#010101"/>
<path d="M644.734 543.783L630.116 522.87V542.184C630.116 543.738 628.809 544.989 627.256 544.989C625.703 544.989 624.451 543.728 624.451 542.184V513.906C624.451 512.454 625.612 511.102 627.311 511.102C628.179 511.102 629.056 511.54 629.586 512.308L644.205 533.221V513.906C644.205 512.353 645.465 511.102 647.064 511.102C648.618 511.102 649.869 512.362 649.869 513.906V542.184C649.869 543.683 648.608 544.989 647.064 544.989C646.141 544.989 645.264 544.56 644.734 543.783Z" fill="#010101"/>
<path d="M326.448 100.208C333.962 100.208 340.053 94.1169 340.053 86.6029C340.053 79.0889 333.962 72.9976 326.448 72.9976C318.934 72.9976 312.842 79.0889 312.842 86.6029C312.842 94.1169 318.934 100.208 326.448 100.208Z" fill="#9C4E98"/>
<path d="M326.447 81.6436C323.894 81.6436 321.821 83.7165 321.821 86.2692C321.821 88.8219 323.894 90.8948 326.447 90.8948C329 90.8948 331.082 88.8219 331.082 86.2692C331.082 83.7255 329 81.6436 326.447 81.6436ZM326.447 82.069C328.764 82.069 330.656 83.9518 330.656 86.2782C330.656 88.5956 328.773 90.4875 326.447 90.4875C324.121 90.4875 322.238 88.6046 322.238 86.2782C322.247 83.9609 324.13 82.069 326.447 82.069Z" fill="white"/>
<path d="M335.707 86.3683L335.399 86.1872C334.784 85.8251 334.358 84.8113 334.34 84.7932C334.213 84.5216 333.996 84.2772 333.697 84.069C333.761 83.7522 333.879 83.4806 334.051 83.2543L334.259 82.9556C334.286 82.9194 334.286 82.8832 334.268 82.8379C334.25 82.8017 334.213 82.7746 334.177 82.7746L333.824 82.7384C333.616 82.7203 333.399 82.6479 333.182 82.5483C333.209 82.2677 333.182 82.0142 333.1 81.7879L333.082 81.7517C333.082 81.7426 332.666 80.9279 332.892 80.077L332.982 79.7331C332.991 79.6969 332.982 79.6516 332.955 79.6244C332.928 79.5973 332.883 79.5882 332.847 79.5973L332.503 79.6969C331.679 79.9413 330.801 79.5249 330.783 79.5158C330.783 79.5158 330.756 79.5068 330.746 79.5068C330.52 79.4343 330.258 79.4162 329.977 79.4525C329.859 79.2352 329.787 79.0179 329.76 78.8007L329.715 78.4477C329.705 78.4115 329.678 78.3752 329.642 78.3571C329.606 78.339 329.561 78.3481 329.524 78.3752L329.244 78.6016C329.081 78.7373 328.882 78.8369 328.646 78.9093C328.474 78.6921 328.275 78.5291 328.058 78.4205L328.022 78.4024C328.013 78.4024 327.144 78.1037 326.718 77.3433L326.537 77.0265C326.519 76.9903 326.483 76.9722 326.438 76.9722C326.392 76.9722 326.356 76.9903 326.338 77.0265L326.166 77.3433C325.75 78.0856 324.826 78.4115 324.817 78.4205C324.817 78.4205 324.79 78.4296 324.781 78.4386C324.573 78.5382 324.383 78.7011 324.211 78.9093C323.985 78.8369 323.794 78.7373 323.641 78.6106L323.36 78.3843C323.324 78.3571 323.288 78.3481 323.242 78.3662C323.206 78.3843 323.179 78.4205 323.17 78.4567L323.134 78.7916C323.106 78.9998 323.043 79.208 322.935 79.4072C322.663 79.38 322.419 79.3981 322.183 79.4706C322.183 79.4706 322.156 79.4796 322.147 79.4796C322.111 79.4977 321.242 79.887 320.436 79.6425L320.101 79.543C320.065 79.5339 320.02 79.543 319.993 79.5701C319.956 79.5973 319.947 79.6425 319.956 79.6788L320.047 80.0227C320.264 80.8646 319.839 81.6883 319.839 81.7064L319.821 81.7426C319.73 81.987 319.712 82.2767 319.748 82.5935C319.504 82.7293 319.259 82.8108 319.033 82.8379L318.68 82.8742C318.644 82.8742 318.608 82.9013 318.589 82.9466C318.571 82.9918 318.58 83.028 318.608 83.0642L318.825 83.3449C318.952 83.5078 319.051 83.707 319.124 83.9242C318.915 84.0962 318.752 84.2772 318.644 84.4854C318.644 84.4854 318.626 84.5216 318.626 84.5307C318.626 84.5397 318.282 85.445 317.53 85.8523L317.214 86.0243C317.177 86.0424 317.159 86.0786 317.15 86.1239C317.141 86.1691 317.168 86.2053 317.205 86.2234L317.512 86.4045C318.264 86.848 318.544 87.7261 318.553 87.7442L318.571 87.7804C318.68 88.0248 318.888 88.2602 319.178 88.4593C319.133 88.7309 319.033 89.0839 318.852 89.3193L318.635 89.6089C318.608 89.6451 318.608 89.6814 318.626 89.7266C318.644 89.7628 318.68 89.79 318.716 89.79L319.069 89.8262C319.259 89.8443 319.468 89.9167 319.694 90.0344C319.676 90.2969 319.703 90.5413 319.775 90.7676C319.775 90.7767 320.183 91.7996 320.002 92.4875L319.911 92.8315C319.902 92.8677 319.911 92.913 319.938 92.9401C319.965 92.9673 320.011 92.9763 320.047 92.9673L320.391 92.8677C321.079 92.6686 322.093 93.0397 322.12 93.0487C322.346 93.1212 322.6 93.1393 322.88 93.1031C323.025 93.3475 323.106 93.5647 323.134 93.7639L323.179 94.1169C323.188 94.1531 323.215 94.1893 323.251 94.2074C323.288 94.2255 323.333 94.2165 323.369 94.1893L323.65 93.963C323.794 93.8453 323.994 93.7458 324.238 93.6733C324.41 93.8725 324.6 94.0264 324.808 94.135C324.854 94.1531 325.822 94.5967 326.175 95.2122L326.356 95.529C326.374 95.5652 326.411 95.5833 326.456 95.5833C326.501 95.5833 326.537 95.5652 326.555 95.529L326.727 95.2122C327.08 94.5876 328.067 94.1441 328.085 94.1259C328.284 94.0264 328.465 93.8725 328.637 93.6733C328.882 93.7458 329.081 93.8453 329.226 93.963L329.506 94.1893C329.534 94.2165 329.579 94.2165 329.624 94.2074C329.66 94.1893 329.687 94.1622 329.696 94.1169L329.742 93.7639C329.769 93.5828 329.841 93.3656 329.977 93.1393C330.24 93.1664 330.475 93.1574 330.71 93.0759C330.719 93.0759 331.733 92.7138 332.43 92.922L332.774 93.0216C332.81 93.0306 332.856 93.0216 332.883 92.9944C332.91 92.9673 332.919 92.922 332.91 92.8858L332.819 92.5418C332.638 91.8539 333.055 90.831 333.064 90.8129C333.145 90.5775 333.172 90.306 333.145 90.0072C333.408 89.8533 333.643 89.7719 333.86 89.7447L334.213 89.7085C334.25 89.7085 334.286 89.6814 334.304 89.6451C334.322 89.6089 334.313 89.5637 334.286 89.5275L334.069 89.2469C333.951 89.102 333.86 88.8938 333.788 88.6313C333.996 88.4684 334.159 88.2783 334.268 88.061C334.268 88.052 334.738 87.0743 335.363 86.7394L335.68 86.5674C335.716 86.5493 335.734 86.5131 335.743 86.4678C335.761 86.4226 335.743 86.3864 335.707 86.3683ZM329.352 92.9854C329.307 93.0759 329.271 93.1574 329.244 93.2388C329.171 93.2026 329.09 93.1664 329.008 93.1393C329.045 93.0578 329.081 92.9763 329.117 92.8858C329.19 92.922 329.271 92.9492 329.352 92.9854ZM328.782 91.3198C328.773 91.5189 328.755 91.7181 328.719 91.9172C328.565 91.7996 328.411 91.6728 328.266 91.537C328.438 91.4737 328.61 91.4103 328.782 91.3198ZM323.776 92.8496C323.813 92.9492 323.858 93.0487 323.903 93.1393C323.822 93.1664 323.731 93.2026 323.659 93.2388C323.622 93.1483 323.577 93.0487 323.532 92.9492C323.613 92.922 323.695 92.8858 323.776 92.8496ZM324.582 91.528C324.446 91.6547 324.31 91.7724 324.166 91.881C324.138 91.709 324.12 91.5189 324.111 91.3379C324.274 91.4013 324.428 91.4737 324.582 91.528ZM319.232 84.8385C319.259 85.3363 319.567 85.8523 320.083 86.3049C319.603 86.7304 319.314 87.2101 319.25 87.6808C319.205 87.6265 319.16 87.5632 319.133 87.4998C319.078 87.3369 318.825 86.6489 318.209 86.1239C318.834 85.6079 319.133 84.8928 319.187 84.757C319.196 84.7389 319.214 84.7117 319.223 84.6936C319.223 84.7479 319.223 84.7842 319.223 84.8023C319.232 84.8113 319.232 84.8385 319.232 84.8385ZM324.093 81.2267C324.102 81.0185 324.12 80.8103 324.157 80.6111C324.319 80.7288 324.482 80.8646 324.627 81.0094C324.455 81.0637 324.274 81.1452 324.093 81.2267ZM323.559 79.5701C323.595 79.4977 323.622 79.4162 323.65 79.3438C323.722 79.38 323.794 79.4162 323.867 79.4434C323.831 79.5158 323.804 79.5882 323.767 79.6607C323.704 79.6244 323.632 79.5973 323.559 79.5701ZM329.108 79.7059C329.072 79.6154 329.036 79.5249 328.999 79.4434C329.09 79.4072 329.171 79.371 329.253 79.3348C329.28 79.4253 329.316 79.5158 329.362 79.6063C329.271 79.6335 329.19 79.6697 329.108 79.7059ZM328.302 81.0275C328.438 80.9008 328.574 80.7831 328.71 80.6835C328.737 80.8555 328.755 81.0366 328.764 81.2176C328.601 81.1452 328.456 81.0818 328.302 81.0275ZM332.512 82.0142C332.521 82.0414 332.53 82.0685 332.539 82.1047C332.494 82.0595 332.457 82.0323 332.448 82.0142C332.448 82.0142 332.421 81.9961 332.421 81.987C332.104 81.7245 331.643 81.5888 331.1 81.5888C331.054 81.5888 331.009 81.5888 330.973 81.5888C330.982 80.9823 330.828 80.4753 330.529 80.1404L330.493 80.1133C330.493 80.1133 330.475 80.1042 330.457 80.077C330.484 80.0861 330.511 80.0861 330.538 80.0952C330.656 80.1495 331.38 80.4572 332.204 80.3848C332.141 81.2357 332.475 81.9418 332.512 82.0142ZM321.432 83.8337C321.368 83.9604 321.314 84.0871 321.26 84.232C321.151 84.1143 321.061 83.9876 320.97 83.8699C321.124 83.8518 321.278 83.8427 321.432 83.8337ZM321.993 82.2858C322.02 82.4306 322.065 82.5935 322.12 82.7655C322.011 82.9013 321.903 83.0461 321.794 83.2091H321.64C321.287 83.2 320.943 83.2272 320.617 83.2906C320.554 83.1548 320.499 83.019 320.454 82.8832C320.671 82.7203 320.807 82.5754 320.834 82.5392C321.079 82.331 321.495 82.2496 321.993 82.2858ZM319.83 84.2048C319.974 84.1324 320.128 84.069 320.309 84.0147C320.49 84.2953 320.699 84.5579 320.934 84.8113L321.052 84.929C320.979 85.2096 320.934 85.4812 320.907 85.7527C320.798 85.8161 320.699 85.8704 320.608 85.9247C320.165 85.5717 319.893 85.1734 319.866 84.8385C319.866 84.7842 319.884 84.5307 319.83 84.2048ZM320.608 86.6942C320.699 86.7485 320.798 86.8028 320.907 86.8661C320.934 87.0924 320.97 87.3278 321.034 87.5813L320.916 87.708C320.717 87.8981 320.536 88.1153 320.373 88.3416C320.183 88.2873 320.011 88.2149 319.848 88.1425C319.866 87.9886 319.866 87.8709 319.866 87.8257C319.893 87.4636 320.155 87.0562 320.608 86.6942ZM321.061 88.4774C321.115 88.405 321.178 88.3326 321.242 88.2602C321.269 88.3416 321.305 88.4231 321.341 88.5046C321.251 88.4955 321.151 88.4865 321.061 88.4774ZM321.513 89.1473H321.676C321.821 89.3826 321.957 89.5908 322.111 89.7809C322.047 89.9801 322.002 90.1611 321.975 90.3241C321.495 90.3603 321.106 90.2788 320.871 90.0887C320.862 90.0796 320.671 89.9077 320.391 89.7266C320.445 89.5184 320.545 89.2921 320.662 89.0658C320.943 89.1111 321.224 89.1382 321.513 89.1473ZM331.38 86.2778C331.38 89.0024 329.162 91.2202 326.438 91.2202C323.713 91.2202 321.495 89.0024 321.495 86.2778C321.495 83.5531 323.713 81.3353 326.438 81.3353C329.171 81.3353 331.38 83.5531 331.38 86.2778ZM331.842 87.6084C331.905 87.3369 331.959 87.0653 331.978 86.8028C332.095 86.7394 332.195 86.6851 332.285 86.6217C332.738 86.9838 333.01 87.3912 333.028 87.7351C333.028 87.7804 333.037 88.0158 333.082 88.3326C332.937 88.4141 332.765 88.4774 332.584 88.5317C332.403 88.2511 332.195 87.9796 331.95 87.7351L331.842 87.6084ZM333.019 84.7389C332.991 85.0829 332.729 85.4812 332.294 85.8433C332.204 85.7889 332.104 85.7256 331.987 85.6713C331.959 85.445 331.923 85.2187 331.86 84.9742L331.978 84.8475C332.177 84.6393 332.358 84.4221 332.521 84.1958C332.702 84.2501 332.874 84.3134 333.028 84.3859C333.01 84.576 333.01 84.7027 333.019 84.7389ZM331.824 84.06C331.76 84.1324 331.697 84.2139 331.634 84.2772C331.606 84.1958 331.57 84.1143 331.534 84.0328C331.634 84.0419 331.733 84.0509 331.824 84.06ZM331.38 83.3992H331.199C331.054 83.1638 330.918 82.9647 330.765 82.7746C330.828 82.5754 330.873 82.3944 330.9 82.2315C331.371 82.1952 331.769 82.2858 331.987 82.4578C332.032 82.5121 332.204 82.6841 332.466 82.8651C332.412 83.0642 332.322 83.2724 332.204 83.4806C331.941 83.4354 331.67 83.4082 331.38 83.3992ZM331.453 88.7037C331.516 88.577 331.57 88.4412 331.634 88.2964C331.742 88.4141 331.842 88.5408 331.932 88.6766C331.778 88.6947 331.615 88.7037 331.453 88.7037ZM330.909 90.2607C330.882 90.1068 330.837 89.9439 330.783 89.7628C330.882 89.6361 330.991 89.4913 331.09 89.3283H331.38C331.688 89.3283 331.987 89.3012 332.285 89.2469C332.358 89.4007 332.421 89.5456 332.457 89.6904C332.258 89.8352 332.113 89.962 332.077 89.9982C331.833 90.2154 331.407 90.306 330.909 90.2607ZM332.847 83.6436C332.919 83.4897 332.991 83.3358 333.046 83.1819C333.127 83.2181 333.218 83.2543 333.299 83.2724C333.227 83.4173 333.172 83.5802 333.127 83.7432C333.028 83.716 332.937 83.6798 332.847 83.6436ZM329.787 81.8332C329.66 81.7426 329.534 81.6521 329.398 81.5616V81.3896C329.398 81.0275 329.362 80.6654 329.28 80.3215C329.416 80.2581 329.552 80.1947 329.678 80.1585C329.841 80.3758 329.995 80.5206 330.059 80.584C330.249 80.8193 330.348 81.1995 330.33 81.6793C330.167 81.7064 329.986 81.7607 329.787 81.8332ZM327.714 80.7197L327.605 80.8374C327.461 80.8103 327.316 80.7831 327.171 80.765C327.062 80.5568 326.963 80.3758 326.854 80.2219C327.153 79.896 327.479 79.7059 327.75 79.6788C327.823 79.6788 328.067 79.6878 328.375 79.6335C328.438 79.7602 328.502 79.896 328.547 80.0408C328.257 80.2128 327.977 80.4482 327.714 80.7197ZM327.75 79.027C327.741 79.027 327.723 79.027 327.723 79.027C327.298 79.0632 326.854 79.3076 326.447 79.715C326.048 79.3076 325.596 79.0632 325.17 79.027H325.125C325.125 79.027 325.071 79.027 324.989 79.027C325.007 79.0179 325.026 79.0089 325.044 78.9998C325.207 78.9365 325.913 78.6559 326.438 78.0403C326.972 78.674 327.669 78.9365 327.795 78.9817C327.823 78.9998 327.85 79.0089 327.877 79.027C327.805 79.0361 327.759 79.027 327.75 79.027ZM326.048 80.2038C325.94 80.3577 325.84 80.5387 325.732 80.7469C325.596 80.765 325.46 80.7831 325.333 80.8103L325.225 80.6926C324.953 80.4029 324.654 80.1585 324.338 79.9503C324.383 79.8236 324.437 79.7059 324.491 79.5973C324.835 79.6607 325.098 79.6516 325.134 79.6516C325.424 79.6878 325.741 79.8779 326.048 80.2038ZM323.46 81.4077V81.5706C323.315 81.6612 323.17 81.7607 323.043 81.8603C322.871 81.806 322.708 81.7607 322.563 81.7245C322.536 81.2267 322.627 80.8193 322.826 80.5749C322.889 80.5206 323.052 80.3577 323.242 80.1133C323.36 80.1495 323.469 80.1947 323.586 80.249C323.505 80.6292 323.46 81.0185 323.46 81.4077ZM322.391 80.1223L322.364 80.1495C322.065 80.4934 321.912 81.0185 321.93 81.6431C321.296 81.6159 320.771 81.7607 320.427 82.0504C320.427 82.0504 320.4 82.0776 320.391 82.0866C320.391 82.0866 320.382 82.0957 320.373 82.1047C320.382 82.0504 320.391 82.0052 320.409 81.9599C320.481 81.806 320.789 81.1452 320.735 80.3396C321.577 80.421 322.319 80.0952 322.391 80.068C322.419 80.0589 322.437 80.0499 322.464 80.0499C322.428 80.0952 322.391 80.1223 322.391 80.1223ZM319.667 83.5802C319.64 83.5078 319.603 83.4263 319.567 83.3539C319.685 83.3177 319.793 83.2724 319.911 83.2181C319.938 83.2906 319.965 83.372 320.002 83.4444C319.884 83.4897 319.766 83.535 319.667 83.5802ZM320.038 88.8938C319.956 89.0658 319.884 89.2288 319.83 89.4007C319.748 89.3645 319.667 89.3283 319.585 89.3012C319.658 89.1473 319.712 88.9753 319.757 88.7852C319.848 88.8214 319.938 88.8576 320.038 88.8938ZM320.463 90.5685C320.807 90.8491 321.323 90.9849 321.921 90.9577C321.921 91.5642 322.075 92.0711 322.373 92.406C322.373 92.406 322.4 92.4332 322.437 92.4785C322.4 92.4694 322.364 92.4604 322.337 92.4513C322.183 92.397 321.432 92.1345 320.69 92.1888C320.717 91.4556 320.436 90.6952 320.382 90.5413C320.373 90.5142 320.364 90.496 320.364 90.4689C320.418 90.5232 320.454 90.5594 320.463 90.5685ZM323.097 90.7133C323.224 90.8038 323.351 90.8943 323.487 90.9758V91.1478C323.487 91.5189 323.523 91.881 323.604 92.225C323.469 92.2974 323.333 92.3517 323.197 92.397C323.025 92.1616 322.871 92.0078 322.844 91.9715C322.645 91.7452 322.545 91.3469 322.563 90.8762C322.717 90.84 322.898 90.7857 323.097 90.7133ZM325.161 91.8448L325.279 91.7271C325.433 91.7633 325.587 91.7905 325.741 91.8086C325.84 92.0168 325.94 92.1888 326.039 92.3336C325.732 92.6686 325.406 92.8768 325.116 92.8949C325.071 92.8949 324.826 92.9039 324.519 92.9673C324.446 92.8315 324.383 92.6867 324.329 92.5328C324.627 92.3336 324.908 92.1073 325.161 91.8448ZM325.17 93.5195C325.596 93.4832 326.048 93.2388 326.447 92.8224C326.854 93.2388 327.307 93.4832 327.741 93.5285C327.741 93.5285 327.795 93.5285 327.877 93.5376C327.859 93.5466 327.841 93.5557 327.823 93.5738C327.723 93.619 326.972 93.9721 326.465 94.5333C325.949 93.963 325.179 93.61 325.098 93.5738C325.08 93.5647 325.053 93.5466 325.035 93.5376C325.107 93.5285 325.152 93.5195 325.17 93.5195ZM327.153 91.7996C327.298 91.7814 327.433 91.7543 327.569 91.7271L327.687 91.8448C327.958 92.1254 328.248 92.3698 328.556 92.569C328.502 92.7138 328.447 92.8405 328.384 92.9582C328.067 92.8949 327.823 92.8858 327.786 92.8858C327.497 92.8587 327.162 92.6595 326.854 92.3155C326.954 92.1797 327.053 91.9987 327.153 91.7996ZM329.416 91.1478V90.9758C329.57 90.8762 329.715 90.7767 329.85 90.6771C330.031 90.7405 330.194 90.7857 330.348 90.8219C330.375 91.3198 330.276 91.7362 330.077 91.9806C330.049 92.0078 329.887 92.1797 329.696 92.4423C329.57 92.406 329.434 92.3517 329.307 92.2884C329.38 91.9172 329.416 91.537 329.416 91.1478ZM330.511 92.4151C330.52 92.406 330.529 92.397 330.538 92.397C330.837 92.053 330.991 91.528 330.982 90.9034C331.615 90.9305 332.141 90.7948 332.503 90.487C332.503 90.487 332.512 90.4779 332.521 90.4689C332.512 90.5142 332.503 90.5504 332.484 90.5956C332.421 90.7495 332.141 91.5099 332.159 92.2431C331.398 92.1797 330.602 92.4604 330.511 92.4875C330.484 92.4966 330.466 92.4966 330.439 92.5056C330.493 92.4423 330.511 92.4151 330.511 92.4151ZM333.245 88.9572C333.281 89.0477 333.308 89.1382 333.344 89.2197C333.236 89.2559 333.118 89.3102 333 89.3645C332.973 89.274 332.937 89.1835 332.892 89.093C333.019 89.0568 333.136 89.0115 333.245 88.9572ZM332.81 86.2325C333.29 85.798 333.58 85.3182 333.643 84.8566C333.697 84.9199 333.743 84.9833 333.77 85.0467C333.806 85.1372 334.15 85.9157 334.711 86.4407C334.123 86.9476 333.752 87.717 333.725 87.7804C333.716 87.7985 333.697 87.8257 333.688 87.8438C333.679 87.7623 333.679 87.717 333.679 87.708C333.643 87.2101 333.335 86.6942 332.81 86.2325Z" fill="white"/>
<path d="M326.419 301.112C333.919 301.112 339.998 295.033 339.998 287.534C339.998 280.035 333.919 273.956 326.419 273.956C318.92 273.956 312.841 280.035 312.841 287.534C312.841 295.033 318.92 301.112 326.419 301.112Z" fill="#D05140"/>
<path d="M326.22 289.733C326.256 289.806 326.338 289.851 326.419 289.851C326.501 289.851 326.573 289.806 326.618 289.733L328.8 285.959C328.836 285.886 328.836 285.805 328.8 285.732C328.764 285.66 328.682 285.615 328.601 285.615H324.238C324.156 285.615 324.084 285.66 324.038 285.732C324.002 285.805 324.002 285.886 324.038 285.959L326.22 289.733Z" fill="white"/>
<path d="M334.34 287.534C335.281 286.42 335.444 284.791 334.711 283.469C334.702 283.451 333.706 281.976 333.706 280.808V280.536C333.706 280.41 333.606 280.31 333.48 280.31H333.208C332.068 280.31 330.502 279.269 330.447 279.233C329.162 278.518 327.542 278.672 326.419 279.613C325.297 278.681 323.676 278.518 322.355 279.26C322.291 279.305 320.762 280.319 319.63 280.319H319.358C319.232 280.319 319.132 280.419 319.132 280.545V280.817C319.132 281.985 318.136 283.469 318.1 283.524C317.385 284.809 317.557 286.429 318.489 287.543C317.548 288.656 317.385 290.285 318.109 291.58C318.517 292.259 319.159 293.599 319.159 294.305V294.576C319.159 294.703 319.259 294.803 319.386 294.803H319.657C320.626 294.803 322.355 295.834 322.382 295.853C322.907 296.142 323.504 296.296 324.111 296.296C324.962 296.296 325.767 295.997 326.41 295.454C327.053 295.997 327.858 296.296 328.709 296.296C329.316 296.296 329.913 296.142 330.447 295.844C330.465 295.834 332.194 294.803 333.154 294.803H333.425C333.552 294.803 333.652 294.703 333.652 294.576V294.305C333.652 293.372 334.666 291.652 334.711 291.562C335.453 290.276 335.281 288.647 334.34 287.534ZM330.158 293.074C329.062 293.816 327.75 294.223 326.419 294.223C325.088 294.223 323.776 293.816 322.681 293.074H330.158ZM333.86 291.064C333.797 291.164 332.919 292.657 332.71 293.843C331.543 294.042 330.112 294.884 329.949 294.974C329.271 295.355 328.465 295.391 327.759 295.11C330.945 294.549 333.435 292.06 333.987 288.873C334.276 289.579 334.24 290.385 333.86 291.064ZM333.987 286.194C333.425 283.008 330.936 280.518 327.75 279.966C328.456 279.685 329.252 279.722 329.931 280.102C330.121 280.229 331.461 281.098 332.728 281.279C332.909 282.582 333.769 283.886 333.86 284.012C334.24 284.682 334.276 285.488 333.987 286.194ZM333.109 287.534C333.109 288.864 332.701 290.168 331.959 291.272V283.795C332.701 284.899 333.109 286.203 333.109 287.534ZM320.87 283.795V291.272C320.128 290.168 319.721 288.864 319.721 287.534C319.73 286.203 320.128 284.899 320.87 283.795ZM318.842 286.194C318.562 285.497 318.598 284.691 318.96 284.021C319.087 283.831 319.92 282.555 320.092 281.279C321.386 281.089 322.744 280.201 322.889 280.102C323.568 279.722 324.373 279.685 325.079 279.966C321.893 280.518 319.404 283.008 318.842 286.194ZM318.842 288.873C319.395 292.06 321.884 294.549 325.07 295.11C324.364 295.391 323.559 295.355 322.889 294.974C322.708 294.866 321.287 294.033 320.128 293.843C319.92 292.648 319.014 291.127 318.978 291.073C318.598 290.385 318.562 289.579 318.842 288.873ZM330.963 282.989V292.078H321.875V282.989H330.963ZM322.681 281.994C323.776 281.251 325.088 280.844 326.419 280.844C327.75 280.844 329.062 281.251 330.158 281.994H322.681Z" fill="white"/>
<path d="M339.998 254.04C339.998 246.541 333.919 240.462 326.42 240.462C318.921 240.462 312.841 246.541 312.841 254.04C312.841 261.539 318.921 267.619 326.42 267.619C333.919 267.619 339.998 261.539 339.998 254.04Z" fill="#E07F38"/>
<path d="M326.913 247.952C326.587 247.916 326.243 247.916 325.917 247.952C322.776 248.205 320.305 250.876 320.305 254.035C320.305 257.402 323.038 260.136 326.406 260.136C329.773 260.136 332.507 257.402 332.507 254.035C332.525 250.876 330.063 248.205 326.913 247.952ZM326.415 257.719C329.112 257.719 331.312 255.52 331.312 252.822C331.312 252.731 331.312 252.641 331.303 252.55C331.448 253.03 331.529 253.528 331.529 254.035C331.529 256.85 329.239 259.149 326.415 259.149C323.591 259.149 321.3 256.859 321.3 254.035C321.3 253.528 321.373 253.03 321.527 252.55C321.518 252.641 321.518 252.731 321.518 252.822C321.518 255.529 323.717 257.719 326.415 257.719ZM326.415 256.723C324.26 256.723 322.513 254.976 322.513 252.822C322.513 250.812 324.016 249.147 326.017 248.939C326.279 248.921 326.56 248.921 326.813 248.939C328.814 249.147 330.316 250.812 330.316 252.822C330.316 254.976 328.569 256.723 326.415 256.723Z" fill="white"/>
<path d="M334.906 258.707C334.608 257.983 334.906 256.553 334.915 256.544V256.526C335.069 255.693 334.771 254.788 334.092 254.027C334.753 253.267 335.051 252.371 334.906 251.547C334.906 251.538 334.897 251.493 334.888 251.493C334.87 251.447 334.544 250.28 334.906 249.401L335.051 249.058C335.078 248.994 335.069 248.913 335.033 248.849C334.997 248.786 334.934 248.75 334.861 248.741L334.49 248.704C333.567 248.623 332.625 247.745 332.544 247.673C331.955 247.22 331.141 247.039 330.272 247.175C329.937 246.36 329.366 245.744 328.669 245.482C328.66 245.482 328.624 245.464 328.615 245.464C328.606 245.464 327.411 245.147 326.832 244.359L326.615 244.061C326.569 244.006 326.506 243.97 326.434 243.97C326.361 243.97 326.298 244.006 326.253 244.061L326.035 244.359C325.474 245.12 324.207 245.464 324.143 245.482C323.446 245.744 322.867 246.36 322.532 247.175C321.663 247.039 320.839 247.22 320.215 247.709C320.206 247.718 319.264 248.623 318.314 248.704L317.943 248.741C317.87 248.75 317.807 248.786 317.771 248.849C317.735 248.913 317.725 248.985 317.753 249.058L317.897 249.401C318.26 250.28 317.934 251.447 317.916 251.493C317.916 251.502 317.906 251.538 317.897 251.547C317.753 252.38 318.051 253.267 318.712 254.027C318.042 254.788 317.744 255.693 317.897 256.544C318.015 257.096 318.124 258.173 317.906 258.707L317.762 259.051C317.735 259.114 317.744 259.196 317.78 259.25C317.816 259.314 317.879 259.35 317.952 259.359L318.323 259.395C318.984 259.449 319.925 260.137 320.242 260.4C320.83 260.852 321.636 261.033 322.523 260.889C322.858 261.703 323.437 262.319 324.143 262.59C324.659 262.771 325.637 263.215 325.999 263.704L326.216 264.003C326.262 264.057 326.325 264.093 326.397 264.093C326.47 264.093 326.533 264.057 326.578 264.003L326.796 263.704C327.266 263.07 328.624 262.59 328.651 262.581C329.348 262.31 329.919 261.703 330.254 260.889C331.132 261.024 331.946 260.852 332.553 260.382C332.861 260.128 333.802 259.44 334.454 259.386L334.825 259.35C334.897 259.341 334.961 259.305 334.997 259.241C335.033 259.178 335.042 259.105 335.015 259.033L334.906 258.707ZM318.893 256.344C318.848 256.073 318.884 255.783 319.002 255.475C319.346 257.232 320.296 258.798 321.699 259.92C321.383 259.884 321.102 259.784 320.885 259.612C320.767 259.513 319.898 258.807 319.002 258.517C319.147 257.594 318.92 256.471 318.893 256.344ZM319.011 249.573C320.007 249.275 320.821 248.514 320.894 248.442C321.111 248.279 321.383 248.179 321.69 248.134C320.296 249.257 319.346 250.814 319.002 252.561C318.893 252.271 318.857 251.99 318.893 251.737C318.966 251.511 319.21 250.551 319.011 249.573ZM332.978 254.036C332.978 257.657 330.036 260.599 326.415 260.599C322.795 260.599 319.853 257.657 319.853 254.036C319.853 250.415 322.795 247.473 326.415 247.473C330.036 247.473 332.978 250.415 332.978 254.036ZM333.838 258.526C332.924 258.825 332.055 259.54 331.964 259.621C331.747 259.793 331.467 259.893 331.141 259.929C332.544 258.807 333.494 257.241 333.838 255.485C333.956 255.783 333.992 256.073 333.947 256.344C333.911 256.498 333.684 257.603 333.838 258.526ZM333.938 251.728C333.983 251.99 333.947 252.28 333.838 252.57C333.494 250.823 332.544 249.266 331.15 248.143C331.458 248.179 331.72 248.279 331.937 248.442C332.109 248.605 332.888 249.293 333.829 249.583C333.63 250.569 333.883 251.547 333.938 251.728ZM323.827 246.93C324.017 246.686 324.243 246.514 324.487 246.414C324.723 246.351 325.709 246.052 326.443 245.382C327.194 246.07 328.163 246.36 328.335 246.405C328.588 246.505 328.814 246.686 329.004 246.939C328.172 246.632 327.303 246.478 326.406 246.478C325.528 246.478 324.659 246.632 323.827 246.93ZM329.013 261.133C328.823 261.377 328.588 261.568 328.335 261.667C328.19 261.721 327.14 262.093 326.425 262.708C325.728 262.111 324.705 261.74 324.505 261.667C324.252 261.568 324.017 261.387 323.827 261.142C325.483 261.74 327.357 261.74 329.013 261.133Z" fill="white"/>
<path d="M339.997 220.545C339.997 213.046 333.918 206.967 326.419 206.967C318.92 206.967 312.841 213.046 312.841 220.545C312.841 228.044 318.92 234.123 326.419 234.123C333.918 234.123 339.997 228.044 339.997 220.545Z" fill="#E5A149"/>
<path d="M335.719 224.305L335.465 223.97C335.049 223.427 335.004 222.368 335.004 222.223C334.967 221.643 334.623 221.037 334.035 220.494C334.614 219.951 334.949 219.344 334.976 218.765C334.976 218.756 334.976 218.711 334.976 218.702C334.976 218.692 334.904 217.751 335.429 217.045L335.683 216.71C335.728 216.647 335.746 216.556 335.71 216.484C335.673 216.411 335.61 216.357 335.529 216.348L335.112 216.303C334.252 216.221 333.564 215.488 333.564 215.488C333.555 215.479 333.528 215.452 333.519 215.443C333.121 215.117 332.514 214.936 331.844 214.954C331.835 214.266 331.645 213.678 331.31 213.297C331.301 213.288 331.265 213.252 331.265 213.252C331.256 213.243 330.55 212.628 330.432 211.749L330.378 211.333C330.369 211.252 330.315 211.179 330.233 211.152C330.161 211.125 330.07 211.134 330.007 211.188L329.681 211.451C329.011 211.985 328.033 211.949 327.997 211.949C327.988 211.949 327.943 211.949 327.934 211.949C327.436 211.985 326.92 212.256 326.449 212.718C325.979 212.265 325.454 211.994 324.965 211.949C324.956 211.949 324.91 211.949 324.901 211.949C324.865 211.949 323.879 211.985 323.218 211.451L322.892 211.188C322.829 211.134 322.738 211.125 322.666 211.152C322.593 211.179 322.539 211.252 322.521 211.333L322.466 211.749C322.349 212.628 321.643 213.243 321.643 213.243C321.634 213.252 321.597 213.288 321.588 213.297C321.235 213.696 321.045 214.302 321.054 215.026C320.33 215.017 319.724 215.189 319.325 215.533C319.316 215.542 319.289 215.569 319.28 215.579C319.271 215.588 318.601 216.321 317.741 216.42L317.325 216.466C317.243 216.475 317.171 216.529 317.144 216.601C317.108 216.674 317.126 216.764 317.171 216.828L317.424 217.163C317.958 217.86 317.895 218.801 317.895 218.81C317.895 218.819 317.895 218.873 317.895 218.883C317.931 219.453 318.275 220.059 318.864 220.602C318.275 221.146 317.94 221.761 317.913 222.368C317.913 222.684 317.832 223.617 317.47 224.097L317.216 224.432C317.171 224.495 317.153 224.585 317.189 224.658C317.225 224.73 317.289 224.785 317.37 224.794L317.786 224.839C318.493 224.911 319.316 225.635 319.371 225.681C319.769 226.007 320.348 226.179 321.045 226.17C321.054 226.857 321.244 227.437 321.606 227.844C321.824 228.07 322.421 228.795 322.494 229.392L322.548 229.808C322.557 229.89 322.611 229.962 322.693 229.99C322.72 229.999 322.747 230.008 322.774 230.008C322.829 230.008 322.874 229.99 322.919 229.962L323.245 229.7C323.815 229.247 324.929 229.193 324.965 229.193C325.463 229.148 325.988 228.876 326.458 228.405C326.929 228.867 327.454 229.148 327.979 229.193C327.988 229.193 329.111 229.238 329.681 229.7L330.007 229.962C330.07 230.017 330.152 230.026 330.233 229.999C330.306 229.971 330.36 229.899 330.378 229.818L330.432 229.401C330.523 228.695 331.292 227.889 331.338 227.844C331.691 227.446 331.881 226.839 331.881 226.124C332.614 226.151 333.202 225.961 333.637 225.608C333.673 225.581 334.479 224.839 335.194 224.757L335.61 224.712C335.692 224.703 335.764 224.649 335.791 224.576C335.782 224.459 335.773 224.368 335.719 224.305ZM318.456 217.172C319.244 216.882 319.796 216.321 319.887 216.221C319.995 216.131 320.149 216.058 320.321 216.013C319.597 216.982 319.117 218.095 318.918 219.281C318.827 219.127 318.782 218.973 318.764 218.837C318.782 218.647 318.8 217.914 318.456 217.172ZM318.936 221.888C319.153 223.083 319.642 224.196 320.384 225.156C320.194 225.11 320.04 225.038 319.923 224.947C319.832 224.866 319.217 224.323 318.474 224.051C318.764 223.309 318.782 222.467 318.782 222.368C318.791 222.223 318.846 222.06 318.936 221.888ZM321.208 216.493C322.457 214.891 324.367 213.949 326.413 213.949C328.459 213.949 330.369 214.891 331.618 216.493H321.208ZM325.626 227.093C322.34 226.704 319.823 223.906 319.823 220.548C319.823 219.652 320.004 218.783 320.357 217.959L325.626 227.093ZM331.691 217.479L326.449 226.559L321.208 217.479H331.691ZM332.505 218.032C332.84 218.828 333.003 219.67 333.003 220.548C333.003 223.861 330.523 226.658 327.282 227.084L332.505 218.032ZM334.406 223.952C333.673 224.241 333.066 224.785 332.967 224.866C332.849 224.966 332.686 225.038 332.487 225.083C333.22 224.106 333.709 222.974 333.899 221.77C333.999 221.942 334.062 222.114 334.071 222.259C334.071 222.368 334.098 223.209 334.406 223.952ZM334.044 218.729C334.035 218.873 333.981 219.036 333.89 219.208C333.682 218.014 333.184 216.9 332.442 215.932C332.623 215.977 332.777 216.04 332.876 216.122C332.985 216.239 333.546 216.792 334.343 217.072C333.999 217.851 334.035 218.602 334.044 218.729ZM327.499 213.035C327.653 212.944 327.816 212.881 327.952 212.872C328.142 212.872 328.902 212.872 329.645 212.528C329.943 213.315 330.496 213.831 330.586 213.913C330.686 214.031 330.758 214.184 330.812 214.375C329.835 213.659 328.703 213.207 327.499 213.035ZM322.023 214.356C322.068 214.184 322.141 214.031 322.231 213.922C322.376 213.795 322.901 213.288 323.191 212.528C323.987 212.899 324.802 212.872 324.874 212.872C325.019 212.89 325.182 212.944 325.345 213.035C324.132 213.198 323.01 213.65 322.023 214.356ZM325.327 228.061C325.164 228.161 325.001 228.215 324.847 228.233C324.72 228.242 323.906 228.288 323.182 228.605C322.856 227.835 322.249 227.211 322.231 227.183C322.131 227.075 322.059 226.912 322.005 226.731C323.001 227.428 324.123 227.889 325.327 228.061ZM330.831 226.713C330.776 226.903 330.704 227.066 330.604 227.174C330.514 227.265 329.953 227.871 329.645 228.595C328.912 228.27 328.079 228.233 327.988 228.224C327.834 228.206 327.671 228.152 327.508 228.052C328.712 227.88 329.844 227.428 330.831 226.713Z" fill="white"/>
<path d="M326.419 173.476C318.92 173.476 312.841 179.555 312.841 187.054C312.841 194.553 318.92 200.632 326.419 200.632C333.918 200.632 339.997 194.553 339.997 187.054C339.997 179.555 333.918 173.476 326.419 173.476Z" fill="#4FA759"/>
<path d="M335.437 185.719L335.048 185.601C334.631 185.474 334.505 185.348 334.224 185.076C334.124 184.976 334.007 184.868 333.853 184.741C333.636 184.56 333.355 184.415 333.029 184.307C333.192 183.999 333.282 183.7 333.301 183.438C333.31 183.284 333.31 183.148 333.319 182.994C333.319 182.65 333.319 182.424 333.536 182.016L333.726 181.654C333.762 181.591 333.753 181.518 333.708 181.455C333.663 181.401 333.59 181.374 333.527 181.392L333.129 181.482C332.712 181.582 332.531 181.537 332.169 181.446C332.024 181.41 331.861 181.374 331.662 181.337C331.372 181.283 331.056 181.301 330.712 181.374C330.694 181.012 330.63 180.695 330.503 180.45C330.431 180.296 330.359 180.17 330.286 180.061C330.114 179.762 329.997 179.572 329.978 179.102L329.96 178.694C329.96 178.622 329.915 178.558 329.852 178.531C329.788 178.504 329.707 178.522 329.662 178.567L329.363 178.848C329.046 179.147 328.865 179.201 328.512 179.301C328.367 179.346 328.213 179.391 328.023 179.464C327.806 179.545 327.589 179.672 327.38 179.844C327.218 179.599 327.037 179.418 326.855 179.292L326.62 179.138C326.249 178.893 325.95 178.703 325.751 178.359L325.534 177.979C325.498 177.916 325.425 177.88 325.353 177.889C325.28 177.898 325.217 177.952 325.199 178.015L325.081 178.441C324.982 178.803 324.873 178.911 324.583 179.201C324.475 179.31 324.357 179.427 324.212 179.59C324.013 179.817 323.85 180.097 323.742 180.414C323.416 180.242 323.117 180.143 322.845 180.124C322.755 180.115 322.664 180.115 322.574 180.115C322.13 180.097 321.777 180.088 321.433 179.889L321.053 179.672C320.99 179.636 320.908 179.645 320.854 179.681C320.8 179.726 320.772 179.799 320.791 179.871L320.899 180.296C320.99 180.659 320.953 180.812 320.863 181.175C320.827 181.328 320.781 181.5 320.736 181.727C320.682 182.025 320.682 182.342 320.745 182.668C320.383 182.677 320.075 182.75 319.84 182.867L319.596 182.994C319.206 183.202 318.89 183.365 318.491 183.374H318.048C317.975 183.374 317.912 183.419 317.885 183.483C317.858 183.546 317.876 183.628 317.921 183.682L318.238 183.999C318.5 184.261 318.546 184.415 318.654 184.795C318.699 184.94 318.745 185.112 318.817 185.32C318.917 185.61 319.08 185.882 319.306 186.135C318.998 186.334 318.754 186.551 318.618 186.769L318.473 187.004C318.238 187.384 318.057 187.683 317.713 187.882L317.333 188.108C317.269 188.145 317.233 188.217 317.242 188.289C317.251 188.362 317.305 188.416 317.378 188.443L317.803 188.552C318.165 188.643 318.274 188.751 318.564 189.023C318.681 189.131 318.808 189.249 318.971 189.394C319.197 189.584 319.469 189.738 319.786 189.837C319.623 190.154 319.523 190.453 319.514 190.715L319.505 190.987C319.496 191.412 319.487 191.784 319.288 192.137L319.071 192.526C319.034 192.589 319.043 192.671 319.089 192.725C319.134 192.779 319.206 192.806 319.279 192.788L319.704 192.671C320.066 192.571 320.22 192.607 320.582 192.698C320.736 192.734 320.908 192.779 321.135 192.816C321.433 192.87 321.75 192.861 322.085 192.788C322.103 193.15 322.176 193.467 322.302 193.703L322.438 193.947C322.655 194.336 322.827 194.644 322.836 195.042L322.845 195.486C322.845 195.558 322.891 195.622 322.963 195.649C323.035 195.676 323.108 195.658 323.162 195.604L323.47 195.287C323.732 195.015 323.877 194.97 324.239 194.861C324.393 194.816 324.565 194.762 324.773 194.68C325.009 194.59 325.226 194.463 325.443 194.3C325.606 194.535 325.769 194.716 325.95 194.843C326.086 194.943 326.213 195.015 326.321 195.088C326.611 195.269 326.81 195.386 327.046 195.785L327.254 196.138C327.29 196.192 327.344 196.228 327.408 196.228C327.417 196.228 327.417 196.228 327.426 196.228C327.498 196.219 327.552 196.174 327.58 196.101L327.706 195.712C327.842 195.305 327.978 195.169 328.231 194.916C328.34 194.807 328.458 194.689 328.593 194.535C328.784 194.318 328.937 194.038 329.055 193.703C329.372 193.875 329.68 193.983 329.951 194.001C330.114 194.019 330.259 194.019 330.395 194.019C330.739 194.029 330.965 194.029 331.372 194.255L331.726 194.454C331.789 194.49 331.861 194.481 331.925 194.445C331.979 194.4 332.006 194.327 331.997 194.264L331.916 193.866C331.825 193.44 331.879 193.25 331.97 192.906C332.006 192.761 332.051 192.598 332.088 192.399C332.142 192.119 332.133 191.802 332.06 191.467C332.423 191.458 332.73 191.394 332.975 191.277C333.12 191.204 333.237 191.141 333.364 191.068C333.663 190.896 333.862 190.788 334.323 190.779L334.731 190.77C334.803 190.77 334.867 190.725 334.894 190.661C334.921 190.598 334.912 190.516 334.858 190.471L334.586 190.172C334.296 189.856 334.242 189.674 334.151 189.321C334.115 189.177 334.07 189.014 333.998 188.824C333.898 188.543 333.735 188.271 333.491 188.018C333.798 187.828 334.043 187.611 334.197 187.384C334.287 187.248 334.369 187.122 334.432 187.004C334.604 186.705 334.722 186.515 335.111 186.271L335.455 186.054C335.518 186.017 335.546 185.945 335.536 185.882C335.527 185.818 335.509 185.737 335.437 185.719ZM324.936 193.793C324.81 193.884 324.683 193.956 324.556 194.001C324.357 194.074 324.203 194.119 324.058 194.164C323.85 194.228 323.669 194.282 323.488 194.382C323.398 194.101 323.253 193.847 323.117 193.594C323.072 193.522 323.035 193.44 322.99 193.368C322.936 193.277 322.9 193.141 322.882 192.978C323.515 193.359 324.203 193.639 324.936 193.793ZM329.861 180.767C329.906 180.867 329.951 181.003 329.969 181.175C329.336 180.794 328.648 180.523 327.933 180.36C328.059 180.269 328.177 180.197 328.304 180.152C328.476 180.088 328.621 180.043 328.747 180.007C328.965 179.943 329.155 179.889 329.363 179.771C329.435 180.034 329.553 180.233 329.68 180.441C329.734 180.541 329.797 180.64 329.861 180.767ZM321.46 182.306C321.451 182.152 321.451 182.007 321.478 181.872C321.515 181.672 321.56 181.518 321.596 181.365C321.65 181.147 321.696 180.966 321.705 180.767C321.994 180.831 322.293 180.849 322.574 180.858C322.655 180.858 322.746 180.867 322.836 180.867C322.936 180.876 323.072 180.912 323.226 180.975C322.574 181.319 321.976 181.772 321.46 182.306ZM333.011 185.076C333.156 185.139 333.282 185.212 333.382 185.302C333.518 185.42 333.626 185.52 333.726 185.619C333.889 185.773 334.034 185.918 334.233 186.045C334.043 186.235 333.934 186.434 333.817 186.633C333.753 186.742 333.69 186.85 333.608 186.968C333.545 187.058 333.436 187.167 333.301 187.267C333.301 187.203 333.301 187.14 333.301 187.086C333.31 186.389 333.21 185.719 333.011 185.076ZM324.248 190.833L325.516 193.033C324.022 192.806 322.673 192.019 321.723 190.833H324.248ZM328.503 183.483L327.118 181.084C328.756 181.274 330.268 182.152 331.264 183.483H328.503ZM331.997 184.777C332.296 185.501 332.45 186.271 332.45 187.067C332.45 187.9 332.287 188.697 331.952 189.457L330.621 187.149L331.997 184.777ZM329.001 189.982L330.132 188.018L331.264 189.982H329.001ZM327.516 190.833L326.376 192.806L325.235 190.833H327.516ZM325.235 183.483L326.376 181.509L327.516 183.483H325.235ZM329.001 184.343H331.264L330.132 186.307L329.001 184.343ZM329.634 187.158L328.005 189.982H324.737L323.108 187.158L324.737 184.334H328.005L329.634 187.158ZM321.478 184.343H323.742L322.61 186.307L321.478 184.343ZM323.751 189.982H321.488L322.619 188.018L323.751 189.982ZM320.809 184.886L322.121 187.158L320.845 189.367C320.546 188.643 320.392 187.873 320.392 187.076C320.392 186.316 320.528 185.583 320.809 184.886ZM321.587 183.483C322.565 182.161 324.004 181.31 325.624 181.102L324.248 183.483H321.587ZM331.128 190.833C330.15 192.046 328.765 192.843 327.227 193.042L328.503 190.833H331.128ZM332.595 183.012C332.595 183.121 332.595 183.238 332.585 183.374C332.576 183.483 332.54 183.628 332.477 183.782C332.124 183.139 331.662 182.55 331.128 182.044C331.282 182.025 331.427 182.025 331.554 182.053C331.735 182.089 331.879 182.125 332.015 182.152C332.223 182.206 332.423 182.252 332.667 182.261C332.595 182.523 332.595 182.759 332.595 183.012ZM324.792 180.079C324.927 179.925 325.045 179.808 325.154 179.699C325.308 179.545 325.434 179.409 325.552 179.246C325.769 179.455 326.014 179.608 326.249 179.762L326.466 179.907C326.557 179.962 326.656 180.07 326.747 180.206C325.996 180.17 325.262 180.251 324.547 180.459C324.62 180.306 324.701 180.188 324.792 180.079ZM320.202 183.528C320.293 183.483 320.428 183.447 320.591 183.428C320.564 183.474 320.537 183.51 320.519 183.555C320.465 183.591 320.41 183.646 320.383 183.7C320.347 183.763 320.329 183.836 320.329 183.908C320.075 184.397 319.876 184.922 319.75 185.465C319.659 185.338 319.596 185.212 319.55 185.085C319.478 184.895 319.433 184.732 319.397 184.578C319.333 184.37 319.279 184.189 319.188 184.008C319.478 183.917 319.731 183.782 319.985 183.646C320.039 183.61 320.121 183.564 320.202 183.528ZM319.125 187.393C319.17 187.321 319.215 187.248 319.261 187.167C319.315 187.076 319.415 186.986 319.541 186.886C319.541 186.95 319.541 187.013 319.541 187.067C319.541 187.746 319.641 188.416 319.84 189.059C319.704 188.996 319.587 188.923 319.478 188.833C319.333 188.715 319.225 188.606 319.089 188.48C318.926 188.326 318.79 188.199 318.627 188.09C318.817 187.882 318.971 187.629 319.125 187.393ZM320.193 191.892C320.256 191.603 320.266 191.304 320.266 191.023L320.275 190.761C320.275 190.688 320.293 190.607 320.329 190.516C320.338 190.553 320.356 190.589 320.374 190.625C320.438 190.725 320.537 190.806 320.655 190.824C320.963 191.295 321.325 191.729 321.741 192.109C321.587 192.128 321.442 192.119 321.307 192.1C321.098 192.064 320.935 192.028 320.791 191.992C320.573 191.937 320.392 191.901 320.193 191.892ZM326.738 194.463C326.629 194.4 326.53 194.336 326.403 194.255C326.339 194.21 326.267 194.146 326.204 194.065C326.367 194.137 326.566 194.101 326.693 193.956C327.236 193.938 327.779 193.847 328.295 193.703C328.231 193.847 328.159 193.965 328.068 194.065C327.951 194.201 327.842 194.309 327.743 194.409C327.589 194.563 327.444 194.707 327.308 194.907C327.127 194.698 326.937 194.59 326.738 194.463ZM329.644 193.16C330.295 192.816 330.893 192.363 331.4 191.829C331.418 191.983 331.409 192.128 331.391 192.263C331.354 192.444 331.318 192.589 331.282 192.725C331.228 192.933 331.173 193.132 331.164 193.368C330.902 193.295 330.675 193.295 330.44 193.286C330.322 193.286 330.196 193.286 330.051 193.268C329.933 193.268 329.797 193.223 329.644 193.16ZM332.676 190.616C332.585 190.661 332.459 190.688 332.305 190.715C332.332 190.688 332.35 190.661 332.368 190.625C332.404 190.562 332.423 190.498 332.423 190.435C332.73 189.883 332.957 189.303 333.11 188.688C333.201 188.815 333.273 188.941 333.319 189.068C333.382 189.231 333.418 189.376 333.454 189.521C333.509 189.729 333.563 189.919 333.681 190.136C333.418 190.209 333.228 190.317 333.011 190.435C332.911 190.489 332.812 190.553 332.676 190.616Z" fill="white"/>
<path d="M339.997 153.561C339.997 146.062 333.918 139.983 326.419 139.983C318.92 139.983 312.841 146.062 312.841 153.561C312.841 161.06 318.92 167.139 326.419 167.139C333.918 167.139 339.997 161.06 339.997 153.561Z" fill="#4191C4"/>
<path d="M336.377 153.445L335.897 153.273C335.462 153.119 335.318 152.975 335.082 152.748C334.983 152.649 334.865 152.54 334.72 152.413C334.557 152.278 334.358 152.151 334.114 152.051C334.304 151.861 334.449 151.671 334.539 151.49C334.611 151.345 334.666 151.218 334.711 151.11C334.838 150.811 334.919 150.612 335.29 150.277L335.671 149.942C335.725 149.888 335.743 149.806 335.716 149.734C335.689 149.661 335.625 149.625 335.544 149.625L335.037 149.652C334.566 149.671 334.385 149.598 334.068 149.48C333.942 149.426 333.797 149.372 333.616 149.318C333.408 149.254 333.172 149.218 332.91 149.218C333.009 148.964 333.073 148.729 333.082 148.53C333.091 148.367 333.091 148.231 333.091 148.114C333.091 147.788 333.091 147.58 333.308 147.118L333.525 146.665C333.561 146.593 333.543 146.511 333.489 146.457C333.435 146.403 333.353 146.385 333.281 146.421L332.828 146.638C332.412 146.837 332.213 146.846 331.887 146.846C331.751 146.846 331.588 146.855 331.389 146.873C331.181 146.892 330.945 146.955 330.71 147.045C330.71 146.774 330.674 146.539 330.61 146.348C330.556 146.195 330.502 146.068 330.457 145.959C330.33 145.66 330.248 145.461 330.276 144.963L330.303 144.457C330.303 144.384 330.257 144.312 330.185 144.285C330.113 144.257 330.031 144.275 329.986 144.33L329.651 144.71C329.343 145.063 329.162 145.135 328.863 145.271C328.737 145.326 328.592 145.389 328.42 145.488C328.302 145.552 328.175 145.633 328.049 145.742C327.976 145.588 327.886 145.452 327.795 145.353L327.623 145.163C327.334 144.846 327.116 144.601 326.981 144.185L326.818 143.66C326.79 143.588 326.727 143.533 326.646 143.533C326.564 143.533 326.501 143.578 326.474 143.66L326.302 144.131C326.166 144.52 326.066 144.629 325.804 144.882C325.695 144.991 325.577 145.108 325.433 145.271C325.279 145.443 325.152 145.633 325.043 145.86C324.853 145.66 324.663 145.525 324.491 145.434C324.41 145.398 324.337 145.362 324.256 145.326C323.876 145.144 323.568 145 323.287 144.665L322.934 144.239C322.88 144.176 322.798 144.158 322.726 144.185C322.654 144.212 322.608 144.285 322.617 144.366L322.654 144.918C322.681 145.326 322.626 145.47 322.491 145.805C322.436 145.941 322.373 146.104 322.301 146.303C322.228 146.52 322.183 146.756 322.174 147.009C321.911 146.901 321.685 146.837 321.477 146.828C321.386 146.819 321.305 146.819 321.214 146.819C320.789 146.801 320.454 146.792 320.065 146.593L319.576 146.339C319.503 146.303 319.422 146.312 319.368 146.376C319.313 146.43 319.295 146.511 319.331 146.584L319.576 147.073C319.766 147.444 319.766 147.589 319.766 147.951C319.766 148.105 319.766 148.267 319.784 148.485C319.802 148.711 319.847 148.937 319.929 149.173C319.657 149.173 319.422 149.209 319.241 149.272C319.159 149.299 319.078 149.336 318.997 149.363C318.598 149.508 318.29 149.625 317.847 149.598L317.295 149.553C317.24 149.544 317.159 149.589 317.132 149.661C317.105 149.734 317.123 149.815 317.177 149.87L317.593 150.223C317.901 150.485 317.965 150.63 318.109 150.956C318.173 151.092 318.236 151.246 318.336 151.445C318.444 151.653 318.571 151.843 318.743 152.024C318.49 152.133 318.281 152.25 318.137 152.386L317.947 152.567C317.639 152.857 317.394 153.092 316.978 153.228L316.453 153.4C316.38 153.427 316.326 153.491 316.326 153.572C316.326 153.653 316.38 153.717 316.453 153.744L316.978 153.907C317.367 154.034 317.476 154.133 317.747 154.387C317.856 154.486 317.974 154.604 318.137 154.74C318.309 154.885 318.508 155.011 318.734 155.111C318.544 155.31 318.399 155.491 318.318 155.672L318.209 155.907C318.037 156.297 317.901 156.604 317.575 156.885L317.159 157.247C317.096 157.301 317.077 157.383 317.114 157.455C317.141 157.528 317.213 157.573 317.295 157.564L317.838 157.519C318.245 157.483 318.39 157.537 318.743 157.673C318.879 157.727 319.033 157.781 319.232 157.845C319.449 157.917 319.685 157.953 319.929 157.962C319.82 158.225 319.766 158.451 319.757 158.65C319.757 158.741 319.748 158.822 319.748 158.913C319.739 159.338 319.73 159.673 319.54 160.062L319.295 160.551C319.259 160.624 319.277 160.705 319.331 160.759C319.386 160.814 319.476 160.823 319.54 160.787L320.028 160.533C320.391 160.343 320.544 160.334 320.907 160.325C321.06 160.325 321.223 160.316 321.441 160.298C321.667 160.28 321.893 160.225 322.12 160.135C322.12 160.406 322.165 160.642 322.228 160.823L322.328 161.067C322.482 161.465 322.608 161.773 322.581 162.208L322.545 162.76C322.536 162.841 322.581 162.914 322.663 162.941C322.735 162.968 322.817 162.95 322.871 162.887L323.224 162.461C323.486 162.144 323.622 162.081 323.957 161.927C324.093 161.864 324.247 161.791 324.437 161.692C324.573 161.619 324.699 161.538 324.826 161.429C324.899 161.583 324.98 161.719 325.071 161.828C325.17 161.954 325.27 162.054 325.351 162.144C325.577 162.38 325.722 162.534 325.876 163.013L326.03 163.493C326.057 163.566 326.121 163.62 326.193 163.62C326.193 163.62 326.193 163.62 326.202 163.62C326.274 163.62 326.347 163.575 326.374 163.502L326.555 163.031C326.718 162.597 326.863 162.461 327.107 162.217C327.207 162.117 327.315 162.009 327.442 161.873C327.587 161.71 327.714 161.511 327.822 161.275C328.012 161.475 328.203 161.619 328.384 161.71C328.528 161.782 328.655 161.837 328.764 161.891C329.063 162.018 329.253 162.108 329.578 162.488L329.904 162.869C329.959 162.923 330.04 162.95 330.104 162.923C330.167 162.896 330.221 162.823 330.221 162.751L330.203 162.244C330.185 161.773 330.266 161.592 330.393 161.293C330.447 161.167 330.511 161.022 330.574 160.832C330.647 160.624 330.683 160.388 330.692 160.117C330.945 160.225 331.181 160.289 331.38 160.307C331.543 160.325 331.679 160.325 331.796 160.325C332.122 160.334 332.33 160.334 332.783 160.56L333.236 160.787C333.308 160.823 333.389 160.805 333.444 160.759C333.498 160.705 333.516 160.624 333.48 160.551L333.272 160.09C333.082 159.664 333.082 159.474 333.073 159.139C333.073 158.994 333.073 158.84 333.055 158.641C333.036 158.433 332.982 158.198 332.892 157.953C332.901 157.953 332.901 157.953 332.91 157.953C333.172 157.953 333.408 157.926 333.598 157.863C333.752 157.817 333.878 157.763 333.996 157.718C334.295 157.6 334.494 157.519 335.001 157.555L335.508 157.591C335.607 157.591 335.652 157.555 335.689 157.483C335.716 157.41 335.698 157.329 335.643 157.274L335.272 156.93C334.928 156.614 334.856 156.432 334.711 156.107C334.657 155.98 334.602 155.844 334.521 155.681C334.421 155.491 334.286 155.292 334.105 155.102C334.358 154.993 334.566 154.876 334.72 154.74C334.838 154.631 334.937 154.541 335.028 154.45L334.901 154.323L335.028 154.45C335.263 154.224 335.408 154.07 335.888 153.907L336.368 153.744C336.44 153.717 336.485 153.653 336.485 153.572C336.494 153.536 336.449 153.472 336.377 153.445ZM322.925 160.596C322.889 160.497 322.871 160.343 322.862 160.153C323.378 160.434 323.921 160.651 324.491 160.805C324.364 160.922 324.238 161.013 324.111 161.085C323.939 161.176 323.803 161.239 323.667 161.303C323.523 161.366 323.387 161.429 323.251 161.511C323.188 161.266 323.097 161.04 323.007 160.805L322.925 160.596ZM325.976 145.751C326.112 145.597 326.22 145.488 326.32 145.389C326.437 145.271 326.537 145.163 326.637 145.045C326.781 145.253 326.935 145.425 327.098 145.606C327.153 145.67 327.207 145.724 327.261 145.787C327.306 145.841 327.388 145.95 327.478 146.176C327.134 146.131 326.781 146.104 326.437 146.104C326.202 146.104 325.967 146.113 325.722 146.14C325.795 145.986 325.876 145.86 325.976 145.751ZM329.941 146.557C329.977 146.665 329.995 146.819 330.004 147.009C329.488 146.729 328.954 146.511 328.384 146.357C328.51 146.24 328.637 146.14 328.755 146.077C328.9 146.004 329.026 145.941 329.162 145.887C329.316 145.814 329.461 145.751 329.624 145.651C329.669 145.86 329.741 146.032 329.814 146.204C329.85 146.321 329.895 146.43 329.941 146.557ZM321.251 149.544C322.5 147.951 324.41 147.009 326.437 147.009C328.465 147.009 330.375 147.951 331.624 149.544H321.251ZM331.715 150.44L330.294 152.893C330.14 151.915 329.615 151.037 328.827 150.44H331.715ZM329.443 153.491C329.443 155.102 328.13 156.414 326.519 156.414C324.908 156.414 323.595 155.102 323.595 153.491C323.595 151.879 324.908 150.567 326.519 150.567C328.13 150.567 329.443 151.879 329.443 153.491ZM324.211 150.44C323.387 151.065 322.853 151.988 322.726 153.011L321.241 150.44H324.211ZM327.895 157.048L326.474 159.519L325.025 157.003C325.93 157.392 326.981 157.41 327.895 157.048ZM325.786 160.126C322.427 159.8 319.847 156.985 319.847 153.581C319.847 152.631 320.047 151.716 320.436 150.865L325.786 160.126ZM332.457 150.956C332.819 151.789 333.009 152.676 333.009 153.59C333.009 156.948 330.466 159.755 327.171 160.126L332.457 150.956ZM334.059 150.82C334.014 150.929 333.969 151.037 333.905 151.155C333.851 151.255 333.752 151.381 333.616 151.517C333.453 150.956 333.226 150.413 332.937 149.906C333.118 149.906 333.272 149.933 333.398 149.978C333.561 150.033 333.688 150.078 333.815 150.132C333.969 150.196 334.123 150.25 334.304 150.295C334.195 150.485 334.132 150.648 334.059 150.82ZM332.43 147.507C332.394 147.724 332.394 147.914 332.394 148.114C332.394 148.222 332.394 148.331 332.385 148.458C332.376 148.575 332.33 148.729 332.267 148.901C331.905 148.449 331.488 148.041 331.018 147.679C331.181 147.616 331.335 147.58 331.47 147.561C331.642 147.543 331.778 147.543 331.923 147.543C332.086 147.543 332.249 147.543 332.43 147.507ZM320.617 148.892C320.563 148.729 320.526 148.575 320.517 148.439C320.508 148.24 320.499 148.086 320.499 147.942C320.499 147.77 320.499 147.625 320.472 147.471C320.716 147.516 320.961 147.525 321.187 147.534L321.441 147.543C321.54 147.552 321.694 147.589 321.866 147.661C321.404 148.023 320.979 148.439 320.617 148.892ZM319.929 149.897C319.639 150.404 319.413 150.947 319.25 151.508C319.141 151.381 319.051 151.255 318.987 151.128C318.897 150.947 318.834 150.802 318.779 150.675C318.716 150.53 318.653 150.395 318.58 150.259C318.825 150.205 319.051 150.123 319.268 150.042C319.341 150.015 319.422 149.987 319.503 149.96C319.594 149.915 319.739 149.897 319.929 149.897ZM318.625 152.92C318.698 152.848 318.834 152.775 319.006 152.703C318.969 152.993 318.951 153.291 318.951 153.581C318.951 153.871 318.969 154.16 319.006 154.45C318.852 154.378 318.716 154.296 318.616 154.206C318.472 154.088 318.363 153.979 318.245 153.871C318.128 153.762 318.019 153.653 317.892 153.563C318.1 153.418 318.272 153.255 318.444 153.092L318.625 152.92ZM318.888 156.179L318.978 155.989C319.024 155.898 319.114 155.772 319.241 155.645C319.404 156.206 319.63 156.749 319.92 157.256C319.748 157.247 319.594 157.22 319.458 157.184C319.268 157.12 319.123 157.066 318.987 157.012C318.834 156.958 318.698 156.903 318.544 156.867C318.68 156.641 318.779 156.423 318.888 156.179ZM320.436 159.664C320.472 159.42 320.481 159.175 320.481 158.94C320.481 158.858 320.481 158.777 320.49 158.696C320.49 158.587 320.535 158.442 320.608 158.261C320.979 158.714 321.395 159.13 321.857 159.492C321.694 159.555 321.54 159.592 321.395 159.601C321.196 159.619 321.042 159.619 320.897 159.628C320.735 159.637 320.59 159.637 320.436 159.664ZM327.162 161.022C327.089 161.185 326.999 161.312 326.908 161.411C326.799 161.529 326.7 161.628 326.6 161.728C326.483 161.846 326.365 161.963 326.256 162.108C326.139 161.927 326.012 161.8 325.885 161.665C325.804 161.583 325.722 161.493 325.641 161.393C325.568 161.303 325.487 161.167 325.424 160.986C326.003 161.076 326.573 161.085 327.162 161.022ZM332.258 158.27C332.321 158.442 332.357 158.596 332.367 158.732C332.376 158.904 332.376 159.049 332.376 159.175C332.376 159.347 332.376 159.51 332.403 159.691C332.195 159.646 332.014 159.646 331.823 159.646C331.706 159.646 331.597 159.646 331.452 159.628C331.335 159.619 331.181 159.574 331 159.501C331.47 159.13 331.887 158.723 332.258 158.27ZM334.077 156.442C334.141 156.595 334.204 156.749 334.304 156.903C334.096 156.948 333.924 157.012 333.733 157.093C333.634 157.129 333.525 157.175 333.408 157.211C333.299 157.247 333.145 157.265 332.955 157.265C332.955 157.265 332.946 157.265 332.937 157.265C333.226 156.758 333.453 156.215 333.616 155.654C333.742 155.79 333.833 155.917 333.896 156.034C333.969 156.188 334.023 156.315 334.077 156.442ZM333.86 154.459C333.896 154.169 333.914 153.871 333.914 153.581C333.914 153.291 333.896 153.002 333.86 152.712C334.023 152.784 334.159 152.866 334.258 152.956C334.385 153.065 334.485 153.165 334.584 153.255C334.702 153.373 334.82 153.491 334.974 153.599C334.793 153.717 334.666 153.844 334.53 153.979C334.449 154.061 334.367 154.142 334.258 154.233C334.168 154.314 334.032 154.387 333.86 154.459ZM323.161 146.077C323.224 145.923 323.278 145.787 323.314 145.633C323.532 145.769 323.749 145.878 323.984 145.986L324.174 146.077C324.265 146.122 324.383 146.222 324.518 146.348C323.957 146.493 323.405 146.71 322.898 146.991C322.907 146.819 322.934 146.665 322.979 146.539C323.043 146.357 323.106 146.213 323.161 146.077ZM329.741 161.04C329.678 161.194 329.615 161.348 329.569 161.529C329.388 161.411 329.225 161.33 329.035 161.248C328.936 161.203 328.836 161.158 328.719 161.094C328.619 161.04 328.492 160.94 328.356 160.805C328.918 160.651 329.461 160.434 329.977 160.162C329.968 160.343 329.941 160.497 329.895 160.624C329.85 160.787 329.796 160.913 329.741 161.04Z" fill="white"/>
<path d="M326.419 133.647C333.919 133.647 339.998 127.567 339.998 120.068C339.998 112.569 333.919 106.49 326.419 106.49C318.92 106.49 312.841 112.569 312.841 120.068C312.841 127.567 318.92 133.647 326.419 133.647Z" fill="#404C9A"/>
<path d="M336.115 119.933L335.97 119.779C335.454 119.226 335.001 117.751 334.802 116.954C334.395 115.397 333.046 114.302 331.525 114.302H329.235C327.461 113.424 325.352 113.433 323.578 114.302H321.297C319.776 114.302 318.427 115.397 318.011 116.991C318.011 117.009 317.649 118.946 316.852 119.815L316.707 119.969C316.626 120.059 316.626 120.186 316.707 120.277L316.852 120.43C317.658 121.299 317.993 123.092 318.011 123.209C318.427 124.766 319.767 125.853 321.278 125.853H323.56C324.438 126.287 325.424 126.513 326.393 126.513C327.361 126.513 328.348 126.287 329.226 125.853H331.507C333.019 125.853 334.368 124.766 334.784 123.191C334.965 122.422 335.418 120.964 335.943 120.403L336.088 120.249C336.196 120.15 336.196 120.014 336.115 119.933ZM330.774 117.552L326.42 125.101L322.066 117.552H330.774ZM321.306 115.207H322.211C322.093 115.307 321.975 115.416 321.867 115.524C320.654 116.737 319.984 118.357 319.984 120.077C319.984 121.797 320.654 123.409 321.867 124.631C321.975 124.739 322.084 124.839 322.202 124.938H321.297C320.201 124.938 319.215 124.133 318.916 123.001C318.88 122.811 318.572 121.2 317.793 120.123C318.572 119.045 318.889 117.362 318.925 117.181C319.224 116.013 320.201 115.207 321.306 115.207ZM322.51 123.979C321.469 122.938 320.889 121.544 320.889 120.077C320.889 119.371 321.025 118.674 321.287 118.023L325.623 125.536C324.447 125.364 323.351 124.821 322.51 123.979ZM322.084 116.647C322.22 116.484 322.356 116.321 322.51 116.167C323.551 115.126 324.945 114.547 326.411 114.547C327.886 114.547 329.271 115.117 330.312 116.167C330.466 116.321 330.611 116.475 330.738 116.647H322.084ZM331.544 118.023C331.806 118.674 331.942 119.362 331.942 120.077C331.942 121.553 331.372 122.938 330.321 123.979C329.48 124.821 328.384 125.364 327.199 125.536L331.544 118.023ZM333.924 122.974C333.616 124.124 332.639 124.938 331.534 124.938H330.629C330.747 124.839 330.856 124.739 330.964 124.631C332.177 123.418 332.847 121.797 332.847 120.077C332.847 118.357 332.177 116.746 330.964 115.524C330.856 115.416 330.738 115.307 330.62 115.207H331.525C332.63 115.207 333.616 116.013 333.915 117.172C333.96 117.371 334.377 119.1 335.047 120.086C334.413 121.028 334.006 122.639 333.924 122.974Z" fill="white"/>
</svg>
