module gitlab.com/jenifael.gingras/go-beat-saber

go 1.18

require github.com/codeclysm/extract/v3 v3.0.2

require (
	github.com/h2non/filetype v1.0.6 // indirect
	github.com/juju/errors v0.0.0-20181118221551-089d3ea4e4d5 // indirect
)
