run_time,iteration,loss,style_loss,content_loss,time
0.1228,0,4.4370e+08,4.4370e+08,0.0000e+00,0.1228
0.2557,1,3.3532e+08,3.3499e+08,3.3026e+05,0.1243
0.3885,2,2.2765e+08,2.2706e+08,5.9239e+05,0.1230
0.5197,3,1.5906e+08,1.5828e+08,7.8138e+05,0.1237
0.6491,4,1.2743e+08,1.2651e+08,9.1332e+05,0.1223
0.7785,5,1.1321e+08,1.1220e+08,1.0139e+06,0.1221
0.9100,6,1.0069e+08,9.9580e+07,1.1048e+06,0.1244
1.0383,7,8.9248e+07,8.8057e+07,1.1914e+06,0.1213
1.1706,8,8.1534e+07,8.0276e+07,1.2571e+06,0.1251
1.3012,9,7.5737e+07,7.4439e+07,1.2980e+06,0.1225
1.4339,10,6.9637e+07,6.8315e+07,1.3223e+06,0.1247
1.5637,11,6.3317e+07,6.1979e+07,1.3380e+06,0.1228
1.6946,12,5.7862e+07,5.6512e+07,1.3504e+06,0.1236
1.8254,13,5.3642e+07,5.2280e+07,1.3618e+06,0.1238
1.9537,14,5.0101e+07,4.8728e+07,1.3732e+06,0.1213
2.0854,15,4.6688e+07,4.5302e+07,1.3862e+06,0.1247
2.2149,16,4.3394e+07,4.1995e+07,1.3993e+06,0.1222
2.3470,17,4.0557e+07,3.9145e+07,1.4122e+06,0.1251
2.4755,18,3.8362e+07,3.6939e+07,1.4230e+06,0.1217
2.6072,19,3.6750e+07,3.5318e+07,1.4314e+06,0.1249
2.7372,20,3.5491e+07,3.4054e+07,1.4367e+06,0.1230
2.8657,21,3.4353e+07,3.2915e+07,1.4379e+06,0.1217
2.9973,22,3.3256e+07,3.1819e+07,1.4370e+06,0.1247
3.1259,23,3.2212e+07,3.0776e+07,1.4357e+06,0.1218
3.2584,24,3.1280e+07,2.9846e+07,1.4333e+06,0.1250
3.3872,25,3.0469e+07,2.9039e+07,1.4300e+06,0.1217
3.5175,26,2.9741e+07,2.8313e+07,1.4277e+06,0.1234
3.6480,27,2.9036e+07,2.7610e+07,1.4262e+06,0.1238
3.7779,28,2.8317e+07,2.6891e+07,1.4262e+06,0.1228
3.9096,29,2.7591e+07,2.6163e+07,1.4279e+06,0.1247
4.0382,30,2.6901e+07,2.5470e+07,1.4312e+06,0.1216
4.1726,31,2.6292e+07,2.4855e+07,1.4366e+06,0.1271
4.3023,32,2.5781e+07,2.4338e+07,1.4431e+06,0.1223
4.4345,33,2.5362e+07,2.3912e+07,1.4500e+06,0.1248
4.5632,34,2.5003e+07,2.3546e+07,1.4570e+06,0.1213
4.6940,35,2.4674e+07,2.3210e+07,1.4638e+06,0.1237
4.8247,36,2.4347e+07,2.2877e+07,1.4696e+06,0.1238
4.9535,37,2.4006e+07,2.2532e+07,1.4739e+06,0.1218
5.0876,38,2.3659e+07,2.2182e+07,1.4764e+06,0.1271
5.2189,39,2.3312e+07,2.1835e+07,1.4770e+06,0.1239
5.3506,40,2.2978e+07,2.1502e+07,1.4758e+06,0.1242
5.4789,41,2.2651e+07,2.1178e+07,1.4728e+06,0.1214
5.6106,42,2.2332e+07,2.0864e+07,1.4687e+06,0.1245
5.7393,43,2.2016e+07,2.0552e+07,1.4635e+06,0.1219
5.8714,44,2.1696e+07,2.0239e+07,1.4575e+06,0.1246
6.0015,45,2.1373e+07,1.9922e+07,1.4514e+06,0.1230
6.1329,46,2.1057e+07,1.9611e+07,1.4453e+06,0.1242
6.2649,47,2.0751e+07,1.9311e+07,1.4400e+06,0.1245
6.3975,48,2.0468e+07,1.9033e+07,1.4351e+06,0.1255
6.5276,49,2.0214e+07,1.8783e+07,1.4313e+06,0.1229
6.6568,50,1.9984e+07,1.8556e+07,1.4284e+06,0.1222
6.7896,51,1.9769e+07,1.8343e+07,1.4264e+06,0.1259
6.9214,52,1.9555e+07,1.8131e+07,1.4247e+06,0.1244
7.0523,53,1.9337e+07,1.7914e+07,1.4232e+06,0.1238
7.1814,54,1.9113e+07,1.7691e+07,1.4221e+06,0.1218
7.3132,55,1.8890e+07,1.7469e+07,1.4208e+06,0.1245
7.4423,56,1.8673e+07,1.7254e+07,1.4191e+06,0.1218
7.5747,57,1.8467e+07,1.7050e+07,1.4170e+06,0.1253
7.7051,58,1.8268e+07,1.6854e+07,1.4140e+06,0.1233
7.8440,59,1.8074e+07,1.6663e+07,1.4104e+06,0.1216
7.9745,60,1.7876e+07,1.6470e+07,1.4060e+06,0.1229
8.1059,61,1.7671e+07,1.6271e+07,1.4009e+06,0.1239
8.2371,62,1.7464e+07,1.6069e+07,1.3952e+06,0.1238
8.3698,63,1.7261e+07,1.5872e+07,1.3894e+06,0.1247
8.4996,64,1.7071e+07,1.5688e+07,1.3838e+06,0.1225
8.6319,65,1.6901e+07,1.5523e+07,1.3785e+06,0.1246
8.7610,66,1.6745e+07,1.5371e+07,1.3737e+06,0.1222
8.8929,67,1.6598e+07,1.5228e+07,1.3695e+06,0.1249
9.0210,68,1.6448e+07,1.5082e+07,1.3658e+06,0.1211
9.1542,69,1.6286e+07,1.4923e+07,1.3630e+06,0.1259
9.2849,70,1.6109e+07,1.4748e+07,1.3609e+06,0.1223
9.4177,71,1.5923e+07,1.4564e+07,1.3591e+06,0.1253
9.5481,72,1.5733e+07,1.4376e+07,1.3574e+06,0.1231
9.6796,73,1.5551e+07,1.4195e+07,1.3556e+06,0.1243
9.8113,74,1.5379e+07,1.4026e+07,1.3534e+06,0.1245
9.9413,75,1.5217e+07,1.3866e+07,1.3511e+06,0.1230
10.0730,76,1.5060e+07,1.3712e+07,1.3482e+06,0.1245
10.2035,77,1.4900e+07,1.3555e+07,1.3448e+06,0.1233
10.3353,78,1.4732e+07,1.3391e+07,1.3409e+06,0.1241
10.4635,79,1.4559e+07,1.3223e+07,1.3367e+06,0.1213
10.5960,80,1.4385e+07,1.3053e+07,1.3321e+06,0.1254
10.7241,81,1.4216e+07,1.2889e+07,1.3275e+06,0.1213
10.8544,82,1.4056e+07,1.2733e+07,1.3230e+06,0.1238
10.9868,83,1.3906e+07,1.2587e+07,1.3189e+06,0.1253
11.1161,84,1.3764e+07,1.2448e+07,1.3153e+06,0.1224
11.2479,85,1.3623e+07,1.2311e+07,1.3122e+06,0.1248
11.3776,86,1.3481e+07,1.2171e+07,1.3096e+06,0.1223
11.5113,87,1.3334e+07,1.2026e+07,1.3075e+06,0.1263
11.6423,88,1.3184e+07,1.1878e+07,1.3060e+06,0.1237
11.7792,89,1.3035e+07,1.1730e+07,1.3049e+06,0.1211
11.9096,90,1.2888e+07,1.1584e+07,1.3041e+06,0.1234
12.0418,91,1.2747e+07,1.1443e+07,1.3035e+06,0.1252
12.1728,92,1.2609e+07,1.1306e+07,1.3029e+06,0.1242
12.3032,93,1.2473e+07,1.1171e+07,1.3021e+06,0.1234
12.4325,94,1.2338e+07,1.1037e+07,1.3010e+06,0.1220
12.5639,95,1.2201e+07,1.0901e+07,1.2997e+06,0.1242
12.6930,96,1.2065e+07,1.0767e+07,1.2981e+06,0.1220
12.8255,97,1.1931e+07,1.0634e+07,1.2962e+06,0.1252
12.9547,98,1.1799e+07,1.0505e+07,1.2940e+06,0.1221
13.0849,99,1.1672e+07,1.0381e+07,1.2916e+06,0.1232
13.2160,100,1.1550e+07,1.0261e+07,1.2891e+06,0.1242
13.3473,101,1.1429e+07,1.0143e+07,1.2866e+06,0.1232
13.4787,102,1.1310e+07,1.0026e+07,1.2841e+06,0.1241
13.6079,103,1.1192e+07,9.9104e+06,1.2817e+06,0.1218
13.7393,104,1.1074e+07,9.7949e+06,1.2795e+06,0.1242
13.8696,105,1.0957e+07,9.6798e+06,1.2773e+06,0.1236
14.0029,106,1.0841e+07,9.5652e+06,1.2754e+06,0.1259
14.1326,107,1.0724e+07,9.4505e+06,1.2737e+06,0.1226
14.2650,108,1.0607e+07,9.3352e+06,1.2720e+06,0.1253
14.3976,109,1.0488e+07,9.2179e+06,1.2706e+06,0.1250
14.5323,110,1.0368e+07,9.0992e+06,1.2692e+06,0.1267
14.6611,111,1.0247e+07,8.9792e+06,1.2678e+06,0.1215
14.7931,112,1.0126e+07,8.8595e+06,1.2666e+06,0.1243
14.9216,113,1.0008e+07,8.7422e+06,1.2655e+06,0.1215
15.0521,114,9.8932e+06,8.6287e+06,1.2645e+06,0.1236
15.1826,115,9.7826e+06,8.5192e+06,1.2634e+06,0.1235
15.3160,116,9.6757e+06,8.4133e+06,1.2624e+06,0.1263
15.4462,117,9.5717e+06,8.3104e+06,1.2613e+06,0.1227
15.5803,118,9.4695e+06,8.2092e+06,1.2602e+06,0.1270
15.7107,119,9.3682e+06,8.1092e+06,1.2591e+06,0.1235
15.8430,120,9.2678e+06,8.0100e+06,1.2577e+06,0.1241
15.9731,121,9.1690e+06,7.9128e+06,1.2562e+06,0.1232
16.1021,122,9.0722e+06,7.8177e+06,1.2545e+06,0.1222
16.2343,123,8.9776e+06,7.7251e+06,1.2525e+06,0.1249
16.3715,124,8.8851e+06,7.6347e+06,1.2504e+06,0.1245
16.5019,125,8.7933e+06,7.5452e+06,1.2481e+06,0.1233
16.6347,126,8.7018e+06,7.4561e+06,1.2458e+06,0.1250
16.7654,127,8.6105e+06,7.3672e+06,1.2433e+06,0.1237
16.8953,128,8.5193e+06,7.2785e+06,1.2409e+06,0.1232
17.0261,129,8.4283e+06,7.1899e+06,1.2384e+06,0.1236
17.1550,130,8.3379e+06,7.1019e+06,1.2360e+06,0.1219
17.2865,131,8.2481e+06,7.0144e+06,1.2337e+06,0.1247
17.4157,132,8.1587e+06,6.9271e+06,1.2316e+06,0.1216
17.5486,133,8.0692e+06,6.8396e+06,1.2296e+06,0.1258
17.6775,134,7.9799e+06,6.7520e+06,1.2278e+06,0.1218
17.8117,135,7.8912e+06,6.6650e+06,1.2263e+06,0.1275
17.9419,136,7.8042e+06,6.5794e+06,1.2249e+06,0.1230
18.0750,137,7.7199e+06,6.4963e+06,1.2236e+06,0.1259
18.2057,138,7.6386e+06,6.4161e+06,1.2225e+06,0.1213
18.3369,139,7.5603e+06,6.3390e+06,1.2213e+06,0.1244
18.4670,140,7.4842e+06,6.2641e+06,1.2201e+06,0.1231
18.5972,141,7.4091e+06,6.1905e+06,1.2187e+06,0.1232
18.7287,142,7.3345e+06,6.1176e+06,1.2169e+06,0.1246
18.8583,143,7.2603e+06,6.0454e+06,1.2149e+06,0.1228
18.9910,144,7.1871e+06,5.9744e+06,1.2127e+06,0.1254
19.1199,145,7.1151e+06,5.9049e+06,1.2102e+06,0.1223
19.2519,146,7.0445e+06,5.8370e+06,1.2075e+06,0.1249
19.3812,147,6.9751e+06,5.7703e+06,1.2048e+06,0.1222
19.5132,148,6.9062e+06,5.7040e+06,1.2022e+06,0.1248
19.6478,149,6.8376e+06,5.6380e+06,1.1996e+06,0.1276
19.7797,150,6.7698e+06,5.5725e+06,1.1972e+06,0.1246
19.9075,151,6.7031e+06,5.5081e+06,1.1950e+06,0.1208
20.0395,152,6.6378e+06,5.4449e+06,1.1929e+06,0.1249
20.1709,153,6.5743e+06,5.3832e+06,1.1911e+06,0.1246
20.3043,154,6.5128e+06,5.3233e+06,1.1894e+06,0.1255
20.4338,155,6.4528e+06,5.2648e+06,1.1879e+06,0.1223
20.5646,156,6.3939e+06,5.2074e+06,1.1866e+06,0.1237
20.6945,157,6.3357e+06,5.1504e+06,1.1853e+06,0.1230
20.8235,158,6.2781e+06,5.0941e+06,1.1841e+06,0.1220
20.9553,159,6.2216e+06,5.0390e+06,1.1826e+06,0.1247
21.0832,160,6.1664e+06,4.9853e+06,1.1810e+06,0.1209
21.2140,161,6.1117e+06,4.9325e+06,1.1792e+06,0.1236
21.3441,162,6.0572e+06,4.8801e+06,1.1771e+06,0.1231
21.4734,163,6.0022e+06,4.8273e+06,1.1748e+06,0.1218
21.6046,164,5.9465e+06,4.7740e+06,1.1724e+06,0.1240
21.7335,165,5.8904e+06,4.7205e+06,1.1699e+06,0.1219
21.8649,166,5.8352e+06,4.6680e+06,1.1672e+06,0.1246
21.9951,167,5.7821e+06,4.6174e+06,1.1646e+06,0.1232
22.1263,168,5.7312e+06,4.5691e+06,1.1621e+06,0.1241
22.2578,169,5.6827e+06,4.5229e+06,1.1597e+06,0.1243
22.3893,170,5.6353e+06,4.4779e+06,1.1574e+06,0.1246
22.5197,171,5.5883e+06,4.4330e+06,1.1553e+06,0.1230
22.6500,172,5.5413e+06,4.3879e+06,1.1534e+06,0.1233
22.7833,173,5.4944e+06,4.3428e+06,1.1516e+06,0.1261
22.9150,174,5.4482e+06,4.2983e+06,1.1499e+06,0.1244
23.0461,175,5.4036e+06,4.2552e+06,1.1484e+06,0.1238
23.1765,176,5.3605e+06,4.2136e+06,1.1469e+06,0.1233
23.3082,177,5.3183e+06,4.1729e+06,1.1454e+06,0.1244
23.4371,178,5.2760e+06,4.1322e+06,1.1438e+06,0.1217
23.5695,179,5.2327e+06,4.0906e+06,1.1420e+06,0.1251
23.6986,180,5.1880e+06,4.0479e+06,1.1401e+06,0.1221
23.8299,181,5.1426e+06,4.0045e+06,1.1381e+06,0.1244
23.9602,182,5.0976e+06,3.9615e+06,1.1361e+06,0.1233
24.0920,183,5.0540e+06,3.9200e+06,1.1339e+06,0.1250
24.2233,184,5.0121e+06,3.8804e+06,1.1317e+06,0.1243
24.3524,185,4.9719e+06,3.8425e+06,1.1294e+06,0.1221
24.4847,186,4.9328e+06,3.8056e+06,1.1272e+06,0.1249
24.6140,187,4.8944e+06,3.7695e+06,1.1250e+06,0.1222
24.7457,188,4.8565e+06,3.7337e+06,1.1228e+06,0.1245
24.8742,189,4.8191e+06,3.6983e+06,1.1208e+06,0.1214
25.0063,190,4.7827e+06,3.6637e+06,1.1189e+06,0.1245
25.1371,191,4.7474e+06,3.6301e+06,1.1172e+06,0.1236
25.2676,192,4.7131e+06,3.5974e+06,1.1157e+06,0.1234
25.3993,193,4.6793e+06,3.5650e+06,1.1143e+06,0.1247
25.5289,194,4.6456e+06,3.5327e+06,1.1129e+06,0.1223
25.6613,195,4.6114e+06,3.4999e+06,1.1116e+06,0.1253
25.7902,196,4.5767e+06,3.4666e+06,1.1102e+06,0.1217
25.9216,197,4.5417e+06,3.4331e+06,1.1087e+06,0.1243
26.0494,198,4.5069e+06,3.3998e+06,1.1071e+06,0.1208
26.1795,199,4.4726e+06,3.3672e+06,1.1054e+06,0.1232
26.3110,200,4.4390e+06,3.3354e+06,1.1035e+06,0.1246
26.4428,201,4.4061e+06,3.3045e+06,1.1016e+06,0.1238
26.5737,202,4.3737e+06,3.2742e+06,1.0995e+06,0.1237
26.7025,203,4.3419e+06,3.2445e+06,1.0974e+06,0.1219
26.8348,204,4.3104e+06,3.2152e+06,1.0953e+06,0.1253
26.9634,205,4.2794e+06,3.1863e+06,1.0931e+06,0.1214
27.0951,206,4.2487e+06,3.1576e+06,1.0911e+06,0.1247
27.2244,207,4.2184e+06,3.1294e+06,1.0890e+06,0.1224
27.3575,208,4.1887e+06,3.1016e+06,1.0871e+06,0.1264
27.4876,209,4.1597e+06,3.0745e+06,1.0852e+06,0.1231
27.6194,210,4.1315e+06,3.0481e+06,1.0833e+06,0.1244
27.7511,211,4.1040e+06,3.0225e+06,1.0815e+06,0.1249
27.8865,212,4.0772e+06,2.9974e+06,1.0798e+06,0.1242
28.0145,213,4.0503e+06,2.9722e+06,1.0781e+06,0.1212
28.1470,214,4.0231e+06,2.9467e+06,1.0764e+06,0.1254
28.2765,215,3.9955e+06,2.9208e+06,1.0748e+06,0.1225
28.4071,216,3.9678e+06,2.8947e+06,1.0731e+06,0.1237
28.5382,217,3.9406e+06,2.8691e+06,1.0715e+06,0.1239
28.6675,218,3.9144e+06,2.8445e+06,1.0699e+06,0.1223
28.7990,219,3.8893e+06,2.8210e+06,1.0683e+06,0.1245
28.9293,220,3.8651e+06,2.7984e+06,1.0667e+06,0.1233
29.0614,221,3.8412e+06,2.7761e+06,1.0652e+06,0.1249
29.1899,222,3.8171e+06,2.7535e+06,1.0636e+06,0.1215
29.3205,223,3.7925e+06,2.7304e+06,1.0621e+06,0.1241
29.4510,224,3.7678e+06,2.7072e+06,1.0605e+06,0.1232
29.5803,225,3.7436e+06,2.6847e+06,1.0589e+06,0.1219
29.7114,226,3.7204e+06,2.6632e+06,1.0572e+06,0.1243
29.8406,227,3.6983e+06,2.6429e+06,1.0554e+06,0.1222
29.9725,228,3.6768e+06,2.6232e+06,1.0536e+06,0.1249
30.1016,229,3.6550e+06,2.6032e+06,1.0517e+06,0.1221
30.2336,230,3.6324e+06,2.5827e+06,1.0498e+06,0.1245
30.3628,231,3.6092e+06,2.5614e+06,1.0478e+06,0.1223
30.4923,232,3.5858e+06,2.5400e+06,1.0458e+06,0.1227
30.6241,233,3.5629e+06,2.5191e+06,1.0438e+06,0.1246
30.7529,234,3.5412e+06,2.4993e+06,1.0419e+06,0.1220
30.8866,235,3.5206e+06,2.4807e+06,1.0400e+06,0.1265
31.0153,236,3.5007e+06,2.4626e+06,1.0381e+06,0.1218
31.1473,237,3.4809e+06,2.4446e+06,1.0363e+06,0.1249
31.2765,238,3.4608e+06,2.4262e+06,1.0346e+06,0.1222
31.4086,239,3.4405e+06,2.4076e+06,1.0329e+06,0.1245
31.5393,240,3.4203e+06,2.3891e+06,1.0312e+06,0.1237
31.6701,241,3.4006e+06,2.3710e+06,1.0295e+06,0.1236
31.8012,242,3.3816e+06,2.3538e+06,1.0279e+06,0.1243
31.9295,243,3.3633e+06,2.3371e+06,1.0262e+06,0.1214
32.0614,244,3.3451e+06,2.3206e+06,1.0245e+06,0.1250
32.1910,245,3.3268e+06,2.3041e+06,1.0227e+06,0.1226
32.3245,246,3.3081e+06,2.2873e+06,1.0208e+06,0.1263
32.4547,247,3.2892e+06,2.2703e+06,1.0190e+06,0.1231
32.5890,248,3.2704e+06,2.2533e+06,1.0170e+06,0.1264
32.7169,249,3.2519e+06,2.2368e+06,1.0151e+06,0.1212
32.8512,250,3.2338e+06,2.2206e+06,1.0132e+06,0.1270
32.9795,251,3.2160e+06,2.2048e+06,1.0113e+06,0.1213
33.1100,252,3.1984e+06,2.1891e+06,1.0094e+06,0.1237
33.2421,253,3.1809e+06,2.1734e+06,1.0075e+06,0.1253
33.3725,254,3.1634e+06,2.1578e+06,1.0057e+06,0.1233
33.5059,255,3.1461e+06,2.1422e+06,1.0039e+06,0.1262
33.6388,256,3.1290e+06,2.1269e+06,1.0021e+06,0.1250
33.7688,257,3.1122e+06,2.1119e+06,1.0003e+06,0.1229
33.8989,258,3.0958e+06,2.0972e+06,9.9857e+05,0.1230
34.0298,259,3.0798e+06,2.0831e+06,9.9675e+05,0.1239
34.1599,260,3.0642e+06,2.0694e+06,9.9486e+05,0.1230
34.2923,261,3.0488e+06,2.0559e+06,9.9289e+05,0.1252
34.4207,262,3.0333e+06,2.0425e+06,9.9082e+05,0.1215
34.5567,263,3.0177e+06,2.0290e+06,9.8868e+05,0.1288
34.6874,264,3.0018e+06,2.0154e+06,9.8646e+05,0.1235
34.8178,265,2.9858e+06,2.0016e+06,9.8419e+05,0.1236
34.9484,266,2.9701e+06,1.9882e+06,9.8189e+05,0.1239
35.0821,267,2.9549e+06,1.9753e+06,9.7961e+05,0.1259
35.2103,268,2.9404e+06,1.9631e+06,9.7737e+05,0.1213
35.3416,269,2.9264e+06,1.9511e+06,9.7522e+05,0.1245
35.4715,270,2.9123e+06,1.9391e+06,9.7314e+05,0.1230
35.6127,271,2.8979e+06,1.9268e+06,9.7116e+05,0.1298
35.7422,272,2.8832e+06,1.9140e+06,9.6927e+05,0.1225
35.8732,273,2.8686e+06,1.9011e+06,9.6745e+05,0.1241
36.0034,274,2.8542e+06,1.8885e+06,9.6567e+05,0.1232
36.1361,275,2.8403e+06,1.8764e+06,9.6391e+05,0.1256
36.2646,276,2.8270e+06,1.8649e+06,9.6217e+05,0.1216
36.3969,277,2.8139e+06,1.8535e+06,9.6044e+05,0.1246
36.5257,278,2.8005e+06,1.8419e+06,9.5864e+05,0.1219
36.6569,279,2.7868e+06,1.8300e+06,9.5678e+05,0.1241
36.7876,280,2.7728e+06,1.8179e+06,9.5484e+05,0.1239
36.9170,281,2.7588e+06,1.8060e+06,9.5284e+05,0.1223
37.0484,282,2.7453e+06,1.7944e+06,9.5082e+05,0.1244
37.1773,283,2.7322e+06,1.7834e+06,9.4879e+05,0.1218
37.3101,284,2.7194e+06,1.7726e+06,9.4677e+05,0.1259
37.4416,285,2.7067e+06,1.7619e+06,9.4478e+05,0.1240
37.5735,286,2.6938e+06,1.7510e+06,9.4284e+05,0.1248
37.7025,287,2.6809e+06,1.7399e+06,9.4096e+05,0.1220
37.8331,288,2.6681e+06,1.7289e+06,9.3912e+05,0.1236
37.9642,289,2.6556e+06,1.7183e+06,9.3733e+05,0.1240
38.0938,290,2.6436e+06,1.7080e+06,9.3557e+05,0.1227
38.2250,291,2.6319e+06,1.6981e+06,9.3385e+05,0.1242
38.3542,292,2.6203e+06,1.6882e+06,9.3215e+05,0.1224
38.4875,293,2.6086e+06,1.6781e+06,9.3046e+05,0.1258
38.6181,294,2.5966e+06,1.6679e+06,9.2873e+05,0.1234
38.7507,295,2.5845e+06,1.6575e+06,9.2698e+05,0.1248
38.8804,296,2.5724e+06,1.6472e+06,9.2521e+05,0.1223
39.0152,297,2.5604e+06,1.6370e+06,9.2341e+05,0.1272
39.1455,298,2.5486e+06,1.6270e+06,9.2160e+05,0.1228
39.2765,299,2.5371e+06,1.6173e+06,9.1981e+05,0.1239
39.4060,300,2.5258e+06,1.6078e+06,9.1801e+05,0.1224
39.5395,301,2.5147e+06,1.5985e+06,9.1622e+05,0.1255
39.6695,302,2.5038e+06,1.5893e+06,9.1446e+05,0.1229
39.8014,303,2.4929e+06,1.5802e+06,9.1272e+05,0.1248
39.9312,304,2.4820e+06,1.5710e+06,9.1102e+05,0.1228
40.0609,305,2.4713e+06,1.5619e+06,9.0936e+05,0.1230
40.1915,306,2.4607e+06,1.5530e+06,9.0771e+05,0.1238
40.3202,307,2.4504e+06,1.5443e+06,9.0611e+05,0.1220
40.4524,308,2.4403e+06,1.5358e+06,9.0452e+05,0.1251
40.5825,309,2.4303e+06,1.5273e+06,9.0297e+05,0.1229
40.7169,310,2.4202e+06,1.5188e+06,9.0143e+05,0.1269
40.8456,311,2.4101e+06,1.5101e+06,8.9993e+05,0.1215
40.9778,312,2.3999e+06,1.5014e+06,8.9845e+05,0.1248
41.1082,313,2.3899e+06,1.4929e+06,8.9700e+05,0.1231
41.2411,314,2.3802e+06,1.4847e+06,8.9556e+05,0.1256
41.3710,315,2.3708e+06,1.4767e+06,8.9413e+05,0.1228
41.5023,316,2.3616e+06,1.4688e+06,8.9271e+05,0.1243
41.6366,317,2.3522e+06,1.4609e+06,8.9129e+05,0.1266
41.7703,318,2.3427e+06,1.4529e+06,8.8984e+05,0.1264
41.9006,319,2.3331e+06,1.4448e+06,8.8837e+05,0.1234
42.0347,320,2.3237e+06,1.4368e+06,8.8687e+05,0.1268
42.1653,321,2.3144e+06,1.4291e+06,8.8537e+05,0.1235
42.2970,322,2.3055e+06,1.4216e+06,8.8387e+05,0.1247
42.4251,323,2.2967e+06,1.4143e+06,8.8237e+05,0.1214
42.5566,324,2.2879e+06,1.4070e+06,8.8088e+05,0.1245
42.6869,325,2.2790e+06,1.3995e+06,8.7941e+05,0.1234
42.8165,326,2.2700e+06,1.3920e+06,8.7796e+05,0.1228
42.9481,327,2.2610e+06,1.3845e+06,8.7655e+05,0.1244
43.0771,328,2.2523e+06,1.3771e+06,8.7517e+05,0.1219
43.2090,329,2.2437e+06,1.3699e+06,8.7380e+05,0.1250
43.3374,330,2.2353e+06,1.3628e+06,8.7246e+05,0.1214
43.4683,331,2.2269e+06,1.3557e+06,8.7113e+05,0.1237
43.5989,332,2.2185e+06,1.3487e+06,8.6981e+05,0.1238
43.7286,333,2.2101e+06,1.3416e+06,8.6849e+05,0.1227
43.8609,334,2.2018e+06,1.3346e+06,8.6718e+05,0.1252
43.9906,335,2.1937e+06,1.3278e+06,8.6586e+05,0.1227
44.1241,336,2.1857e+06,1.3212e+06,8.6453e+05,0.1262
44.2538,337,2.1778e+06,1.3146e+06,8.6318e+05,0.1227
44.3867,338,2.1699e+06,1.3081e+06,8.6182e+05,0.1259
44.5154,339,2.1620e+06,1.3016e+06,8.6044e+05,0.1219
44.6479,340,2.1541e+06,1.2950e+06,8.5905e+05,0.1254
44.7765,341,2.1461e+06,1.2884e+06,8.5764e+05,0.1212
44.9079,342,2.1381e+06,1.2819e+06,8.5623e+05,0.1245
45.0382,343,2.1302e+06,1.2754e+06,8.5482e+05,0.1235
45.1680,344,2.1223e+06,1.2689e+06,8.5342e+05,0.1227
45.3000,345,2.1146e+06,1.2626e+06,8.5202e+05,0.1248
45.4309,346,2.1070e+06,1.2563e+06,8.5063e+05,0.1229
45.5629,347,2.0994e+06,1.2502e+06,8.4926e+05,0.1241
45.6969,348,2.0919e+06,1.2440e+06,8.4790e+05,0.1272
45.8274,349,2.0844e+06,1.2379e+06,8.4657e+05,0.1234
45.9569,350,2.0770e+06,1.2317e+06,8.4525e+05,0.1226
46.0880,351,2.0696e+06,1.2257e+06,8.4393e+05,0.1242
46.2173,352,2.0624e+06,1.2198e+06,8.4259e+05,0.1223
46.3507,353,2.0553e+06,1.2141e+06,8.4124e+05,0.1261
46.4805,354,2.0483e+06,1.2084e+06,8.3985e+05,0.1227
46.6144,355,2.0413e+06,1.2028e+06,8.3843e+05,0.1258
46.7507,356,2.0342e+06,1.1972e+06,8.3698e+05,0.1228
46.8833,357,2.0271e+06,1.1916e+06,8.3551e+05,0.1243
47.0141,358,2.0200e+06,1.1860e+06,8.3403e+05,0.1234
47.1457,359,2.0132e+06,1.1806e+06,8.3253e+05,0.1229
47.2748,360,2.0065e+06,1.1754e+06,8.3106e+05,0.1220
47.4072,361,1.9998e+06,1.1702e+06,8.2961e+05,0.1254
47.5367,362,1.9931e+06,1.1650e+06,8.2818e+05,0.1225
47.6692,363,1.9864e+06,1.1596e+06,8.2679e+05,0.1255
47.7989,364,1.9796e+06,1.1542e+06,8.2541e+05,0.1225
47.9307,365,1.9729e+06,1.1489e+06,8.2405e+05,0.1245
48.0596,366,1.9664e+06,1.1437e+06,8.2270e+05,0.1220
48.1898,367,1.9600e+06,1.1386e+06,8.2135e+05,0.1235
48.3209,368,1.9535e+06,1.1335e+06,8.1998e+05,0.1240
48.4502,369,1.9470e+06,1.1284e+06,8.1858e+05,0.1223
48.5832,370,1.9404e+06,1.1233e+06,8.1715e+05,0.1256
48.7127,371,1.9339e+06,1.1182e+06,8.1570e+05,0.1226
48.8442,372,1.9274e+06,1.1132e+06,8.1424e+05,0.1241
48.9730,373,1.9211e+06,1.1083e+06,8.1278e+05,0.1219
49.1040,374,1.9149e+06,1.1035e+06,8.1133e+05,0.1239
49.2355,375,1.9087e+06,1.0988e+06,8.0990e+05,0.1243
49.3669,376,1.9027e+06,1.0942e+06,8.0850e+05,0.1242
49.4975,377,1.8966e+06,1.0895e+06,8.0711e+05,0.1239
49.6267,378,1.8906e+06,1.0848e+06,8.0575e+05,0.1225
49.7592,379,1.8847e+06,1.0802e+06,8.0441e+05,0.1254
49.8886,380,1.8788e+06,1.0758e+06,8.0309e+05,0.1225
50.0199,381,1.8732e+06,1.0714e+06,8.0177e+05,0.1244
50.1491,382,1.8676e+06,1.0671e+06,8.0046e+05,0.1224
50.2854,383,1.8620e+06,1.0629e+06,7.9915e+05,0.1285
50.4154,384,1.8564e+06,1.0586e+06,7.9784e+05,0.1226
50.5485,385,1.8507e+06,1.0542e+06,7.9652e+05,0.1258
50.6793,386,1.8449e+06,1.0497e+06,7.9521e+05,0.1233
50.8117,387,1.8392e+06,1.0453e+06,7.9392e+05,0.1250
50.9405,388,1.8336e+06,1.0409e+06,7.9264e+05,0.1218
51.0725,389,1.8281e+06,1.0367e+06,7.9135e+05,0.1252
51.2022,390,1.8226e+06,1.0326e+06,7.9005e+05,0.1227
51.3322,391,1.8172e+06,1.0285e+06,7.8876e+05,0.1230
51.4649,392,1.8118e+06,1.0243e+06,7.8747e+05,0.1257
51.5968,393,1.8063e+06,1.0202e+06,7.8618e+05,0.1248
51.7276,394,1.8009e+06,1.0160e+06,7.8488e+05,0.1239
51.8567,395,1.7956e+06,1.0120e+06,7.8358e+05,0.1219
51.9887,396,1.7904e+06,1.0081e+06,7.8229e+05,0.1252
52.1195,397,1.7852e+06,1.0042e+06,7.8102e+05,0.1237
52.2519,398,1.7801e+06,1.0003e+06,7.7977e+05,0.1254
52.3825,399,1.7749e+06,9.9636e+05,7.7854e+05,0.1235
52.5166,400,1.7697e+06,9.9235e+05,7.7733e+05,0.1264
52.6466,401,1.7645e+06,9.8838e+05,7.7613e+05,0.1219
52.7818,402,1.7595e+06,9.8452e+05,7.7494e+05,0.1280
52.9113,403,1.7545e+06,9.8074e+05,7.7375e+05,0.1219
53.0428,404,1.7496e+06,9.7700e+05,7.7256e+05,0.1246
53.1723,405,1.7446e+06,9.7321e+05,7.7135e+05,0.1227
53.3047,406,1.7395e+06,9.6941e+05,7.7012e+05,0.1253
53.4351,407,1.7345e+06,9.6563e+05,7.6888e+05,0.1232
53.5690,408,1.7296e+06,9.6193e+05,7.6763e+05,0.1266
53.6990,409,1.7247e+06,9.5836e+05,7.6638e+05,0.1231
53.8362,410,1.7200e+06,9.5488e+05,7.6514e+05,0.1244
53.9672,411,1.7153e+06,9.5143e+05,7.6392e+05,0.1240
54.0998,412,1.7106e+06,9.4792e+05,7.6272e+05,0.1252
54.2309,413,1.7059e+06,9.4434e+05,7.6153e+05,0.1242
54.3630,414,1.7011e+06,9.4075e+05,7.6036e+05,0.1251
54.4926,415,1.6964e+06,9.3719e+05,7.5919e+05,0.1230
54.6241,416,1.6917e+06,9.3371e+05,7.5803e+05,0.1245
54.7527,417,1.6872e+06,9.3033e+05,7.5687e+05,0.1218
54.8853,418,1.6827e+06,9.2699e+05,7.5573e+05,0.1251
55.0133,419,1.6783e+06,9.2367e+05,7.5459e+05,0.1210
55.1443,420,1.6738e+06,9.2034e+05,7.5346e+05,0.1240
55.2744,421,1.6694e+06,9.1704e+05,7.5234e+05,0.1235
55.4035,422,1.6650e+06,9.1379e+05,7.5121e+05,0.1221
55.5354,423,1.6607e+06,9.1061e+05,7.5008e+05,0.1247
55.6644,424,1.6565e+06,9.0751e+05,7.4895e+05,0.1218
55.7967,425,1.6522e+06,9.0443e+05,7.4780e+05,0.1253
55.9255,426,1.6480e+06,9.0136e+05,7.4664e+05,0.1217
56.0576,427,1.6437e+06,8.9825e+05,7.4548e+05,0.1249
56.1861,428,1.6394e+06,8.9513e+05,7.4431e+05,0.1218
56.3166,429,1.6352e+06,8.9204e+05,7.4313e+05,0.1236
56.4473,430,1.6310e+06,8.8901e+05,7.4196e+05,0.1237
56.5770,431,1.6268e+06,8.8606e+05,7.4078e+05,0.1228
56.7085,432,1.6228e+06,8.8316e+05,7.3962e+05,0.1247
56.8386,433,1.6187e+06,8.8024e+05,7.3847e+05,0.1231
56.9714,434,1.6146e+06,8.7727e+05,7.3732e+05,0.1255
57.1009,435,1.6105e+06,8.7427e+05,7.3618e+05,0.1224
57.2340,436,1.6063e+06,8.7129e+05,7.3505e+05,0.1253
57.3646,437,1.6023e+06,8.6840e+05,7.3392e+05,0.1233
57.4981,438,1.5984e+06,8.6561e+05,7.3279e+05,0.1262
57.6277,439,1.5945e+06,8.6285e+05,7.3166e+05,0.1222
57.7614,440,1.5906e+06,8.6008e+05,7.3051e+05,0.1267
57.8976,441,1.5866e+06,8.5725e+05,7.2937e+05,0.1289
58.0282,442,1.5826e+06,8.5442e+05,7.2821e+05,0.1236
58.1578,443,1.5787e+06,8.5163e+05,7.2705e+05,0.1230
58.2901,444,1.5748e+06,8.4891e+05,7.2588e+05,0.1251
58.4196,445,1.5710e+06,8.4625e+05,7.2472e+05,0.1225
58.5518,446,1.5672e+06,8.4357e+05,7.2358e+05,0.1250
58.6802,447,1.5633e+06,8.4088e+05,7.2244e+05,0.1214
58.8126,448,1.5595e+06,8.3819e+05,7.2132e+05,0.1250
58.9426,449,1.5557e+06,8.3553e+05,7.2021e+05,0.1223
59.0723,450,1.5520e+06,8.3293e+05,7.1911e+05,0.1229
59.2034,451,1.5484e+06,8.3039e+05,7.1803e+05,0.1240
59.3322,452,1.5448e+06,8.2789e+05,7.1695e+05,0.1218
59.4647,453,1.5412e+06,8.2537e+05,7.1587e+05,0.1255
59.5945,454,1.5376e+06,8.2281e+05,7.1479e+05,0.1226
59.7268,455,1.5339e+06,8.2023e+05,7.1370e+05,0.1253
59.8589,456,1.5303e+06,8.1768e+05,7.1262e+05,0.1249
59.9918,457,1.5267e+06,8.1518e+05,7.1155e+05,0.1254
60.1201,458,1.5232e+06,8.1275e+05,7.1049e+05,0.1214
60.2520,459,1.5198e+06,8.1036e+05,7.0943e+05,0.1246
60.3816,460,1.5164e+06,8.0797e+05,7.0839e+05,0.1226
60.5154,461,1.5129e+06,8.0555e+05,7.0735e+05,0.1259
60.6460,462,1.5094e+06,8.0311e+05,7.0632e+05,0.1233
60.7797,463,1.5060e+06,8.0070e+05,7.0530e+05,0.1265
60.9104,464,1.5026e+06,7.9833e+05,7.0429e+05,0.1234
61.0445,465,1.4993e+06,7.9601e+05,7.0329e+05,0.1266
61.1734,466,1.4960e+06,7.9370e+05,7.0230e+05,0.1216
61.3065,467,1.4927e+06,7.9137e+05,7.0133e+05,0.1259
61.4377,468,1.4894e+06,7.8899e+05,7.0038e+05,0.1239
61.5707,469,1.4860e+06,7.8655e+05,6.9944e+05,0.1257
61.6992,470,1.4826e+06,7.8411e+05,6.9853e+05,0.1212
61.8297,471,1.4793e+06,7.8172e+05,6.9763e+05,0.1236
61.9611,472,1.4761e+06,7.7938e+05,6.9673e+05,0.1240
62.0900,473,1.4729e+06,7.7709e+05,6.9583e+05,0.1221
62.2212,474,1.4697e+06,7.7482e+05,6.9492e+05,0.1241
62.3499,475,1.4665e+06,7.7253e+05,6.9400e+05,0.1216
62.4820,476,1.4633e+06,7.7025e+05,6.9307e+05,0.1247
62.6109,477,1.4602e+06,7.6801e+05,6.9214e+05,0.1220
62.7432,478,1.4570e+06,7.6584e+05,6.9120e+05,0.1249
62.8724,479,1.4540e+06,7.6372e+05,6.9027e+05,0.1224
63.0023,480,1.4509e+06,7.6160e+05,6.8934e+05,0.1228
63.1336,481,1.4479e+06,7.5946e+05,6.8841e+05,0.1244
63.2618,482,1.4448e+06,7.5728e+05,6.8750e+05,0.1214
63.3941,483,1.4417e+06,7.5510e+05,6.8659e+05,0.1254
63.5234,484,1.4386e+06,7.5295e+05,6.8569e+05,0.1222
63.6567,485,1.4356e+06,7.5084e+05,6.8478e+05,0.1261
63.7872,486,1.4326e+06,7.4877e+05,6.8387e+05,0.1236
63.9250,487,1.4297e+06,7.4670e+05,6.8295e+05,0.1304
64.0543,488,1.4267e+06,7.4464e+05,6.8204e+05,0.1223
64.1850,489,1.4237e+06,7.4260e+05,6.8113e+05,0.1234
64.3151,490,1.4208e+06,7.4060e+05,6.8022e+05,0.1233
64.4476,491,1.4180e+06,7.3862e+05,6.7933e+05,0.1248
64.5763,492,1.4151e+06,7.3666e+05,6.7845e+05,0.1216
64.7070,493,1.4123e+06,7.3469e+05,6.7758e+05,0.1235
64.8380,494,1.4094e+06,7.3270e+05,6.7672e+05,0.1243
64.9733,495,1.4066e+06,7.3070e+05,6.7586e+05,0.1240
65.1027,496,1.4037e+06,7.2870e+05,6.7501e+05,0.1223
65.2335,497,1.4009e+06,7.2672e+05,6.7415e+05,0.1236
65.3656,498,1.3981e+06,7.2479e+05,6.7328e+05,0.1250
65.4980,499,1.3953e+06,7.2291e+05,6.7241e+05,0.1254
65.6291,500,1.3926e+06,7.2105e+05,6.7154e+05,0.1241
65.7607,501,1.3899e+06,7.1918e+05,6.7068e+05,0.1236
65.8905,502,1.3871e+06,7.1731e+05,6.6984e+05,0.1228
66.0219,503,1.3844e+06,7.1543e+05,6.6900e+05,0.1240
66.1535,504,1.3817e+06,7.1358e+05,6.6817e+05,0.1248
66.2849,505,1.3791e+06,7.1176e+05,6.6734e+05,0.1245
66.4183,506,1.3765e+06,7.0996e+05,6.6651e+05,0.1257
66.5498,507,1.3739e+06,7.0819e+05,6.6568e+05,0.1243
66.6828,508,1.3712e+06,7.0640e+05,6.6483e+05,0.1257
66.8141,509,1.3686e+06,7.0461e+05,6.6397e+05,0.1243
66.9470,510,1.3659e+06,7.0283e+05,6.6310e+05,0.1256
67.0814,511,1.3633e+06,7.0109e+05,6.6224e+05,0.1266
67.2138,512,1.3608e+06,6.9939e+05,6.6137e+05,0.1232
67.3466,513,1.3582e+06,6.9770e+05,6.6052e+05,0.1246
67.4749,514,1.3557e+06,6.9599e+05,6.5968e+05,0.1214
67.6082,515,1.3531e+06,6.9427e+05,6.5887e+05,0.1258
67.7376,516,1.3506e+06,6.9255e+05,6.5806e+05,0.1223
67.8692,517,1.3481e+06,6.9084e+05,6.5726e+05,0.1245
68.0010,518,1.3456e+06,6.8916e+05,6.5647e+05,0.1244
68.1323,519,1.3432e+06,6.8750e+05,6.5568e+05,0.1238
68.2641,520,1.3407e+06,6.8584e+05,6.5489e+05,0.1250
68.3943,521,1.3383e+06,6.8418e+05,6.5410e+05,0.1233
68.5251,522,1.3358e+06,6.8253e+05,6.5332e+05,0.1238
68.6539,523,1.3334e+06,6.8089e+05,6.5253e+05,0.1220
68.7858,524,1.3310e+06,6.7927e+05,6.5175e+05,0.1248
68.9155,525,1.3286e+06,6.7765e+05,6.5097e+05,0.1228
69.0480,526,1.3262e+06,6.7604e+05,6.5020e+05,0.1251
69.1765,527,1.3239e+06,6.7443e+05,6.4944e+05,0.1215
69.3087,528,1.3215e+06,6.7282e+05,6.4868e+05,0.1255
69.4379,529,1.3191e+06,6.7123e+05,6.4792e+05,0.1224
69.5671,530,1.3168e+06,6.6965e+05,6.4716e+05,0.1224
69.6988,531,1.3145e+06,6.6808e+05,6.4640e+05,0.1249
69.8277,532,1.3122e+06,6.6652e+05,6.4565e+05,0.1221
69.9594,533,1.3099e+06,6.6498e+05,6.4491e+05,0.1241
70.0881,534,1.3076e+06,6.6343e+05,6.4417e+05,0.1217
70.2201,535,1.3053e+06,6.6186e+05,6.4345e+05,0.1249
70.3505,536,1.3030e+06,6.6031e+05,6.4273e+05,0.1233
70.4820,537,1.3008e+06,6.5877e+05,6.4202e+05,0.1244
70.6136,538,1.2986e+06,6.5726e+05,6.4131e+05,0.1244
70.7448,539,1.2964e+06,6.5579e+05,6.4060e+05,0.1243
70.8771,540,1.2942e+06,6.5434e+05,6.3989e+05,0.1255
71.0120,541,1.2920e+06,6.5287e+05,6.3917e+05,0.1280
71.1427,542,1.2899e+06,6.5141e+05,6.3845e+05,0.1233
71.2753,543,1.2877e+06,6.4996e+05,6.3773e+05,0.1255
71.4042,544,1.2856e+06,6.4854e+05,6.3701e+05,0.1219
71.5351,545,1.2834e+06,6.4715e+05,6.3629e+05,0.1241
71.6660,546,1.2813e+06,6.4576e+05,6.3558e+05,0.1235
71.7970,547,1.2792e+06,6.4434e+05,6.3488e+05,0.1240
71.9296,548,1.2771e+06,6.4291e+05,6.3419e+05,0.1256
72.0634,549,1.2750e+06,6.4148e+05,6.3349e+05,0.1246
72.1938,550,1.2729e+06,6.4007e+05,6.3280e+05,0.1236
72.3252,551,1.2708e+06,6.3869e+05,6.3211e+05,0.1247
72.4574,552,1.2687e+06,6.3732e+05,6.3141e+05,0.1250
72.5889,553,1.2667e+06,6.3597e+05,6.3071e+05,0.1244
72.7200,554,1.2646e+06,6.3461e+05,6.3001e+05,0.1243
72.8514,555,1.2626e+06,6.3324e+05,6.2931e+05,0.1243
72.9827,556,1.2605e+06,6.3188e+05,6.2862e+05,0.1243
73.1138,557,1.2585e+06,6.3053e+05,6.2793e+05,0.1238
73.2449,558,1.2564e+06,6.2919e+05,6.2725e+05,0.1237
73.3744,559,1.2544e+06,6.2786e+05,6.2657e+05,0.1227
73.5061,560,1.2524e+06,6.2654e+05,6.2590e+05,0.1248
73.6347,561,1.2504e+06,6.2522e+05,6.2523e+05,0.1214
73.7664,562,1.2485e+06,6.2392e+05,6.2455e+05,0.1248
73.8960,563,1.2465e+06,6.2264e+05,6.2386e+05,0.1227
74.0271,564,1.2445e+06,6.2138e+05,6.2316e+05,0.1240
74.1576,565,1.2426e+06,6.2014e+05,6.2246e+05,0.1236
74.2879,566,1.2407e+06,6.1890e+05,6.2177e+05,0.1235
74.4207,567,1.2387e+06,6.1766e+05,6.2108e+05,0.1262
74.5522,568,1.2368e+06,6.1641e+05,6.2041e+05,0.1244
74.6824,569,1.2349e+06,6.1516e+05,6.1974e+05,0.1232
74.8112,570,1.2330e+06,6.1393e+05,6.1910e+05,0.1221
74.9425,571,1.2312e+06,6.1271e+05,6.1845e+05,0.1243
75.0721,572,1.2293e+06,6.1149e+05,6.1781e+05,0.1229
75.2045,573,1.2274e+06,6.1027e+05,6.1717e+05,0.1252
75.3338,574,1.2256e+06,6.0906e+05,6.1651e+05,0.1226
75.4648,575,1.2237e+06,6.0785e+05,6.1586e+05,0.1238
75.5959,576,1.2219e+06,6.0667e+05,6.1521e+05,0.1243
75.7250,577,1.2201e+06,6.0550e+05,6.1456e+05,0.1221
75.8562,578,1.2182e+06,6.0433e+05,6.1391e+05,0.1242
75.9839,579,1.2164e+06,6.0314e+05,6.1327e+05,0.1208
76.1205,580,1.2146e+06,6.0193e+05,6.1264e+05,0.1225
76.2489,581,1.2127e+06,6.0072e+05,6.1203e+05,0.1215
76.3809,582,1.2109e+06,5.9953e+05,6.1141e+05,0.1249
76.5104,583,1.2092e+06,5.9835e+05,6.1081e+05,0.1226
76.6429,584,1.2074e+06,5.9719e+05,6.1020e+05,0.1251
76.7754,585,1.2056e+06,5.9601e+05,6.0960e+05,0.1246
76.9106,586,1.2038e+06,5.9482e+05,6.0899e+05,0.1275
77.0413,587,1.2020e+06,5.9363e+05,6.0839e+05,0.1235
77.1745,588,1.2003e+06,5.9246e+05,6.0780e+05,0.1256
77.3037,589,1.1985e+06,5.9132e+05,6.0720e+05,0.1223
77.4393,590,1.1968e+06,5.9018e+05,6.0661e+05,0.1283
77.5684,591,1.1951e+06,5.8905e+05,6.0602e+05,0.1216
77.6993,592,1.1933e+06,5.8790e+05,6.0543e+05,0.1240
77.8282,593,1.1916e+06,5.8676e+05,6.0485e+05,0.1219
77.9604,594,1.1899e+06,5.8563e+05,6.0426e+05,0.1248
78.0908,595,1.1882e+06,5.8452e+05,6.0367e+05,0.1234
78.2213,596,1.1865e+06,5.8343e+05,6.0308e+05,0.1234
78.3533,597,1.1848e+06,5.8235e+05,6.0250e+05,0.1249
78.4838,598,1.1832e+06,5.8127e+05,6.0191e+05,0.1237
78.6152,599,1.1815e+06,5.8018e+05,6.0133e+05,0.1240
78.7451,600,1.1799e+06,5.7910e+05,6.0076e+05,0.1231
78.8771,601,1.1782e+06,5.7803e+05,6.0019e+05,0.1242
79.0055,602,1.1766e+06,5.7697e+05,5.9962e+05,0.1211
79.1370,603,1.1750e+06,5.7591e+05,5.9907e+05,0.1242
79.2664,604,1.1734e+06,5.7485e+05,5.9851e+05,0.1225
79.3956,605,1.1717e+06,5.7378e+05,5.9796e+05,0.1223
79.5272,606,1.1701e+06,5.7272e+05,5.9740e+05,0.1247
79.6560,607,1.1685e+06,5.7169e+05,5.9685e+05,0.1220
79.7879,608,1.1670e+06,5.7067e+05,5.9629e+05,0.1251
79.9191,609,1.1654e+06,5.6965e+05,5.9574e+05,0.1242
80.0524,610,1.1638e+06,5.6862e+05,5.9518e+05,0.1262
80.1812,611,1.1622e+06,5.6759e+05,5.9462e+05,0.1216
80.3122,612,1.1606e+06,5.6655e+05,5.9407e+05,0.1240
80.4430,613,1.1591e+06,5.6554e+05,5.9352e+05,0.1238
80.5723,614,1.1575e+06,5.6456e+05,5.9297e+05,0.1224
80.7035,615,1.1560e+06,5.6358e+05,5.9242e+05,0.1244
80.8322,616,1.1545e+06,5.6259e+05,5.9187e+05,0.1218
80.9648,617,1.1529e+06,5.6160e+05,5.9133e+05,0.1256
81.0941,618,1.1514e+06,5.6063e+05,5.9079e+05,0.1221
81.2250,619,1.1499e+06,5.5967e+05,5.9025e+05,0.1240
81.3549,620,1.1484e+06,5.5874e+05,5.8971e+05,0.1228
81.4837,621,1.1470e+06,5.5780e+05,5.8917e+05,0.1218
81.6158,622,1.1455e+06,5.5685e+05,5.8863e+05,0.1249
81.7433,623,1.1440e+06,5.5590e+05,5.8810e+05,0.1207
81.8754,624,1.1425e+06,5.5494e+05,5.8756e+05,0.1252
82.0052,625,1.1410e+06,5.5401e+05,5.8703e+05,0.1229
82.1355,626,1.1396e+06,5.5310e+05,5.8649e+05,0.1232
82.2668,627,1.1382e+06,5.5220e+05,5.8596e+05,0.1241
82.3955,628,1.1367e+06,5.5129e+05,5.8542e+05,0.1219
82.5276,629,1.1353e+06,5.5037e+05,5.8489e+05,0.1251
82.6563,630,1.1338e+06,5.4944e+05,5.8437e+05,0.1218
82.7880,631,1.1324e+06,5.4853e+05,5.8384e+05,0.1249
82.9182,632,1.1309e+06,5.4762e+05,5.8332e+05,0.1230
83.0498,633,1.1295e+06,5.4672e+05,5.8280e+05,0.1250
83.1804,634,1.1281e+06,5.4583e+05,5.8228e+05,0.1237
83.3096,635,1.1267e+06,5.4492e+05,5.8175e+05,0.1222
83.4416,636,1.1252e+06,5.4402e+05,5.8122e+05,0.1250
83.5705,637,1.1238e+06,5.4313e+05,5.8069e+05,0.1222
83.7023,638,1.1224e+06,5.4225e+05,5.8017e+05,0.1249
83.8305,639,1.1210e+06,5.4138e+05,5.7965e+05,0.1214
83.9609,640,1.1196e+06,5.4050e+05,5.7914e+05,0.1237
84.0929,641,1.1183e+06,5.3962e+05,5.7864e+05,0.1251
84.2237,642,1.1169e+06,5.3873e+05,5.7814e+05,0.1224
84.3549,643,1.1155e+06,5.3784e+05,5.7766e+05,0.1242
84.4850,644,1.1141e+06,5.3696e+05,5.7717e+05,0.1231
84.6180,645,1.1128e+06,5.3608e+05,5.7669e+05,0.1256
84.7483,646,1.1114e+06,5.3521e+05,5.7620e+05,0.1233
84.8820,647,1.1100e+06,5.3435e+05,5.7570e+05,0.1263
85.0126,648,1.1087e+06,5.3350e+05,5.7520e+05,0.1237
85.1433,649,1.1073e+06,5.3266e+05,5.7469e+05,0.1236
85.2721,650,1.1060e+06,5.3183e+05,5.7419e+05,0.1219
85.4056,651,1.1047e+06,5.3101e+05,5.7368e+05,0.1264
85.5374,652,1.1034e+06,5.3018e+05,5.7319e+05,0.1232
85.6705,653,1.1020e+06,5.2934e+05,5.7269e+05,0.1260
85.7995,654,1.1007e+06,5.2851e+05,5.7220e+05,0.1220
85.9310,655,1.0994e+06,5.2769e+05,5.7171e+05,0.1247
86.0622,656,1.0981e+06,5.2689e+05,5.7123e+05,0.1243
86.1992,657,1.0968e+06,5.2609e+05,5.7074e+05,0.1296
86.3296,658,1.0955e+06,5.2529e+05,5.7026e+05,0.1233
86.4625,659,1.0943e+06,5.2449e+05,5.6978e+05,0.1259
86.5905,660,1.0930e+06,5.2369e+05,5.6930e+05,0.1212
86.7214,661,1.0917e+06,5.2292e+05,5.6882e+05,0.1241
86.8504,662,1.0905e+06,5.2215e+05,5.6835e+05,0.1221
86.9795,663,1.0893e+06,5.2139e+05,5.6788e+05,0.1223
87.1117,664,1.0880e+06,5.2062e+05,5.6741e+05,0.1250
87.2419,665,1.0868e+06,5.1985e+05,5.6694e+05,0.1227
87.3739,666,1.0856e+06,5.1909e+05,5.6648e+05,0.1247
87.5024,667,1.0844e+06,5.1835e+05,5.6600e+05,0.1216
87.6366,668,1.0831e+06,5.1761e+05,5.6553e+05,0.1271
87.7707,669,1.0819e+06,5.1688e+05,5.6506e+05,0.1238
87.9036,670,1.0807e+06,5.1615e+05,5.6459e+05,0.1253
88.0333,671,1.0795e+06,5.1541e+05,5.6412e+05,0.1226
88.1650,672,1.0783e+06,5.1467e+05,5.6366e+05,0.1247
88.2943,673,1.0771e+06,5.1394e+05,5.6320e+05,0.1221
88.4271,674,1.0760e+06,5.1320e+05,5.6275e+05,0.1260
88.5562,675,1.0748e+06,5.1247e+05,5.6230e+05,0.1222
88.6872,676,1.0736e+06,5.1174e+05,5.6185e+05,0.1241
88.8176,677,1.0724e+06,5.1101e+05,5.6140e+05,0.1236
88.9484,678,1.0712e+06,5.1028e+05,5.6095e+05,0.1239
89.0803,679,1.0701e+06,5.0957e+05,5.6050e+05,0.1246
89.2093,680,1.0689e+06,5.0886e+05,5.6004e+05,0.1215
89.3414,681,1.0677e+06,5.0816e+05,5.5959e+05,0.1248
89.4702,682,1.0666e+06,5.0745e+05,5.5914e+05,0.1221
89.6018,683,1.0654e+06,5.0673e+05,5.5870e+05,0.1247
89.7312,684,1.0643e+06,5.0601e+05,5.5827e+05,0.1228
89.8620,685,1.0631e+06,5.0530e+05,5.5784e+05,0.1238
89.9936,686,1.0620e+06,5.0459e+05,5.5742e+05,0.1242
90.1228,687,1.0609e+06,5.0388e+05,5.5699e+05,0.1222
90.2562,688,1.0597e+06,5.0317e+05,5.5657e+05,0.1262
90.3849,689,1.0586e+06,5.0247e+05,5.5615e+05,0.1218
90.5163,690,1.0575e+06,5.0177e+05,5.5573e+05,0.1244
90.6444,691,1.0564e+06,5.0108e+05,5.5531e+05,0.1214
90.7755,692,1.0553e+06,5.0039e+05,5.5489e+05,0.1243
90.9069,693,1.0542e+06,4.9971e+05,5.5447e+05,0.1242
91.0389,694,1.0531e+06,4.9903e+05,5.5405e+05,0.1248
91.1712,695,1.0520e+06,4.9835e+05,5.5363e+05,0.1250
91.3067,696,1.0509e+06,4.9768e+05,5.5321e+05,0.1230
91.4350,697,1.0498e+06,4.9702e+05,5.5278e+05,0.1210
91.5653,698,1.0487e+06,4.9636e+05,5.5236e+05,0.1234
91.6962,699,1.0477e+06,4.9571e+05,5.5194e+05,0.1239
91.8248,700,1.0466e+06,4.9506e+05,5.5153e+05,0.1221
91.9573,701,1.0455e+06,4.9441e+05,5.5111e+05,0.1247
92.0859,702,1.0445e+06,4.9377e+05,5.5070e+05,0.1217
92.2192,703,1.0434e+06,4.9313e+05,5.5028e+05,0.1262
92.3483,704,1.0424e+06,4.9250e+05,5.4986e+05,0.1219
92.4785,705,1.0413e+06,4.9188e+05,5.4944e+05,0.1233
92.6087,706,1.0403e+06,4.9127e+05,5.4901e+05,0.1234
92.7370,707,1.0392e+06,4.9066e+05,5.4858e+05,0.1217
92.8698,708,1.0382e+06,4.9006e+05,5.4814e+05,0.1256
92.9999,709,1.0372e+06,4.8946e+05,5.4770e+05,0.1229
93.1329,710,1.0361e+06,4.8886e+05,5.4727e+05,0.1258
93.2619,711,1.0351e+06,4.8826e+05,5.4684e+05,0.1223
93.3932,712,1.0341e+06,4.8766e+05,5.4642e+05,0.1241
93.5235,713,1.0331e+06,4.8705e+05,5.4600e+05,0.1236
93.6526,714,1.0320e+06,4.8645e+05,5.4559e+05,0.1223
93.7843,715,1.0310e+06,4.8585e+05,5.4518e+05,0.1249
93.9124,716,1.0300e+06,4.8525e+05,5.4477e+05,0.1214
94.0447,717,1.0290e+06,4.8466e+05,5.4436e+05,0.1251
94.1741,718,1.0280e+06,4.8408e+05,5.4394e+05,0.1224
94.3078,719,1.0270e+06,4.8350e+05,5.4352e+05,0.1268
94.4382,720,1.0260e+06,4.8292e+05,5.4310e+05,0.1233
94.5688,721,1.0250e+06,4.8234e+05,5.4269e+05,0.1234
94.7009,722,1.0240e+06,4.8176e+05,5.4228e+05,0.1252
94.8303,723,1.0230e+06,4.8118e+05,5.4187e+05,0.1228
94.9631,724,1.0221e+06,4.8060e+05,5.4146e+05,0.1256
95.0920,725,1.0211e+06,4.8003e+05,5.4106e+05,0.1220
95.2252,726,1.0201e+06,4.7946e+05,5.4066e+05,0.1265
95.3589,727,1.0192e+06,4.7889e+05,5.4027e+05,0.1224
95.4911,728,1.0182e+06,4.7832e+05,5.3987e+05,0.1251
95.6221,729,1.0172e+06,4.7775e+05,5.3948e+05,0.1243
95.7538,730,1.0163e+06,4.7718e+05,5.3909e+05,0.1247
95.8856,731,1.0153e+06,4.7661e+05,5.3871e+05,0.1249
96.0181,732,1.0144e+06,4.7604e+05,5.3833e+05,0.1254
96.1498,733,1.0134e+06,4.7547e+05,5.3795e+05,0.1246
96.2824,734,1.0125e+06,4.7491e+05,5.3757e+05,0.1257
96.4120,735,1.0115e+06,4.7435e+05,5.3720e+05,0.1228
96.5432,736,1.0106e+06,4.7379e+05,5.3682e+05,0.1242
96.6747,737,1.0097e+06,4.7324e+05,5.3644e+05,0.1244
96.8065,738,1.0087e+06,4.7269e+05,5.3606e+05,0.1246
96.9371,739,1.0078e+06,4.7214e+05,5.3568e+05,0.1235
97.0685,740,1.0069e+06,4.7158e+05,5.3531e+05,0.1246
97.1969,741,1.0060e+06,4.7102e+05,5.3494e+05,0.1215
97.3288,742,1.0050e+06,4.7046e+05,5.3458e+05,0.1250
97.4583,743,1.0041e+06,4.6989e+05,5.3422e+05,0.1223
97.5887,744,1.0032e+06,4.6933e+05,5.3387e+05,0.1237
97.7195,745,1.0023e+06,4.6877e+05,5.3351e+05,0.1240
97.8504,746,1.0014e+06,4.6823e+05,5.3315e+05,0.1241
97.9849,747,1.0005e+06,4.6768e+05,5.3279e+05,0.1273
98.1156,748,9.9957e+05,4.6715e+05,5.3242e+05,0.1234
98.2459,749,9.9867e+05,4.6663e+05,5.3205e+05,0.1235
98.3752,750,9.9779e+05,4.6611e+05,5.3168e+05,0.1221
98.5074,751,9.9690e+05,4.6559e+05,5.3131e+05,0.1253
98.6372,752,9.9602e+05,4.6506e+05,5.3096e+05,0.1222
98.7699,753,9.9514e+05,4.6453e+05,5.3061e+05,0.1251
98.8989,754,9.9427e+05,4.6401e+05,5.3026e+05,0.1216
99.0318,755,9.9340e+05,4.6348e+05,5.2991e+05,0.1254
99.1609,756,9.9253e+05,4.6296e+05,5.2957e+05,0.1221
99.2916,757,9.9167e+05,4.6245e+05,5.2922e+05,0.1240
99.4239,758,9.9081e+05,4.6194e+05,5.2888e+05,0.1247
99.5550,759,9.8996e+05,4.6143e+05,5.2853e+05,0.1243
99.6876,760,9.8910e+05,4.6092e+05,5.2818e+05,0.1255
99.8183,761,9.8826e+05,4.6042e+05,5.2783e+05,0.1237
99.9490,762,9.8741e+05,4.5992e+05,5.2749e+05,0.1238
100.0809,763,9.8657e+05,4.5942e+05,5.2715e+05,0.1247
100.2132,764,9.8573e+05,4.5892e+05,5.2681e+05,0.1253
100.3427,765,9.8489e+05,4.5842e+05,5.2647e+05,0.1225
100.4737,766,9.8405e+05,4.5792e+05,5.2613e+05,0.1243
100.6024,767,9.8321e+05,4.5742e+05,5.2579e+05,0.1220
100.7352,768,9.8238e+05,4.5692e+05,5.2546e+05,0.1259
100.8638,769,9.8154e+05,4.5642e+05,5.2512e+05,0.1218
100.9937,770,9.8071e+05,4.5591e+05,5.2479e+05,0.1232
101.1243,771,9.7988e+05,4.5541e+05,5.2447e+05,0.1237
101.2533,772,9.7905e+05,4.5491e+05,5.2414e+05,0.1223
101.3906,773,9.7823e+05,4.5441e+05,5.2382e+05,0.1301
101.5232,774,9.7741e+05,4.5392e+05,5.2349e+05,0.1254
101.6531,775,9.7659e+05,4.5343e+05,5.2316e+05,0.1229
101.7827,776,9.7577e+05,4.5295e+05,5.2283e+05,0.1228
101.9132,777,9.7497e+05,4.5247e+05,5.2250e+05,0.1234
102.0427,778,9.7416e+05,4.5199e+05,5.2217e+05,0.1225
102.1751,779,9.7336e+05,4.5151e+05,5.2185e+05,0.1253
102.3038,780,9.7257e+05,4.5103e+05,5.2154e+05,0.1219
102.4369,781,9.7178e+05,4.5055e+05,5.2123e+05,0.1259
102.5679,782,9.7099e+05,4.5007e+05,5.2092e+05,0.1240
102.7014,783,9.7021e+05,4.4960e+05,5.2061e+05,0.1263
102.8315,784,9.6943e+05,4.4913e+05,5.2030e+05,0.1228
102.9649,785,9.6865e+05,4.4866e+05,5.1999e+05,0.1262
103.0941,786,9.6787e+05,4.4819e+05,5.1968e+05,0.1221
103.2260,787,9.6710e+05,4.4773e+05,5.1938e+05,0.1249
103.3569,788,9.6633e+05,4.4727e+05,5.1907e+05,0.1239
103.4898,789,9.6556e+05,4.4681e+05,5.1876e+05,0.1254
103.6210,790,9.6479e+05,4.4635e+05,5.1844e+05,0.1241
103.7532,791,9.6402e+05,4.4589e+05,5.1813e+05,0.1250
103.8841,792,9.6326e+05,4.4544e+05,5.1781e+05,0.1238
104.0187,793,9.6249e+05,4.4500e+05,5.1750e+05,0.1268
104.1479,794,9.6174e+05,4.4456e+05,5.1718e+05,0.1219
104.2790,795,9.6098e+05,4.4412e+05,5.1686e+05,0.1239
104.4090,796,9.6022e+05,4.4367e+05,5.1655e+05,0.1228
104.5384,797,9.5947e+05,4.4322e+05,5.1625e+05,0.1224
104.6700,798,9.5872e+05,4.4277e+05,5.1595e+05,0.1247
104.7991,799,9.5796e+05,4.4232e+05,5.1565e+05,0.1221
104.9309,800,9.5722e+05,4.4186e+05,5.1535e+05,0.1250
105.0620,801,9.5647e+05,4.4141e+05,5.1506e+05,0.1216
105.1944,802,9.5572e+05,4.4096e+05,5.1477e+05,0.1254
105.3229,803,9.5498e+05,4.4051e+05,5.1447e+05,0.1219
105.4539,804,9.5424e+05,4.4007e+05,5.1417e+05,0.1238
105.5843,805,9.5351e+05,4.3964e+05,5.1387e+05,0.1235
105.7134,806,9.5278e+05,4.3920e+05,5.1357e+05,0.1223
105.8448,807,9.5204e+05,4.3877e+05,5.1328e+05,0.1245
105.9747,808,9.5131e+05,4.3833e+05,5.1299e+05,0.1231
106.1072,809,9.5058e+05,4.3789e+05,5.1269e+05,0.1252
106.2358,810,9.4986e+05,4.3746e+05,5.1239e+05,0.1216
106.3676,811,9.4913e+05,4.3704e+05,5.1210e+05,0.1249
106.4982,812,9.4841e+05,4.3662e+05,5.1180e+05,0.1220
106.6290,813,9.4769e+05,4.3620e+05,5.1149e+05,0.1239
106.7595,814,9.4697e+05,4.3579e+05,5.1118e+05,0.1233
106.8880,815,9.4626e+05,4.3538e+05,5.1088e+05,0.1215
107.0195,816,9.4554e+05,4.3497e+05,5.1058e+05,0.1239
107.1482,817,9.4483e+05,4.3456e+05,5.1027e+05,0.1218
107.2814,818,9.4412e+05,4.3415e+05,5.0997e+05,0.1261
107.4106,819,9.4342e+05,4.3374e+05,5.0967e+05,0.1221
107.5411,820,9.4272e+05,4.3334e+05,5.0937e+05,0.1235
107.6725,821,9.4202e+05,4.3295e+05,5.0907e+05,0.1247
107.8037,822,9.4132e+05,4.3255e+05,5.0877e+05,0.1244
107.9344,823,9.4063e+05,4.3216e+05,5.0847e+05,0.1240
108.0636,824,9.3994e+05,4.3177e+05,5.0817e+05,0.1225
108.1964,825,9.3926e+05,4.3138e+05,5.0788e+05,0.1253
108.3291,826,9.3857e+05,4.3098e+05,5.0759e+05,0.1248
108.4628,827,9.3788e+05,4.3058e+05,5.0730e+05,0.1257
108.5958,828,9.3720e+05,4.3018e+05,5.0702e+05,0.1256
108.7264,829,9.3651e+05,4.2978e+05,5.0673e+05,0.1235
108.8567,830,9.3583e+05,4.2939e+05,5.0644e+05,0.1235
108.9886,831,9.3515e+05,4.2899e+05,5.0616e+05,0.1251
109.1188,832,9.3447e+05,4.2860e+05,5.0587e+05,0.1232
109.2495,833,9.3379e+05,4.2821e+05,5.0558e+05,0.1237
109.3791,834,9.3312e+05,4.2782e+05,5.0530e+05,0.1227
109.5116,835,9.3244e+05,4.2742e+05,5.0502e+05,0.1256
109.6413,836,9.3177e+05,4.2703e+05,5.0474e+05,0.1222
109.7744,837,9.3110e+05,4.2664e+05,5.0446e+05,0.1260
109.9042,838,9.3043e+05,4.2625e+05,5.0418e+05,0.1229
110.0370,839,9.2977e+05,4.2587e+05,5.0390e+05,0.1257
110.1660,840,9.2910e+05,4.2548e+05,5.0362e+05,0.1222
110.2992,841,9.2844e+05,4.2510e+05,5.0334e+05,0.1263
110.4300,842,9.2778e+05,4.2472e+05,5.0306e+05,0.1237
110.5632,843,9.2713e+05,4.2434e+05,5.0278e+05,0.1255
110.6922,844,9.2647e+05,4.2397e+05,5.0251e+05,0.1220
110.8227,845,9.2582e+05,4.2359e+05,5.0223e+05,0.1238
110.9532,846,9.2517e+05,4.2321e+05,5.0196e+05,0.1235
111.0821,847,9.2452e+05,4.2283e+05,5.0169e+05,0.1220
111.2136,848,9.2388e+05,4.2245e+05,5.0142e+05,0.1243
111.3414,849,9.2323e+05,4.2208e+05,5.0115e+05,0.1208
111.4751,850,9.2259e+05,4.2170e+05,5.0089e+05,0.1266
111.6053,851,9.2195e+05,4.2133e+05,5.0063e+05,0.1230
111.7386,852,9.2131e+05,4.2095e+05,5.0037e+05,0.1260
111.8687,853,9.2068e+05,4.2057e+05,5.0011e+05,0.1232
112.0017,854,9.2004e+05,4.2019e+05,4.9986e+05,0.1260
112.1303,855,9.1941e+05,4.1981e+05,4.9960e+05,0.1217
112.2606,856,9.1878e+05,4.1944e+05,4.9934e+05,0.1236
112.3921,857,9.1816e+05,4.1907e+05,4.9908e+05,0.1246
112.5207,858,9.1753e+05,4.1871e+05,4.9882e+05,0.1217
112.6516,859,9.1690e+05,4.1836e+05,4.9855e+05,0.1241
112.7797,860,9.1628e+05,4.1800e+05,4.9828e+05,0.1214
112.9105,861,9.1566e+05,4.1765e+05,4.9801e+05,0.1240
113.0471,862,9.1504e+05,4.1730e+05,4.9774e+05,0.1203
113.1789,863,9.1442e+05,4.1695e+05,4.9747e+05,0.1249
113.3068,864,9.1381e+05,4.1661e+05,4.9720e+05,0.1210
113.4390,865,9.1319e+05,4.1627e+05,4.9693e+05,0.1252
113.5688,866,9.1258e+05,4.1593e+05,4.9665e+05,0.1228
113.7008,867,9.1197e+05,4.1559e+05,4.9638e+05,0.1247
113.8302,868,9.1136e+05,4.1525e+05,4.9611e+05,0.1227
113.9590,869,9.1075e+05,4.1492e+05,4.9583e+05,0.1221
114.0907,870,9.1014e+05,4.1458e+05,4.9556e+05,0.1246
114.2213,871,9.0954e+05,4.1424e+05,4.9530e+05,0.1234
114.3527,872,9.0894e+05,4.1390e+05,4.9503e+05,0.1246
114.4812,873,9.0834e+05,4.1357e+05,4.9477e+05,0.1213
114.6134,874,9.0774e+05,4.1323e+05,4.9451e+05,0.1247
114.7424,875,9.0714e+05,4.1290e+05,4.9424e+05,0.1220
114.8727,876,9.0655e+05,4.1258e+05,4.9397e+05,0.1236
115.0034,877,9.0596e+05,4.1226e+05,4.9370e+05,0.1240
115.1319,878,9.0537e+05,4.1194e+05,4.9343e+05,0.1217
115.2647,879,9.0478e+05,4.1162e+05,4.9316e+05,0.1259
115.3945,880,9.0419e+05,4.1130e+05,4.9290e+05,0.1232
115.5280,881,9.0361e+05,4.1097e+05,4.9264e+05,0.1261
115.6576,882,9.0303e+05,4.1065e+05,4.9238e+05,0.1225
115.7906,883,9.0245e+05,4.1032e+05,4.9213e+05,0.1258
115.9202,884,9.0187e+05,4.1000e+05,4.9188e+05,0.1228
116.0534,885,9.0130e+05,4.0968e+05,4.9162e+05,0.1258
116.1821,886,9.0072e+05,4.0936e+05,4.9136e+05,0.1220
116.3157,887,9.0015e+05,4.0904e+05,4.9111e+05,0.1261
116.4469,888,8.9957e+05,4.0872e+05,4.9086e+05,0.1240
116.5826,889,8.9900e+05,4.0840e+05,4.9061e+05,0.1285
116.7151,890,8.9843e+05,4.0807e+05,4.9036e+05,0.1254
116.8466,891,8.9786e+05,4.0774e+05,4.9012e+05,0.1241
116.9787,892,8.9730e+05,4.0741e+05,4.8989e+05,0.1251
117.1122,893,8.9673e+05,4.0708e+05,4.8965e+05,0.1260
117.2431,894,8.9616e+05,4.0674e+05,4.8942e+05,0.1235
117.3776,895,8.9560e+05,4.0641e+05,4.8919e+05,0.1267
117.5130,896,8.9503e+05,4.0607e+05,4.8896e+05,0.1280
117.6459,897,8.9447e+05,4.0574e+05,4.8873e+05,0.1226
117.7795,898,8.9390e+05,4.0540e+05,4.8850e+05,0.1263
117.9097,899,8.9334e+05,4.0506e+05,4.8828e+05,0.1229
118.0437,900,8.9278e+05,4.0473e+05,4.8805e+05,0.1258
118.1750,901,8.9222e+05,4.0440e+05,4.8782e+05,0.1228
118.3080,902,8.9166e+05,4.0407e+05,4.8759e+05,0.1255
118.4395,903,8.9111e+05,4.0375e+05,4.8735e+05,0.1244
118.5729,904,8.9055e+05,4.0344e+05,4.8711e+05,0.1261
118.7065,905,8.9000e+05,4.0313e+05,4.8687e+05,0.1257
118.8376,906,8.8944e+05,4.0282e+05,4.8663e+05,0.1239
118.9712,907,8.8889e+05,4.0251e+05,4.8639e+05,0.1261
119.1021,908,8.8835e+05,4.0220e+05,4.8615e+05,0.1234
119.2342,909,8.8780e+05,4.0189e+05,4.8591e+05,0.1250
119.3627,910,8.8726e+05,4.0159e+05,4.8568e+05,0.1214
119.4940,911,8.8672e+05,4.0129e+05,4.8544e+05,0.1240
119.6254,912,8.8619e+05,4.0099e+05,4.8520e+05,0.1244
119.7567,913,8.8565e+05,4.0069e+05,4.8496e+05,0.1242
119.8871,914,8.8512e+05,4.0040e+05,4.8471e+05,0.1235
120.0168,915,8.8459e+05,4.0011e+05,4.8447e+05,0.1228
120.1478,916,8.8406e+05,3.9982e+05,4.8423e+05,0.1239
120.2780,917,8.8353e+05,3.9953e+05,4.8400e+05,0.1231
120.4094,918,8.8300e+05,3.9924e+05,4.8376e+05,0.1241
120.5384,919,8.8248e+05,3.9896e+05,4.8352e+05,0.1219
120.6698,920,8.8196e+05,3.9868e+05,4.8328e+05,0.1243
120.8002,921,8.8143e+05,3.9840e+05,4.8303e+05,0.1234
120.9303,922,8.8091e+05,3.9812e+05,4.8279e+05,0.1232
121.0615,923,8.8039e+05,3.9785e+05,4.8255e+05,0.1241
121.1899,924,8.7987e+05,3.9757e+05,4.8230e+05,0.1216
121.3224,925,8.7935e+05,3.9729e+05,4.8207e+05,0.1254
121.4521,926,8.7884e+05,3.9701e+05,4.8183e+05,0.1227
121.5863,927,8.7832e+05,3.9673e+05,4.8159e+05,0.1266
121.7145,928,8.7781e+05,3.9645e+05,4.8135e+05,0.1212
121.8455,929,8.7729e+05,3.9618e+05,4.8111e+05,0.1238
121.9755,930,8.7678e+05,3.9591e+05,4.8087e+05,0.1231
122.1050,931,8.7627e+05,3.9564e+05,4.8063e+05,0.1224
122.2372,932,8.7576e+05,3.9537e+05,4.8040e+05,0.1249
122.3674,933,8.7526e+05,3.9509e+05,4.8017e+05,0.1235
122.4996,934,8.7475e+05,3.9481e+05,4.7994e+05,0.1249
122.6305,935,8.7425e+05,3.9453e+05,4.7972e+05,0.1234
122.7632,936,8.7375e+05,3.9425e+05,4.7949e+05,0.1255
122.8907,937,8.7325e+05,3.9398e+05,4.7927e+05,0.1208
123.0260,938,8.7275e+05,3.9370e+05,4.7905e+05,0.1284
123.1544,939,8.7226e+05,3.9342e+05,4.7883e+05,0.1215
123.2861,940,8.7176e+05,3.9315e+05,4.7861e+05,0.1249
123.4162,941,8.7127e+05,3.9287e+05,4.7839e+05,0.1233
123.5458,942,8.7077e+05,3.9260e+05,4.7817e+05,0.1229
123.6770,943,8.7028e+05,3.9233e+05,4.7795e+05,0.1239
123.8056,944,8.6978e+05,3.9206e+05,4.7773e+05,0.1220
123.9370,945,8.6929e+05,3.9179e+05,4.7750e+05,0.1246
124.0656,946,8.6880e+05,3.9152e+05,4.7728e+05,0.1218
124.1969,947,8.6831e+05,3.9125e+05,4.7706e+05,0.1246
124.3284,948,8.6783e+05,3.9098e+05,4.7684e+05,0.1243
124.4587,949,8.6734e+05,3.9071e+05,4.7662e+05,0.1233
124.5899,950,8.6685e+05,3.9044e+05,4.7641e+05,0.1246
124.7198,951,8.6636e+05,3.9017e+05,4.7619e+05,0.1228
124.8530,952,8.6587e+05,3.8990e+05,4.7597e+05,0.1260
124.9824,953,8.6539e+05,3.8963e+05,4.7576e+05,0.1222
125.1143,954,8.6491e+05,3.8937e+05,4.7554e+05,0.1250
125.2430,955,8.6443e+05,3.8911e+05,4.7532e+05,0.1217
125.3751,956,8.6395e+05,3.8885e+05,4.7510e+05,0.1253
125.5033,957,8.6347e+05,3.8860e+05,4.7487e+05,0.1216
125.6338,958,8.6299e+05,3.8834e+05,4.7465e+05,0.1238
125.7645,959,8.6252e+05,3.8809e+05,4.7443e+05,0.1238
125.8931,960,8.6204e+05,3.8783e+05,4.7421e+05,0.1220
126.0244,961,8.6156e+05,3.8757e+05,4.7399e+05,0.1245
126.1527,962,8.6109e+05,3.8732e+05,4.7378e+05,0.1215
126.2854,963,8.6062e+05,3.8706e+05,4.7356e+05,0.1256
126.4162,964,8.6015e+05,3.8681e+05,4.7335e+05,0.1240
126.5467,965,8.5969e+05,3.8656e+05,4.7313e+05,0.1236
126.6771,966,8.5923e+05,3.8631e+05,4.7292e+05,0.1235
126.8069,967,8.5877e+05,3.8606e+05,4.7270e+05,0.1231
126.9382,968,8.5831e+05,3.8582e+05,4.7249e+05,0.1242
127.0671,969,8.5785e+05,3.8557e+05,4.7228e+05,0.1222
127.1998,970,8.5739e+05,3.8532e+05,4.7207e+05,0.1258
127.3299,971,8.5693e+05,3.8507e+05,4.7186e+05,0.1218
127.4636,972,8.5648e+05,3.8482e+05,4.7166e+05,0.1261
127.5939,973,8.5602e+05,3.8457e+05,4.7145e+05,0.1230
127.7313,974,8.5557e+05,3.8431e+05,4.7125e+05,0.1303
127.8600,975,8.5511e+05,3.8406e+05,4.7105e+05,0.1217
127.9909,976,8.5466e+05,3.8381e+05,4.7085e+05,0.1240
128.1206,977,8.5421e+05,3.8355e+05,4.7066e+05,0.1227
128.2532,978,8.5376e+05,3.8329e+05,4.7046e+05,0.1256
128.3832,979,8.5331e+05,3.8304e+05,4.7027e+05,0.1228
128.5162,980,8.5287e+05,3.8278e+05,4.7008e+05,0.1259
128.6452,981,8.5242e+05,3.8253e+05,4.6990e+05,0.1221
128.7757,982,8.5198e+05,3.8227e+05,4.6971e+05,0.1235
128.9090,983,8.5154e+05,3.8202e+05,4.6952e+05,0.1216
129.0425,984,8.5110e+05,3.8176e+05,4.6933e+05,0.1259
129.1726,985,8.5066e+05,3.8151e+05,4.6915e+05,0.1233
129.3044,986,8.5022e+05,3.8125e+05,4.6897e+05,0.1242
129.4347,987,8.4978e+05,3.8099e+05,4.6880e+05,0.1235
129.5653,988,8.4935e+05,3.8073e+05,4.6862e+05,0.1238
129.6956,989,8.4891e+05,3.8048e+05,4.6844e+05,0.1235
129.8253,990,8.4848e+05,3.8023e+05,4.6825e+05,0.1227
129.9590,991,8.4805e+05,3.7998e+05,4.6807e+05,0.1264
130.0890,992,8.4761e+05,3.7974e+05,4.6788e+05,0.1233
130.2206,993,8.4718e+05,3.7950e+05,4.6769e+05,0.1244
130.3481,994,8.4675e+05,3.7925e+05,4.6750e+05,0.1207
130.4786,995,8.4632e+05,3.7901e+05,4.6731e+05,0.1237
130.6092,996,8.4589e+05,3.7877e+05,4.6712e+05,0.1237
130.7378,997,8.4546e+05,3.7853e+05,4.6694e+05,0.1218
130.8701,998,8.4503e+05,3.7828e+05,4.6675e+05,0.1255
130.9987,999,8.4460e+05,3.7804e+05,4.6657e+05,0.1218
