run_time,iteration,loss,style_loss,content_loss,time
0.1182,0,5.6151e+08,5.6151e+08,0.0000e+00,0.1181
0.2513,1,4.2587e+08,4.2551e+08,3.6092e+05,0.1247
0.3805,2,2.7350e+08,2.7270e+08,7.9251e+05,0.1222
0.5122,3,1.9962e+08,1.9851e+08,1.1061e+06,0.1245
0.6426,4,1.7537e+08,1.7415e+08,1.2186e+06,0.1232
0.7742,5,1.4889e+08,1.4766e+08,1.2282e+06,0.1246
0.9078,6,1.3312e+08,1.3188e+08,1.2435e+06,0.1265
1.0414,7,1.2500e+08,1.2370e+08,1.2979e+06,0.1265
1.1713,8,1.1704e+08,1.1565e+08,1.3859e+06,0.1229
1.3048,9,1.0915e+08,1.0767e+08,1.4865e+06,0.1261
1.4337,10,1.0275e+08,1.0117e+08,1.5810e+06,0.1220
1.5644,11,9.7310e+07,9.5654e+07,1.6552e+06,0.1235
1.6955,12,9.1514e+07,8.9812e+07,1.7021e+06,0.1242
1.8260,13,8.5096e+07,8.3377e+07,1.7191e+06,0.1236
1.9573,14,7.8867e+07,7.7152e+07,1.7148e+06,0.1242
2.0876,15,7.3594e+07,7.1895e+07,1.6995e+06,0.1233
2.2221,16,6.9366e+07,6.7685e+07,1.6805e+06,0.1272
2.3545,17,6.5841e+07,6.4177e+07,1.6640e+06,0.1253
2.4871,18,6.2656e+07,6.1003e+07,1.6538e+06,0.1256
2.6202,19,5.9673e+07,5.8023e+07,1.6504e+06,0.1259
2.7518,20,5.6936e+07,5.5283e+07,1.6537e+06,0.1246
2.8858,21,5.4514e+07,5.2854e+07,1.6601e+06,0.1265
3.0157,22,5.2391e+07,5.0723e+07,1.6677e+06,0.1226
3.1511,23,5.0512e+07,4.8837e+07,1.6745e+06,0.1282
3.2812,24,4.8826e+07,4.7147e+07,1.6783e+06,0.1227
3.4190,25,4.7350e+07,4.5672e+07,1.6785e+06,0.1305
3.5517,26,4.6123e+07,4.4448e+07,1.6753e+06,0.1257
3.6824,27,4.5126e+07,4.3455e+07,1.6709e+06,0.1236
3.8166,28,4.4277e+07,4.2611e+07,1.6658e+06,0.1268
3.9477,29,4.3475e+07,4.1814e+07,1.6611e+06,0.1238
4.0806,30,4.2631e+07,4.0973e+07,1.6577e+06,0.1256
4.2102,31,4.1740e+07,4.0085e+07,1.6553e+06,0.1224
4.3426,32,4.0842e+07,3.9189e+07,1.6537e+06,0.1252
4.4719,33,3.9983e+07,3.8330e+07,1.6534e+06,0.1224
4.6021,34,3.9203e+07,3.7549e+07,1.6534e+06,0.1234
4.7340,35,3.8495e+07,3.6841e+07,1.6532e+06,0.1249
4.8658,36,3.7830e+07,3.6178e+07,1.6523e+06,0.1244
4.9975,37,3.7191e+07,3.5540e+07,1.6515e+06,0.1246
5.1274,38,3.6567e+07,3.4916e+07,1.6508e+06,0.1229
5.2596,39,3.5971e+07,3.4320e+07,1.6508e+06,0.1246
5.3888,40,3.5421e+07,3.3769e+07,1.6515e+06,0.1224
5.5205,41,3.4927e+07,3.3274e+07,1.6531e+06,0.1246
5.6488,42,3.4474e+07,3.2818e+07,1.6555e+06,0.1213
5.7807,43,3.4041e+07,3.2382e+07,1.6589e+06,0.1249
5.9118,44,3.3605e+07,3.1942e+07,1.6627e+06,0.1240
6.0452,45,3.3156e+07,3.1489e+07,1.6671e+06,0.1259
6.1751,46,3.2697e+07,3.1026e+07,1.6710e+06,0.1229
6.3076,47,3.2242e+07,3.0568e+07,1.6736e+06,0.1253
6.4372,48,3.1805e+07,3.0130e+07,1.6748e+06,0.1226
6.5683,49,3.1384e+07,2.9711e+07,1.6739e+06,0.1241
6.6997,50,3.0982e+07,2.9312e+07,1.6708e+06,0.1244
6.8307,51,3.0593e+07,2.8927e+07,1.6656e+06,0.1238
6.9624,52,3.0211e+07,2.8552e+07,1.6587e+06,0.1245
7.0937,53,2.9834e+07,2.8182e+07,1.6512e+06,0.1240
7.2261,54,2.9458e+07,2.7814e+07,1.6439e+06,0.1250
7.3572,55,2.9087e+07,2.7450e+07,1.6371e+06,0.1239
7.4890,56,2.8718e+07,2.7086e+07,1.6316e+06,0.1247
7.6185,57,2.8346e+07,2.6719e+07,1.6276e+06,0.1226
7.7509,58,2.7970e+07,2.6344e+07,1.6256e+06,0.1254
7.8823,59,2.7594e+07,2.5969e+07,1.6249e+06,0.1242
8.0154,60,2.7224e+07,2.5598e+07,1.6258e+06,0.1255
8.1456,61,2.6866e+07,2.5237e+07,1.6281e+06,0.1229
8.2791,62,2.6523e+07,2.4892e+07,1.6308e+06,0.1259
8.4120,63,2.6199e+07,2.4565e+07,1.6333e+06,0.1256
8.5455,64,2.5891e+07,2.4256e+07,1.6350e+06,0.1260
8.6798,65,2.5589e+07,2.3954e+07,1.6352e+06,0.1268
8.8108,66,2.5287e+07,2.3653e+07,1.6340e+06,0.1237
8.9451,67,2.4983e+07,2.3352e+07,1.6309e+06,0.1269
9.0750,68,2.4678e+07,2.3051e+07,1.6264e+06,0.1226
9.2077,69,2.4377e+07,2.2756e+07,1.6206e+06,0.1256
9.3370,70,2.4091e+07,2.2476e+07,1.6143e+06,0.1222
9.4700,71,2.3823e+07,2.2215e+07,1.6079e+06,0.1258
9.6000,72,2.3570e+07,2.1968e+07,1.6020e+06,0.1229
9.7333,73,2.3328e+07,2.1731e+07,1.5966e+06,0.1262
9.8624,74,2.3089e+07,2.1496e+07,1.5925e+06,0.1221
9.9944,75,2.2847e+07,2.1257e+07,1.5896e+06,0.1249
10.1264,76,2.2600e+07,2.1012e+07,1.5880e+06,0.1250
10.2618,77,2.2352e+07,2.0764e+07,1.5874e+06,0.1280
10.3950,78,2.2106e+07,2.0519e+07,1.5874e+06,0.1215
10.5301,79,2.1868e+07,2.0280e+07,1.5879e+06,0.1276
10.6633,80,2.1636e+07,2.0048e+07,1.5884e+06,0.1255
10.7957,81,2.1410e+07,1.9821e+07,1.5883e+06,0.1251
10.9286,82,2.1185e+07,1.9597e+07,1.5874e+06,0.1253
11.0592,83,2.0956e+07,1.9371e+07,1.5855e+06,0.1233
11.1935,84,2.0726e+07,1.9144e+07,1.5826e+06,0.1271
11.3244,85,2.0498e+07,1.8919e+07,1.5791e+06,0.1236
11.4570,86,2.0275e+07,1.8700e+07,1.5750e+06,0.1253
11.5868,87,2.0061e+07,1.8490e+07,1.5707e+06,0.1229
11.7209,88,1.9855e+07,1.8288e+07,1.5664e+06,0.1263
11.8510,89,1.9654e+07,1.8091e+07,1.5625e+06,0.1228
11.9837,90,1.9455e+07,1.7896e+07,1.5591e+06,0.1253
12.1134,91,1.9256e+07,1.7700e+07,1.5564e+06,0.1227
12.2464,92,1.9058e+07,1.7503e+07,1.5546e+06,0.1258
12.3766,93,1.8863e+07,1.7310e+07,1.5537e+06,0.1226
12.5080,94,1.8674e+07,1.7121e+07,1.5535e+06,0.1244
12.6397,95,1.8492e+07,1.6938e+07,1.5536e+06,0.1249
12.7718,96,1.8315e+07,1.6761e+07,1.5540e+06,0.1250
12.9047,97,1.8139e+07,1.6585e+07,1.5542e+06,0.1241
13.0383,98,1.7962e+07,1.6408e+07,1.5540e+06,0.1264
13.1681,99,1.7782e+07,1.6229e+07,1.5532e+06,0.1227
13.3009,100,1.7598e+07,1.6047e+07,1.5519e+06,0.1253
13.4314,101,1.7413e+07,1.5863e+07,1.5497e+06,0.1229
13.5663,102,1.7229e+07,1.5682e+07,1.5471e+06,0.1276
13.6954,103,1.7050e+07,1.5505e+07,1.5442e+06,0.1217
13.8279,104,1.6874e+07,1.5333e+07,1.5412e+06,0.1253
13.9581,105,1.6702e+07,1.5164e+07,1.5384e+06,0.1230
14.0894,106,1.6532e+07,1.4996e+07,1.5360e+06,0.1244
14.2208,107,1.6361e+07,1.4828e+07,1.5338e+06,0.1245
14.3525,108,1.6190e+07,1.4658e+07,1.5321e+06,0.1242
14.4842,109,1.6021e+07,1.4490e+07,1.5308e+06,0.1249
14.6158,110,1.5854e+07,1.4324e+07,1.5297e+06,0.1246
14.7475,111,1.5691e+07,1.4162e+07,1.5287e+06,0.1246
14.8793,112,1.5534e+07,1.4006e+07,1.5277e+06,0.1242
15.0106,113,1.5381e+07,1.3854e+07,1.5263e+06,0.1242
15.1419,114,1.5231e+07,1.3706e+07,1.5247e+06,0.1244
15.2753,115,1.5084e+07,1.3561e+07,1.5227e+06,0.1263
15.4103,116,1.4938e+07,1.3418e+07,1.5204e+06,0.1263
15.5397,117,1.4796e+07,1.3278e+07,1.5178e+06,0.1220
15.6717,118,1.4656e+07,1.3141e+07,1.5148e+06,0.1251
15.8012,119,1.4518e+07,1.3006e+07,1.5117e+06,0.1228
15.9338,120,1.4380e+07,1.2872e+07,1.5086e+06,0.1255
16.0672,121,1.4241e+07,1.2735e+07,1.5056e+06,0.1260
16.1997,122,1.4101e+07,1.2598e+07,1.5028e+06,0.1253
16.3298,123,1.3959e+07,1.2459e+07,1.5002e+06,0.1227
16.4622,124,1.3818e+07,1.2321e+07,1.4978e+06,0.1255
16.5927,125,1.3681e+07,1.2185e+07,1.4957e+06,0.1237
16.7241,126,1.3548e+07,1.2054e+07,1.4938e+06,0.1244
16.8557,127,1.3421e+07,1.1929e+07,1.4919e+06,0.1245
16.9867,128,1.3298e+07,1.1808e+07,1.4899e+06,0.1242
17.1185,129,1.3177e+07,1.1689e+07,1.4878e+06,0.1248
17.2492,130,1.3055e+07,1.1570e+07,1.4855e+06,0.1234
17.3809,131,1.2934e+07,1.1451e+07,1.4828e+06,0.1246
17.5127,132,1.2813e+07,1.1333e+07,1.4801e+06,0.1239
17.6459,133,1.2693e+07,1.1216e+07,1.4772e+06,0.1255
17.7758,134,1.2577e+07,1.1102e+07,1.4743e+06,0.1228
17.9095,135,1.2464e+07,1.0993e+07,1.4715e+06,0.1263
18.0401,136,1.2355e+07,1.0886e+07,1.4688e+06,0.1235
18.1723,137,1.2247e+07,1.0781e+07,1.4661e+06,0.1248
18.3039,138,1.2139e+07,1.0675e+07,1.4637e+06,0.1247
18.4360,139,1.2030e+07,1.0568e+07,1.4614e+06,0.1248
18.5660,140,1.1920e+07,1.0460e+07,1.4593e+06,0.1229
18.6986,141,1.1809e+07,1.0352e+07,1.4573e+06,0.1253
18.8280,142,1.1700e+07,1.0245e+07,1.4555e+06,0.1225
18.9607,143,1.1593e+07,1.0139e+07,1.4536e+06,0.1257
19.0910,144,1.1488e+07,1.0037e+07,1.4515e+06,0.1228
19.2279,145,1.1385e+07,9.9353e+06,1.4493e+06,0.1295
19.3648,146,1.1282e+07,9.8350e+06,1.4468e+06,0.1251
19.4965,147,1.1180e+07,9.7361e+06,1.4441e+06,0.1243
19.6313,148,1.1080e+07,9.6388e+06,1.4414e+06,0.1270
19.7623,149,1.0982e+07,9.5438e+06,1.4385e+06,0.1239
19.8963,150,1.0887e+07,9.4510e+06,1.4356e+06,0.1266
20.0267,151,1.0793e+07,9.3603e+06,1.4327e+06,0.1229
20.1607,152,1.0701e+07,9.2711e+06,1.4300e+06,0.1268
20.2939,153,1.0610e+07,9.1827e+06,1.4275e+06,0.1259
20.4270,154,1.0519e+07,9.0941e+06,1.4251e+06,0.1258
20.5608,155,1.0429e+07,9.0057e+06,1.4230e+06,0.1265
20.6913,156,1.0339e+07,8.9184e+06,1.4208e+06,0.1235
20.8234,157,1.0251e+07,8.8328e+06,1.4186e+06,0.1248
20.9543,158,1.0165e+07,8.7490e+06,1.4162e+06,0.1240
21.0854,159,1.0081e+07,8.6670e+06,1.4137e+06,0.1241
21.2159,160,9.9970e+06,8.5860e+06,1.4109e+06,0.1235
21.3511,161,9.9131e+06,8.5052e+06,1.4080e+06,0.1283
21.4816,162,9.8287e+06,8.4239e+06,1.4048e+06,0.1233
21.6124,163,9.7437e+06,8.3423e+06,1.4015e+06,0.1240
21.7438,164,9.6590e+06,8.2609e+06,1.3980e+06,0.1245
21.8764,165,9.5754e+06,8.1807e+06,1.3948e+06,0.1254
22.0079,166,9.4937e+06,8.1020e+06,1.3917e+06,0.1246
22.1399,167,9.4140e+06,8.0249e+06,1.3891e+06,0.1247
22.2714,168,9.3359e+06,7.9490e+06,1.3869e+06,0.1245
22.4089,169,9.2584e+06,7.8733e+06,1.3852e+06,0.1257
22.5399,170,9.1813e+06,7.7976e+06,1.3838e+06,0.1238
22.6745,171,9.1051e+06,7.7224e+06,1.3827e+06,0.1272
22.8053,172,9.0301e+06,7.6483e+06,1.3818e+06,0.1237
22.9390,173,8.9568e+06,7.5759e+06,1.3809e+06,0.1264
23.0701,174,8.8850e+06,7.5050e+06,1.3800e+06,0.1240
23.2040,175,8.8141e+06,7.4352e+06,1.3789e+06,0.1264
23.3366,176,8.7438e+06,7.3664e+06,1.3774e+06,0.1252
23.4772,177,8.6737e+06,7.2980e+06,1.3757e+06,0.1333
23.6116,178,8.6042e+06,7.2305e+06,1.3736e+06,0.1267
23.7442,179,8.5361e+06,7.1647e+06,1.3714e+06,0.1254
23.8764,180,8.4703e+06,7.1012e+06,1.3691e+06,0.1249
24.0091,181,8.4065e+06,7.0397e+06,1.3668e+06,0.1256
24.1391,182,8.3445e+06,6.9799e+06,1.3646e+06,0.1229
24.2713,183,8.2833e+06,6.9206e+06,1.3627e+06,0.1249
24.4027,184,8.2221e+06,6.8611e+06,1.3611e+06,0.1246
24.5353,185,8.1605e+06,6.8007e+06,1.3598e+06,0.1252
24.6654,186,8.0987e+06,6.7400e+06,1.3587e+06,0.1232
24.7965,187,8.0377e+06,6.6799e+06,1.3578e+06,0.1241
24.9281,188,7.9782e+06,6.6212e+06,1.3569e+06,0.1246
25.0594,189,7.9204e+06,6.5645e+06,1.3559e+06,0.1244
25.1925,190,7.8641e+06,6.5093e+06,1.3548e+06,0.1259
25.3250,191,7.8088e+06,6.4553e+06,1.3535e+06,0.1252
25.4565,192,7.7534e+06,6.4015e+06,1.3519e+06,0.1241
25.5885,193,7.6976e+06,6.3478e+06,1.3499e+06,0.1253
25.7200,194,7.6417e+06,6.2941e+06,1.3475e+06,0.1246
25.8513,195,7.5862e+06,6.2412e+06,1.3450e+06,0.1244
25.9823,196,7.5316e+06,6.1893e+06,1.3423e+06,0.1242
26.1136,197,7.4781e+06,6.1386e+06,1.3395e+06,0.1238
26.2448,198,7.4253e+06,6.0885e+06,1.3368e+06,0.1242
26.3753,199,7.3727e+06,6.0384e+06,1.3343e+06,0.1235
26.5078,200,7.3203e+06,5.9882e+06,1.3321e+06,0.1253
26.6405,201,7.2681e+06,5.9380e+06,1.3301e+06,0.1236
26.7725,202,7.2163e+06,5.8879e+06,1.3284e+06,0.1247
26.9035,203,7.1652e+06,5.8382e+06,1.3270e+06,0.1239
27.0358,204,7.1149e+06,5.7891e+06,1.3258e+06,0.1252
27.1654,205,7.0652e+06,5.7404e+06,1.3247e+06,0.1228
27.2980,206,7.0158e+06,5.6922e+06,1.3237e+06,0.1251
27.4323,207,6.9670e+06,5.6445e+06,1.3225e+06,0.1274
27.5631,208,6.9187e+06,5.5974e+06,1.3213e+06,0.1236
27.6944,209,6.8715e+06,5.5516e+06,1.3199e+06,0.1244
27.8257,210,6.8254e+06,5.5071e+06,1.3183e+06,0.1245
27.9583,211,6.7805e+06,5.4639e+06,1.3167e+06,0.1254
28.0900,212,6.7363e+06,5.4214e+06,1.3149e+06,0.1248
28.2210,213,6.6922e+06,5.3790e+06,1.3132e+06,0.1242
28.3560,214,6.6476e+06,5.3363e+06,1.3114e+06,0.1276
28.4939,215,6.6027e+06,5.2931e+06,1.3096e+06,0.1274
28.6274,216,6.5581e+06,5.2502e+06,1.3079e+06,0.1252
28.7620,217,6.5143e+06,5.2081e+06,1.3062e+06,0.1270
28.8975,218,6.4716e+06,5.1672e+06,1.3045e+06,0.1271
29.0276,219,6.4302e+06,5.1275e+06,1.3027e+06,0.1231
29.1614,220,6.3895e+06,5.0887e+06,1.3008e+06,0.1253
29.2911,221,6.3493e+06,5.0504e+06,1.2989e+06,0.1225
29.4240,222,6.3093e+06,5.0124e+06,1.2969e+06,0.1256
29.5533,223,6.2696e+06,4.9747e+06,1.2949e+06,0.1222
29.6856,224,6.2303e+06,4.9375e+06,1.2928e+06,0.1251
29.8154,225,6.1916e+06,4.9009e+06,1.2907e+06,0.1229
29.9485,226,6.1537e+06,4.8649e+06,1.2887e+06,0.1258
30.0791,227,6.1160e+06,4.8292e+06,1.2868e+06,0.1237
30.2127,228,6.0784e+06,4.7934e+06,1.2850e+06,0.1264
30.3422,229,6.0404e+06,4.7571e+06,1.2833e+06,0.1227
30.4764,230,6.0021e+06,4.7205e+06,1.2816e+06,0.1268
30.6058,231,5.9640e+06,4.6840e+06,1.2800e+06,0.1225
30.7394,232,5.9265e+06,4.6481e+06,1.2784e+06,0.1263
30.8691,233,5.8897e+06,4.6129e+06,1.2768e+06,0.1229
31.0010,234,5.8533e+06,4.5782e+06,1.2751e+06,0.1247
31.1320,235,5.8170e+06,4.5439e+06,1.2731e+06,0.1238
31.2638,236,5.7808e+06,4.5098e+06,1.2710e+06,0.1247
31.3957,237,5.7449e+06,4.4760e+06,1.2689e+06,0.1247
31.5299,238,5.7096e+06,4.4429e+06,1.2667e+06,0.1246
31.6593,239,5.6754e+06,4.4108e+06,1.2646e+06,0.1222
31.7927,240,5.6422e+06,4.3796e+06,1.2625e+06,0.1258
31.9230,241,5.6097e+06,4.3491e+06,1.2606e+06,0.1234
32.0542,242,5.5775e+06,4.3187e+06,1.2589e+06,0.1243
32.1856,243,5.5454e+06,4.2881e+06,1.2572e+06,0.1243
32.3175,244,5.5129e+06,4.2572e+06,1.2557e+06,0.1249
32.4490,245,5.4805e+06,4.2262e+06,1.2543e+06,0.1248
32.5804,246,5.4485e+06,4.1956e+06,1.2529e+06,0.1245
32.7123,247,5.4171e+06,4.1656e+06,1.2514e+06,0.1249
32.8432,248,5.3863e+06,4.1365e+06,1.2499e+06,0.1242
32.9741,249,5.3561e+06,4.1080e+06,1.2481e+06,0.1239
33.1050,250,5.3261e+06,4.0800e+06,1.2461e+06,0.1239
33.2386,251,5.2964e+06,4.0523e+06,1.2441e+06,0.1261
33.3707,252,5.2671e+06,4.0252e+06,1.2419e+06,0.1252
33.5082,253,5.2384e+06,3.9987e+06,1.2396e+06,0.1305
33.6413,254,5.2103e+06,3.9729e+06,1.2374e+06,0.1259
33.7710,255,5.1826e+06,3.9473e+06,1.2352e+06,0.1228
33.9039,256,5.1549e+06,3.9217e+06,1.2332e+06,0.1252
34.0331,257,5.1272e+06,3.8959e+06,1.2313e+06,0.1222
34.1655,258,5.0997e+06,3.8701e+06,1.2296e+06,0.1252
34.2944,259,5.0725e+06,3.8445e+06,1.2280e+06,0.1218
34.4271,260,5.0458e+06,3.8193e+06,1.2265e+06,0.1258
34.5624,261,5.0196e+06,3.7947e+06,1.2249e+06,0.1217
34.6954,262,4.9940e+06,3.7706e+06,1.2233e+06,0.1255
34.8252,263,4.9684e+06,3.7467e+06,1.2217e+06,0.1228
34.9582,264,4.9428e+06,3.7229e+06,1.2199e+06,0.1260
35.0883,265,4.9171e+06,3.6991e+06,1.2180e+06,0.1228
35.2213,266,4.8914e+06,3.6754e+06,1.2160e+06,0.1258
35.3509,267,4.8662e+06,3.6522e+06,1.2140e+06,0.1227
35.4833,268,4.8414e+06,3.6295e+06,1.2119e+06,0.1253
35.6145,269,4.8170e+06,3.6071e+06,1.2099e+06,0.1243
35.7482,270,4.7929e+06,3.5849e+06,1.2080e+06,0.1267
35.8793,271,4.7687e+06,3.5626e+06,1.2061e+06,0.1241
36.0117,272,4.7444e+06,3.5400e+06,1.2044e+06,0.1246
36.1426,273,4.7204e+06,3.5176e+06,1.2027e+06,0.1240
36.2757,274,4.6967e+06,3.4955e+06,1.2012e+06,0.1257
36.4075,275,4.6735e+06,3.4739e+06,1.1996e+06,0.1246
36.5395,276,4.6507e+06,3.4527e+06,1.1979e+06,0.1251
36.6708,277,4.6283e+06,3.4320e+06,1.1962e+06,0.1243
36.8027,278,4.6060e+06,3.4115e+06,1.1945e+06,0.1251
36.9322,279,4.5839e+06,3.3912e+06,1.1926e+06,0.1227
37.0645,280,4.5619e+06,3.3712e+06,1.1907e+06,0.1255
37.1954,281,4.5402e+06,3.3514e+06,1.1888e+06,0.1240
37.3282,282,4.5187e+06,3.3319e+06,1.1867e+06,0.1257
37.4585,283,4.4972e+06,3.3125e+06,1.1848e+06,0.1236
37.5909,284,4.4758e+06,3.2930e+06,1.1828e+06,0.1257
37.7202,285,4.4544e+06,3.2734e+06,1.1810e+06,0.1223
37.8525,286,4.4331e+06,3.2539e+06,1.1792e+06,0.1253
37.9818,287,4.4121e+06,3.2347e+06,1.1774e+06,0.1225
38.1147,288,4.3915e+06,3.2158e+06,1.1757e+06,0.1258
38.2443,289,4.3711e+06,3.1971e+06,1.1740e+06,0.1228
38.3759,290,4.3509e+06,3.1788e+06,1.1722e+06,0.1243
38.5104,291,4.3308e+06,3.1605e+06,1.1703e+06,0.1280
38.6426,292,4.3107e+06,3.1422e+06,1.1684e+06,0.1250
38.7718,293,4.2906e+06,3.1241e+06,1.1665e+06,0.1224
38.9049,294,4.2709e+06,3.1064e+06,1.1645e+06,0.1250
39.0349,295,4.2514e+06,3.0890e+06,1.1624e+06,0.1231
39.1671,296,4.2324e+06,3.0721e+06,1.1603e+06,0.1250
39.2988,297,4.2135e+06,3.0553e+06,1.1583e+06,0.1237
39.4331,298,4.1947e+06,3.0384e+06,1.1563e+06,0.1272
39.5644,299,4.1757e+06,3.0215e+06,1.1542e+06,0.1242
39.6995,300,4.1568e+06,3.0046e+06,1.1522e+06,0.1273
39.8311,301,4.1381e+06,2.9879e+06,1.1502e+06,0.1236
39.9628,302,4.1196e+06,2.9714e+06,1.1482e+06,0.1246
40.0934,303,4.1014e+06,2.9552e+06,1.1462e+06,0.1235
40.2253,304,4.0835e+06,2.9393e+06,1.1442e+06,0.1248
40.3544,305,4.0656e+06,2.9235e+06,1.1421e+06,0.1223
40.4889,306,4.0480e+06,2.9079e+06,1.1401e+06,0.1276
40.6209,307,4.0306e+06,2.8926e+06,1.1380e+06,0.1252
40.7539,308,4.0135e+06,2.8775e+06,1.1360e+06,0.1256
40.8843,309,3.9966e+06,2.8627e+06,1.1339e+06,0.1235
41.0163,310,3.9798e+06,2.8478e+06,1.1320e+06,0.1250
41.1461,311,3.9630e+06,2.8330e+06,1.1300e+06,0.1231
41.2785,312,3.9461e+06,2.8180e+06,1.1281e+06,0.1253
41.4082,313,3.9292e+06,2.8030e+06,1.1262e+06,0.1226
41.5414,314,3.9124e+06,2.7881e+06,1.1243e+06,0.1262
41.6712,315,3.8959e+06,2.7735e+06,1.1224e+06,0.1228
41.8040,316,3.8796e+06,2.7592e+06,1.1204e+06,0.1258
41.9351,317,3.8634e+06,2.7451e+06,1.1184e+06,0.1241
42.0700,318,3.8473e+06,2.7311e+06,1.1162e+06,0.1279
42.2000,319,3.8312e+06,2.7172e+06,1.1141e+06,0.1229
42.3330,320,3.8153e+06,2.7033e+06,1.1119e+06,0.1259
42.4634,321,3.7995e+06,2.6897e+06,1.1098e+06,0.1235
42.5958,322,3.7839e+06,2.6762e+06,1.1078e+06,0.1254
42.7254,323,3.7686e+06,2.6628e+06,1.1058e+06,0.1227
42.8583,324,3.7534e+06,2.6495e+06,1.1039e+06,0.1258
42.9891,325,3.7382e+06,2.6361e+06,1.1021e+06,0.1239
43.1213,326,3.7231e+06,2.6228e+06,1.1003e+06,0.1251
43.2507,327,3.7081e+06,2.6095e+06,1.0986e+06,0.1225
43.3838,328,3.6933e+06,2.5964e+06,1.0969e+06,0.1259
43.5190,329,3.6786e+06,2.5834e+06,1.0952e+06,0.1284
43.6511,330,3.6640e+06,2.5707e+06,1.0933e+06,0.1251
43.7811,331,3.6495e+06,2.5580e+06,1.0914e+06,0.1230
43.9149,332,3.6350e+06,2.5455e+06,1.0895e+06,0.1270
44.0455,333,3.6206e+06,2.5332e+06,1.0874e+06,0.1238
44.1791,334,3.6064e+06,2.5211e+06,1.0853e+06,0.1262
44.3105,335,3.5924e+06,2.5092e+06,1.0832e+06,0.1246
44.4430,336,3.5786e+06,2.4974e+06,1.0812e+06,0.1255
44.5767,337,3.5647e+06,2.4854e+06,1.0793e+06,0.1269
44.7075,338,3.5508e+06,2.4733e+06,1.0775e+06,0.1236
44.8401,339,3.5367e+06,2.4610e+06,1.0758e+06,0.1259
44.9701,340,3.5227e+06,2.4486e+06,1.0741e+06,0.1232
45.1019,341,3.5090e+06,2.4364e+06,1.0725e+06,0.1248
45.2328,342,3.4955e+06,2.4245e+06,1.0709e+06,0.1242
45.3637,343,3.4822e+06,2.4128e+06,1.0693e+06,0.1238
45.4948,344,3.4689e+06,2.4013e+06,1.0676e+06,0.1240
45.6253,345,3.4557e+06,2.3899e+06,1.0659e+06,0.1234
45.7574,346,3.4426e+06,2.3785e+06,1.0641e+06,0.1248
45.8886,347,3.4294e+06,2.3672e+06,1.0622e+06,0.1244
46.0206,348,3.4164e+06,2.3561e+06,1.0604e+06,0.1252
46.1497,349,3.4035e+06,2.3450e+06,1.0585e+06,0.1226
46.2814,350,3.3908e+06,2.3341e+06,1.0568e+06,0.1247
46.4127,351,3.3782e+06,2.3231e+06,1.0551e+06,0.1245
46.5458,352,3.3657e+06,2.3122e+06,1.0535e+06,0.1262
46.6773,353,3.3533e+06,2.3013e+06,1.0520e+06,0.1248
46.8094,354,3.3410e+06,2.2905e+06,1.0505e+06,0.1253
46.9401,355,3.3288e+06,2.2798e+06,1.0491e+06,0.1238
47.0723,356,3.3167e+06,2.2691e+06,1.0476e+06,0.1248
47.2036,357,3.3046e+06,2.2585e+06,1.0461e+06,0.1244
47.3372,358,3.2927e+06,2.2481e+06,1.0446e+06,0.1266
47.4686,359,3.2810e+06,2.2380e+06,1.0430e+06,0.1245
47.6021,360,3.2694e+06,2.2280e+06,1.0414e+06,0.1262
47.7353,361,3.2579e+06,2.2182e+06,1.0397e+06,0.1243
47.8664,362,3.2466e+06,2.2085e+06,1.0380e+06,0.1246
47.9977,363,3.2351e+06,2.1988e+06,1.0364e+06,0.1244
48.1308,364,3.2237e+06,2.1889e+06,1.0347e+06,0.1265
48.2640,365,3.2123e+06,2.1791e+06,1.0332e+06,0.1262
48.3953,366,3.2010e+06,2.1693e+06,1.0317e+06,0.1242
48.5360,367,3.1898e+06,2.1596e+06,1.0302e+06,0.1335
48.6704,368,3.1788e+06,2.1501e+06,1.0287e+06,0.1271
48.8015,369,3.1677e+06,2.1405e+06,1.0272e+06,0.1241
48.9372,370,3.1567e+06,2.1310e+06,1.0258e+06,0.1273
49.0690,371,3.1457e+06,2.1214e+06,1.0243e+06,0.1245
49.2040,372,3.1349e+06,2.1119e+06,1.0230e+06,0.1269
49.3383,373,3.1241e+06,2.1025e+06,1.0216e+06,0.1266
49.4702,374,3.1135e+06,2.0932e+06,1.0203e+06,0.1247
49.6048,375,3.1030e+06,2.0840e+06,1.0190e+06,0.1273
49.7360,376,3.0925e+06,2.0748e+06,1.0177e+06,0.1242
49.8694,377,3.0821e+06,2.0657e+06,1.0164e+06,0.1259
49.9993,378,3.0717e+06,2.0566e+06,1.0151e+06,0.1228
50.1316,379,3.0615e+06,2.0477e+06,1.0138e+06,0.1253
50.2610,380,3.0514e+06,2.0390e+06,1.0124e+06,0.1226
50.3937,381,3.0414e+06,2.0305e+06,1.0109e+06,0.1257
50.5220,382,3.0314e+06,2.0220e+06,1.0094e+06,0.1218
50.6538,383,3.0214e+06,2.0136e+06,1.0078e+06,0.1250
50.7845,384,3.0116e+06,2.0053e+06,1.0063e+06,0.1233
50.9164,385,3.0019e+06,1.9972e+06,1.0047e+06,0.1250
51.0480,386,2.9923e+06,1.9891e+06,1.0032e+06,0.1245
51.1788,387,2.9827e+06,1.9810e+06,1.0017e+06,0.1242
51.3107,388,2.9733e+06,1.9730e+06,1.0003e+06,0.1252
51.4416,389,2.9638e+06,1.9648e+06,9.9897e+05,0.1240
51.5730,390,2.9542e+06,1.9565e+06,9.9771e+05,0.1247
51.7036,391,2.9448e+06,1.9483e+06,9.9650e+05,0.1240
51.8358,392,2.9354e+06,1.9401e+06,9.9531e+05,0.1254
51.9664,393,2.9260e+06,1.9319e+06,9.9412e+05,0.1238
52.0979,394,2.9168e+06,1.9239e+06,9.9290e+05,0.1248
52.2277,395,2.9076e+06,1.9159e+06,9.9166e+05,0.1229
52.3600,396,2.8985e+06,1.9081e+06,9.9037e+05,0.1253
52.4904,397,2.8894e+06,1.9004e+06,9.8906e+05,0.1234
52.6229,398,2.8805e+06,1.8927e+06,9.8774e+05,0.1256
52.7576,399,2.8716e+06,1.8852e+06,9.8642e+05,0.1278
52.8893,400,2.8628e+06,1.8777e+06,9.8512e+05,0.1246
53.0232,401,2.8541e+06,1.8702e+06,9.8387e+05,0.1240
53.1544,402,2.8453e+06,1.8627e+06,9.8266e+05,0.1244
53.2860,403,2.8367e+06,1.8552e+06,9.8148e+05,0.1243
53.4164,404,2.8280e+06,1.8477e+06,9.8030e+05,0.1238
53.5489,405,2.8195e+06,1.8404e+06,9.7910e+05,0.1258
53.6807,406,2.8109e+06,1.8331e+06,9.7786e+05,0.1249
53.8135,407,2.8024e+06,1.8258e+06,9.7657e+05,0.1246
53.9437,408,2.7939e+06,1.8187e+06,9.7522e+05,0.1234
54.0740,409,2.7854e+06,1.8116e+06,9.7383e+05,0.1235
54.2055,410,2.7771e+06,1.8047e+06,9.7242e+05,0.1248
54.3381,411,2.7688e+06,1.7978e+06,9.7099e+05,0.1246
54.4713,412,2.7606e+06,1.7910e+06,9.6958e+05,0.1256
54.6032,413,2.7523e+06,1.7842e+06,9.6818e+05,0.1247
54.7346,414,2.7440e+06,1.7772e+06,9.6681e+05,0.1247
54.8660,415,2.7357e+06,1.7703e+06,9.6545e+05,0.1245
54.9980,416,2.7276e+06,1.7635e+06,9.6409e+05,0.1252
55.1287,417,2.7195e+06,1.7568e+06,9.6272e+05,0.1240
55.2608,418,2.7116e+06,1.7502e+06,9.6133e+05,0.1250
55.3911,419,2.7037e+06,1.7438e+06,9.5989e+05,0.1237
55.5232,420,2.6959e+06,1.7374e+06,9.5843e+05,0.1253
55.6535,421,2.6881e+06,1.7311e+06,9.5693e+05,0.1237
55.7874,422,2.6803e+06,1.7249e+06,9.5541e+05,0.1271
55.9188,423,2.6727e+06,1.7188e+06,9.5389e+05,0.1244
56.0498,424,2.6651e+06,1.7127e+06,9.5238e+05,0.1245
56.1794,425,2.6576e+06,1.7067e+06,9.5086e+05,0.1228
56.3118,426,2.6501e+06,1.7007e+06,9.4938e+05,0.1249
56.4414,427,2.6426e+06,1.6947e+06,9.4792e+05,0.1230
56.5738,428,2.6353e+06,1.6888e+06,9.4647e+05,0.1253
56.7048,429,2.6279e+06,1.6829e+06,9.4504e+05,0.1239
56.8373,430,2.6206e+06,1.6770e+06,9.4360e+05,0.1257
56.9668,431,2.6133e+06,1.6712e+06,9.4216e+05,0.1225
57.0991,432,2.6061e+06,1.6653e+06,9.4071e+05,0.1255
57.2281,433,2.5988e+06,1.6596e+06,9.3926e+05,0.1222
57.3609,434,2.5917e+06,1.6539e+06,9.3781e+05,0.1261
57.4902,435,2.5846e+06,1.6482e+06,9.3637e+05,0.1224
57.6214,436,2.5775e+06,1.6426e+06,9.3495e+05,0.1244
57.7527,437,2.5704e+06,1.6369e+06,9.3358e+05,0.1245
57.8841,438,2.5634e+06,1.6311e+06,9.3222e+05,0.1246
58.0159,439,2.5563e+06,1.6254e+06,9.3087e+05,0.1251
58.1462,440,2.5493e+06,1.6198e+06,9.2951e+05,0.1236
58.2778,441,2.5424e+06,1.6142e+06,9.2816e+05,0.1249
58.4075,442,2.5355e+06,1.6087e+06,9.2680e+05,0.1230
58.5395,443,2.5288e+06,1.6034e+06,9.2542e+05,0.1253
58.6694,444,2.5221e+06,1.5980e+06,9.2403e+05,0.1231
58.8036,445,2.5153e+06,1.5927e+06,9.2262e+05,0.1274
58.9330,446,2.5087e+06,1.5875e+06,9.2120e+05,0.1225
59.0648,447,2.5020e+06,1.5823e+06,9.1977e+05,0.1247
59.1933,448,2.4954e+06,1.5771e+06,9.1836e+05,0.1217
59.3247,449,2.4889e+06,1.5719e+06,9.1699e+05,0.1248
59.4551,450,2.4825e+06,1.5668e+06,9.1564e+05,0.1236
59.5854,451,2.4761e+06,1.5617e+06,9.1433e+05,0.1235
59.7168,452,2.4697e+06,1.5567e+06,9.1304e+05,0.1246
59.8507,453,2.4634e+06,1.5516e+06,9.1175e+05,0.1273
59.9819,454,2.4571e+06,1.5466e+06,9.1045e+05,0.1237
60.1125,455,2.4508e+06,1.5416e+06,9.0914e+05,0.1238
60.2446,456,2.4445e+06,1.5367e+06,9.0783e+05,0.1250
60.3746,457,2.4383e+06,1.5317e+06,9.0653e+05,0.1233
60.5065,458,2.4321e+06,1.5268e+06,9.0524e+05,0.1252
60.6366,459,2.4259e+06,1.5220e+06,9.0396e+05,0.1232
60.7702,460,2.4198e+06,1.5171e+06,9.0270e+05,0.1267
60.9012,461,2.4137e+06,1.5122e+06,9.0148e+05,0.1219
61.0339,462,2.4076e+06,1.5073e+06,9.0030e+05,0.1260
61.1649,463,2.4015e+06,1.5024e+06,8.9913e+05,0.1241
61.2975,464,2.3955e+06,1.4975e+06,8.9796e+05,0.1255
61.4285,465,2.3895e+06,1.4927e+06,8.9679e+05,0.1241
61.5618,466,2.3835e+06,1.4879e+06,8.9562e+05,0.1259
61.6926,467,2.3776e+06,1.4832e+06,8.9444e+05,0.1240
61.8273,468,2.3718e+06,1.4785e+06,8.9325e+05,0.1276
61.9586,469,2.3659e+06,1.4739e+06,8.9205e+05,0.1240
62.0911,470,2.3601e+06,1.4693e+06,8.9086e+05,0.1257
62.2230,471,2.3543e+06,1.4647e+06,8.8967e+05,0.1247
62.3542,472,2.3486e+06,1.4601e+06,8.8852e+05,0.1244
62.4839,473,2.3429e+06,1.4555e+06,8.8738e+05,0.1230
62.6158,474,2.3371e+06,1.4509e+06,8.8626e+05,0.1251
62.7455,475,2.3315e+06,1.4463e+06,8.8518e+05,0.1231
62.8818,476,2.3258e+06,1.4417e+06,8.8410e+05,0.1294
63.0141,477,2.3203e+06,1.4372e+06,8.8302e+05,0.1252
63.1449,478,2.3147e+06,1.4327e+06,8.8193e+05,0.1243
63.2745,479,2.3091e+06,1.4283e+06,8.8082e+05,0.1228
63.4067,480,2.3036e+06,1.4240e+06,8.7969e+05,0.1251
63.5364,481,2.2982e+06,1.4197e+06,8.7854e+05,0.1229
63.6689,482,2.2929e+06,1.4155e+06,8.7738e+05,0.1256
63.7988,483,2.2875e+06,1.4113e+06,8.7621e+05,0.1230
63.9316,484,2.2822e+06,1.4072e+06,8.7504e+05,0.1259
64.0606,485,2.2769e+06,1.4030e+06,8.7389e+05,0.1220
64.1932,486,2.2716e+06,1.3989e+06,8.7276e+05,0.1258
64.3218,487,2.2664e+06,1.3947e+06,8.7165e+05,0.1219
64.4535,488,2.2612e+06,1.3906e+06,8.7055e+05,0.1250
64.5839,489,2.2560e+06,1.3866e+06,8.6945e+05,0.1237
64.7154,490,2.2509e+06,1.3826e+06,8.6834e+05,0.1243
64.8468,491,2.2458e+06,1.3786e+06,8.6723e+05,0.1248
64.9780,492,2.2408e+06,1.3747e+06,8.6611e+05,0.1243
65.1093,493,2.2357e+06,1.3708e+06,8.6497e+05,0.1245
65.2392,494,2.2307e+06,1.3669e+06,8.6384e+05,0.1231
65.3715,495,2.2258e+06,1.3631e+06,8.6271e+05,0.1255
65.5011,496,2.2208e+06,1.3592e+06,8.6158e+05,0.1229
65.6336,497,2.2159e+06,1.3554e+06,8.6048e+05,0.1259
65.7622,498,2.2110e+06,1.3516e+06,8.5940e+05,0.1218
65.8952,499,2.2061e+06,1.3477e+06,8.5835e+05,0.1260
66.0245,500,2.2013e+06,1.3440e+06,8.5730e+05,0.1227
66.1578,501,2.1964e+06,1.3402e+06,8.5628e+05,0.1253
66.2877,502,2.1916e+06,1.3364e+06,8.5526e+05,0.1235
66.4196,503,2.1869e+06,1.3326e+06,8.5426e+05,0.1252
66.5499,504,2.1822e+06,1.3289e+06,8.5326e+05,0.1236
66.6803,505,2.1775e+06,1.3252e+06,8.5227e+05,0.1238
66.8138,506,2.1728e+06,1.3215e+06,8.5127e+05,0.1267
66.9444,507,2.1682e+06,1.3179e+06,8.5028e+05,0.1237
67.0771,508,2.1635e+06,1.3143e+06,8.4927e+05,0.1259
67.2094,509,2.1589e+06,1.3106e+06,8.4825e+05,0.1254
67.3421,510,2.1543e+06,1.3071e+06,8.4721e+05,0.1258
67.4754,511,2.1497e+06,1.3035e+06,8.4613e+05,0.1261
67.6054,512,2.1451e+06,1.3001e+06,8.4504e+05,0.1231
67.7370,513,2.1406e+06,1.2967e+06,8.4394e+05,0.1249
67.8693,514,2.1361e+06,1.2933e+06,8.4284e+05,0.1255
68.0022,515,2.1317e+06,1.2899e+06,8.4173e+05,0.1244
68.1330,516,2.1272e+06,1.2866e+06,8.4062e+05,0.1241
68.2660,517,2.1227e+06,1.2832e+06,8.3952e+05,0.1261
68.3972,518,2.1183e+06,1.2798e+06,8.3846e+05,0.1243
68.5306,519,2.1139e+06,1.2765e+06,8.3740e+05,0.1263
68.6614,520,2.1095e+06,1.2731e+06,8.3638e+05,0.1237
68.7955,521,2.1051e+06,1.2697e+06,8.3536e+05,0.1271
68.9249,522,2.1008e+06,1.2664e+06,8.3435e+05,0.1223
69.0583,523,2.0964e+06,1.2631e+06,8.3333e+05,0.1261
69.1900,524,2.0921e+06,1.2598e+06,8.3231e+05,0.1249
69.3238,525,2.0879e+06,1.2566e+06,8.3127e+05,0.1267
69.4518,526,2.0836e+06,1.2534e+06,8.3023e+05,0.1215
69.5837,527,2.0795e+06,1.2503e+06,8.2920e+05,0.1252
69.7140,528,2.0753e+06,1.2471e+06,8.2820e+05,0.1236
69.8454,529,2.0712e+06,1.2440e+06,8.2721e+05,0.1249
69.9812,530,2.0671e+06,1.2409e+06,8.2625e+05,0.1290
70.1135,531,2.0630e+06,1.2377e+06,8.2532e+05,0.1253
70.2421,532,2.0590e+06,1.2346e+06,8.2442e+05,0.1219
70.3749,533,2.0550e+06,1.2315e+06,8.2352e+05,0.1259
70.5053,534,2.0510e+06,1.2284e+06,8.2261e+05,0.1237
70.6372,535,2.0470e+06,1.2253e+06,8.2170e+05,0.1249
70.7674,536,2.0431e+06,1.2223e+06,8.2077e+05,0.1231
70.8982,537,2.0392e+06,1.2193e+06,8.1982e+05,0.1239
71.0322,538,2.0353e+06,1.2164e+06,8.1885e+05,0.1237
71.1645,539,2.0314e+06,1.2135e+06,8.1789e+05,0.1252
71.2943,540,2.0276e+06,1.2106e+06,8.1692e+05,0.1228
71.4244,541,2.0237e+06,1.2078e+06,8.1597e+05,0.1234
71.5573,542,2.0199e+06,1.2049e+06,8.1504e+05,0.1260
71.6882,543,2.0161e+06,1.2020e+06,8.1412e+05,0.1239
71.8208,544,2.0123e+06,1.1990e+06,8.1323e+05,0.1260
71.9520,545,2.0085e+06,1.1961e+06,8.1235e+05,0.1242
72.0842,546,2.0047e+06,1.1932e+06,8.1147e+05,0.1253
72.2165,547,2.0009e+06,1.1903e+06,8.1059e+05,0.1255
72.3501,548,1.9972e+06,1.1875e+06,8.0969e+05,0.1267
72.4830,549,1.9935e+06,1.1847e+06,8.0878e+05,0.1259
72.6140,550,1.9898e+06,1.1819e+06,8.0787e+05,0.1243
72.7478,551,1.9861e+06,1.1791e+06,8.0696e+05,0.1269
72.8774,552,1.9824e+06,1.1763e+06,8.0606e+05,0.1227
73.0096,553,1.9787e+06,1.1735e+06,8.0518e+05,0.1252
73.1412,554,1.9750e+06,1.1707e+06,8.0432e+05,0.1245
73.2727,555,1.9714e+06,1.1679e+06,8.0347e+05,0.1245
73.4034,556,1.9678e+06,1.1652e+06,8.0264e+05,0.1240
73.5334,557,1.9642e+06,1.1624e+06,8.0181e+05,0.1233
73.6659,558,1.9607e+06,1.1597e+06,8.0098e+05,0.1256
73.7964,559,1.9572e+06,1.1570e+06,8.0015e+05,0.1234
73.9305,560,1.9536e+06,1.1543e+06,7.9932e+05,0.1271
74.0605,561,1.9501e+06,1.1517e+06,7.9848e+05,0.1231
74.1925,562,1.9466e+06,1.1490e+06,7.9763e+05,0.1251
74.3221,563,1.9432e+06,1.1464e+06,7.9680e+05,0.1227
74.4547,564,1.9397e+06,1.1438e+06,7.9597e+05,0.1257
74.5842,565,1.9363e+06,1.1412e+06,7.9514e+05,0.1229
74.7175,566,1.9329e+06,1.1386e+06,7.9432e+05,0.1262
74.8478,567,1.9296e+06,1.1361e+06,7.9349e+05,0.1234
74.9811,568,1.9262e+06,1.1336e+06,7.9265e+05,0.1261
75.1124,569,1.9229e+06,1.1311e+06,7.9182e+05,0.1241
75.2461,570,1.9196e+06,1.1286e+06,7.9097e+05,0.1263
75.3777,571,1.9163e+06,1.1262e+06,7.9012e+05,0.1247
75.5112,572,1.9130e+06,1.1237e+06,7.8928e+05,0.1266
75.6431,573,1.9097e+06,1.1213e+06,7.8845e+05,0.1250
75.7759,574,1.9065e+06,1.1188e+06,7.8763e+05,0.1257
75.9081,575,1.9032e+06,1.1164e+06,7.8682e+05,0.1254
76.0407,576,1.9000e+06,1.1139e+06,7.8602e+05,0.1259
76.1749,577,1.8967e+06,1.1115e+06,7.8525e+05,0.1267
76.3052,578,1.8935e+06,1.1090e+06,7.8446e+05,0.1235
76.4398,579,1.8903e+06,1.1066e+06,7.8368e+05,0.1275
76.5709,580,1.8871e+06,1.1042e+06,7.8289e+05,0.1240
76.7050,581,1.8839e+06,1.1018e+06,7.8209e+05,0.1270
76.8364,582,1.8807e+06,1.0994e+06,7.8130e+05,0.1244
76.9696,583,1.8776e+06,1.0971e+06,7.8052e+05,0.1263
77.1007,584,1.8745e+06,1.0947e+06,7.7974e+05,0.1241
77.2345,585,1.8714e+06,1.0924e+06,7.7897e+05,0.1265
77.3669,586,1.8683e+06,1.0901e+06,7.7822e+05,0.1254
77.4993,587,1.8652e+06,1.0877e+06,7.7747e+05,0.1254
77.6313,588,1.8621e+06,1.0854e+06,7.7673e+05,0.1250
77.7628,589,1.8591e+06,1.0831e+06,7.7598e+05,0.1245
77.8936,590,1.8560e+06,1.0808e+06,7.7523e+05,0.1240
78.0255,591,1.8530e+06,1.0786e+06,7.7444e+05,0.1253
78.1566,592,1.8500e+06,1.0764e+06,7.7364e+05,0.1241
78.2884,593,1.8470e+06,1.0742e+06,7.7282e+05,0.1249
78.4185,594,1.8440e+06,1.0720e+06,7.7199e+05,0.1233
78.5509,595,1.8410e+06,1.0699e+06,7.7115e+05,0.1254
78.6807,596,1.8381e+06,1.0678e+06,7.7032e+05,0.1230
78.8135,597,1.8351e+06,1.0656e+06,7.6950e+05,0.1256
78.9430,598,1.8322e+06,1.0635e+06,7.6869e+05,0.1227
79.0747,599,1.8293e+06,1.0614e+06,7.6790e+05,0.1249
79.2043,600,1.8264e+06,1.0593e+06,7.6711e+05,0.1229
79.3387,601,1.8235e+06,1.0572e+06,7.6631e+05,0.1266
79.4700,602,1.8206e+06,1.0551e+06,7.6550e+05,0.1246
79.6046,603,1.8177e+06,1.0531e+06,7.6468e+05,0.1262
79.7360,604,1.8149e+06,1.0510e+06,7.6386e+05,0.1245
79.8697,605,1.8120e+06,1.0490e+06,7.6305e+05,0.1265
79.9987,606,1.8092e+06,1.0469e+06,7.6225e+05,0.1223
80.1306,607,1.8063e+06,1.0449e+06,7.6147e+05,0.1251
80.2597,608,1.8035e+06,1.0428e+06,7.6072e+05,0.1221
80.3929,609,1.8007e+06,1.0407e+06,7.5998e+05,0.1264
80.5214,610,1.7979e+06,1.0386e+06,7.5927e+05,0.1218
80.6536,611,1.7951e+06,1.0366e+06,7.5856e+05,0.1253
80.7836,612,1.7924e+06,1.0345e+06,7.5785e+05,0.1231
80.9158,613,1.7897e+06,1.0325e+06,7.5714e+05,0.1252
81.0478,614,1.7869e+06,1.0305e+06,7.5642e+05,0.1252
81.1801,615,1.7842e+06,1.0285e+06,7.5570e+05,0.1245
81.3125,616,1.7815e+06,1.0265e+06,7.5497e+05,0.1251
81.4451,617,1.7788e+06,1.0246e+06,7.5423e+05,0.1256
81.5759,618,1.7761e+06,1.0226e+06,7.5350e+05,0.1237
81.7070,619,1.7734e+06,1.0206e+06,7.5278e+05,0.1243
81.8376,620,1.7707e+06,1.0187e+06,7.5207e+05,0.1237
81.9678,621,1.7681e+06,1.0167e+06,7.5137e+05,0.1235
82.1004,622,1.7654e+06,1.0148e+06,7.5067e+05,0.1254
82.2307,623,1.7628e+06,1.0128e+06,7.4997e+05,0.1230
82.3626,624,1.7601e+06,1.0109e+06,7.4927e+05,0.1249
82.4930,625,1.7575e+06,1.0089e+06,7.4857e+05,0.1235
82.6262,626,1.7549e+06,1.0070e+06,7.4787e+05,0.1263
82.7562,627,1.7523e+06,1.0052e+06,7.4716e+05,0.1233
82.8884,628,1.7498e+06,1.0033e+06,7.4646e+05,0.1250
83.0175,629,1.7472e+06,1.0014e+06,7.4578e+05,0.1225
83.1536,630,1.7446e+06,9.9954e+05,7.4510e+05,0.1295
83.2831,631,1.7421e+06,9.9767e+05,7.4443e+05,0.1225
83.4155,632,1.7396e+06,9.9581e+05,7.4375e+05,0.1255
83.5449,633,1.7370e+06,9.9397e+05,7.4307e+05,0.1227
83.6784,634,1.7345e+06,9.9214e+05,7.4239e+05,0.1267
83.8077,635,1.7320e+06,9.9032e+05,7.4171e+05,0.1225
83.9416,636,1.7295e+06,9.8851e+05,7.4104e+05,0.1269
84.0755,637,1.7271e+06,9.8672e+05,7.4036e+05,0.1267
84.2084,638,1.7246e+06,9.8493e+05,7.3969e+05,0.1251
84.3376,639,1.7222e+06,9.8316e+05,7.3901e+05,0.1223
84.4702,640,1.7197e+06,9.8139e+05,7.3834e+05,0.1257
84.6007,641,1.7173e+06,9.7964e+05,7.3767e+05,0.1239
84.7328,642,1.7149e+06,9.7791e+05,7.3700e+05,0.1252
84.8640,643,1.7125e+06,9.7619e+05,7.3633e+05,0.1243
84.9972,644,1.7102e+06,9.7449e+05,7.3567e+05,0.1259
85.1266,645,1.7078e+06,9.7277e+05,7.3501e+05,0.1227
85.2595,646,1.7054e+06,9.7106e+05,7.3437e+05,0.1254
85.3880,647,1.7031e+06,9.6934e+05,7.3373e+05,0.1218
85.5188,648,1.7007e+06,9.6761e+05,7.3311e+05,0.1241
85.6498,649,1.6984e+06,9.6586e+05,7.3251e+05,0.1241
85.7809,650,1.6960e+06,9.6412e+05,7.3192e+05,0.1244
85.9134,651,1.6937e+06,9.6239e+05,7.3132e+05,0.1255
86.0440,652,1.6914e+06,9.6068e+05,7.3072e+05,0.1239
86.1785,653,1.6891e+06,9.5898e+05,7.3011e+05,0.1277
86.3103,654,1.6868e+06,9.5730e+05,7.2948e+05,0.1248
86.4400,655,1.6845e+06,9.5566e+05,7.2884e+05,0.1230
86.5696,656,1.6822e+06,9.5403e+05,7.2819e+05,0.1230
86.7019,657,1.6800e+06,9.5243e+05,7.2754e+05,0.1256
86.8313,658,1.6777e+06,9.5084e+05,7.2688e+05,0.1227
86.9636,659,1.6755e+06,9.4925e+05,7.2624e+05,0.1254
87.0924,660,1.6733e+06,9.4764e+05,7.2561e+05,0.1221
87.2258,661,1.6710e+06,9.4602e+05,7.2500e+05,0.1266
87.3546,662,1.6688e+06,9.4441e+05,7.2440e+05,0.1222
87.4865,663,1.6666e+06,9.4281e+05,7.2379e+05,0.1249
87.6169,664,1.6644e+06,9.4123e+05,7.2318e+05,0.1240
87.7477,665,1.6622e+06,9.3967e+05,7.2256e+05,0.1242
87.8790,666,1.6601e+06,9.3814e+05,7.2193e+05,0.1247
88.0083,667,1.6579e+06,9.3662e+05,7.2129e+05,0.1227
88.1401,668,1.6558e+06,9.3512e+05,7.2064e+05,0.1254
88.2707,669,1.6536e+06,9.3362e+05,7.2000e+05,0.1237
88.4029,670,1.6515e+06,9.3212e+05,7.1936e+05,0.1255
88.5352,671,1.6493e+06,9.3061e+05,7.1873e+05,0.1251
88.6696,672,1.6472e+06,9.2910e+05,7.1811e+05,0.1250
88.8011,673,1.6451e+06,9.2759e+05,7.1750e+05,0.1241
88.9332,674,1.6430e+06,9.2608e+05,7.1691e+05,0.1248
89.0623,675,1.6409e+06,9.2457e+05,7.1632e+05,0.1223
89.1947,676,1.6388e+06,9.2307e+05,7.1573e+05,0.1258
89.3243,677,1.6367e+06,9.2160e+05,7.1514e+05,0.1228
89.4573,678,1.6347e+06,9.2014e+05,7.1454e+05,0.1264
89.5877,679,1.6326e+06,9.1868e+05,7.1395e+05,0.1238
89.7201,680,1.6306e+06,9.1723e+05,7.1337e+05,0.1258
89.8488,681,1.6286e+06,9.1578e+05,7.1279e+05,0.1223
89.9812,682,1.6266e+06,9.1433e+05,7.1222e+05,0.1258
90.1110,683,1.6245e+06,9.1287e+05,7.1167e+05,0.1233
90.2438,684,1.6226e+06,9.1143e+05,7.1112e+05,0.1262
90.3749,685,1.6206e+06,9.1000e+05,7.1058e+05,0.1244
90.5049,686,1.6186e+06,9.0857e+05,7.1004e+05,0.1233
90.6364,687,1.6166e+06,9.0715e+05,7.0950e+05,0.1246
90.7655,688,1.6147e+06,9.0574e+05,7.0896e+05,0.1226
90.8988,689,1.6128e+06,9.0435e+05,7.0841e+05,0.1265
91.0275,690,1.6108e+06,9.0296e+05,7.0788e+05,0.1220
91.1610,691,1.6089e+06,9.0158e+05,7.0735e+05,0.1268
91.2918,692,1.6070e+06,9.0020e+05,7.0682e+05,0.1220
91.4262,693,1.6051e+06,8.9881e+05,7.0629e+05,0.1275
91.5564,694,1.6032e+06,8.9743e+05,7.0578e+05,0.1235
91.6900,695,1.6013e+06,8.9605e+05,7.0527e+05,0.1268
91.8208,696,1.5994e+06,8.9467e+05,7.0477e+05,0.1241
91.9549,697,1.5975e+06,8.9328e+05,7.0426e+05,0.1269
92.0859,698,1.5957e+06,8.9190e+05,7.0376e+05,0.1243
92.2197,699,1.5938e+06,8.9052e+05,7.0326e+05,0.1267
92.3519,700,1.5919e+06,8.8915e+05,7.0277e+05,0.1252
92.4861,701,1.5901e+06,8.8779e+05,7.0227e+05,0.1266
92.6197,702,1.5882e+06,8.8644e+05,7.0177e+05,0.1268
92.7508,703,1.5864e+06,8.8511e+05,7.0127e+05,0.1243
92.8823,704,1.5846e+06,8.8380e+05,7.0076e+05,0.1247
93.0125,705,1.5827e+06,8.8252e+05,7.0023e+05,0.1234
93.1414,706,1.5809e+06,8.8125e+05,6.9970e+05,0.1224
93.2771,707,1.5792e+06,8.7999e+05,6.9916e+05,0.1290
93.4085,708,1.5774e+06,8.7873e+05,6.9863e+05,0.1247
93.5380,709,1.5756e+06,8.7746e+05,6.9810e+05,0.1229
93.6755,710,1.5738e+06,8.7620e+05,6.9757e+05,0.1218
93.8044,711,1.5720e+06,8.7493e+05,6.9706e+05,0.1225
93.9367,712,1.5702e+06,8.7366e+05,6.9656e+05,0.1257
94.0656,713,1.5685e+06,8.7239e+05,6.9607e+05,0.1225
94.1979,714,1.5667e+06,8.7112e+05,6.9558e+05,0.1256
94.3296,715,1.5650e+06,8.6989e+05,6.9508e+05,0.1221
94.4604,716,1.5632e+06,8.6867e+05,6.9456e+05,0.1241
94.5919,717,1.5615e+06,8.6748e+05,6.9404e+05,0.1249
94.7214,718,1.5598e+06,8.6629e+05,6.9350e+05,0.1230
94.8543,719,1.5581e+06,8.6512e+05,6.9295e+05,0.1253
94.9844,720,1.5564e+06,8.6396e+05,6.9241e+05,0.1233
95.1180,721,1.5547e+06,8.6279e+05,6.9188e+05,0.1269
95.2475,722,1.5530e+06,8.6160e+05,6.9136e+05,0.1228
95.3814,723,1.5512e+06,8.6039e+05,6.9086e+05,0.1267
95.5135,724,1.5495e+06,8.5918e+05,6.9037e+05,0.1248
95.6470,725,1.5478e+06,8.5796e+05,6.8988e+05,0.1267
95.7797,726,1.5462e+06,8.5676e+05,6.8940e+05,0.1257
95.9112,727,1.5445e+06,8.5557e+05,6.8891e+05,0.1245
96.0431,728,1.5428e+06,8.5440e+05,6.8841e+05,0.1248
96.1728,729,1.5411e+06,8.5324e+05,6.8790e+05,0.1228
96.3031,730,1.5395e+06,8.5210e+05,6.8739e+05,0.1237
96.4360,731,1.5378e+06,8.5096e+05,6.8687e+05,0.1253
96.5678,732,1.5362e+06,8.4982e+05,6.8636e+05,0.1243
96.6997,733,1.5345e+06,8.4868e+05,6.8586e+05,0.1248
96.8313,734,1.5329e+06,8.4754e+05,6.8535e+05,0.1245
96.9638,735,1.5313e+06,8.4642e+05,6.8485e+05,0.1254
97.0956,736,1.5297e+06,8.4532e+05,6.8434e+05,0.1245
97.2276,737,1.5280e+06,8.4421e+05,6.8383e+05,0.1250
97.3592,738,1.5264e+06,8.4311e+05,6.8331e+05,0.1248
97.4904,739,1.5248e+06,8.4202e+05,6.8279e+05,0.1240
97.6215,740,1.5232e+06,8.4093e+05,6.8228e+05,0.1241
97.7535,741,1.5216e+06,8.3984e+05,6.8177e+05,0.1249
97.8851,742,1.5200e+06,8.3875e+05,6.8127e+05,0.1247
98.0173,743,1.5184e+06,8.3766e+05,6.8078e+05,0.1252
98.1488,744,1.5169e+06,8.3656e+05,6.8030e+05,0.1244
98.2805,745,1.5153e+06,8.3548e+05,6.7982e+05,0.1248
98.4126,746,1.5137e+06,8.3440e+05,6.7935e+05,0.1247
98.5447,747,1.5122e+06,8.3333e+05,6.7887e+05,0.1246
98.6858,748,1.5107e+06,8.3227e+05,6.7839e+05,0.1217
98.8167,749,1.5091e+06,8.3121e+05,6.7791e+05,0.1239
98.9481,750,1.5076e+06,8.3015e+05,6.7743e+05,0.1244
99.0801,751,1.5060e+06,8.2909e+05,6.7695e+05,0.1249
99.2132,752,1.5045e+06,8.2802e+05,6.7648e+05,0.1258
99.3453,753,1.5030e+06,8.2693e+05,6.7602e+05,0.1251
99.4773,754,1.5014e+06,8.2585e+05,6.7557e+05,0.1247
99.6104,755,1.4999e+06,8.2476e+05,6.7513e+05,0.1260
99.7409,756,1.4984e+06,8.2369e+05,6.7468e+05,0.1236
99.8749,757,1.4969e+06,8.2262e+05,6.7424e+05,0.1264
100.0070,758,1.4954e+06,8.2157e+05,6.7379e+05,0.1236
100.1404,759,1.4939e+06,8.2053e+05,6.7334e+05,0.1264
100.2697,760,1.4924e+06,8.1949e+05,6.7289e+05,0.1224
100.4026,761,1.4909e+06,8.1847e+05,6.7245e+05,0.1260
100.5324,762,1.4895e+06,8.1745e+05,6.7201e+05,0.1229
100.6651,763,1.4880e+06,8.1643e+05,6.7157e+05,0.1255
100.7948,764,1.4866e+06,8.1542e+05,6.7113e+05,0.1228
100.9257,765,1.4851e+06,8.1441e+05,6.7069e+05,0.1242
101.0591,766,1.4837e+06,8.1342e+05,6.7025e+05,0.1262
101.1934,767,1.4822e+06,8.1242e+05,6.6980e+05,0.1271
101.3234,768,1.4808e+06,8.1143e+05,6.6935e+05,0.1230
101.4570,769,1.4793e+06,8.1045e+05,6.6890e+05,0.1264
101.5870,770,1.4779e+06,8.0946e+05,6.6846e+05,0.1230
101.7205,771,1.4765e+06,8.0848e+05,6.6802e+05,0.1267
101.8496,772,1.4751e+06,8.0748e+05,6.6759e+05,0.1223
101.9817,773,1.4737e+06,8.0650e+05,6.6717e+05,0.1251
102.1134,774,1.4723e+06,8.0552e+05,6.6674e+05,0.1244
102.2477,775,1.4709e+06,8.0455e+05,6.6631e+05,0.1275
102.3785,776,1.4695e+06,8.0360e+05,6.6587e+05,0.1236
102.5134,777,1.4681e+06,8.0267e+05,6.6543e+05,0.1273
102.6451,778,1.4667e+06,8.0174e+05,6.6497e+05,0.1248
102.7793,779,1.4653e+06,8.0083e+05,6.6452e+05,0.1266
102.9115,780,1.4640e+06,7.9991e+05,6.6406e+05,0.1252
103.0449,781,1.4626e+06,7.9899e+05,6.6361e+05,0.1262
103.1788,782,1.4612e+06,7.9806e+05,6.6317e+05,0.1267
103.3099,783,1.4599e+06,7.9712e+05,6.6274e+05,0.1240
103.4434,784,1.4585e+06,7.9617e+05,6.6232e+05,0.1263
103.5757,785,1.4571e+06,7.9523e+05,6.6190e+05,0.1251
103.7099,786,1.4558e+06,7.9428e+05,6.6149e+05,0.1270
103.8398,787,1.4544e+06,7.9334e+05,6.6107e+05,0.1230
103.9744,788,1.4531e+06,7.9241e+05,6.6065e+05,0.1275
104.1068,789,1.4517e+06,7.9148e+05,6.6023e+05,0.1248
104.2405,790,1.4504e+06,7.9056e+05,6.5981e+05,0.1266
104.3748,791,1.4490e+06,7.8963e+05,6.5940e+05,0.1269
104.5048,792,1.4477e+06,7.8869e+05,6.5899e+05,0.1231
104.6395,793,1.4463e+06,7.8774e+05,6.5859e+05,0.1272
104.7713,794,1.4450e+06,7.8679e+05,6.5820e+05,0.1246
104.9052,795,1.4437e+06,7.8585e+05,6.5781e+05,0.1269
105.0364,796,1.4423e+06,7.8492e+05,6.5741e+05,0.1240
105.1687,797,1.4410e+06,7.8399e+05,6.5702e+05,0.1253
105.2979,798,1.4397e+06,7.8306e+05,6.5662e+05,0.1224
105.4302,799,1.4384e+06,7.8215e+05,6.5622e+05,0.1254
105.5602,800,1.4371e+06,7.8124e+05,6.5582e+05,0.1230
105.6975,801,1.4358e+06,7.8034e+05,6.5542e+05,0.1265
105.8300,802,1.4345e+06,7.7943e+05,6.5502e+05,0.1253
105.9618,803,1.4332e+06,7.7852e+05,6.5463e+05,0.1249
106.0941,804,1.4319e+06,7.7762e+05,6.5425e+05,0.1250
106.2252,805,1.4306e+06,7.7673e+05,6.5386e+05,0.1241
106.3561,806,1.4293e+06,7.7584e+05,6.5346e+05,0.1240
106.4887,807,1.4280e+06,7.7497e+05,6.5306e+05,0.1241
106.6210,808,1.4268e+06,7.7412e+05,6.5265e+05,0.1249
106.7524,809,1.4255e+06,7.7327e+05,6.5223e+05,0.1243
106.8835,810,1.4242e+06,7.7242e+05,6.5181e+05,0.1244
107.0158,811,1.4230e+06,7.7157e+05,6.5140e+05,0.1245
107.1470,812,1.4217e+06,7.7071e+05,6.5100e+05,0.1243
107.2784,813,1.4205e+06,7.6984e+05,6.5062e+05,0.1246
107.4088,814,1.4192e+06,7.6898e+05,6.5024e+05,0.1238
107.5397,815,1.4180e+06,7.6810e+05,6.4987e+05,0.1240
107.6693,816,1.4167e+06,7.6723e+05,6.4950e+05,0.1227
107.8014,817,1.4155e+06,7.6635e+05,6.4914e+05,0.1253
107.9313,818,1.4143e+06,7.6548e+05,6.4878e+05,0.1229
108.0668,819,1.4130e+06,7.6462e+05,6.4842e+05,0.1280
108.1977,820,1.4118e+06,7.6375e+05,6.4807e+05,0.1240
108.3321,821,1.4106e+06,7.6289e+05,6.4772e+05,0.1271
108.4646,822,1.4094e+06,7.6203e+05,6.4737e+05,0.1252
108.5960,823,1.4082e+06,7.6117e+05,6.4702e+05,0.1240
108.7262,824,1.4070e+06,7.6032e+05,6.4666e+05,0.1233
108.8579,825,1.4058e+06,7.5949e+05,6.4629e+05,0.1251
108.9879,826,1.4046e+06,7.5866e+05,6.4592e+05,0.1232
109.1203,827,1.4034e+06,7.5784e+05,6.4555e+05,0.1252
109.2530,828,1.4022e+06,7.5702e+05,6.4519e+05,0.1257
109.3845,829,1.4010e+06,7.5619e+05,6.4483e+05,0.1247
109.5147,830,1.3998e+06,7.5535e+05,6.4449e+05,0.1231
109.6471,831,1.3987e+06,7.5450e+05,6.4416e+05,0.1253
109.7762,832,1.3975e+06,7.5366e+05,6.4383e+05,0.1224
109.9091,833,1.3963e+06,7.5282e+05,6.4351e+05,0.1258
110.0380,834,1.3952e+06,7.5199e+05,6.4317e+05,0.1222
110.1708,835,1.3940e+06,7.5117e+05,6.4284e+05,0.1259
110.3002,836,1.3928e+06,7.5035e+05,6.4250e+05,0.1228
110.4324,837,1.3917e+06,7.4955e+05,6.4215e+05,0.1251
110.5633,838,1.3906e+06,7.4876e+05,6.4181e+05,0.1238
110.6940,839,1.3894e+06,7.4797e+05,6.4147e+05,0.1237
110.8253,840,1.3883e+06,7.4717e+05,6.4113e+05,0.1245
110.9561,841,1.3872e+06,7.4638e+05,6.4080e+05,0.1238
111.0877,842,1.3861e+06,7.4559e+05,6.4047e+05,0.1243
111.2170,843,1.3849e+06,7.4480e+05,6.4014e+05,0.1225
111.3490,844,1.3838e+06,7.4401e+05,6.3981e+05,0.1250
111.4784,845,1.3827e+06,7.4322e+05,6.3947e+05,0.1229
111.6126,846,1.3816e+06,7.4245e+05,6.3913e+05,0.1272
111.7420,847,1.3805e+06,7.4167e+05,6.3880e+05,0.1223
111.8743,848,1.3794e+06,7.4090e+05,6.3846e+05,0.1253
112.0037,849,1.3783e+06,7.4014e+05,6.3812e+05,0.1225
112.1380,850,1.3772e+06,7.3937e+05,6.3779e+05,0.1264
112.2673,851,1.3761e+06,7.3859e+05,6.3747e+05,0.1226
112.4002,852,1.3750e+06,7.3781e+05,6.3715e+05,0.1259
112.5335,853,1.3739e+06,7.3704e+05,6.3683e+05,0.1262
112.6657,854,1.3728e+06,7.3627e+05,6.3651e+05,0.1252
112.7949,855,1.3717e+06,7.3550e+05,6.3618e+05,0.1223
112.9282,856,1.3706e+06,7.3475e+05,6.3585e+05,0.1265
113.0583,857,1.3695e+06,7.3401e+05,6.3551e+05,0.1229
113.1914,858,1.3684e+06,7.3327e+05,6.3518e+05,0.1256
113.3206,859,1.3674e+06,7.3253e+05,6.3485e+05,0.1222
113.4572,860,1.3663e+06,7.3179e+05,6.3452e+05,0.1295
113.5875,861,1.3652e+06,7.3105e+05,6.3419e+05,0.1231
113.7223,862,1.3642e+06,7.3030e+05,6.3387e+05,0.1242
113.8528,863,1.3631e+06,7.2955e+05,6.3355e+05,0.1235
113.9864,864,1.3620e+06,7.2881e+05,6.3323e+05,0.1264
114.1161,865,1.3610e+06,7.2807e+05,6.3291e+05,0.1228
114.2503,866,1.3599e+06,7.2733e+05,6.3259e+05,0.1270
114.3852,867,1.3589e+06,7.2660e+05,6.3228e+05,0.1277
114.5162,868,1.3578e+06,7.2586e+05,6.3196e+05,0.1232
114.6480,869,1.3568e+06,7.2514e+05,6.3164e+05,0.1246
114.7778,870,1.3557e+06,7.2441e+05,6.3133e+05,0.1231
114.9089,871,1.3547e+06,7.2369e+05,6.3101e+05,0.1243
115.0398,872,1.3537e+06,7.2297e+05,6.3070e+05,0.1239
115.1698,873,1.3526e+06,7.2225e+05,6.3039e+05,0.1230
115.3018,874,1.3516e+06,7.2153e+05,6.3008e+05,0.1251
115.4314,875,1.3506e+06,7.2081e+05,6.2977e+05,0.1225
115.5641,876,1.3496e+06,7.2009e+05,6.2946e+05,0.1251
115.6927,877,1.3485e+06,7.1939e+05,6.2914e+05,0.1216
115.8265,878,1.3475e+06,7.1869e+05,6.2882e+05,0.1271
115.9557,879,1.3465e+06,7.1799e+05,6.2850e+05,0.1223
116.0896,880,1.3455e+06,7.1730e+05,6.2817e+05,0.1267
116.2208,881,1.3444e+06,7.1661e+05,6.2784e+05,0.1242
116.3557,882,1.3434e+06,7.1593e+05,6.2749e+05,0.1274
116.4874,883,1.3424e+06,7.1526e+05,6.2715e+05,0.1246
116.6211,884,1.3414e+06,7.1459e+05,6.2681e+05,0.1265
116.7530,885,1.3404e+06,7.1393e+05,6.2647e+05,0.1247
116.8848,886,1.3394e+06,7.1326e+05,6.2613e+05,0.1251
117.0162,887,1.3384e+06,7.1259e+05,6.2580e+05,0.1247
117.1474,888,1.3374e+06,7.1192e+05,6.2548e+05,0.1242
117.2772,889,1.3364e+06,7.1125e+05,6.2516e+05,0.1229
117.4090,890,1.3354e+06,7.1057e+05,6.2484e+05,0.1248
117.5380,891,1.3344e+06,7.0990e+05,6.2453e+05,0.1221
117.6706,892,1.3334e+06,7.0923e+05,6.2422e+05,0.1254
117.8001,893,1.3325e+06,7.0856e+05,6.2390e+05,0.1226
117.9317,894,1.3315e+06,7.0789e+05,6.2359e+05,0.1246
118.0638,895,1.3305e+06,7.0722e+05,6.2329e+05,0.1251
118.1974,896,1.3295e+06,7.0655e+05,6.2298e+05,0.1265
118.3271,897,1.3286e+06,7.0587e+05,6.2268e+05,0.1228
118.4582,898,1.3276e+06,7.0521e+05,6.2238e+05,0.1241
118.5890,899,1.3266e+06,7.0454e+05,6.2207e+05,0.1241
118.7289,900,1.3257e+06,7.0389e+05,6.2177e+05,0.1210
118.8636,901,1.3247e+06,7.0325e+05,6.2146e+05,0.1249
118.9950,902,1.3237e+06,7.0261e+05,6.2114e+05,0.1245
119.1261,903,1.3228e+06,7.0197e+05,6.2082e+05,0.1240
119.2573,904,1.3218e+06,7.0134e+05,6.2050e+05,0.1244
119.3877,905,1.3209e+06,7.0072e+05,6.2018e+05,0.1238
119.5192,906,1.3200e+06,7.0009e+05,6.1987e+05,0.1247
119.6497,907,1.3190e+06,6.9946e+05,6.1957e+05,0.1237
119.7824,908,1.3181e+06,6.9883e+05,6.1927e+05,0.1255
119.9121,909,1.3172e+06,6.9820e+05,6.1897e+05,0.1229
120.0444,910,1.3162e+06,6.9758e+05,6.1867e+05,0.1251
120.1748,911,1.3153e+06,6.9696e+05,6.1836e+05,0.1236
120.3092,912,1.3144e+06,6.9635e+05,6.1805e+05,0.1273
120.4401,913,1.3135e+06,6.9575e+05,6.1774e+05,0.1238
120.5729,914,1.3126e+06,6.9514e+05,6.1742e+05,0.1255
120.7047,915,1.3116e+06,6.9453e+05,6.1711e+05,0.1247
120.8364,916,1.3107e+06,6.9391e+05,6.1681e+05,0.1249
120.9662,917,1.3098e+06,6.9329e+05,6.1652e+05,0.1231
121.0999,918,1.3089e+06,6.9267e+05,6.1624e+05,0.1268
121.2317,919,1.3080e+06,6.9204e+05,6.1596e+05,0.1247
121.3643,920,1.3071e+06,6.9141e+05,6.1568e+05,0.1253
121.4952,921,1.3062e+06,6.9079e+05,6.1540e+05,0.1237
121.6288,922,1.3053e+06,6.9018e+05,6.1511e+05,0.1265
121.7620,923,1.3044e+06,6.8958e+05,6.1482e+05,0.1259
121.8936,924,1.3035e+06,6.8898e+05,6.1453e+05,0.1244
122.0262,925,1.3026e+06,6.8840e+05,6.1423e+05,0.1255
122.1565,926,1.3017e+06,6.8781e+05,6.1393e+05,0.1234
122.2886,927,1.3009e+06,6.8721e+05,6.1364e+05,0.1251
122.4186,928,1.3000e+06,6.8662e+05,6.1335e+05,0.1232
122.5493,929,1.2991e+06,6.8601e+05,6.1306e+05,0.1239
122.6810,930,1.2982e+06,6.8542e+05,6.1278e+05,0.1250
122.8110,931,1.2973e+06,6.8482e+05,6.1249e+05,0.1229
122.9441,932,1.2964e+06,6.8424e+05,6.1221e+05,0.1264
123.0738,933,1.2956e+06,6.8366e+05,6.1192e+05,0.1224
123.2062,934,1.2947e+06,6.8308e+05,6.1163e+05,0.1254
123.3367,935,1.2938e+06,6.8250e+05,6.1134e+05,0.1238
123.4718,936,1.2930e+06,6.8192e+05,6.1106e+05,0.1284
123.6105,937,1.2921e+06,6.8134e+05,6.1078e+05,0.1317
123.7482,938,1.2913e+06,6.8076e+05,6.1050e+05,0.1232
123.8795,939,1.2904e+06,6.8018e+05,6.1022e+05,0.1243
124.0127,940,1.2895e+06,6.7961e+05,6.0994e+05,0.1262
124.1426,941,1.2887e+06,6.7903e+05,6.0967e+05,0.1228
124.2764,942,1.2878e+06,6.7845e+05,6.0939e+05,0.1266
124.4066,943,1.2870e+06,6.7787e+05,6.0912e+05,0.1232
124.5407,944,1.2861e+06,6.7729e+05,6.0885e+05,0.1272
124.6723,945,1.2853e+06,6.7671e+05,6.0858e+05,0.1247
124.8068,946,1.2844e+06,6.7613e+05,6.0832e+05,0.1273
124.9375,947,1.2836e+06,6.7555e+05,6.0805e+05,0.1238
125.0703,948,1.2828e+06,6.7498e+05,6.0778e+05,0.1259
125.2001,949,1.2819e+06,6.7442e+05,6.0751e+05,0.1230
125.3328,950,1.2811e+06,6.7386e+05,6.0725e+05,0.1256
125.4636,951,1.2803e+06,6.7330e+05,6.0698e+05,0.1242
125.5951,952,1.2795e+06,6.7275e+05,6.0671e+05,0.1245
125.7249,953,1.2786e+06,6.7220e+05,6.0644e+05,0.1229
125.8576,954,1.2778e+06,6.7165e+05,6.0617e+05,0.1257
125.9866,955,1.2770e+06,6.7110e+05,6.0590e+05,0.1221
126.1195,956,1.2762e+06,6.7056e+05,6.0562e+05,0.1258
126.2490,957,1.2754e+06,6.7001e+05,6.0534e+05,0.1228
126.3810,958,1.2745e+06,6.6948e+05,6.0506e+05,0.1250
126.5125,959,1.2737e+06,6.6894e+05,6.0479e+05,0.1244
126.6433,960,1.2729e+06,6.6840e+05,6.0451e+05,0.1240
126.7748,961,1.2721e+06,6.6786e+05,6.0423e+05,0.1246
126.9040,962,1.2713e+06,6.6733e+05,6.0396e+05,0.1226
127.0360,963,1.2705e+06,6.6679e+05,6.0369e+05,0.1253
127.1654,964,1.2697e+06,6.6625e+05,6.0341e+05,0.1227
127.2977,965,1.2689e+06,6.6572e+05,6.0314e+05,0.1253
127.4273,966,1.2681e+06,6.6520e+05,6.0287e+05,0.1229
127.5597,967,1.2673e+06,6.6468e+05,6.0259e+05,0.1255
127.6880,968,1.2665e+06,6.6415e+05,6.0231e+05,0.1216
127.8198,969,1.2657e+06,6.6363e+05,6.0203e+05,0.1248
127.9508,970,1.2649e+06,6.6310e+05,6.0175e+05,0.1236
128.0814,971,1.2641e+06,6.6258e+05,6.0149e+05,0.1233
128.2115,972,1.2633e+06,6.6205e+05,6.0122e+05,0.1235
128.3410,973,1.2625e+06,6.6152e+05,6.0095e+05,0.1226
128.4741,974,1.2617e+06,6.6101e+05,6.0069e+05,0.1263
128.6045,975,1.2609e+06,6.6050e+05,6.0041e+05,0.1238
128.7381,976,1.2601e+06,6.5999e+05,6.0013e+05,0.1267
128.8679,977,1.2593e+06,6.5950e+05,5.9984e+05,0.1228
129.0001,978,1.2586e+06,6.5901e+05,5.9955e+05,0.1251
129.1321,979,1.2578e+06,6.5853e+05,5.9925e+05,0.1249
129.2662,980,1.2570e+06,6.5805e+05,5.9895e+05,0.1269
129.3983,981,1.2562e+06,6.5757e+05,5.9865e+05,0.1252
129.5311,982,1.2554e+06,6.5708e+05,5.9835e+05,0.1258
129.6642,983,1.2547e+06,6.5660e+05,5.9806e+05,0.1263
129.7988,984,1.2539e+06,6.5612e+05,5.9777e+05,0.1237
129.9323,985,1.2531e+06,6.5564e+05,5.9748e+05,0.1264
130.0624,986,1.2524e+06,6.5516e+05,5.9720e+05,0.1229
130.1947,987,1.2516e+06,6.5468e+05,5.9692e+05,0.1254
130.3245,988,1.2508e+06,6.5420e+05,5.9664e+05,0.1230
130.4569,989,1.2501e+06,6.5372e+05,5.9637e+05,0.1255
130.5862,990,1.2493e+06,6.5323e+05,5.9610e+05,0.1227
130.7213,991,1.2486e+06,6.5274e+05,5.9584e+05,0.1240
130.8505,992,1.2478e+06,6.5224e+05,5.9558e+05,0.1221
130.9826,993,1.2471e+06,6.5174e+05,5.9533e+05,0.1254
131.1128,994,1.2463e+06,6.5124e+05,5.9509e+05,0.1234
131.2451,995,1.2456e+06,6.5073e+05,5.9484e+05,0.1255
131.3749,996,1.2448e+06,6.5022e+05,5.9460e+05,0.1229
131.5056,997,1.2441e+06,6.4971e+05,5.9436e+05,0.1240
131.6370,998,1.2433e+06,6.4920e+05,5.9411e+05,0.1241
131.7665,999,1.2426e+06,6.4870e+05,5.9387e+05,0.1229
