run_time,iteration,loss,style_loss,content_loss,time
0.1231,0,6.0205e+08,6.0205e+08,0.0000e+00,0.1231
0.2524,1,4.4564e+08,4.4527e+08,3.7067e+05,0.1211
0.3836,2,2.8766e+08,2.8682e+08,8.3832e+05,0.1238
0.5136,3,2.1070e+08,2.0954e+08,1.1612e+06,0.1229
0.6460,4,1.7695e+08,1.7567e+08,1.2790e+06,0.1250
0.7768,5,1.4882e+08,1.4751e+08,1.3154e+06,0.1233
0.9108,6,1.3428e+08,1.3292e+08,1.3605e+06,0.1268
1.0409,7,1.2599e+08,1.2456e+08,1.4289e+06,0.1223
1.1759,8,1.1838e+08,1.1688e+08,1.5092e+06,0.1272
1.3068,9,1.1132e+08,1.0973e+08,1.5908e+06,0.1227
1.4408,10,1.0483e+08,1.0317e+08,1.6577e+06,0.1265
1.5703,11,9.8086e+07,9.6384e+07,1.7024e+06,0.1224
1.7034,12,9.0626e+07,8.8901e+07,1.7246e+06,0.1255
1.8323,13,8.3181e+07,8.1453e+07,1.7277e+06,0.1219
1.9658,14,7.6777e+07,7.5057e+07,1.7205e+06,0.1261
2.0960,15,7.1725e+07,7.0018e+07,1.7073e+06,0.1231
2.2287,16,6.7749e+07,6.6055e+07,1.6944e+06,0.1253
2.3580,17,6.4326e+07,6.2639e+07,1.6867e+06,0.1220
2.4903,18,6.1138e+07,5.9451e+07,1.6875e+06,0.1250
2.6193,19,5.8137e+07,5.6440e+07,1.6965e+06,0.1219
2.7505,20,5.5434e+07,5.3723e+07,1.7114e+06,0.1239
2.8809,21,5.3133e+07,5.1404e+07,1.7291e+06,0.1230
3.0143,22,5.1232e+07,4.9485e+07,1.7468e+06,0.1262
3.1454,23,4.9617e+07,4.7858e+07,1.7599e+06,0.1236
3.2767,24,4.8186e+07,4.6420e+07,1.7665e+06,0.1239
3.4091,25,4.6895e+07,4.5129e+07,1.7661e+06,0.1247
3.5402,26,4.5737e+07,4.3977e+07,1.7601e+06,0.1242
3.6701,27,4.4718e+07,4.2967e+07,1.7504e+06,0.1228
3.8001,28,4.3817e+07,4.2078e+07,1.7388e+06,0.1228
3.9322,29,4.2973e+07,4.1244e+07,1.7285e+06,0.1252
4.0613,30,4.2128e+07,4.0407e+07,1.7209e+06,0.1220
4.1949,31,4.1256e+07,3.9540e+07,1.7160e+06,0.1264
4.3236,32,4.0371e+07,3.8656e+07,1.7151e+06,0.1215
4.4557,33,3.9515e+07,3.7797e+07,1.7183e+06,0.1251
4.5846,34,3.8725e+07,3.7001e+07,1.7244e+06,0.1217
4.7157,35,3.8018e+07,3.6285e+07,1.7324e+06,0.1241
4.8460,36,3.7399e+07,3.5658e+07,1.7413e+06,0.1232
4.9752,37,3.6831e+07,3.5081e+07,1.7498e+06,0.1222
5.1066,38,3.6300e+07,3.4542e+07,1.7576e+06,0.1242
5.2395,39,3.5798e+07,3.4035e+07,1.7633e+06,0.1215
5.3711,40,3.5318e+07,3.3552e+07,1.7660e+06,0.1241
5.5001,41,3.4855e+07,3.3088e+07,1.7667e+06,0.1217
5.6325,42,3.4401e+07,3.2635e+07,1.7655e+06,0.1253
5.7614,43,3.3939e+07,3.2175e+07,1.7631e+06,0.1218
5.8931,44,3.3453e+07,3.1693e+07,1.7598e+06,0.1243
6.0232,45,3.2953e+07,3.1197e+07,1.7557e+06,0.1226
6.1533,46,3.2453e+07,3.0702e+07,1.7509e+06,0.1230
6.2848,47,3.1964e+07,3.0217e+07,1.7462e+06,0.1242
6.4142,48,3.1500e+07,2.9759e+07,1.7411e+06,0.1222
6.5460,49,3.1060e+07,2.9324e+07,1.7357e+06,0.1245
6.6744,50,3.0633e+07,2.8903e+07,1.7300e+06,0.1214
6.8060,51,3.0211e+07,2.8486e+07,1.7244e+06,0.1242
6.9367,52,2.9784e+07,2.8064e+07,1.7194e+06,0.1236
7.0703,53,2.9346e+07,2.7631e+07,1.7148e+06,0.1258
7.2000,54,2.8905e+07,2.7195e+07,1.7108e+06,0.1222
7.3315,55,2.8475e+07,2.6767e+07,1.7077e+06,0.1238
7.4624,56,2.8068e+07,2.6362e+07,1.7054e+06,0.1237
7.5937,57,2.7684e+07,2.5980e+07,1.7040e+06,0.1242
7.7237,58,2.7328e+07,2.5624e+07,1.7035e+06,0.1230
7.8536,59,2.6994e+07,2.5290e+07,1.7037e+06,0.1227
7.9866,60,2.6674e+07,2.4970e+07,1.7040e+06,0.1257
8.1158,61,2.6363e+07,2.4659e+07,1.7045e+06,0.1221
8.2481,62,2.6059e+07,2.4354e+07,1.7047e+06,0.1251
8.3775,63,2.5757e+07,2.4053e+07,1.7042e+06,0.1220
8.5097,64,2.5459e+07,2.3756e+07,1.7029e+06,0.1246
8.6392,65,2.5165e+07,2.3464e+07,1.7005e+06,0.1219
8.7721,66,2.4878e+07,2.3181e+07,1.6969e+06,0.1256
8.9014,67,2.4598e+07,2.2906e+07,1.6922e+06,0.1222
9.0339,68,2.4325e+07,2.2638e+07,1.6869e+06,0.1250
9.1693,69,2.4055e+07,2.2374e+07,1.6811e+06,0.1277
9.3025,70,2.3788e+07,2.2113e+07,1.6753e+06,0.1247
9.4321,71,2.3523e+07,2.1853e+07,1.6698e+06,0.1222
9.5642,72,2.3259e+07,2.1593e+07,1.6653e+06,0.1245
9.6928,73,2.2994e+07,2.1332e+07,1.6619e+06,0.1215
9.8246,74,2.2729e+07,2.1069e+07,1.6595e+06,0.1245
9.9558,75,2.2463e+07,2.0805e+07,1.6581e+06,0.1240
10.0872,76,2.2202e+07,2.0544e+07,1.6577e+06,0.1238
10.2170,77,2.1948e+07,2.0290e+07,1.6579e+06,0.1227
10.3462,78,2.1702e+07,2.0043e+07,1.6585e+06,0.1219
10.4785,79,2.1464e+07,1.9805e+07,1.6592e+06,0.1253
10.6074,80,2.1231e+07,1.9572e+07,1.6593e+06,0.1219
10.7396,81,2.1000e+07,1.9341e+07,1.6587e+06,0.1250
10.8690,82,2.0768e+07,1.9111e+07,1.6572e+06,0.1223
11.0018,83,2.0534e+07,1.8880e+07,1.6546e+06,0.1255
11.1315,84,2.0301e+07,1.8650e+07,1.6511e+06,0.1226
11.2624,85,2.0070e+07,1.8424e+07,1.6469e+06,0.1238
11.4026,86,1.9847e+07,1.8205e+07,1.6422e+06,0.1211
11.5341,87,1.9634e+07,1.7996e+07,1.6372e+06,0.1239
11.6639,88,1.9430e+07,1.7798e+07,1.6324e+06,0.1227
11.7957,89,1.9235e+07,1.7607e+07,1.6283e+06,0.1246
11.9247,90,1.9042e+07,1.7417e+07,1.6248e+06,0.1218
12.0592,91,1.8847e+07,1.7225e+07,1.6221e+06,0.1272
12.1898,92,1.8650e+07,1.7030e+07,1.6203e+06,0.1230
12.3236,93,1.8453e+07,1.6833e+07,1.6193e+06,0.1256
12.4532,94,1.8256e+07,1.6637e+07,1.6190e+06,0.1224
12.5853,95,1.8064e+07,1.6445e+07,1.6191e+06,0.1249
12.7167,96,1.7877e+07,1.6257e+07,1.6192e+06,0.1237
12.8511,97,1.7693e+07,1.6074e+07,1.6190e+06,0.1259
12.9875,98,1.7509e+07,1.5891e+07,1.6183e+06,0.1288
13.1176,99,1.7324e+07,1.5707e+07,1.6168e+06,0.1228
13.2498,100,1.7133e+07,1.5519e+07,1.6144e+06,0.1247
13.3819,101,1.6939e+07,1.5328e+07,1.6111e+06,0.1219
13.5144,102,1.6743e+07,1.5136e+07,1.6070e+06,0.1251
13.6442,103,1.6548e+07,1.4945e+07,1.6023e+06,0.1225
13.7757,104,1.6356e+07,1.4758e+07,1.5974e+06,0.1242
13.9070,105,1.6170e+07,1.4577e+07,1.5925e+06,0.1236
14.0373,106,1.5991e+07,1.4403e+07,1.5878e+06,0.1232
14.1686,107,1.5818e+07,1.4235e+07,1.5836e+06,0.1241
14.2984,108,1.5651e+07,1.4071e+07,1.5802e+06,0.1226
14.4315,109,1.5487e+07,1.3909e+07,1.5774e+06,0.1258
14.5606,110,1.5325e+07,1.3749e+07,1.5753e+06,0.1218
14.6932,111,1.5166e+07,1.3592e+07,1.5737e+06,0.1253
14.8232,112,1.5008e+07,1.3436e+07,1.5725e+06,0.1226
14.9561,113,1.4853e+07,1.3282e+07,1.5713e+06,0.1253
15.0848,114,1.4699e+07,1.3129e+07,1.5701e+06,0.1215
15.2172,115,1.4548e+07,1.2980e+07,1.5686e+06,0.1251
15.3468,116,1.4399e+07,1.2832e+07,1.5667e+06,0.1222
15.4769,117,1.4252e+07,1.2687e+07,1.5645e+06,0.1229
15.6076,118,1.4106e+07,1.2544e+07,1.5620e+06,0.1237
15.7370,119,1.3962e+07,1.2403e+07,1.5590e+06,0.1224
15.8704,120,1.3821e+07,1.2265e+07,1.5557e+06,0.1261
16.0011,121,1.3681e+07,1.2129e+07,1.5521e+06,0.1232
16.1357,122,1.3543e+07,1.1994e+07,1.5484e+06,0.1275
16.2678,123,1.3405e+07,1.1860e+07,1.5449e+06,0.1241
16.3988,124,1.3269e+07,1.1727e+07,1.5417e+06,0.1239
16.5273,125,1.3134e+07,1.1595e+07,1.5387e+06,0.1218
16.6609,126,1.3001e+07,1.1465e+07,1.5359e+06,0.1264
16.7913,127,1.2872e+07,1.1338e+07,1.5334e+06,0.1233
16.9232,128,1.2745e+07,1.1214e+07,1.5312e+06,0.1248
17.0537,129,1.2620e+07,1.1090e+07,1.5294e+06,0.1237
17.1873,130,1.2495e+07,1.0967e+07,1.5277e+06,0.1265
17.3178,131,1.2370e+07,1.0844e+07,1.5262e+06,0.1235
17.4499,132,1.2246e+07,1.0721e+07,1.5247e+06,0.1246
17.5802,133,1.2123e+07,1.0600e+07,1.5232e+06,0.1228
17.7136,134,1.2003e+07,1.0481e+07,1.5216e+06,0.1258
17.8441,135,1.1885e+07,1.0365e+07,1.5199e+06,0.1228
17.9779,136,1.1771e+07,1.0253e+07,1.5179e+06,0.1265
18.1078,137,1.1658e+07,1.0142e+07,1.5159e+06,0.1227
18.2390,138,1.1546e+07,1.0032e+07,1.5137e+06,0.1243
18.3691,139,1.1433e+07,9.9216e+06,1.5116e+06,0.1232
18.5015,140,1.1321e+07,9.8114e+06,1.5094e+06,0.1251
18.6304,141,1.1209e+07,9.7022e+06,1.5071e+06,0.1219
18.7607,142,1.1099e+07,9.5945e+06,1.5048e+06,0.1235
18.8919,143,1.0992e+07,9.4897e+06,1.5024e+06,0.1241
19.0235,144,1.0888e+07,9.3881e+06,1.4998e+06,0.1242
19.1543,145,1.0786e+07,9.2892e+06,1.4971e+06,0.1239
19.2839,146,1.0687e+07,9.1928e+06,1.4944e+06,0.1226
19.4214,147,1.0590e+07,9.0981e+06,1.4917e+06,0.1231
19.5550,148,1.0494e+07,9.0048e+06,1.4892e+06,0.1264
19.6909,149,1.0400e+07,8.9129e+06,1.4868e+06,0.1285
19.8243,150,1.0307e+07,8.8226e+06,1.4845e+06,0.1258
19.9533,151,1.0217e+07,8.7344e+06,1.4823e+06,0.1221
20.0853,152,1.0128e+07,8.6477e+06,1.4803e+06,0.1251
20.2141,153,1.0040e+07,8.5616e+06,1.4785e+06,0.1220
20.3465,154,9.9524e+06,8.4756e+06,1.4768e+06,0.1252
20.4761,155,9.8641e+06,8.3889e+06,1.4753e+06,0.1226
20.6089,156,9.7752e+06,8.3013e+06,1.4739e+06,0.1258
20.7398,157,9.6860e+06,8.2135e+06,1.4724e+06,0.1238
20.8706,158,9.5980e+06,8.1272e+06,1.4708e+06,0.1237
21.0013,159,9.5119e+06,8.0430e+06,1.4689e+06,0.1237
21.1315,160,9.4280e+06,7.9611e+06,1.4668e+06,0.1234
21.2629,161,9.3460e+06,7.8815e+06,1.4646e+06,0.1241
21.3961,162,9.2654e+06,7.8034e+06,1.4621e+06,0.1261
21.5295,163,9.1855e+06,7.7262e+06,1.4594e+06,0.1262
21.6609,164,9.1062e+06,7.6495e+06,1.4566e+06,0.1245
21.7937,165,9.0275e+06,7.5737e+06,1.4538e+06,0.1259
21.9252,166,8.9500e+06,7.4989e+06,1.4511e+06,0.1245
22.0555,167,8.8742e+06,7.4256e+06,1.4486e+06,0.1233
22.1871,168,8.8008e+06,7.3544e+06,1.4464e+06,0.1247
22.3175,169,8.7293e+06,7.2849e+06,1.4444e+06,0.1237
22.4466,170,8.6596e+06,7.2169e+06,1.4427e+06,0.1223
22.5778,171,8.5908e+06,7.1496e+06,1.4412e+06,0.1240
22.7075,172,8.5224e+06,7.0823e+06,1.4401e+06,0.1226
22.8414,173,8.4543e+06,7.0152e+06,1.4391e+06,0.1268
22.9701,174,8.3865e+06,6.9483e+06,1.4382e+06,0.1218
23.1023,175,8.3190e+06,6.8818e+06,1.4371e+06,0.1249
23.2320,176,8.2519e+06,6.8160e+06,1.4359e+06,0.1229
23.3622,177,8.1852e+06,6.7507e+06,1.4345e+06,0.1235
23.4931,178,8.1190e+06,6.6863e+06,1.4327e+06,0.1241
23.6236,179,8.0534e+06,6.6228e+06,1.4306e+06,0.1227
23.7554,180,7.9886e+06,6.5605e+06,1.4281e+06,0.1249
23.8846,181,7.9249e+06,6.4994e+06,1.4255e+06,0.1221
24.0167,182,7.8622e+06,6.4394e+06,1.4228e+06,0.1250
24.1457,183,7.8004e+06,6.3804e+06,1.4200e+06,0.1222
24.2782,184,7.7395e+06,6.3222e+06,1.4174e+06,0.1251
24.4074,185,7.6794e+06,6.2644e+06,1.4149e+06,0.1225
24.5361,186,7.6202e+06,6.2075e+06,1.4127e+06,0.1219
24.6694,187,7.5625e+06,6.1518e+06,1.4106e+06,0.1260
24.8010,188,7.5066e+06,6.0979e+06,1.4087e+06,0.1245
24.9323,189,7.4523e+06,6.0455e+06,1.4068e+06,0.1243
25.0632,190,7.3993e+06,5.9943e+06,1.4050e+06,0.1238
25.1952,191,7.3468e+06,5.9438e+06,1.4030e+06,0.1251
25.3238,192,7.2941e+06,5.8933e+06,1.4009e+06,0.1220
25.4583,193,7.2407e+06,5.8422e+06,1.3986e+06,0.1277
25.5882,194,7.1865e+06,5.7904e+06,1.3961e+06,0.1229
25.7219,195,7.1321e+06,5.7387e+06,1.3934e+06,0.1259
25.8518,196,7.0783e+06,5.6878e+06,1.3905e+06,0.1222
25.9832,197,7.0258e+06,5.6383e+06,1.3875e+06,0.1241
26.1119,198,6.9750e+06,5.5904e+06,1.3845e+06,0.1218
26.2446,199,6.9256e+06,5.5440e+06,1.3816e+06,0.1256
26.3742,200,6.8771e+06,5.4984e+06,1.3787e+06,0.1226
26.5122,201,6.8288e+06,5.4528e+06,1.3760e+06,0.1220
26.6422,202,6.7805e+06,5.4069e+06,1.3736e+06,0.1228
26.7738,203,6.7320e+06,5.3606e+06,1.3714e+06,0.1243
26.9017,204,6.6836e+06,5.3142e+06,1.3693e+06,0.1210
27.0329,205,6.6360e+06,5.2687e+06,1.3673e+06,0.1237
27.1623,206,6.5897e+06,5.2244e+06,1.3653e+06,0.1223
27.2921,207,6.5447e+06,5.1814e+06,1.3633e+06,0.1227
27.4242,208,6.5004e+06,5.1393e+06,1.3611e+06,0.1250
27.5529,209,6.4563e+06,5.0976e+06,1.3588e+06,0.1218
27.6853,210,6.4122e+06,5.0558e+06,1.3564e+06,0.1253
27.8160,211,6.3678e+06,5.0139e+06,1.3539e+06,0.1235
27.9496,212,6.3233e+06,4.9719e+06,1.3513e+06,0.1255
28.0782,213,6.2789e+06,4.9301e+06,1.3488e+06,0.1214
28.2098,214,6.2351e+06,4.8889e+06,1.3463e+06,0.1246
28.3403,215,6.1925e+06,4.8485e+06,1.3439e+06,0.1236
28.4728,216,6.1510e+06,4.8092e+06,1.3418e+06,0.1257
28.6030,217,6.1106e+06,4.7708e+06,1.3398e+06,0.1229
28.7348,218,6.0710e+06,4.7329e+06,1.3381e+06,0.1244
28.8659,219,6.0320e+06,4.6955e+06,1.3366e+06,0.1236
28.9966,220,5.9934e+06,4.6583e+06,1.3351e+06,0.1234
29.1292,221,5.9551e+06,4.6214e+06,1.3337e+06,0.1256
29.2685,222,5.9172e+06,4.5848e+06,1.3324e+06,0.1214
29.4000,223,5.8797e+06,4.5488e+06,1.3309e+06,0.1235
29.5337,224,5.8428e+06,4.5135e+06,1.3294e+06,0.1264
29.6646,225,5.8067e+06,4.4790e+06,1.3277e+06,0.1235
29.7981,226,5.7715e+06,4.4455e+06,1.3259e+06,0.1260
29.9295,227,5.7368e+06,4.4127e+06,1.3240e+06,0.1244
30.0627,228,5.7023e+06,4.3803e+06,1.3220e+06,0.1261
30.1946,229,5.6676e+06,4.3476e+06,1.3200e+06,0.1247
30.3250,230,5.6327e+06,4.3147e+06,1.3180e+06,0.1235
30.4566,231,5.5976e+06,4.2816e+06,1.3160e+06,0.1243
30.5898,232,5.5625e+06,4.2484e+06,1.3141e+06,0.1261
30.7225,233,5.5279e+06,4.2157e+06,1.3122e+06,0.1250
30.8529,234,5.4941e+06,4.1837e+06,1.3104e+06,0.1233
30.9834,235,5.4611e+06,4.1524e+06,1.3087e+06,0.1236
31.1140,236,5.4288e+06,4.1217e+06,1.3071e+06,0.1238
31.2435,237,5.3971e+06,4.0917e+06,1.3054e+06,0.1225
31.3771,238,5.3656e+06,4.0618e+06,1.3038e+06,0.1265
31.5067,239,5.3344e+06,4.0322e+06,1.3022e+06,0.1225
31.6403,240,5.3034e+06,4.0029e+06,1.3005e+06,0.1258
31.7706,241,5.2729e+06,3.9741e+06,1.2988e+06,0.1231
31.9031,242,5.2433e+06,3.9462e+06,1.2971e+06,0.1248
32.0323,243,5.2144e+06,3.9191e+06,1.2953e+06,0.1217
32.1667,244,5.1860e+06,3.8925e+06,1.2935e+06,0.1270
32.2976,245,5.1577e+06,3.8660e+06,1.2916e+06,0.1236
32.4288,246,5.1292e+06,3.8394e+06,1.2897e+06,0.1244
32.5581,247,5.1005e+06,3.8127e+06,1.2878e+06,0.1221
32.6911,248,5.0717e+06,3.7858e+06,1.2859e+06,0.1258
32.8196,249,5.0431e+06,3.7591e+06,1.2839e+06,0.1213
32.9522,250,5.0149e+06,3.7329e+06,1.2820e+06,0.1251
33.0823,251,4.9872e+06,3.7072e+06,1.2800e+06,0.1230
33.2126,252,4.9601e+06,3.6820e+06,1.2781e+06,0.1234
33.3454,253,4.9333e+06,3.6572e+06,1.2761e+06,0.1257
33.4770,254,4.9068e+06,3.6326e+06,1.2741e+06,0.1243
33.6077,255,4.8805e+06,3.6083e+06,1.2722e+06,0.1237
33.7421,256,4.8544e+06,3.5841e+06,1.2703e+06,0.1269
33.8780,257,4.8285e+06,3.5601e+06,1.2684e+06,0.1240
34.0106,258,4.8027e+06,3.5362e+06,1.2665e+06,0.1252
34.1395,259,4.7771e+06,3.5126e+06,1.2646e+06,0.1218
34.2778,260,4.7518e+06,3.4892e+06,1.2626e+06,0.1214
34.4088,261,4.7267e+06,3.4660e+06,1.2606e+06,0.1238
34.5393,262,4.7018e+06,3.4431e+06,1.2587e+06,0.1235
34.6691,263,4.6772e+06,3.4205e+06,1.2566e+06,0.1226
34.8012,264,4.6528e+06,3.3982e+06,1.2546e+06,0.1244
34.9313,265,4.6286e+06,3.3762e+06,1.2524e+06,0.1231
35.0642,266,4.6048e+06,3.3546e+06,1.2502e+06,0.1257
35.1933,267,4.5811e+06,3.3333e+06,1.2479e+06,0.1222
35.3249,268,4.5577e+06,3.3122e+06,1.2455e+06,0.1246
35.4532,269,4.5346e+06,3.2914e+06,1.2432e+06,0.1215
35.5853,270,4.5119e+06,3.2710e+06,1.2409e+06,0.1253
35.7168,271,4.4896e+06,3.2510e+06,1.2386e+06,0.1244
35.8476,272,4.4677e+06,3.2312e+06,1.2365e+06,0.1236
35.9802,273,4.4459e+06,3.2115e+06,1.2345e+06,0.1253
36.1126,274,4.4244e+06,3.1919e+06,1.2325e+06,0.1254
36.2450,275,4.4030e+06,3.1723e+06,1.2306e+06,0.1241
36.3784,276,4.3817e+06,3.1530e+06,1.2288e+06,0.1251
36.5103,277,4.3607e+06,3.1339e+06,1.2269e+06,0.1248
36.6451,278,4.3399e+06,3.1150e+06,1.2249e+06,0.1270
36.7752,279,4.3191e+06,3.0962e+06,1.2228e+06,0.1224
36.9069,280,4.2983e+06,3.0777e+06,1.2206e+06,0.1246
37.0380,281,4.2777e+06,3.0594e+06,1.2183e+06,0.1236
37.1725,282,4.2573e+06,3.0415e+06,1.2158e+06,0.1271
37.3031,283,4.2372e+06,3.0239e+06,1.2133e+06,0.1232
37.4358,284,4.2173e+06,3.0066e+06,1.2108e+06,0.1251
37.5654,285,4.1977e+06,2.9894e+06,1.2083e+06,0.1223
37.6996,286,4.1783e+06,2.9724e+06,1.2059e+06,0.1263
37.8295,287,4.1590e+06,2.9554e+06,1.2036e+06,0.1223
37.9667,288,4.1398e+06,2.9383e+06,1.2015e+06,0.1297
38.1005,289,4.1207e+06,2.9212e+06,1.1995e+06,0.1259
38.2326,290,4.1019e+06,2.9043e+06,1.1976e+06,0.1244
38.3675,291,4.0835e+06,2.8877e+06,1.1958e+06,0.1267
38.4992,292,4.0654e+06,2.8714e+06,1.1940e+06,0.1241
38.6322,293,4.0475e+06,2.8554e+06,1.1921e+06,0.1254
38.7631,294,4.0296e+06,2.8394e+06,1.1902e+06,0.1236
38.8958,295,4.0115e+06,2.8234e+06,1.1881e+06,0.1253
39.0253,296,3.9932e+06,2.8073e+06,1.1859e+06,0.1220
39.1609,297,3.9748e+06,2.7912e+06,1.1836e+06,0.1280
39.2941,298,3.9566e+06,2.7754e+06,1.1812e+06,0.1239
39.4269,299,3.9387e+06,2.7598e+06,1.1789e+06,0.1254
39.5608,300,3.9211e+06,2.7445e+06,1.1766e+06,0.1257
39.6935,301,3.9038e+06,2.7294e+06,1.1744e+06,0.1249
39.8255,302,3.8866e+06,2.7143e+06,1.1723e+06,0.1246
39.9557,303,3.8695e+06,2.6992e+06,1.1703e+06,0.1228
40.0885,304,3.8525e+06,2.6840e+06,1.1685e+06,0.1246
40.2192,305,3.8357e+06,2.6689e+06,1.1667e+06,0.1230
40.3535,306,3.8192e+06,2.6541e+06,1.1651e+06,0.1268
40.4851,307,3.8030e+06,2.6396e+06,1.1633e+06,0.1242
40.6194,308,3.7871e+06,2.6255e+06,1.1616e+06,0.1265
40.7484,309,3.7713e+06,2.6115e+06,1.1598e+06,0.1218
40.8813,310,3.7556e+06,2.5978e+06,1.1578e+06,0.1252
41.0098,311,3.7399e+06,2.5841e+06,1.1558e+06,0.1212
41.1436,312,3.7242e+06,2.5705e+06,1.1537e+06,0.1265
41.2729,313,3.7085e+06,2.5570e+06,1.1515e+06,0.1218
41.4054,314,3.6927e+06,2.5434e+06,1.1493e+06,0.1248
41.5355,315,3.6771e+06,2.5300e+06,1.1471e+06,0.1228
41.6698,316,3.6617e+06,2.5167e+06,1.1450e+06,0.1270
41.7994,317,3.6466e+06,2.5037e+06,1.1429e+06,0.1223
41.9319,318,3.6317e+06,2.4908e+06,1.1408e+06,0.1252
42.0611,319,3.6169e+06,2.4780e+06,1.1389e+06,0.1220
42.1928,320,3.6021e+06,2.4651e+06,1.1370e+06,0.1247
42.3225,321,3.5872e+06,2.4521e+06,1.1351e+06,0.1225
42.4526,322,3.5725e+06,2.4391e+06,1.1333e+06,0.1230
42.5848,323,3.5578e+06,2.4263e+06,1.1315e+06,0.1249
42.7147,324,3.5434e+06,2.4137e+06,1.1297e+06,0.1217
42.8473,325,3.5294e+06,2.4015e+06,1.1279e+06,0.1252
42.9784,326,3.5156e+06,2.3896e+06,1.1260e+06,0.1236
43.1107,327,3.5019e+06,2.3778e+06,1.1241e+06,0.1248
43.2405,328,3.4881e+06,2.3660e+06,1.1221e+06,0.1225
43.3735,329,3.4742e+06,2.3540e+06,1.1201e+06,0.1250
43.5025,330,3.4602e+06,2.3421e+06,1.1181e+06,0.1219
43.6346,331,3.4464e+06,2.3303e+06,1.1161e+06,0.1247
43.7636,332,3.4328e+06,2.3187e+06,1.1141e+06,0.1217
43.8968,333,3.4195e+06,2.3075e+06,1.1120e+06,0.1254
44.0280,334,3.4064e+06,2.2964e+06,1.1100e+06,0.1238
44.1625,335,3.3934e+06,2.2854e+06,1.1080e+06,0.1253
44.2981,336,3.3804e+06,2.2743e+06,1.1061e+06,0.1215
44.4288,337,3.3672e+06,2.2630e+06,1.1042e+06,0.1237
44.5587,338,3.3541e+06,2.2518e+06,1.1023e+06,0.1227
44.6949,339,3.3412e+06,2.2407e+06,1.1004e+06,0.1291
44.8260,340,3.3285e+06,2.2299e+06,1.0986e+06,0.1240
44.9577,341,3.3160e+06,2.2191e+06,1.0969e+06,0.1243
45.0887,342,3.3036e+06,2.2084e+06,1.0951e+06,0.1234
45.2207,343,3.2912e+06,2.1978e+06,1.0934e+06,0.1246
45.3504,344,3.2787e+06,2.1871e+06,1.0916e+06,0.1225
45.4825,345,3.2661e+06,2.1764e+06,1.0897e+06,0.1246
45.6111,346,3.2536e+06,2.1659e+06,1.0878e+06,0.1216
45.7460,347,3.2413e+06,2.1555e+06,1.0858e+06,0.1231
45.8759,348,3.2291e+06,2.1454e+06,1.0838e+06,0.1226
46.0091,349,3.2172e+06,2.1355e+06,1.0817e+06,0.1255
46.1383,350,3.2054e+06,2.1258e+06,1.0797e+06,0.1221
46.2708,351,3.1938e+06,2.1162e+06,1.0776e+06,0.1252
46.4029,352,3.1822e+06,2.1066e+06,1.0756e+06,0.1221
46.5352,353,3.1707e+06,2.0969e+06,1.0737e+06,0.1249
46.6633,354,3.1592e+06,2.0872e+06,1.0719e+06,0.1213
46.7962,355,3.1477e+06,2.0775e+06,1.0702e+06,0.1255
46.9252,356,3.1364e+06,2.0680e+06,1.0685e+06,0.1220
47.0558,357,3.1253e+06,2.0585e+06,1.0668e+06,0.1237
47.1869,358,3.1144e+06,2.0492e+06,1.0652e+06,0.1242
47.3159,359,3.1035e+06,2.0400e+06,1.0635e+06,0.1217
47.4482,360,3.0925e+06,2.0308e+06,1.0618e+06,0.1250
47.5771,361,3.0816e+06,2.0216e+06,1.0600e+06,0.1220
47.7092,362,3.0706e+06,2.0125e+06,1.0581e+06,0.1251
47.8380,363,3.0596e+06,2.0034e+06,1.0562e+06,0.1218
47.9693,364,3.0488e+06,1.9946e+06,1.0542e+06,0.1240
48.0997,365,3.0381e+06,1.9858e+06,1.0523e+06,0.1232
48.2298,366,3.0276e+06,1.9772e+06,1.0504e+06,0.1232
48.3620,367,3.0171e+06,1.9685e+06,1.0486e+06,0.1251
48.4904,368,3.0066e+06,1.9597e+06,1.0468e+06,0.1215
48.6223,369,2.9961e+06,1.9509e+06,1.0452e+06,0.1246
48.7515,370,2.9857e+06,1.9421e+06,1.0436e+06,0.1224
48.8835,371,2.9755e+06,1.9335e+06,1.0420e+06,0.1250
49.0131,372,2.9654e+06,1.9250e+06,1.0404e+06,0.1225
49.1437,373,2.9555e+06,1.9167e+06,1.0388e+06,0.1237
49.2764,374,2.9456e+06,1.9085e+06,1.0371e+06,0.1256
49.4067,375,2.9358e+06,1.9004e+06,1.0354e+06,0.1230
49.5369,376,2.9259e+06,1.8923e+06,1.0336e+06,0.1233
49.6695,377,2.9161e+06,1.8843e+06,1.0318e+06,0.1257
49.8034,378,2.9064e+06,1.8764e+06,1.0300e+06,0.1246
49.9369,379,2.8968e+06,1.8686e+06,1.0282e+06,0.1257
50.0667,380,2.8873e+06,1.8609e+06,1.0265e+06,0.1226
50.1991,381,2.8780e+06,1.8532e+06,1.0248e+06,0.1254
50.3309,382,2.8686e+06,1.8455e+06,1.0232e+06,0.1243
50.4641,383,2.8593e+06,1.8377e+06,1.0217e+06,0.1254
50.5941,384,2.8500e+06,1.8298e+06,1.0202e+06,0.1225
50.7278,385,2.8408e+06,1.8220e+06,1.0188e+06,0.1261
50.8579,386,2.8315e+06,1.8142e+06,1.0173e+06,0.1225
50.9909,387,2.8224e+06,1.8065e+06,1.0159e+06,0.1256
51.1210,388,2.8133e+06,1.7988e+06,1.0145e+06,0.1224
51.2515,389,2.8043e+06,1.7913e+06,1.0130e+06,0.1234
51.3818,390,2.7954e+06,1.7839e+06,1.0115e+06,0.1224
51.5111,391,2.7865e+06,1.7765e+06,1.0100e+06,0.1225
51.6426,392,2.7776e+06,1.7692e+06,1.0084e+06,0.1247
51.7703,393,2.7687e+06,1.7619e+06,1.0068e+06,0.1208
51.9015,394,2.7600e+06,1.7547e+06,1.0052e+06,0.1239
52.0321,395,2.7513e+06,1.7476e+06,1.0037e+06,0.1234
52.1628,396,2.7427e+06,1.7405e+06,1.0022e+06,0.1238
52.2934,397,2.7343e+06,1.7335e+06,1.0007e+06,0.1237
52.4233,398,2.7258e+06,1.7265e+06,9.9928e+05,0.1232
52.5554,399,2.7173e+06,1.7195e+06,9.9785e+05,0.1252
52.6832,400,2.7089e+06,1.7124e+06,9.9643e+05,0.1210
52.8184,401,2.7004e+06,1.7054e+06,9.9504e+05,0.1272
52.9469,402,2.6921e+06,1.6985e+06,9.9364e+05,0.1217
53.0802,403,2.6839e+06,1.6916e+06,9.9224e+05,0.1250
53.2089,404,2.6757e+06,1.6848e+06,9.9085e+05,0.1218
53.3394,405,2.6674e+06,1.6780e+06,9.8945e+05,0.1238
53.4707,406,2.6592e+06,1.6711e+06,9.8804e+05,0.1245
53.6004,407,2.6509e+06,1.6643e+06,9.8662e+05,0.1226
53.7324,408,2.6428e+06,1.6576e+06,9.8519e+05,0.1250
53.8618,409,2.6347e+06,1.6510e+06,9.8374e+05,0.1223
53.9958,410,2.6267e+06,1.6445e+06,9.8228e+05,0.1268
54.1267,411,2.6189e+06,1.6381e+06,9.8082e+05,0.1239
54.2600,412,2.6110e+06,1.6317e+06,9.7935e+05,0.1259
54.3927,413,2.6032e+06,1.6253e+06,9.7790e+05,0.1249
54.5254,414,2.5955e+06,1.6190e+06,9.7644e+05,0.1248
54.6561,415,2.5878e+06,1.6128e+06,9.7499e+05,0.1239
54.7856,416,2.5802e+06,1.6067e+06,9.7355e+05,0.1225
54.9147,417,2.5728e+06,1.6007e+06,9.7213e+05,0.1221
55.0472,418,2.5654e+06,1.5947e+06,9.7073e+05,0.1253
55.1754,419,2.5580e+06,1.5887e+06,9.6935e+05,0.1214
55.3062,420,2.5507e+06,1.5827e+06,9.6799e+05,0.1237
55.4358,421,2.5433e+06,1.5767e+06,9.6663e+05,0.1226
55.5654,422,2.5360e+06,1.5708e+06,9.6526e+05,0.1227
55.6971,423,2.5288e+06,1.5649e+06,9.6387e+05,0.1245
55.8298,424,2.5217e+06,1.5592e+06,9.6247e+05,0.1260
55.9619,425,2.5147e+06,1.5536e+06,9.6105e+05,0.1250
56.0917,426,2.5077e+06,1.5480e+06,9.5965e+05,0.1227
56.2254,427,2.5007e+06,1.5425e+06,9.5825e+05,0.1263
56.3576,428,2.4938e+06,1.5369e+06,9.5688e+05,0.1251
56.4889,429,2.4869e+06,1.5314e+06,9.5553e+05,0.1244
56.6184,430,2.4802e+06,1.5260e+06,9.5423e+05,0.1225
56.7494,431,2.4735e+06,1.5206e+06,9.5297e+05,0.1241
56.8811,432,2.4669e+06,1.5152e+06,9.5173e+05,0.1249
57.0131,433,2.4604e+06,1.5099e+06,9.5051e+05,0.1244
57.1413,434,2.4539e+06,1.5046e+06,9.4929e+05,0.1211
57.2726,435,2.4474e+06,1.4993e+06,9.4805e+05,0.1242
57.4020,436,2.4409e+06,1.4941e+06,9.4679e+05,0.1225
57.5319,437,2.4344e+06,1.4889e+06,9.4550e+05,0.1232
57.6636,438,2.4280e+06,1.4838e+06,9.4418e+05,0.1247
57.7933,439,2.4216e+06,1.4787e+06,9.4285e+05,0.1229
57.9266,440,2.4153e+06,1.4738e+06,9.4152e+05,0.1256
58.0557,441,2.4090e+06,1.4688e+06,9.4020e+05,0.1219
58.1871,442,2.4027e+06,1.4638e+06,9.3892e+05,0.1243
58.3156,443,2.3963e+06,1.4587e+06,9.3766e+05,0.1216
58.4457,444,2.3900e+06,1.4536e+06,9.3642e+05,0.1233
58.5758,445,2.3837e+06,1.4485e+06,9.3520e+05,0.1235
58.7082,446,2.3775e+06,1.4435e+06,9.3399e+05,0.1253
58.8415,447,2.3713e+06,1.4386e+06,9.3276e+05,0.1260
58.9734,448,2.3652e+06,1.4337e+06,9.3151e+05,0.1248
59.1042,449,2.3590e+06,1.4288e+06,9.3022e+05,0.1236
59.2365,450,2.3528e+06,1.4239e+06,9.2889e+05,0.1253
59.3681,451,2.3467e+06,1.4191e+06,9.2752e+05,0.1247
59.5019,452,2.3406e+06,1.4144e+06,9.2614e+05,0.1264
59.6326,453,2.3346e+06,1.4098e+06,9.2480e+05,0.1238
59.7646,454,2.3287e+06,1.4052e+06,9.2350e+05,0.1246
59.8955,455,2.3228e+06,1.4005e+06,9.2226e+05,0.1241
60.0282,456,2.3169e+06,1.3958e+06,9.2107e+05,0.1255
60.1578,457,2.3109e+06,1.3910e+06,9.1995e+05,0.1224
60.2890,458,2.3050e+06,1.3862e+06,9.1887e+05,0.1238
60.4189,459,2.2993e+06,1.3815e+06,9.1780e+05,0.1232
60.5484,460,2.2936e+06,1.3769e+06,9.1672e+05,0.1226
60.6803,461,2.2880e+06,1.3724e+06,9.1562e+05,0.1247
60.8125,462,2.2824e+06,1.3679e+06,9.1447e+05,0.1256
60.9479,463,2.2768e+06,1.3635e+06,9.1329e+05,0.1241
61.0792,464,2.2712e+06,1.3591e+06,9.1206e+05,0.1239
61.2098,465,2.2656e+06,1.3548e+06,9.1081e+05,0.1235
61.3403,466,2.2601e+06,1.3506e+06,9.0957e+05,0.1234
61.4713,467,2.2547e+06,1.3464e+06,9.0835e+05,0.1242
61.6006,468,2.2494e+06,1.3422e+06,9.0715e+05,0.1227
61.7322,469,2.2441e+06,1.3381e+06,9.0599e+05,0.1246
61.8626,470,2.2388e+06,1.3340e+06,9.0486e+05,0.1234
61.9957,471,2.2336e+06,1.3298e+06,9.0377e+05,0.1257
62.1250,472,2.2283e+06,1.3256e+06,9.0270e+05,0.1220
62.2572,473,2.2231e+06,1.3215e+06,9.0164e+05,0.1252
62.3863,474,2.2180e+06,1.3174e+06,9.0058e+05,0.1223
62.5169,475,2.2129e+06,1.3134e+06,8.9953e+05,0.1238
62.6474,476,2.2079e+06,1.3095e+06,8.9846e+05,0.1237
62.7781,477,2.2030e+06,1.3056e+06,8.9739e+05,0.1238
62.9114,478,2.1980e+06,1.3017e+06,8.9631e+05,0.1259
63.0410,479,2.1930e+06,1.2978e+06,8.9523e+05,0.1224
63.1728,480,2.1880e+06,1.2939e+06,8.9417e+05,0.1247
63.3014,481,2.1831e+06,1.2900e+06,8.9312e+05,0.1218
63.4332,482,2.1783e+06,1.2862e+06,8.9208e+05,0.1247
63.5614,483,2.1734e+06,1.2824e+06,8.9106e+05,0.1214
63.6918,484,2.1686e+06,1.2786e+06,8.9003e+05,0.1236
63.8223,485,2.1638e+06,1.2748e+06,8.8901e+05,0.1236
63.9512,486,2.1590e+06,1.2710e+06,8.8800e+05,0.1221
64.0833,487,2.1542e+06,1.2672e+06,8.8699e+05,0.1249
64.2129,488,2.1495e+06,1.2635e+06,8.8599e+05,0.1226
64.3468,489,2.1448e+06,1.2598e+06,8.8501e+05,0.1256
64.4771,490,2.1401e+06,1.2561e+06,8.8403e+05,0.1234
64.6141,491,2.1354e+06,1.2523e+06,8.8306e+05,0.1298
64.7448,492,2.1307e+06,1.2485e+06,8.8211e+05,0.1220
64.8765,493,2.1259e+06,1.2447e+06,8.8117e+05,0.1246
65.0053,494,2.1212e+06,1.2410e+06,8.8022e+05,0.1217
65.1364,495,2.1166e+06,1.2373e+06,8.7927e+05,0.1240
65.2649,496,2.1120e+06,1.2337e+06,8.7832e+05,0.1217
65.3987,497,2.1075e+06,1.2301e+06,8.7736e+05,0.1267
65.5297,498,2.1029e+06,1.2265e+06,8.7640e+05,0.1239
65.6631,499,2.0984e+06,1.2230e+06,8.7544e+05,0.1264
65.7923,500,2.0939e+06,1.2194e+06,8.7450e+05,0.1223
65.9257,501,2.0894e+06,1.2158e+06,8.7356e+05,0.1241
66.0540,502,2.0849e+06,1.2123e+06,8.7264e+05,0.1211
66.1874,503,2.0805e+06,1.2088e+06,8.7173e+05,0.1262
66.3165,504,2.0761e+06,1.2053e+06,8.7083e+05,0.1221
66.4484,505,2.0717e+06,1.2018e+06,8.6992e+05,0.1245
66.5795,506,2.0674e+06,1.1984e+06,8.6901e+05,0.1236
66.7092,507,2.0631e+06,1.1950e+06,8.6809e+05,0.1230
66.8396,508,2.0588e+06,1.1916e+06,8.6716e+05,0.1235
66.9695,509,2.0545e+06,1.1883e+06,8.6623e+05,0.1229
67.1032,510,2.0502e+06,1.1850e+06,8.6529e+05,0.1266
67.2325,511,2.0460e+06,1.1817e+06,8.6436e+05,0.1218
67.3654,512,2.0418e+06,1.1784e+06,8.6345e+05,0.1259
67.4930,513,2.0376e+06,1.1751e+06,8.6255e+05,0.1208
67.6250,514,2.0335e+06,1.1718e+06,8.6168e+05,0.1251
67.7537,515,2.0293e+06,1.1685e+06,8.6081e+05,0.1220
67.8831,516,2.0252e+06,1.1653e+06,8.5994e+05,0.1228
68.0161,517,2.0212e+06,1.1621e+06,8.5907e+05,0.1255
68.1461,518,2.0172e+06,1.1590e+06,8.5818e+05,0.1229
68.2797,519,2.0131e+06,1.1559e+06,8.5726e+05,0.1259
68.4121,520,2.0091e+06,1.1528e+06,8.5632e+05,0.1247
68.5442,521,2.0051e+06,1.1498e+06,8.5537e+05,0.1249
68.6767,522,2.0012e+06,1.1467e+06,8.5442e+05,0.1254
68.8085,523,1.9972e+06,1.1437e+06,8.5349e+05,0.1248
68.9400,524,1.9933e+06,1.1408e+06,8.5258e+05,0.1242
69.0705,525,1.9895e+06,1.1378e+06,8.5169e+05,0.1234
69.2014,526,1.9856e+06,1.1347e+06,8.5084e+05,0.1237
69.3327,527,1.9817e+06,1.1317e+06,8.5002e+05,0.1242
69.4616,528,1.9779e+06,1.1287e+06,8.4921e+05,0.1218
69.5930,529,1.9741e+06,1.1257e+06,8.4841e+05,0.1246
69.7220,530,1.9704e+06,1.1228e+06,8.4759e+05,0.1220
69.8556,531,1.9667e+06,1.1199e+06,8.4673e+05,0.1261
69.9848,532,1.9629e+06,1.1171e+06,8.4584e+05,0.1222
70.1180,533,1.9592e+06,1.1143e+06,8.4493e+05,0.1256
70.2469,534,1.9555e+06,1.1115e+06,8.4400e+05,0.1218
70.3786,535,1.9518e+06,1.1088e+06,8.4307e+05,0.1245
70.5086,536,1.9482e+06,1.1061e+06,8.4216e+05,0.1229
70.6374,537,1.9446e+06,1.1034e+06,8.4126e+05,0.1220
70.7687,538,1.9410e+06,1.1006e+06,8.4039e+05,0.1244
70.8979,539,1.9374e+06,1.0979e+06,8.3954e+05,0.1223
71.0328,540,1.9339e+06,1.0952e+06,8.3871e+05,0.1277
71.1615,541,1.9303e+06,1.0925e+06,8.3788e+05,0.1218
71.2935,542,1.9268e+06,1.0898e+06,8.3706e+05,0.1250
71.4224,543,1.9233e+06,1.0871e+06,8.3624e+05,0.1220
71.5534,544,1.9198e+06,1.0844e+06,8.3540e+05,0.1241
71.6843,545,1.9164e+06,1.0818e+06,8.3455e+05,0.1237
71.8141,546,1.9129e+06,1.0792e+06,8.3369e+05,0.1230
71.9471,547,1.9095e+06,1.0767e+06,8.3283e+05,0.1261
72.0832,548,1.9061e+06,1.0741e+06,8.3197e+05,0.1245
72.2130,549,1.9027e+06,1.0715e+06,8.3112e+05,0.1225
72.3436,550,1.8993e+06,1.0690e+06,8.3028e+05,0.1236
72.4736,551,1.8959e+06,1.0665e+06,8.2945e+05,0.1231
72.6024,552,1.8926e+06,1.0640e+06,8.2862e+05,0.1220
72.7343,553,1.8893e+06,1.0615e+06,8.2780e+05,0.1247
72.8643,554,1.8860e+06,1.0590e+06,8.2698e+05,0.1227
72.9977,555,1.8827e+06,1.0565e+06,8.2616e+05,0.1256
73.1268,556,1.8794e+06,1.0541e+06,8.2533e+05,0.1221
73.2595,557,1.8761e+06,1.0516e+06,8.2451e+05,0.1253
73.3874,558,1.8729e+06,1.0492e+06,8.2369e+05,0.1210
73.5176,559,1.8697e+06,1.0468e+06,8.2286e+05,0.1232
73.6483,560,1.8664e+06,1.0444e+06,8.2205e+05,0.1237
73.7768,561,1.8632e+06,1.0420e+06,8.2123e+05,0.1219
73.9095,562,1.8600e+06,1.0396e+06,8.2040e+05,0.1257
74.0394,563,1.8568e+06,1.0373e+06,8.1957e+05,0.1230
74.1708,564,1.8537e+06,1.0349e+06,8.1874e+05,0.1243
74.2995,565,1.8505e+06,1.0326e+06,8.1790e+05,0.1216
74.4305,566,1.8473e+06,1.0303e+06,8.1705e+05,0.1240
74.5601,567,1.8442e+06,1.0280e+06,8.1621e+05,0.1227
74.6889,568,1.8410e+06,1.0257e+06,8.1536e+05,0.1219
74.8204,569,1.8380e+06,1.0234e+06,8.1453e+05,0.1246
74.9501,570,1.8349e+06,1.0212e+06,8.1371e+05,0.1231
75.0850,571,1.8318e+06,1.0189e+06,8.1289e+05,0.1275
75.2145,572,1.8288e+06,1.0167e+06,8.1210e+05,0.1222
75.3463,573,1.8257e+06,1.0144e+06,8.1130e+05,0.1250
75.4745,574,1.8227e+06,1.0122e+06,8.1051e+05,0.1215
75.6050,575,1.8197e+06,1.0100e+06,8.0972e+05,0.1239
75.7353,576,1.8167e+06,1.0078e+06,8.0893e+05,0.1235
75.8641,577,1.8138e+06,1.0056e+06,8.0815e+05,0.1218
75.9975,578,1.8108e+06,1.0035e+06,8.0737e+05,0.1263
76.1322,579,1.8079e+06,1.0013e+06,8.0660e+05,0.1228
76.2629,580,1.8050e+06,9.9917e+05,8.0583e+05,0.1237
76.3922,581,1.8021e+06,9.9705e+05,8.0507e+05,0.1225
76.5241,582,1.7992e+06,9.9494e+05,8.0430e+05,0.1248
76.6543,583,1.7964e+06,9.9283e+05,8.0354e+05,0.1232
76.7867,584,1.7935e+06,9.9073e+05,8.0278e+05,0.1253
76.9148,585,1.7907e+06,9.8864e+05,8.0201e+05,0.1213
77.0462,586,1.7878e+06,9.8657e+05,8.0124e+05,0.1245
77.1764,587,1.7850e+06,9.8451e+05,8.0046e+05,0.1231
77.3054,588,1.7822e+06,9.8248e+05,7.9967e+05,0.1221
77.4374,589,1.7793e+06,9.8046e+05,7.9888e+05,0.1249
77.5655,590,1.7765e+06,9.7845e+05,7.9810e+05,0.1213
77.6988,591,1.7738e+06,9.7644e+05,7.9734e+05,0.1265
77.8272,592,1.7710e+06,9.7444e+05,7.9660e+05,0.1218
77.9601,593,1.7683e+06,9.7245e+05,7.9586e+05,0.1254
78.0915,594,1.7656e+06,9.7047e+05,7.9514e+05,0.1243
78.2238,595,1.7629e+06,9.6851e+05,7.9441e+05,0.1249
78.3528,596,1.7602e+06,9.6657e+05,7.9367e+05,0.1221
78.4813,597,1.7576e+06,9.6466e+05,7.9291e+05,0.1217
78.6129,598,1.7549e+06,9.6278e+05,7.9212e+05,0.1247
78.7416,599,1.7522e+06,9.6093e+05,7.9131e+05,0.1217
78.8741,600,1.7496e+06,9.5911e+05,7.9048e+05,0.1259
79.0046,601,1.7470e+06,9.5733e+05,7.8965e+05,0.1227
79.1427,602,1.7444e+06,9.5557e+05,7.8882e+05,0.1304
79.2741,603,1.7418e+06,9.5380e+05,7.8802e+05,0.1239
79.4069,604,1.7393e+06,9.5202e+05,7.8724e+05,0.1255
79.5378,605,1.7367e+06,9.5021e+05,7.8649e+05,0.1237
79.6684,606,1.7341e+06,9.4839e+05,7.8575e+05,0.1235
79.7981,607,1.7316e+06,9.4658e+05,7.8503e+05,0.1226
79.9318,608,1.7291e+06,9.4479e+05,7.8431e+05,0.1264
80.0625,609,1.7266e+06,9.4300e+05,7.8358e+05,0.1232
80.1955,610,1.7241e+06,9.4123e+05,7.8285e+05,0.1246
80.3249,611,1.7216e+06,9.3948e+05,7.8210e+05,0.1223
80.4567,612,1.7191e+06,9.3775e+05,7.8134e+05,0.1248
80.5852,613,1.7166e+06,9.3602e+05,7.8058e+05,0.1217
80.7189,614,1.7141e+06,9.3430e+05,7.7982e+05,0.1264
80.8490,615,1.7116e+06,9.3257e+05,7.7908e+05,0.1231
80.9810,616,1.7092e+06,9.3083e+05,7.7835e+05,0.1249
81.1116,617,1.7067e+06,9.2908e+05,7.7764e+05,0.1236
81.2423,618,1.7043e+06,9.2732e+05,7.7695e+05,0.1239
81.3727,619,1.7018e+06,9.2557e+05,7.7628e+05,0.1233
81.5023,620,1.6994e+06,9.2382e+05,7.7560e+05,0.1227
81.6345,621,1.6970e+06,9.2209e+05,7.7492e+05,0.1252
81.7653,622,1.6946e+06,9.2037e+05,7.7422e+05,0.1237
81.8967,623,1.6922e+06,9.1865e+05,7.7353e+05,0.1245
82.0254,624,1.6898e+06,9.1695e+05,7.7283e+05,0.1218
82.1575,625,1.6874e+06,9.1526e+05,7.7214e+05,0.1253
82.2874,626,1.6850e+06,9.1358e+05,7.7144e+05,0.1228
82.4167,627,1.6827e+06,9.1192e+05,7.7076e+05,0.1224
82.5481,628,1.6804e+06,9.1027e+05,7.7008e+05,0.1245
82.6764,629,1.6780e+06,9.0863e+05,7.6941e+05,0.1216
82.8089,630,1.6757e+06,9.0699e+05,7.6875e+05,0.1253
82.9383,631,1.6734e+06,9.0536e+05,7.6808e+05,0.1226
83.0696,632,1.6712e+06,9.0374e+05,7.6741e+05,0.1242
83.2005,633,1.6689e+06,9.0215e+05,7.6674e+05,0.1240
83.3317,634,1.6666e+06,9.0057e+05,7.6606e+05,0.1242
83.4657,635,1.6644e+06,8.9899e+05,7.6540e+05,0.1266
83.5975,636,1.6622e+06,8.9742e+05,7.6473e+05,0.1240
83.7297,637,1.6599e+06,8.9582e+05,7.6408e+05,0.1248
83.8621,638,1.6577e+06,8.9423e+05,7.6344e+05,0.1252
83.9917,639,1.6554e+06,8.9264e+05,7.6281e+05,0.1227
84.1208,640,1.6532e+06,8.9106e+05,7.6218e+05,0.1222
84.2540,641,1.6510e+06,8.8949e+05,7.6155e+05,0.1260
84.3825,642,1.6488e+06,8.8792e+05,7.6092e+05,0.1208
84.5142,643,1.6467e+06,8.8637e+05,7.6029e+05,0.1247
84.6427,644,1.6445e+06,8.8483e+05,7.5966e+05,0.1217
84.7736,645,1.6423e+06,8.8330e+05,7.5903e+05,0.1239
84.9051,646,1.6402e+06,8.8180e+05,7.5840e+05,0.1244
85.0351,647,1.6381e+06,8.8031e+05,7.5777e+05,0.1230
85.1666,648,1.6360e+06,8.7882e+05,7.5714e+05,0.1243
85.3017,649,1.6338e+06,8.7734e+05,7.5651e+05,0.1284
85.4320,650,1.6317e+06,8.7586e+05,7.5587e+05,0.1229
85.5613,651,1.6296e+06,8.7441e+05,7.5523e+05,0.1225
85.6934,652,1.6275e+06,8.7296e+05,7.5458e+05,0.1252
85.8221,653,1.6254e+06,8.7152e+05,7.5392e+05,0.1220
85.9540,654,1.6233e+06,8.7006e+05,7.5327e+05,0.1250
86.0825,655,1.6212e+06,8.6861e+05,7.5264e+05,0.1217
86.2173,656,1.6192e+06,8.6714e+05,7.5201e+05,0.1278
86.3476,657,1.6171e+06,8.6567e+05,7.5141e+05,0.1234
86.4810,658,1.6150e+06,8.6419e+05,7.5081e+05,0.1261
86.6100,659,1.6129e+06,8.6272e+05,7.5023e+05,0.1220
86.7412,660,1.6109e+06,8.6126e+05,7.4964e+05,0.1241
86.8712,661,1.6089e+06,8.5982e+05,7.4905e+05,0.1233
87.0007,662,1.6068e+06,8.5840e+05,7.4845e+05,0.1223
87.1334,663,1.6048e+06,8.5700e+05,7.4784e+05,0.1253
87.2671,664,1.6028e+06,8.5561e+05,7.4722e+05,0.1240
87.3974,665,1.6008e+06,8.5424e+05,7.4660e+05,0.1230
87.5267,666,1.5989e+06,8.5287e+05,7.4600e+05,0.1224
87.6588,667,1.5969e+06,8.5149e+05,7.4540e+05,0.1253
87.7875,668,1.5949e+06,8.5009e+05,7.4483e+05,0.1219
87.9199,669,1.5929e+06,8.4867e+05,7.4427e+05,0.1254
88.0499,670,1.5910e+06,8.4726e+05,7.4373e+05,0.1230
88.1838,671,1.5890e+06,8.4585e+05,7.4319e+05,0.1269
88.3141,672,1.5871e+06,8.4445e+05,7.4266e+05,0.1231
88.4469,673,1.5852e+06,8.4306e+05,7.4212e+05,0.1247
88.5758,674,1.5833e+06,8.4169e+05,7.4157e+05,0.1220
88.7070,675,1.5813e+06,8.4034e+05,7.4100e+05,0.1245
88.8373,676,1.5794e+06,8.3901e+05,7.4043e+05,0.1234
88.9663,677,1.5775e+06,8.3770e+05,7.3984e+05,0.1221
89.0978,678,1.5757e+06,8.3639e+05,7.3927e+05,0.1243
89.2283,679,1.5738e+06,8.3506e+05,7.3870e+05,0.1233
89.3620,680,1.5719e+06,8.3373e+05,7.3814e+05,0.1264
89.4923,681,1.5700e+06,8.3240e+05,7.3758e+05,0.1233
89.6260,682,1.5681e+06,8.3107e+05,7.3703e+05,0.1268
89.7566,683,1.5662e+06,8.2976e+05,7.3647e+05,0.1235
89.8887,684,1.5644e+06,8.2847e+05,7.3591e+05,0.1251
90.0167,685,1.5625e+06,8.2719e+05,7.3533e+05,0.1212
90.1501,686,1.5607e+06,8.2594e+05,7.3474e+05,0.1266
90.2799,687,1.5588e+06,8.2470e+05,7.3414e+05,0.1222
90.4122,688,1.5570e+06,8.2347e+05,7.3355e+05,0.1250
90.5412,689,1.5552e+06,8.2224e+05,7.3297e+05,0.1222
90.6719,690,1.5534e+06,8.2100e+05,7.3240e+05,0.1240
90.8016,691,1.5516e+06,8.1975e+05,7.3184e+05,0.1230
90.9303,692,1.5498e+06,8.1851e+05,7.3130e+05,0.1219
91.0629,693,1.5480e+06,8.1726e+05,7.3076e+05,0.1253
91.1942,694,1.5463e+06,8.1603e+05,7.3022e+05,0.1242
91.3286,695,1.5445e+06,8.1480e+05,7.2968e+05,0.1238
91.4572,696,1.5427e+06,8.1359e+05,7.2914e+05,0.1217
91.5893,697,1.5410e+06,8.1239e+05,7.2859e+05,0.1254
91.7192,698,1.5392e+06,8.1119e+05,7.2804e+05,0.1234
91.8495,699,1.5375e+06,8.0999e+05,7.2751e+05,0.1234
91.9795,700,1.5358e+06,8.0878e+05,7.2698e+05,0.1231
92.1132,701,1.5340e+06,8.0756e+05,7.2646e+05,0.1220
92.2437,702,1.5323e+06,8.0635e+05,7.2596e+05,0.1236
92.3746,703,1.5306e+06,8.0514e+05,7.2546e+05,0.1239
92.5078,704,1.5289e+06,8.0393e+05,7.2496e+05,0.1257
92.6377,705,1.5272e+06,8.0273e+05,7.2445e+05,0.1228
92.7700,706,1.5255e+06,8.0155e+05,7.2394e+05,0.1249
92.9009,707,1.5238e+06,8.0038e+05,7.2342e+05,0.1239
93.0336,708,1.5221e+06,7.9923e+05,7.2289e+05,0.1251
93.1626,709,1.5205e+06,7.9808e+05,7.2237e+05,0.1222
93.2941,710,1.5188e+06,7.9694e+05,7.2184e+05,0.1240
93.4231,711,1.5171e+06,7.9580e+05,7.2131e+05,0.1219
93.5550,712,1.5155e+06,7.9466e+05,7.2079e+05,0.1249
93.6836,713,1.5138e+06,7.9352e+05,7.2027e+05,0.1218
93.8147,714,1.5121e+06,7.9240e+05,7.1974e+05,0.1243
93.9454,715,1.5105e+06,7.9128e+05,7.1922e+05,0.1241
94.0741,716,1.5089e+06,7.9018e+05,7.1869e+05,0.1218
94.2056,717,1.5072e+06,7.8908e+05,7.1816e+05,0.1246
94.3342,718,1.5056e+06,7.8800e+05,7.1764e+05,0.1216
94.4671,719,1.5040e+06,7.8691e+05,7.1711e+05,0.1254
94.5959,720,1.5024e+06,7.8583e+05,7.1659e+05,0.1217
94.7267,721,1.5008e+06,7.8475e+05,7.1607e+05,0.1239
94.8575,722,1.4992e+06,7.8367e+05,7.1555e+05,0.1239
94.9863,723,1.4976e+06,7.8260e+05,7.1502e+05,0.1219
95.1180,724,1.4960e+06,7.8155e+05,7.1450e+05,0.1248
95.2468,725,1.4945e+06,7.8050e+05,7.1397e+05,0.1221
95.3816,726,1.4929e+06,7.7948e+05,7.1343e+05,0.1258
95.5100,727,1.4913e+06,7.7846e+05,7.1289e+05,0.1214
95.6471,728,1.4898e+06,7.7744e+05,7.1235e+05,0.1300
95.7767,729,1.4883e+06,7.7644e+05,7.1181e+05,0.1224
95.9101,730,1.4867e+06,7.7543e+05,7.1128e+05,0.1263
96.0399,731,1.4852e+06,7.7442e+05,7.1075e+05,0.1220
96.1711,732,1.4837e+06,7.7342e+05,7.1023e+05,0.1241
96.3002,733,1.4821e+06,7.7243e+05,7.0971e+05,0.1222
96.4340,734,1.4806e+06,7.7144e+05,7.0919e+05,0.1263
96.5630,735,1.4791e+06,7.7046e+05,7.0868e+05,0.1219
96.6951,736,1.4777e+06,7.6949e+05,7.0816e+05,0.1252
96.8259,737,1.4762e+06,7.6853e+05,7.0765e+05,0.1239
96.9564,738,1.4747e+06,7.6756e+05,7.0714e+05,0.1236
97.0869,739,1.4732e+06,7.6660e+05,7.0665e+05,0.1235
97.2157,740,1.4718e+06,7.6563e+05,7.0616e+05,0.1219
97.3467,741,1.4703e+06,7.6464e+05,7.0569e+05,0.1240
97.4755,742,1.4689e+06,7.6365e+05,7.0522e+05,0.1218
97.6071,743,1.4674e+06,7.6266e+05,7.0475e+05,0.1246
97.7367,744,1.4659e+06,7.6167e+05,7.0428e+05,0.1228
97.8674,745,1.4645e+06,7.6070e+05,7.0380e+05,0.1238
98.0008,746,1.4631e+06,7.5975e+05,7.0331e+05,0.1250
98.1335,747,1.4616e+06,7.5880e+05,7.0282e+05,0.1253
98.2686,748,1.4602e+06,7.5788e+05,7.0232e+05,0.1242
98.4025,749,1.4588e+06,7.5695e+05,7.0183e+05,0.1262
98.5326,750,1.4574e+06,7.5602e+05,7.0134e+05,0.1230
98.6645,751,1.4559e+06,7.5507e+05,7.0087e+05,0.1248
98.7953,752,1.4545e+06,7.5411e+05,7.0042e+05,0.1238
98.9281,753,1.4531e+06,7.5314e+05,6.9998e+05,0.1257
99.0571,754,1.4517e+06,7.5216e+05,6.9954e+05,0.1219
99.1921,755,1.4503e+06,7.5119e+05,6.9910e+05,0.1274
99.3232,756,1.4489e+06,7.5023e+05,6.9866e+05,0.1237
99.4554,757,1.4475e+06,7.4928e+05,6.9820e+05,0.1247
99.5871,758,1.4461e+06,7.4833e+05,6.9774e+05,0.1242
99.7215,759,1.4447e+06,7.4741e+05,6.9727e+05,0.1266
99.8532,760,1.4433e+06,7.4649e+05,6.9681e+05,0.1242
99.9848,761,1.4419e+06,7.4558e+05,6.9635e+05,0.1242
100.1142,762,1.4406e+06,7.4465e+05,6.9590e+05,0.1225
100.2462,763,1.4392e+06,7.4372e+05,6.9547e+05,0.1246
100.3753,764,1.4378e+06,7.4279e+05,6.9504e+05,0.1223
100.5078,765,1.4365e+06,7.4187e+05,6.9461e+05,0.1253
100.6379,766,1.4351e+06,7.4096e+05,6.9418e+05,0.1226
100.7714,767,1.4338e+06,7.4005e+05,6.9375e+05,0.1265
100.8998,768,1.4324e+06,7.3914e+05,6.9331e+05,0.1215
101.0314,769,1.4311e+06,7.3824e+05,6.9288e+05,0.1248
101.1617,770,1.4298e+06,7.3734e+05,6.9245e+05,0.1235
101.2933,771,1.4285e+06,7.3643e+05,6.9203e+05,0.1239
101.4255,772,1.4271e+06,7.3552e+05,6.9161e+05,0.1252
101.5596,773,1.4258e+06,7.3459e+05,6.9121e+05,0.1261
101.6899,774,1.4245e+06,7.3367e+05,6.9081e+05,0.1230
101.8215,775,1.4231e+06,7.3274e+05,6.9040e+05,0.1248
101.9509,776,1.4218e+06,7.3183e+05,6.8999e+05,0.1225
102.0813,777,1.4205e+06,7.3092e+05,6.8957e+05,0.1235
102.2139,778,1.4192e+06,7.3002e+05,6.8915e+05,0.1258
102.3452,779,1.4179e+06,7.2913e+05,6.8873e+05,0.1243
102.4770,780,1.4166e+06,7.2825e+05,6.8831e+05,0.1246
102.6077,781,1.4153e+06,7.2737e+05,6.8790e+05,0.1235
102.7387,782,1.4140e+06,7.2649e+05,6.8749e+05,0.1241
102.8676,783,1.4127e+06,7.2561e+05,6.8708e+05,0.1217
102.9990,784,1.4114e+06,7.2474e+05,6.8667e+05,0.1242
103.1272,785,1.4101e+06,7.2387e+05,6.8626e+05,0.1215
103.2584,786,1.4089e+06,7.2302e+05,6.8584e+05,0.1245
103.3881,787,1.4076e+06,7.2217e+05,6.8542e+05,0.1227
103.5166,788,1.4063e+06,7.2133e+05,6.8499e+05,0.1218
103.6480,789,1.4051e+06,7.2051e+05,6.8455e+05,0.1244
103.7759,790,1.4038e+06,7.1969e+05,6.8411e+05,0.1210
103.9070,791,1.4025e+06,7.1886e+05,6.8367e+05,0.1243
104.0368,792,1.4013e+06,7.1804e+05,6.8324e+05,0.1229
104.1661,793,1.4000e+06,7.1722e+05,6.8280e+05,0.1224
104.2981,794,1.3988e+06,7.1641e+05,6.8237e+05,0.1251
104.4280,795,1.3976e+06,7.1562e+05,6.8194e+05,0.1228
104.5599,796,1.3963e+06,7.1482e+05,6.8152e+05,0.1247
104.6880,797,1.3951e+06,7.1402e+05,6.8109e+05,0.1213
104.8190,798,1.3939e+06,7.1322e+05,6.8067e+05,0.1239
104.9500,799,1.3927e+06,7.1244e+05,6.8026e+05,0.1241
105.0804,800,1.3915e+06,7.1165e+05,6.7985e+05,0.1233
105.2122,801,1.3903e+06,7.1087e+05,6.7945e+05,0.1231
105.3416,802,1.3891e+06,7.1008e+05,6.7904e+05,0.1222
105.4736,803,1.3879e+06,7.0930e+05,6.7864e+05,0.1249
105.6027,804,1.3868e+06,7.0853e+05,6.7822e+05,0.1222
105.7353,805,1.3856e+06,7.0777e+05,6.7780e+05,0.1256
105.8641,806,1.3844e+06,7.0701e+05,6.7737e+05,0.1217
105.9968,807,1.3832e+06,7.0627e+05,6.7694e+05,0.1252
106.1264,808,1.3820e+06,7.0552e+05,6.7652e+05,0.1230
106.2572,809,1.3809e+06,7.0476e+05,6.7610e+05,0.1239
106.3882,810,1.3797e+06,7.0400e+05,6.7570e+05,0.1241
106.5187,811,1.3785e+06,7.0322e+05,6.7531e+05,0.1228
106.6505,812,1.3774e+06,7.0243e+05,6.7494e+05,0.1249
106.7800,813,1.3762e+06,7.0163e+05,6.7458e+05,0.1225
106.9109,814,1.3751e+06,7.0083e+05,6.7422e+05,0.1241
107.0390,815,1.3739e+06,7.0005e+05,6.7387e+05,0.1212
107.1704,816,1.3728e+06,6.9927e+05,6.7351e+05,0.1243
107.2998,817,1.3716e+06,6.9850e+05,6.7314e+05,0.1225
107.4297,818,1.3705e+06,6.9775e+05,6.7277e+05,0.1232
107.5609,819,1.3694e+06,6.9700e+05,6.7239e+05,0.1244
107.6904,820,1.3683e+06,6.9625e+05,6.7202e+05,0.1226
107.8215,821,1.3671e+06,6.9549e+05,6.7165e+05,0.1242
107.9496,822,1.3660e+06,6.9474e+05,6.7128e+05,0.1213
108.0811,823,1.3649e+06,6.9398e+05,6.7091e+05,0.1246
108.2115,824,1.3638e+06,6.9324e+05,6.7054e+05,0.1237
108.3422,825,1.3627e+06,6.9249e+05,6.7017e+05,0.1235
108.4739,826,1.3615e+06,6.9175e+05,6.6979e+05,0.1238
108.6029,827,1.3604e+06,6.9102e+05,6.6940e+05,0.1220
108.7353,828,1.3593e+06,6.9030e+05,6.6901e+05,0.1250
108.8641,829,1.3582e+06,6.8959e+05,6.6862e+05,0.1218
108.9972,830,1.3571e+06,6.8888e+05,6.6823e+05,0.1259
109.1256,831,1.3560e+06,6.8817e+05,6.6785e+05,0.1217
109.2573,832,1.3549e+06,6.8745e+05,6.6748e+05,0.1246
109.3925,833,1.3538e+06,6.8674e+05,6.6710e+05,0.1283
109.5245,834,1.3528e+06,6.8603e+05,6.6673e+05,0.1246
109.6537,835,1.3517e+06,6.8533e+05,6.6635e+05,0.1220
109.7854,836,1.3506e+06,6.8464e+05,6.6597e+05,0.1246
109.9149,837,1.3495e+06,6.8396e+05,6.6559e+05,0.1224
110.0460,838,1.3485e+06,6.8328e+05,6.6520e+05,0.1237
110.1779,839,1.3474e+06,6.8259e+05,6.6482e+05,0.1247
110.3094,840,1.3463e+06,6.8190e+05,6.6445e+05,0.1238
110.4421,841,1.3453e+06,6.8120e+05,6.6409e+05,0.1253
110.5735,842,1.3442e+06,6.8050e+05,6.6373e+05,0.1238
110.7038,843,1.3432e+06,6.7979e+05,6.6339e+05,0.1229
110.8333,844,1.3421e+06,6.7909e+05,6.6305e+05,0.1226
110.9644,845,1.3411e+06,6.7839e+05,6.6271e+05,0.1240
111.0943,846,1.3401e+06,6.7770e+05,6.6236e+05,0.1228
111.2262,847,1.3390e+06,6.7702e+05,6.6201e+05,0.1249
111.3547,848,1.3380e+06,6.7634e+05,6.6166e+05,0.1215
111.4872,849,1.3370e+06,6.7567e+05,6.6131e+05,0.1251
111.6170,850,1.3359e+06,6.7499e+05,6.6096e+05,0.1227
111.7473,851,1.3349e+06,6.7431e+05,6.6061e+05,0.1235
111.8786,852,1.3339e+06,6.7364e+05,6.6026e+05,0.1243
112.0074,853,1.3329e+06,6.7297e+05,6.5991e+05,0.1221
112.1383,854,1.3319e+06,6.7230e+05,6.5957e+05,0.1237
112.2666,855,1.3309e+06,6.7163e+05,6.5922e+05,0.1214
112.3975,856,1.3298e+06,6.7097e+05,6.5888e+05,0.1239
112.5271,857,1.3288e+06,6.7031e+05,6.5853e+05,0.1227
112.6564,858,1.3278e+06,6.6965e+05,6.5819e+05,0.1221
112.7882,859,1.3269e+06,6.6900e+05,6.5785e+05,0.1249
112.9167,860,1.3259e+06,6.6835e+05,6.5751e+05,0.1216
113.0490,861,1.3249e+06,6.6771e+05,6.5717e+05,0.1251
113.1781,862,1.3239e+06,6.6707e+05,6.5682e+05,0.1222
113.3084,863,1.3229e+06,6.6644e+05,6.5647e+05,0.1235
113.4404,864,1.3219e+06,6.6582e+05,6.5611e+05,0.1250
113.5697,865,1.3210e+06,6.6520e+05,6.5575e+05,0.1225
113.7019,866,1.3200e+06,6.6458e+05,6.5540e+05,0.1246
113.8308,867,1.3190e+06,6.6395e+05,6.5505e+05,0.1218
113.9637,868,1.3180e+06,6.6333e+05,6.5471e+05,0.1250
114.0924,869,1.3171e+06,6.6269e+05,6.5437e+05,0.1221
114.2245,870,1.3161e+06,6.6205e+05,6.5404e+05,0.1248
114.3533,871,1.3151e+06,6.6141e+05,6.5371e+05,0.1220
114.4853,872,1.3142e+06,6.6077e+05,6.5339e+05,0.1246
114.6156,873,1.3132e+06,6.6014e+05,6.5305e+05,0.1226
114.7457,874,1.3122e+06,6.5951e+05,6.5271e+05,0.1232
114.8775,875,1.3113e+06,6.5890e+05,6.5237e+05,0.1249
115.0069,876,1.3103e+06,6.5829e+05,6.5203e+05,0.1223
115.1392,877,1.3094e+06,6.5768e+05,6.5169e+05,0.1250
115.2678,878,1.3084e+06,6.5707e+05,6.5135e+05,0.1217
115.3995,879,1.3075e+06,6.5646e+05,6.5103e+05,0.1245
115.5285,880,1.3066e+06,6.5585e+05,6.5071e+05,0.1222
115.6600,881,1.3056e+06,6.5524e+05,6.5039e+05,0.1242
115.7910,882,1.3047e+06,6.5462e+05,6.5008e+05,0.1242
115.9221,883,1.3038e+06,6.5400e+05,6.4977e+05,0.1243
116.0531,884,1.3028e+06,6.5338e+05,6.4947e+05,0.1242
116.1856,885,1.3019e+06,6.5277e+05,6.4917e+05,0.1256
116.3175,886,1.3010e+06,6.5216e+05,6.4887e+05,0.1242
116.4482,887,1.3001e+06,6.5154e+05,6.4858e+05,0.1237
116.5799,888,1.2992e+06,6.5093e+05,6.4829e+05,0.1244
116.7106,889,1.2983e+06,6.5031e+05,6.4800e+05,0.1236
116.8417,890,1.2974e+06,6.4970e+05,6.4771e+05,0.1241
116.9708,891,1.2965e+06,6.4910e+05,6.4741e+05,0.1223
117.1020,892,1.2956e+06,6.4852e+05,6.4711e+05,0.1241
117.2305,893,1.2947e+06,6.4794e+05,6.4681e+05,0.1216
117.3627,894,1.2939e+06,6.4736e+05,6.4650e+05,0.1250
117.4918,895,1.2930e+06,6.4678e+05,6.4619e+05,0.1223
117.6221,896,1.2921e+06,6.4621e+05,6.4588e+05,0.1233
117.7537,897,1.2912e+06,6.4563e+05,6.4557e+05,0.1242
117.8827,898,1.2903e+06,6.4506e+05,6.4526e+05,0.1223
118.0161,899,1.2894e+06,6.4448e+05,6.4496e+05,0.1262
118.1439,900,1.2886e+06,6.4391e+05,6.4465e+05,0.1210
118.2773,901,1.2877e+06,6.4334e+05,6.4433e+05,0.1251
118.4057,902,1.2868e+06,6.4278e+05,6.4402e+05,0.1214
118.5380,903,1.2859e+06,6.4222e+05,6.4370e+05,0.1250
118.6671,904,1.2850e+06,6.4166e+05,6.4337e+05,0.1215
118.7959,905,1.2842e+06,6.4111e+05,6.4305e+05,0.1218
118.9274,906,1.2833e+06,6.4056e+05,6.4273e+05,0.1244
119.0564,907,1.2824e+06,6.4001e+05,6.4241e+05,0.1222
119.1881,908,1.2815e+06,6.3945e+05,6.4210e+05,0.1249
119.3234,909,1.2807e+06,6.3888e+05,6.4179e+05,0.1287
119.4542,910,1.2798e+06,6.3832e+05,6.4149e+05,0.1232
119.5820,911,1.2789e+06,6.3775e+05,6.4119e+05,0.1210
119.7134,912,1.2781e+06,6.3719e+05,6.4088e+05,0.1243
119.8431,913,1.2772e+06,6.3664e+05,6.4057e+05,0.1229
119.9752,914,1.2764e+06,6.3611e+05,6.4025e+05,0.1252
120.1076,915,1.2755e+06,6.3557e+05,6.3993e+05,0.1255
120.2386,916,1.2747e+06,6.3504e+05,6.3961e+05,0.1239
120.3693,917,1.2738e+06,6.3451e+05,6.3929e+05,0.1237
120.4987,918,1.2730e+06,6.3399e+05,6.3896e+05,0.1224
120.6309,919,1.2721e+06,6.3346e+05,6.3864e+05,0.1250
120.7603,920,1.2713e+06,6.3294e+05,6.3832e+05,0.1223
120.8922,921,1.2704e+06,6.3242e+05,6.3800e+05,0.1249
121.0243,922,1.2696e+06,6.3189e+05,6.3769e+05,0.1249
121.1554,923,1.2687e+06,6.3137e+05,6.3738e+05,0.1238
121.2843,924,1.2679e+06,6.3084e+05,6.3706e+05,0.1215
121.4161,925,1.2671e+06,6.3032e+05,6.3675e+05,0.1249
121.5457,926,1.2663e+06,6.2981e+05,6.3645e+05,0.1227
121.6775,927,1.2654e+06,6.2930e+05,6.3614e+05,0.1248
121.8082,928,1.2646e+06,6.2879e+05,6.3583e+05,0.1233
121.9388,929,1.2638e+06,6.2828e+05,6.3552e+05,0.1237
122.0732,930,1.2630e+06,6.2778e+05,6.3520e+05,0.1272
122.2045,931,1.2622e+06,6.2729e+05,6.3489e+05,0.1245
122.3366,932,1.2614e+06,6.2679e+05,6.3458e+05,0.1249
122.4689,933,1.2606e+06,6.2629e+05,6.3427e+05,0.1254
122.5999,934,1.2598e+06,6.2578e+05,6.3397e+05,0.1240
122.7329,935,1.2590e+06,6.2527e+05,6.3368e+05,0.1254
122.8637,936,1.2581e+06,6.2475e+05,6.3339e+05,0.1237
122.9939,937,1.2573e+06,6.2423e+05,6.3311e+05,0.1234
123.1248,938,1.2565e+06,6.2371e+05,6.3283e+05,0.1243
123.2558,939,1.2557e+06,6.2320e+05,6.3255e+05,0.1243
123.3867,940,1.2549e+06,6.2270e+05,6.3225e+05,0.1239
123.5157,941,1.2542e+06,6.2220e+05,6.3195e+05,0.1221
123.6495,942,1.2534e+06,6.2172e+05,6.3164e+05,0.1268
123.7795,943,1.2526e+06,6.2124e+05,6.3133e+05,0.1228
123.9111,944,1.2518e+06,6.2076e+05,6.3102e+05,0.1246
124.0395,945,1.2510e+06,6.2028e+05,6.3071e+05,0.1213
124.1716,946,1.2502e+06,6.1980e+05,6.3040e+05,0.1252
124.3018,947,1.2494e+06,6.1932e+05,6.3010e+05,0.1233
124.4328,948,1.2486e+06,6.1885e+05,6.2979e+05,0.1239
124.5631,949,1.2479e+06,6.1837e+05,6.2948e+05,0.1233
124.6981,950,1.2471e+06,6.1790e+05,6.2917e+05,0.1283
124.8277,951,1.2463e+06,6.1743e+05,6.2887e+05,0.1226
124.9574,952,1.2455e+06,6.1696e+05,6.2856e+05,0.1228
125.0898,953,1.2447e+06,6.1649e+05,6.2825e+05,0.1254
125.2204,954,1.2440e+06,6.1601e+05,6.2795e+05,0.1236
125.3534,955,1.2432e+06,6.1553e+05,6.2766e+05,0.1257
125.4847,956,1.2424e+06,6.1505e+05,6.2736e+05,0.1244
125.6195,957,1.2416e+06,6.1458e+05,6.2707e+05,0.1279
125.7543,958,1.2409e+06,6.1410e+05,6.2677e+05,0.1242
125.8823,959,1.2401e+06,6.1363e+05,6.2648e+05,0.1210
126.0168,960,1.2393e+06,6.1316e+05,6.2619e+05,0.1277
126.1448,961,1.2386e+06,6.1269e+05,6.2589e+05,0.1211
126.2753,962,1.2378e+06,6.1222e+05,6.2560e+05,0.1236
126.4064,963,1.2371e+06,6.1175e+05,6.2531e+05,0.1242
126.5358,964,1.2363e+06,6.1128e+05,6.2503e+05,0.1224
126.6690,965,1.2355e+06,6.1081e+05,6.2474e+05,0.1261
126.7993,966,1.2348e+06,6.1034e+05,6.2445e+05,0.1227
126.9310,967,1.2340e+06,6.0988e+05,6.2416e+05,0.1248
127.0596,968,1.2333e+06,6.0942e+05,6.2387e+05,0.1216
127.1918,969,1.2325e+06,6.0897e+05,6.2358e+05,0.1251
127.3207,970,1.2318e+06,6.0851e+05,6.2329e+05,0.1220
127.4500,971,1.2311e+06,6.0805e+05,6.2300e+05,0.1225
127.5819,972,1.2303e+06,6.0759e+05,6.2272e+05,0.1247
127.7110,973,1.2296e+06,6.0712e+05,6.2245e+05,0.1223
127.8449,974,1.2288e+06,6.0665e+05,6.2219e+05,0.1265
127.9740,975,1.2281e+06,6.0617e+05,6.2193e+05,0.1222
128.1069,976,1.2274e+06,6.0570e+05,6.2166e+05,0.1261
128.2354,977,1.2266e+06,6.0524e+05,6.2139e+05,0.1216
128.3678,978,1.2259e+06,6.0478e+05,6.2112e+05,0.1251
128.4975,979,1.2252e+06,6.0433e+05,6.2083e+05,0.1229
128.6260,980,1.2244e+06,6.0389e+05,6.2055e+05,0.1216
128.7574,981,1.2237e+06,6.0345e+05,6.2025e+05,0.1242
128.8863,982,1.2230e+06,6.0301e+05,6.1996e+05,0.1218
129.0187,983,1.2222e+06,6.0258e+05,6.1967e+05,0.1255
129.1479,984,1.2215e+06,6.0215e+05,6.1937e+05,0.1226
129.2788,985,1.2208e+06,6.0172e+05,6.1908e+05,0.1242
129.4090,986,1.2201e+06,6.0128e+05,6.1879e+05,0.1233
129.5386,987,1.2194e+06,6.0085e+05,6.1850e+05,0.1226
129.6712,988,1.2186e+06,6.0041e+05,6.1822e+05,0.1256
129.8017,989,1.2179e+06,5.9998e+05,6.1794e+05,0.1210
129.9338,990,1.2172e+06,5.9955e+05,6.1766e+05,0.1248
130.0629,991,1.2165e+06,5.9912e+05,6.1738e+05,0.1220
130.1954,992,1.2158e+06,5.9869e+05,6.1711e+05,0.1255
130.3246,993,1.2151e+06,5.9826e+05,6.1683e+05,0.1216
130.4553,994,1.2144e+06,5.9783e+05,6.1656e+05,0.1236
130.5849,995,1.2137e+06,5.9740e+05,6.1628e+05,0.1225
130.7148,996,1.2130e+06,5.9697e+05,6.1600e+05,0.1230
130.8470,997,1.2123e+06,5.9654e+05,6.1573e+05,0.1249
130.9760,998,1.2116e+06,5.9610e+05,6.1547e+05,0.1220
131.1083,999,1.2109e+06,5.9567e+05,6.1521e+05,0.1250
