run_time,iteration,loss,style_loss,content_loss,time
0.1221,0,4.3801e+08,4.3801e+08,0.0000e+00,0.1221
0.2542,1,3.9793e+08,3.9760e+08,3.2215e+05,0.1234
0.3845,2,3.3531e+08,3.3477e+08,5.4282e+05,0.1225
0.5136,3,2.9822e+08,2.9747e+08,7.5166e+05,0.1222
0.6457,4,2.7371e+08,2.7276e+08,9.5225e+05,0.1244
0.7745,5,2.5614e+08,2.5503e+08,1.1134e+06,0.1219
0.9056,6,2.4084e+08,2.3962e+08,1.2160e+06,0.1243
1.0356,7,2.2671e+08,2.2543e+08,1.2790e+06,0.1232
1.1645,8,2.1398e+08,2.1265e+08,1.3283e+06,0.1224
1.2958,9,2.0231e+08,2.0094e+08,1.3762e+06,0.1245
1.4239,10,1.9161e+08,1.9019e+08,1.4276e+06,0.1216
1.5556,11,1.8180e+08,1.8032e+08,1.4811e+06,0.1250
1.6854,12,1.7290e+08,1.7136e+08,1.5357e+06,0.1232
1.8144,13,1.6496e+08,1.6337e+08,1.5891e+06,0.1224
1.9457,14,1.5787e+08,1.5623e+08,1.6341e+06,0.1243
2.0764,15,1.5145e+08,1.4978e+08,1.6685e+06,0.1229
2.2101,16,1.4554e+08,1.4385e+08,1.6943e+06,0.1263
2.3406,17,1.4004e+08,1.3833e+08,1.7134e+06,0.1232
2.4734,18,1.3489e+08,1.3316e+08,1.7279e+06,0.1257
2.6040,19,1.3013e+08,1.2839e+08,1.7402e+06,0.1234
2.7376,20,1.2564e+08,1.2389e+08,1.7522e+06,0.1265
2.8678,21,1.2144e+08,1.1968e+08,1.7643e+06,0.1234
3.0034,22,1.1742e+08,1.1564e+08,1.7788e+06,0.1288
3.1333,23,1.1363e+08,1.1183e+08,1.7957e+06,0.1229
3.2646,24,1.1008e+08,1.0827e+08,1.8123e+06,0.1242
3.3931,25,1.0678e+08,1.0495e+08,1.8280e+06,0.1218
3.5247,26,1.0370e+08,1.0186e+08,1.8420e+06,0.1247
3.6531,27,1.0082e+08,9.8964e+07,1.8523e+06,0.1217
3.7845,28,9.8101e+07,9.6242e+07,1.8590e+06,0.1247
3.9166,29,9.5508e+07,9.3644e+07,1.8643e+06,0.1252
4.0476,30,9.3043e+07,9.1175e+07,1.8680e+06,0.1242
4.1772,31,9.0662e+07,8.8790e+07,1.8727e+06,0.1226
4.3062,32,8.8349e+07,8.6472e+07,1.8771e+06,0.1221
4.4447,33,8.6136e+07,8.4254e+07,1.8816e+06,0.1316
4.5789,34,8.4030e+07,8.2144e+07,1.8860e+06,0.1212
4.7082,35,8.2048e+07,8.0158e+07,1.8902e+06,0.1221
4.8431,36,8.0163e+07,7.8269e+07,1.8939e+06,0.1262
4.9741,37,7.8354e+07,7.6458e+07,1.8968e+06,0.1231
5.1082,38,7.6612e+07,7.4713e+07,1.8983e+06,0.1259
5.2373,39,7.4931e+07,7.3033e+07,1.8984e+06,0.1215
5.3715,40,7.3318e+07,7.1420e+07,1.8978e+06,0.1267
5.5035,41,7.1755e+07,6.9858e+07,1.8971e+06,0.1237
5.6373,42,7.0241e+07,6.8344e+07,1.8968e+06,0.1258
5.7689,43,6.8750e+07,6.6852e+07,1.8978e+06,0.1239
5.9014,44,6.7297e+07,6.5397e+07,1.9000e+06,0.1252
6.0303,45,6.5887e+07,6.3984e+07,1.9029e+06,0.1222
6.1632,46,6.4549e+07,6.2643e+07,1.9057e+06,0.1256
6.2925,47,6.3287e+07,6.1378e+07,1.9083e+06,0.1221
6.4248,48,6.2071e+07,6.0161e+07,1.9098e+06,0.1253
6.5537,49,6.0881e+07,5.8971e+07,1.9105e+06,0.1222
6.6854,50,5.9723e+07,5.7813e+07,1.9100e+06,0.1248
6.8154,51,5.8587e+07,5.6679e+07,1.9087e+06,0.1232
6.9445,52,5.7465e+07,5.5559e+07,1.9067e+06,0.1222
7.0766,53,5.6352e+07,5.4447e+07,1.9054e+06,0.1251
7.2061,54,5.5247e+07,5.3343e+07,1.9043e+06,0.1224
7.3377,55,5.4167e+07,5.2264e+07,1.9030e+06,0.1246
7.4666,56,5.3111e+07,5.1209e+07,1.9020e+06,0.1221
7.5980,57,5.2084e+07,5.0182e+07,1.9021e+06,0.1244
7.7283,58,5.1098e+07,4.9196e+07,1.9028e+06,0.1235
7.8574,59,5.0153e+07,4.8248e+07,1.9042e+06,0.1223
7.9896,60,4.9233e+07,4.7327e+07,1.9058e+06,0.1252
8.1183,61,4.8337e+07,4.6430e+07,1.9067e+06,0.1215
8.2511,62,4.7455e+07,4.5549e+07,1.9067e+06,0.1259
8.3818,63,4.6601e+07,4.4694e+07,1.9064e+06,0.1233
8.5165,64,4.5761e+07,4.3855e+07,1.9055e+06,0.1269
8.6465,65,4.4948e+07,4.3044e+07,1.9045e+06,0.1227
8.7795,66,4.4165e+07,4.2261e+07,1.9041e+06,0.1262
8.9090,67,4.3394e+07,4.1490e+07,1.9041e+06,0.1223
9.0406,68,4.2642e+07,4.0738e+07,1.9043e+06,0.1246
9.1710,69,4.1915e+07,4.0010e+07,1.9050e+06,0.1235
9.3048,70,4.1206e+07,3.9299e+07,1.9062e+06,0.1263
9.4355,71,4.0510e+07,3.8602e+07,1.9079e+06,0.1237
9.5698,72,3.9835e+07,3.7925e+07,1.9098e+06,0.1268
9.7002,73,3.9170e+07,3.7257e+07,1.9124e+06,0.1233
9.8338,74,3.8522e+07,3.6607e+07,1.9151e+06,0.1268
9.9646,75,3.7894e+07,3.5976e+07,1.9181e+06,0.1238
10.1018,76,3.7277e+07,3.5356e+07,1.9210e+06,0.1301
10.2344,77,3.6670e+07,3.4747e+07,1.9231e+06,0.1254
10.3642,78,3.6063e+07,3.4138e+07,1.9250e+06,0.1227
10.4940,79,3.5461e+07,3.3534e+07,1.9268e+06,0.1234
10.6258,80,3.4868e+07,3.2940e+07,1.9282e+06,0.1249
10.7547,81,3.4296e+07,3.2367e+07,1.9290e+06,0.1221
10.8872,82,3.3738e+07,3.1809e+07,1.9292e+06,0.1254
11.0189,83,3.3194e+07,3.1265e+07,1.9291e+06,0.1239
11.1559,84,3.2666e+07,3.0738e+07,1.9282e+06,0.1235
11.2872,85,3.2156e+07,3.0229e+07,1.9268e+06,0.1243
11.4200,86,3.1663e+07,2.9738e+07,1.9250e+06,0.1258
11.5517,87,3.1182e+07,2.9259e+07,1.9235e+06,0.1244
11.6842,88,3.0716e+07,2.8794e+07,1.9217e+06,0.1256
11.8170,89,3.0265e+07,2.8345e+07,1.9200e+06,0.1256
11.9485,90,2.9834e+07,2.7916e+07,1.9184e+06,0.1242
12.0791,91,2.9407e+07,2.7490e+07,1.9168e+06,0.1236
12.2100,92,2.8983e+07,2.7068e+07,1.9150e+06,0.1239
12.3402,93,2.8569e+07,2.6656e+07,1.9131e+06,0.1231
12.4731,94,2.8165e+07,2.6253e+07,1.9118e+06,0.1230
12.6028,95,2.7771e+07,2.5860e+07,1.9107e+06,0.1232
12.7355,96,2.7383e+07,2.5473e+07,1.9094e+06,0.1258
12.8652,97,2.7000e+07,2.5092e+07,1.9082e+06,0.1230
12.9967,98,2.6634e+07,2.4727e+07,1.9071e+06,0.1246
13.1251,99,2.6277e+07,2.4371e+07,1.9062e+06,0.1218
13.2574,100,2.5930e+07,2.4025e+07,1.9048e+06,0.1250
13.3883,101,2.5590e+07,2.3688e+07,1.9029e+06,0.1230
13.5197,102,2.5255e+07,2.3354e+07,1.9009e+06,0.1244
13.6516,103,2.4918e+07,2.3019e+07,1.8988e+06,0.1250
13.7814,104,2.4582e+07,2.2686e+07,1.8964e+06,0.1231
13.9171,105,2.4252e+07,2.2358e+07,1.8935e+06,0.1287
14.0493,106,2.3929e+07,2.2039e+07,1.8905e+06,0.1250
14.1798,107,2.3617e+07,2.1730e+07,1.8874e+06,0.1236
14.3121,108,2.3310e+07,2.1426e+07,1.8843e+06,0.1253
14.4432,109,2.3007e+07,2.1126e+07,1.8813e+06,0.1241
14.5775,110,2.2711e+07,2.0833e+07,1.8785e+06,0.1258
14.7061,111,2.2424e+07,2.0548e+07,1.8759e+06,0.1217
14.8369,112,2.2143e+07,2.0269e+07,1.8735e+06,0.1239
14.9679,113,2.1863e+07,1.9992e+07,1.8708e+06,0.1242
15.0970,114,2.1587e+07,1.9719e+07,1.8681e+06,0.1222
15.2293,115,2.1319e+07,1.9453e+07,1.8657e+06,0.1252
15.3593,116,2.1056e+07,1.9192e+07,1.8633e+06,0.1232
15.4915,117,2.0800e+07,1.8939e+07,1.8609e+06,0.1256
15.6217,118,2.0550e+07,1.8692e+07,1.8583e+06,0.1207
15.7536,119,2.0304e+07,1.8448e+07,1.8559e+06,0.1248
15.8838,120,2.0061e+07,1.8207e+07,1.8536e+06,0.1236
16.0183,121,1.9821e+07,1.7969e+07,1.8514e+06,0.1262
16.1483,122,1.9581e+07,1.7732e+07,1.8495e+06,0.1226
16.2821,123,1.9344e+07,1.7496e+07,1.8476e+06,0.1258
16.4125,124,1.9113e+07,1.7267e+07,1.8456e+06,0.1229
16.5452,125,1.8889e+07,1.7045e+07,1.8437e+06,0.1250
16.6741,126,1.8670e+07,1.6828e+07,1.8419e+06,0.1216
16.8070,127,1.8456e+07,1.6616e+07,1.8401e+06,0.1256
16.9367,128,1.8245e+07,1.6407e+07,1.8383e+06,0.1227
17.0690,129,1.8035e+07,1.6198e+07,1.8368e+06,0.1250
17.2005,130,1.7828e+07,1.5992e+07,1.8353e+06,0.1246
17.3325,131,1.7624e+07,1.5790e+07,1.8339e+06,0.1249
17.4627,132,1.7425e+07,1.5592e+07,1.8323e+06,0.1233
17.5930,133,1.7229e+07,1.5398e+07,1.8308e+06,0.1236
17.7241,134,1.7036e+07,1.5207e+07,1.8292e+06,0.1243
17.8534,135,1.6846e+07,1.5019e+07,1.8275e+06,0.1225
17.9858,136,1.6662e+07,1.4836e+07,1.8260e+06,0.1247
18.1172,137,1.6484e+07,1.4660e+07,1.8245e+06,0.1244
18.2519,138,1.6313e+07,1.4489e+07,1.8234e+06,0.1238
18.3814,139,1.6146e+07,1.4324e+07,1.8223e+06,0.1224
18.5138,140,1.5984e+07,1.4163e+07,1.8214e+06,0.1253
18.6436,141,1.5826e+07,1.4006e+07,1.8206e+06,0.1226
18.7763,142,1.5674e+07,1.3854e+07,1.8197e+06,0.1250
18.9062,143,1.5525e+07,1.3706e+07,1.8187e+06,0.1225
19.0394,144,1.5376e+07,1.3559e+07,1.8175e+06,0.1257
19.1686,145,1.5230e+07,1.3414e+07,1.8160e+06,0.1221
19.3021,146,1.5084e+07,1.3269e+07,1.8142e+06,0.1261
19.4314,147,1.4942e+07,1.3130e+07,1.8124e+06,0.1222
19.5671,148,1.4803e+07,1.2993e+07,1.8105e+06,0.1285
19.6961,149,1.4665e+07,1.2857e+07,1.8088e+06,0.1219
19.8291,150,1.4527e+07,1.2719e+07,1.8074e+06,0.1256
19.9584,151,1.4387e+07,1.2581e+07,1.8065e+06,0.1224
20.0903,152,1.4248e+07,1.2442e+07,1.8058e+06,0.1245
20.2215,153,1.4110e+07,1.2305e+07,1.8053e+06,0.1241
20.3527,154,1.3976e+07,1.2171e+07,1.8051e+06,0.1240
20.4836,155,1.3844e+07,1.2039e+07,1.8048e+06,0.1239
20.6142,156,1.3713e+07,1.1908e+07,1.8045e+06,0.1235
20.7464,157,1.3583e+07,1.1779e+07,1.8041e+06,0.1252
20.8765,158,1.3456e+07,1.1652e+07,1.8036e+06,0.1230
21.0081,159,1.3331e+07,1.1528e+07,1.8030e+06,0.1241
21.1387,160,1.3210e+07,1.1408e+07,1.8024e+06,0.1235
21.2719,161,1.3090e+07,1.1288e+07,1.8016e+06,0.1257
21.4020,162,1.2971e+07,1.1170e+07,1.8009e+06,0.1230
21.5343,163,1.2853e+07,1.1053e+07,1.8001e+06,0.1251
21.6680,164,1.2737e+07,1.0937e+07,1.7993e+06,0.1268
21.7994,165,1.2621e+07,1.0822e+07,1.7984e+06,0.1245
21.9314,166,1.2508e+07,1.0711e+07,1.7975e+06,0.1247
22.0628,167,1.2399e+07,1.0602e+07,1.7966e+06,0.1244
22.1920,168,1.2294e+07,1.0498e+07,1.7954e+06,0.1222
22.3258,169,1.2191e+07,1.0398e+07,1.7938e+06,0.1264
22.4571,170,1.2091e+07,1.0299e+07,1.7923e+06,0.1240
22.5913,171,1.1991e+07,1.0200e+07,1.7907e+06,0.1266
22.7241,172,1.1891e+07,1.0102e+07,1.7891e+06,0.1256
22.8559,173,1.1792e+07,1.0004e+07,1.7875e+06,0.1245
22.9880,174,1.1693e+07,9.9076e+06,1.7858e+06,0.1245
23.1186,175,1.1597e+07,9.8129e+06,1.7839e+06,0.1234
23.2500,176,1.1501e+07,9.7196e+06,1.7818e+06,0.1243
23.3816,177,1.1408e+07,9.6280e+06,1.7796e+06,0.1243
23.5125,178,1.1313e+07,9.5361e+06,1.7773e+06,0.1238
23.6440,179,1.1219e+07,9.4439e+06,1.7751e+06,0.1245
23.7744,180,1.1126e+07,9.3529e+06,1.7726e+06,0.1235
23.9084,181,1.1034e+07,9.2640e+06,1.7702e+06,0.1267
24.0393,182,1.0945e+07,9.1772e+06,1.7678e+06,0.1237
24.1714,183,1.0857e+07,9.0917e+06,1.7654e+06,0.1249
24.3032,184,1.0771e+07,9.0081e+06,1.7630e+06,0.1244
24.4343,185,1.0688e+07,8.9270e+06,1.7606e+06,0.1239
24.5677,186,1.0605e+07,8.8466e+06,1.7583e+06,0.1261
24.6982,187,1.0523e+07,8.7670e+06,1.7558e+06,0.1233
24.8276,188,1.0441e+07,8.6879e+06,1.7533e+06,0.1222
24.9592,189,1.0359e+07,8.6080e+06,1.7509e+06,0.1243
25.0896,190,1.0276e+07,8.5278e+06,1.7483e+06,0.1232
25.2220,191,1.0194e+07,8.4488e+06,1.7457e+06,0.1252
25.3516,192,1.0114e+07,8.3714e+06,1.7430e+06,0.1226
25.4851,193,1.0037e+07,8.2963e+06,1.7402e+06,0.1261
25.6154,194,9.9610e+06,8.2234e+06,1.7376e+06,0.1231
25.7484,195,9.8860e+06,8.1509e+06,1.7351e+06,0.1254
25.8775,196,9.8122e+06,8.0795e+06,1.7327e+06,0.1221
26.0112,197,9.7398e+06,8.0094e+06,1.7304e+06,0.1263
26.1421,198,9.6689e+06,7.9409e+06,1.7280e+06,0.1226
26.2740,199,9.5994e+06,7.8738e+06,1.7256e+06,0.1249
26.4054,200,9.5298e+06,7.8068e+06,1.7231e+06,0.1245
26.5398,201,9.4591e+06,7.7385e+06,1.7205e+06,0.1245
26.6714,202,9.3876e+06,7.6696e+06,1.7180e+06,0.1244
26.8050,203,9.3155e+06,7.6000e+06,1.7155e+06,0.1264
26.9340,204,9.2438e+06,7.5310e+06,1.7128e+06,0.1221
27.0680,205,9.1730e+06,7.4628e+06,1.7102e+06,0.1266
27.1976,206,9.1027e+06,7.3951e+06,1.7076e+06,0.1226
27.3300,207,9.0334e+06,7.3283e+06,1.7051e+06,0.1251
27.4587,208,8.9661e+06,7.2635e+06,1.7026e+06,0.1219
27.5909,209,8.9004e+06,7.2002e+06,1.7002e+06,0.1252
27.7199,210,8.8366e+06,7.1389e+06,1.6977e+06,0.1221
27.8522,211,8.7744e+06,7.0792e+06,1.6952e+06,0.1256
27.9824,212,8.7131e+06,7.0204e+06,1.6927e+06,0.1234
28.1136,213,8.6516e+06,6.9615e+06,1.6901e+06,0.1243
28.2459,214,8.5896e+06,6.9022e+06,1.6874e+06,0.1241
28.3790,215,8.5264e+06,6.8417e+06,1.6847e+06,0.1249
28.5096,216,8.4628e+06,6.7809e+06,1.6819e+06,0.1236
28.6413,217,8.3991e+06,6.7202e+06,1.6789e+06,0.1249
28.7707,218,8.3358e+06,6.6601e+06,1.6757e+06,0.1226
28.8997,219,8.2737e+06,6.6012e+06,1.6725e+06,0.1223
29.0323,220,8.2132e+06,6.5440e+06,1.6692e+06,0.1252
29.1618,221,8.1542e+06,6.4880e+06,1.6661e+06,0.1227
29.2961,222,8.0966e+06,6.4336e+06,1.6630e+06,0.1269
29.4267,223,8.0404e+06,6.3806e+06,1.6598e+06,0.1237
29.5598,224,7.9850e+06,6.3285e+06,1.6566e+06,0.1256
29.6908,225,7.9294e+06,6.2762e+06,1.6532e+06,0.1241
29.8231,226,7.8739e+06,6.2240e+06,1.6499e+06,0.1255
29.9522,227,7.8186e+06,6.1720e+06,1.6466e+06,0.1224
30.0845,228,7.7631e+06,6.1199e+06,1.6432e+06,0.1252
30.2130,229,7.7076e+06,6.0677e+06,1.6399e+06,0.1219
30.3473,230,7.6521e+06,6.0155e+06,1.6366e+06,0.1271
30.4781,231,7.5972e+06,5.9640e+06,1.6332e+06,0.1238
30.6123,232,7.5436e+06,5.9138e+06,1.6298e+06,0.1263
30.7414,233,7.4907e+06,5.8644e+06,1.6263e+06,0.1223
30.8769,234,7.4393e+06,5.8166e+06,1.6228e+06,0.1275
31.0082,235,7.3887e+06,5.7694e+06,1.6193e+06,0.1235
31.1413,236,7.3390e+06,5.7233e+06,1.6157e+06,0.1252
31.2714,237,7.2899e+06,5.6778e+06,1.6121e+06,0.1227
31.4029,238,7.2406e+06,5.6322e+06,1.6085e+06,0.1240
31.5332,239,7.1915e+06,5.5867e+06,1.6048e+06,0.1229
31.6660,240,7.1426e+06,5.5413e+06,1.6013e+06,0.1254
31.7957,241,7.0942e+06,5.4964e+06,1.5978e+06,0.1229
31.9294,242,7.0465e+06,5.4521e+06,1.5944e+06,0.1266
32.0589,243,6.9996e+06,5.4087e+06,1.5909e+06,0.1225
32.1920,244,6.9533e+06,5.3657e+06,1.5876e+06,0.1257
32.3214,245,6.9079e+06,5.3236e+06,1.5844e+06,0.1220
32.4538,246,6.8631e+06,5.2819e+06,1.5812e+06,0.1252
32.5821,247,6.8187e+06,5.2407e+06,1.5781e+06,0.1213
32.7141,248,6.7748e+06,5.2000e+06,1.5749e+06,0.1253
32.8446,249,6.7311e+06,5.1595e+06,1.5716e+06,0.1235
32.9757,250,6.6878e+06,5.1197e+06,1.5682e+06,0.1241
33.1063,251,6.6445e+06,5.0796e+06,1.5649e+06,0.1234
33.2359,252,6.6014e+06,5.0397e+06,1.5617e+06,0.1227
33.3682,253,6.5585e+06,4.9999e+06,1.5586e+06,0.1255
33.4979,254,6.5159e+06,4.9603e+06,1.5556e+06,0.1227
33.6306,255,6.4738e+06,4.9211e+06,1.5527e+06,0.1256
33.7612,256,6.4323e+06,4.8824e+06,1.5499e+06,0.1238
33.8930,257,6.3913e+06,4.8442e+06,1.5471e+06,0.1250
34.0213,258,6.3507e+06,4.8062e+06,1.5444e+06,0.1216
34.1542,259,6.3105e+06,4.7686e+06,1.5419e+06,0.1260
34.2849,260,6.2703e+06,4.7310e+06,1.5393e+06,0.1239
34.4178,261,6.2304e+06,4.6935e+06,1.5369e+06,0.1259
34.5475,262,6.1908e+06,4.6563e+06,1.5345e+06,0.1229
34.6808,263,6.1518e+06,4.6196e+06,1.5322e+06,0.1259
34.8092,264,6.1134e+06,4.5834e+06,1.5300e+06,0.1219
34.9401,265,6.0752e+06,4.5474e+06,1.5278e+06,0.1241
35.0707,266,6.0377e+06,4.5122e+06,1.5256e+06,0.1239
35.2006,267,6.0009e+06,4.4776e+06,1.5233e+06,0.1232
35.3353,268,5.9646e+06,4.4436e+06,1.5210e+06,0.1279
35.4665,269,5.9286e+06,4.4101e+06,1.5186e+06,0.1229
35.5983,270,5.8933e+06,4.3772e+06,1.5161e+06,0.1250
35.7282,271,5.8587e+06,4.3451e+06,1.5136e+06,0.1230
35.8602,272,5.8244e+06,4.3133e+06,1.5111e+06,0.1249
35.9897,273,5.7905e+06,4.2819e+06,1.5086e+06,0.1225
36.1217,274,5.7571e+06,4.2510e+06,1.5061e+06,0.1250
36.2525,275,5.7235e+06,4.2200e+06,1.5036e+06,0.1242
36.3863,276,5.6900e+06,4.1890e+06,1.5011e+06,0.1266
36.5200,277,5.6569e+06,4.1583e+06,1.4986e+06,0.1254
36.6535,278,5.6241e+06,4.1279e+06,1.4962e+06,0.1256
36.7854,279,5.5913e+06,4.0976e+06,1.4937e+06,0.1245
36.9157,280,5.5585e+06,4.0672e+06,1.4912e+06,0.1235
37.0456,281,5.5258e+06,4.0372e+06,1.4887e+06,0.1233
37.1765,282,5.4933e+06,4.0073e+06,1.4860e+06,0.1240
37.3072,283,5.4609e+06,3.9777e+06,1.4832e+06,0.1238
37.4395,284,5.4284e+06,3.9479e+06,1.4805e+06,0.1254
37.5693,285,5.3961e+06,3.9184e+06,1.4778e+06,0.1228
37.7037,286,5.3643e+06,3.8893e+06,1.4750e+06,0.1269
37.8354,287,5.3326e+06,3.8604e+06,1.4722e+06,0.1249
37.9671,288,5.3010e+06,3.8316e+06,1.4694e+06,0.1247
38.0966,289,5.2699e+06,3.8033e+06,1.4666e+06,0.1225
38.2286,290,5.2394e+06,3.7755e+06,1.4639e+06,0.1249
38.3591,291,5.2091e+06,3.7480e+06,1.4611e+06,0.1235
38.4910,292,5.1792e+06,3.7209e+06,1.4583e+06,0.1250
38.6199,293,5.1498e+06,3.6944e+06,1.4554e+06,0.1219
38.7532,294,5.1205e+06,3.6681e+06,1.4525e+06,0.1259
38.8832,295,5.0913e+06,3.6419e+06,1.4495e+06,0.1230
39.0154,296,5.0623e+06,3.6159e+06,1.4465e+06,0.1250
39.1457,297,5.0336e+06,3.5901e+06,1.4435e+06,0.1234
39.2801,298,5.0050e+06,3.5645e+06,1.4404e+06,0.1268
39.4095,299,4.9769e+06,3.5394e+06,1.4375e+06,0.1223
39.5427,300,4.9495e+06,3.5149e+06,1.4346e+06,0.1258
39.6775,301,4.9224e+06,3.4906e+06,1.4318e+06,0.1225
39.8108,302,4.8958e+06,3.4668e+06,1.4290e+06,0.1261
39.9437,303,4.8696e+06,3.4433e+06,1.4263e+06,0.1253
40.0740,304,4.8439e+06,3.4202e+06,1.4237e+06,0.1233
40.2037,305,4.8186e+06,3.3973e+06,1.4212e+06,0.1230
40.3359,306,4.7934e+06,3.3748e+06,1.4186e+06,0.1254
40.4653,307,4.7683e+06,3.3523e+06,1.4160e+06,0.1227
40.5974,308,4.7433e+06,3.3300e+06,1.4133e+06,0.1252
40.7256,309,4.7184e+06,3.3077e+06,1.4107e+06,0.1213
40.8581,310,4.6935e+06,3.2855e+06,1.4080e+06,0.1257
40.9873,311,4.6690e+06,3.2635e+06,1.4055e+06,0.1225
41.1188,312,4.6447e+06,3.2418e+06,1.4029e+06,0.1242
41.2495,313,4.6206e+06,3.2204e+06,1.4002e+06,0.1239
41.3804,314,4.5967e+06,3.1992e+06,1.3975e+06,0.1240
41.5128,315,4.5733e+06,3.1785e+06,1.3947e+06,0.1254
41.6439,316,4.5502e+06,3.1583e+06,1.3919e+06,0.1243
41.7766,317,4.5276e+06,3.1385e+06,1.3891e+06,0.1253
41.9095,318,4.5051e+06,3.1189e+06,1.3862e+06,0.1257
42.0410,319,4.4826e+06,3.0994e+06,1.3833e+06,0.1243
42.1744,320,4.4602e+06,3.0798e+06,1.3804e+06,0.1261
42.3042,321,4.4378e+06,3.0602e+06,1.3776e+06,0.1221
42.4363,322,4.4152e+06,3.0404e+06,1.3748e+06,0.1253
42.5665,323,4.3927e+06,3.0206e+06,1.3722e+06,0.1234
42.6970,324,4.3705e+06,3.0009e+06,1.3695e+06,0.1236
42.8277,325,4.3485e+06,2.9815e+06,1.3670e+06,0.1239
42.9573,326,4.3269e+06,2.9623e+06,1.3645e+06,0.1230
43.0906,327,4.3056e+06,2.9436e+06,1.3620e+06,0.1264
43.2209,328,4.2845e+06,2.9251e+06,1.3595e+06,0.1235
43.3531,329,4.2634e+06,2.9066e+06,1.3569e+06,0.1251
43.4846,330,4.2425e+06,2.8882e+06,1.3543e+06,0.1247
43.6186,331,4.2218e+06,2.8701e+06,1.3517e+06,0.1266
43.7501,332,4.2013e+06,2.8522e+06,1.3491e+06,0.1245
43.8826,333,4.1809e+06,2.8342e+06,1.3467e+06,0.1256
44.0140,334,4.1605e+06,2.8162e+06,1.3442e+06,0.1245
44.1457,335,4.1401e+06,2.7982e+06,1.3419e+06,0.1250
44.2778,336,4.1198e+06,2.7803e+06,1.3395e+06,0.1251
44.4105,337,4.0996e+06,2.7625e+06,1.3371e+06,0.1257
44.5446,338,4.0795e+06,2.7449e+06,1.3346e+06,0.1274
44.6746,339,4.0597e+06,2.7276e+06,1.3321e+06,0.1228
44.8064,340,4.0403e+06,2.7107e+06,1.3296e+06,0.1246
44.9381,341,4.0211e+06,2.6941e+06,1.3270e+06,0.1252
45.0708,342,4.0022e+06,2.6777e+06,1.3245e+06,0.1258
45.2012,343,3.9836e+06,2.6616e+06,1.3220e+06,0.1237
45.3334,344,3.9651e+06,2.6455e+06,1.3196e+06,0.1251
45.4675,345,3.9465e+06,2.6294e+06,1.3171e+06,0.1271
45.6035,346,3.9278e+06,2.6131e+06,1.3147e+06,0.1264
45.7339,347,3.9092e+06,2.5969e+06,1.3122e+06,0.1235
45.8666,348,3.8905e+06,2.5807e+06,1.3097e+06,0.1253
45.9972,349,3.8718e+06,2.5645e+06,1.3072e+06,0.1234
46.1300,350,3.8533e+06,2.5487e+06,1.3046e+06,0.1257
46.2587,351,3.8352e+06,2.5331e+06,1.3021e+06,0.1222
46.3922,352,3.8172e+06,2.5177e+06,1.2996e+06,0.1268
46.5214,353,3.7995e+06,2.5024e+06,1.2971e+06,0.1225
46.6546,354,3.7819e+06,2.4873e+06,1.2946e+06,0.1262
46.7848,355,3.7645e+06,2.4724e+06,1.2921e+06,0.1235
46.9178,356,3.7473e+06,2.4577e+06,1.2896e+06,0.1261
47.0469,357,3.7302e+06,2.4431e+06,1.2871e+06,0.1224
47.1792,358,3.7132e+06,2.4287e+06,1.2846e+06,0.1253
47.3085,359,3.6963e+06,2.4143e+06,1.2820e+06,0.1227
47.4382,360,3.6793e+06,2.3999e+06,1.2794e+06,0.1229
47.5699,361,3.6623e+06,2.3856e+06,1.2767e+06,0.1250
47.7002,362,3.6455e+06,2.3715e+06,1.2740e+06,0.1233
47.8332,363,3.6288e+06,2.3576e+06,1.2713e+06,0.1259
47.9621,364,3.6124e+06,2.3439e+06,1.2685e+06,0.1225
48.0935,365,3.5962e+06,2.3304e+06,1.2658e+06,0.1247
48.2229,366,3.5803e+06,2.3171e+06,1.2631e+06,0.1227
48.3556,367,3.5644e+06,2.3039e+06,1.2605e+06,0.1261
48.4848,368,3.5487e+06,2.2907e+06,1.2580e+06,0.1224
48.6177,369,3.5331e+06,2.2776e+06,1.2555e+06,0.1254
48.7494,370,3.5175e+06,2.2646e+06,1.2529e+06,0.1243
48.8825,371,3.5020e+06,2.2516e+06,1.2504e+06,0.1258
49.0118,372,3.4866e+06,2.2388e+06,1.2478e+06,0.1226
49.1433,373,3.4712e+06,2.2261e+06,1.2451e+06,0.1247
49.2739,374,3.4560e+06,2.2136e+06,1.2424e+06,0.1242
49.4034,375,3.4408e+06,2.2012e+06,1.2397e+06,0.1229
49.5357,376,3.4259e+06,2.1889e+06,1.2370e+06,0.1253
49.6737,377,3.4111e+06,2.1768e+06,1.2343e+06,0.1225
49.8036,378,3.3963e+06,2.1646e+06,1.2317e+06,0.1233
49.9368,379,3.3818e+06,2.1526e+06,1.2291e+06,0.1261
50.0660,380,3.3673e+06,2.1407e+06,1.2266e+06,0.1225
50.1970,381,3.3530e+06,2.1289e+06,1.2240e+06,0.1240
50.3273,382,3.3387e+06,2.1173e+06,1.2215e+06,0.1235
50.4564,383,3.3246e+06,2.1057e+06,1.2189e+06,0.1225
50.5883,384,3.3105e+06,2.0943e+06,1.2162e+06,0.1253
50.7176,385,3.2966e+06,2.0831e+06,1.2136e+06,0.1224
50.8496,386,3.2827e+06,2.0718e+06,1.2109e+06,0.1249
50.9776,387,3.2689e+06,2.0605e+06,1.2084e+06,0.1214
51.1084,388,3.2551e+06,2.0492e+06,1.2059e+06,0.1240
51.2398,389,3.2413e+06,2.0378e+06,1.2035e+06,0.1247
51.3696,390,3.2277e+06,2.0266e+06,1.2011e+06,0.1229
51.5021,391,3.2144e+06,2.0157e+06,1.1987e+06,0.1254
51.6349,392,3.2013e+06,2.0050e+06,1.1963e+06,0.1260
51.7656,393,3.1883e+06,1.9944e+06,1.1939e+06,0.1240
51.8949,394,3.1753e+06,1.9840e+06,1.1914e+06,0.1227
52.0269,395,3.1625e+06,1.9737e+06,1.1888e+06,0.1253
52.1559,396,3.1498e+06,1.9635e+06,1.1863e+06,0.1221
52.2897,397,3.1370e+06,1.9532e+06,1.1838e+06,0.1272
52.4179,398,3.1244e+06,1.9430e+06,1.1814e+06,0.1215
52.5515,399,3.1117e+06,1.9327e+06,1.1790e+06,0.1242
52.6836,400,3.0991e+06,1.9224e+06,1.1767e+06,0.1213
52.8164,401,3.0865e+06,1.9121e+06,1.1744e+06,0.1249
52.9446,402,3.0741e+06,1.9020e+06,1.1721e+06,0.1212
53.0784,403,3.0618e+06,1.8921e+06,1.1697e+06,0.1265
53.2090,404,3.0497e+06,1.8824e+06,1.1673e+06,0.1234
53.3429,405,3.0376e+06,1.8728e+06,1.1649e+06,0.1270
53.4735,406,3.0257e+06,1.8633e+06,1.1624e+06,0.1236
53.6078,407,3.0138e+06,1.8538e+06,1.1600e+06,0.1272
53.7384,408,3.0020e+06,1.8443e+06,1.1576e+06,0.1234
53.8720,409,2.9901e+06,1.8348e+06,1.1553e+06,0.1263
54.0012,410,2.9783e+06,1.8253e+06,1.1530e+06,0.1225
54.1355,411,2.9667e+06,1.8159e+06,1.1507e+06,0.1269
54.2659,412,2.9552e+06,1.8067e+06,1.1485e+06,0.1236
54.3998,413,2.9438e+06,1.7976e+06,1.1462e+06,0.1269
54.5303,414,2.9326e+06,1.7887e+06,1.1439e+06,0.1238
54.6616,415,2.9216e+06,1.7800e+06,1.1416e+06,0.1240
54.7903,416,2.9106e+06,1.7713e+06,1.1393e+06,0.1217
54.9224,417,2.8998e+06,1.7628e+06,1.1370e+06,0.1251
55.0513,418,2.8890e+06,1.7542e+06,1.1348e+06,0.1223
55.1811,419,2.8783e+06,1.7457e+06,1.1326e+06,0.1234
55.3126,420,2.8675e+06,1.7371e+06,1.1305e+06,0.1244
55.4413,421,2.8568e+06,1.7284e+06,1.1284e+06,0.1219
55.5739,422,2.8462e+06,1.7199e+06,1.1263e+06,0.1256
55.7025,423,2.8356e+06,1.7115e+06,1.1241e+06,0.1220
55.8357,424,2.8251e+06,1.7031e+06,1.1220e+06,0.1262
55.9650,425,2.8146e+06,1.6948e+06,1.1197e+06,0.1226
56.0962,426,2.8042e+06,1.6867e+06,1.1175e+06,0.1242
56.2270,427,2.7940e+06,1.6786e+06,1.1153e+06,0.1241
56.3574,428,2.7838e+06,1.6706e+06,1.1132e+06,0.1235
56.4892,429,2.7736e+06,1.6625e+06,1.1112e+06,0.1250
56.6182,430,2.7636e+06,1.6544e+06,1.1092e+06,0.1223
56.7500,431,2.7536e+06,1.6463e+06,1.1072e+06,0.1249
56.8785,432,2.7437e+06,1.6384e+06,1.1053e+06,0.1218
57.0119,433,2.7338e+06,1.6305e+06,1.1033e+06,0.1264
57.1413,434,2.7240e+06,1.6228e+06,1.1012e+06,0.1223
57.2728,435,2.7144e+06,1.6153e+06,1.0991e+06,0.1245
57.4037,436,2.7049e+06,1.6079e+06,1.0969e+06,0.1241
57.5333,437,2.6955e+06,1.6007e+06,1.0948e+06,0.1230
57.6652,438,2.6861e+06,1.5934e+06,1.0927e+06,0.1253
57.7950,439,2.6769e+06,1.5862e+06,1.0907e+06,0.1230
57.9280,440,2.6677e+06,1.5789e+06,1.0888e+06,0.1257
58.0569,441,2.6585e+06,1.5717e+06,1.0869e+06,0.1220
58.1890,442,2.6494e+06,1.5645e+06,1.0850e+06,0.1254
58.3179,443,2.6404e+06,1.5573e+06,1.0831e+06,0.1220
58.4488,444,2.6314e+06,1.5503e+06,1.0811e+06,0.1239
58.5797,445,2.6224e+06,1.5434e+06,1.0791e+06,0.1244
58.7098,446,2.6136e+06,1.5366e+06,1.0770e+06,0.1233
58.8420,447,2.6048e+06,1.5299e+06,1.0749e+06,0.1254
58.9710,448,2.5961e+06,1.5233e+06,1.0728e+06,0.1223
59.1029,449,2.5874e+06,1.5166e+06,1.0708e+06,0.1253
59.2313,450,2.5788e+06,1.5099e+06,1.0689e+06,0.1220
59.3640,451,2.5702e+06,1.5031e+06,1.0671e+06,0.1257
59.4931,452,2.5616e+06,1.4964e+06,1.0652e+06,0.1222
59.6245,453,2.5531e+06,1.4898e+06,1.0633e+06,0.1247
59.7561,454,2.5446e+06,1.4832e+06,1.0614e+06,0.1245
59.8864,455,2.5362e+06,1.4768e+06,1.0594e+06,0.1232
60.0173,456,2.5278e+06,1.4704e+06,1.0574e+06,0.1244
60.1460,457,2.5195e+06,1.4641e+06,1.0553e+06,0.1219
60.2774,458,2.5112e+06,1.4578e+06,1.0534e+06,0.1246
60.4061,459,2.5030e+06,1.4515e+06,1.0515e+06,0.1219
60.5395,460,2.4949e+06,1.4453e+06,1.0496e+06,0.1265
60.6685,461,2.4868e+06,1.4391e+06,1.0478e+06,0.1221
60.7996,462,2.4789e+06,1.4329e+06,1.0460e+06,0.1242
60.9307,463,2.4709e+06,1.4267e+06,1.0442e+06,0.1243
61.0614,464,2.4630e+06,1.4206e+06,1.0423e+06,0.1240
61.1927,465,2.4551e+06,1.4146e+06,1.0405e+06,0.1243
61.3223,466,2.4472e+06,1.4086e+06,1.0386e+06,0.1229
61.4552,467,2.4394e+06,1.4026e+06,1.0368e+06,0.1261
61.5844,468,2.4317e+06,1.3967e+06,1.0350e+06,0.1225
61.7161,469,2.4241e+06,1.3909e+06,1.0332e+06,0.1248
61.8456,470,2.4166e+06,1.3851e+06,1.0315e+06,0.1223
61.9792,471,2.4091e+06,1.3793e+06,1.0298e+06,0.1263
62.1098,472,2.4016e+06,1.3736e+06,1.0280e+06,0.1237
62.2447,473,2.3941e+06,1.3678e+06,1.0263e+06,0.1251
62.3732,474,2.3867e+06,1.3622e+06,1.0245e+06,0.1215
62.5057,475,2.3793e+06,1.3565e+06,1.0227e+06,0.1255
62.6349,476,2.3719e+06,1.3510e+06,1.0209e+06,0.1224
62.7704,477,2.3645e+06,1.3454e+06,1.0191e+06,0.1288
62.8989,478,2.3572e+06,1.3399e+06,1.0173e+06,0.1214
63.0303,479,2.3500e+06,1.3345e+06,1.0155e+06,0.1246
63.1611,480,2.3428e+06,1.3290e+06,1.0138e+06,0.1239
63.2902,481,2.3356e+06,1.3235e+06,1.0121e+06,0.1224
63.4223,482,2.3286e+06,1.3181e+06,1.0105e+06,0.1250
63.5510,483,2.3216e+06,1.3128e+06,1.0088e+06,0.1219
63.6830,484,2.3146e+06,1.3075e+06,1.0071e+06,0.1251
63.8124,485,2.3077e+06,1.3024e+06,1.0053e+06,0.1220
63.9451,486,2.3008e+06,1.2972e+06,1.0036e+06,0.1252
64.0763,487,2.2939e+06,1.2921e+06,1.0018e+06,0.1240
64.2107,488,2.2871e+06,1.2870e+06,1.0001e+06,0.1270
64.3411,489,2.2803e+06,1.2818e+06,9.9842e+05,0.1226
64.4751,490,2.2735e+06,1.2767e+06,9.9679e+05,0.1270
64.6040,491,2.2668e+06,1.2716e+06,9.9517e+05,0.1221
64.7361,492,2.2602e+06,1.2666e+06,9.9356e+05,0.1250
64.8661,493,2.2536e+06,1.2617e+06,9.9193e+05,0.1230
64.9997,494,2.2471e+06,1.2568e+06,9.9026e+05,0.1262
65.1296,495,2.2405e+06,1.2519e+06,9.8858e+05,0.1226
65.2627,496,2.2340e+06,1.2471e+06,9.8689e+05,0.1260
65.3918,497,2.2275e+06,1.2423e+06,9.8521e+05,0.1221
65.5248,498,2.2210e+06,1.2375e+06,9.8357e+05,0.1253
65.6550,499,2.2146e+06,1.2326e+06,9.8197e+05,0.1228
65.7864,500,2.2082e+06,1.2278e+06,9.8042e+05,0.1243
65.9190,501,2.2018e+06,1.2229e+06,9.7890e+05,0.1230
66.0528,502,2.1955e+06,1.2181e+06,9.7741e+05,0.1261
66.1838,503,2.1893e+06,1.2134e+06,9.7590e+05,0.1238
66.3174,504,2.1833e+06,1.2089e+06,9.7438e+05,0.1269
66.4464,505,2.1773e+06,1.2045e+06,9.7281e+05,0.1221
66.5798,506,2.1713e+06,1.2000e+06,9.7123e+05,0.1265
66.7090,507,2.1653e+06,1.1957e+06,9.6966e+05,0.1223
66.8406,508,2.1594e+06,1.1913e+06,9.6811e+05,0.1247
66.9709,509,2.1535e+06,1.1869e+06,9.6661e+05,0.1232
67.1007,510,2.1476e+06,1.1825e+06,9.6513e+05,0.1230
67.2325,511,2.1418e+06,1.1781e+06,9.6369e+05,0.1249
67.3610,512,2.1360e+06,1.1737e+06,9.6224e+05,0.1219
67.4931,513,2.1302e+06,1.1695e+06,9.6077e+05,0.1251
67.6220,514,2.1246e+06,1.1653e+06,9.5929e+05,0.1222
67.7560,515,2.1190e+06,1.1612e+06,9.5778e+05,0.1267
67.8884,516,2.1134e+06,1.1572e+06,9.5627e+05,0.1241
68.0244,517,2.1080e+06,1.1532e+06,9.5477e+05,0.1276
68.1564,518,2.1026e+06,1.1492e+06,9.5331e+05,0.1243
68.2883,519,2.0971e+06,1.1452e+06,9.5191e+05,0.1241
68.4183,520,2.0917e+06,1.1411e+06,9.5056e+05,0.1226
68.5510,521,2.0863e+06,1.1370e+06,9.4925e+05,0.1255
68.6806,522,2.0809e+06,1.1329e+06,9.4794e+05,0.1228
68.8128,523,2.0755e+06,1.1289e+06,9.4660e+05,0.1252
68.9420,524,2.0701e+06,1.1249e+06,9.4522e+05,0.1221
69.0752,525,2.0647e+06,1.1209e+06,9.4381e+05,0.1260
69.2038,526,2.0594e+06,1.1170e+06,9.4238e+05,0.1220
69.3365,527,2.0540e+06,1.1131e+06,9.4096e+05,0.1257
69.4670,528,2.0487e+06,1.1091e+06,9.3958e+05,0.1236
69.5984,529,2.0434e+06,1.1052e+06,9.3825e+05,0.1243
69.7283,530,2.0382e+06,1.1012e+06,9.3696e+05,0.1228
69.8606,531,2.0329e+06,1.0972e+06,9.3566e+05,0.1257
69.9913,532,2.0277e+06,1.0934e+06,9.3433e+05,0.1238
70.1210,533,2.0225e+06,1.0895e+06,9.3297e+05,0.1228
70.2552,534,2.0174e+06,1.0858e+06,9.3156e+05,0.1271
70.3849,535,2.0123e+06,1.0821e+06,9.3012e+05,0.1228
70.5159,536,2.0072e+06,1.0785e+06,9.2868e+05,0.1242
70.6450,537,2.0021e+06,1.0748e+06,9.2726e+05,0.1224
70.7774,538,1.9970e+06,1.0712e+06,9.2586e+05,0.1255
70.9082,539,1.9920e+06,1.0675e+06,9.2449e+05,0.1209
71.0407,540,1.9870e+06,1.0639e+06,9.2312e+05,0.1256
71.1693,541,1.9821e+06,1.0604e+06,9.2175e+05,0.1220
71.3014,542,1.9773e+06,1.0569e+06,9.2034e+05,0.1254
71.4312,543,1.9724e+06,1.0535e+06,9.1888e+05,0.1231
71.5610,544,1.9676e+06,1.0502e+06,9.1742e+05,0.1230
71.6928,545,1.9629e+06,1.0469e+06,9.1595e+05,0.1249
71.8233,546,1.9581e+06,1.0436e+06,9.1449e+05,0.1238
71.9551,547,1.9533e+06,1.0403e+06,9.1308e+05,0.1249
72.0879,548,1.9486e+06,1.0369e+06,9.1170e+05,0.1258
72.2214,549,1.9438e+06,1.0335e+06,9.1034e+05,0.1227
72.3528,550,1.9391e+06,1.0301e+06,9.0898e+05,0.1238
72.4839,551,1.9344e+06,1.0268e+06,9.0759e+05,0.1242
72.6131,552,1.9298e+06,1.0236e+06,9.0617e+05,0.1223
72.7453,553,1.9251e+06,1.0204e+06,9.0471e+05,0.1252
72.8741,554,1.9205e+06,1.0173e+06,9.0326e+05,0.1221
73.0064,555,1.9160e+06,1.0141e+06,9.0184e+05,0.1254
73.1353,556,1.9114e+06,1.0110e+06,9.0046e+05,0.1220
73.2681,557,1.9069e+06,1.0078e+06,8.9914e+05,0.1259
73.3980,558,1.9024e+06,1.0046e+06,8.9786e+05,0.1228
73.5298,559,1.8979e+06,1.0013e+06,8.9658e+05,0.1249
73.6606,560,1.8935e+06,9.9819e+05,8.9529e+05,0.1241
73.7898,561,1.8891e+06,9.9511e+05,8.9398e+05,0.1225
73.9225,562,1.8847e+06,9.9206e+05,8.9265e+05,0.1257
74.0518,563,1.8804e+06,9.8904e+05,8.9132e+05,0.1220
74.1837,564,1.8760e+06,9.8603e+05,8.9001e+05,0.1248
74.3123,565,1.8718e+06,9.8304e+05,8.8872e+05,0.1220
74.4446,566,1.8675e+06,9.8003e+05,8.8748e+05,0.1253
74.5742,567,1.8633e+06,9.7702e+05,8.8627e+05,0.1230
74.7063,568,1.8591e+06,9.7403e+05,8.8508e+05,0.1249
74.8388,569,1.8549e+06,9.7106e+05,8.8387e+05,0.1257
74.9725,570,1.8508e+06,9.6814e+05,8.8264e+05,0.1242
75.1020,571,1.8466e+06,9.6527e+05,8.8137e+05,0.1223
75.2332,572,1.8425e+06,9.6244e+05,8.8009e+05,0.1245
75.3636,573,1.8385e+06,9.5964e+05,8.7882e+05,0.1233
75.4934,574,1.8344e+06,9.5684e+05,8.7758e+05,0.1232
75.6253,575,1.8304e+06,9.5405e+05,8.7636e+05,0.1252
75.7549,576,1.8264e+06,9.5127e+05,8.7517e+05,0.1226
75.8872,577,1.8225e+06,9.4850e+05,8.7399e+05,0.1249
76.0170,578,1.8186e+06,9.4576e+05,8.7281e+05,0.1228
76.1496,579,1.8147e+06,9.4305e+05,8.7163e+05,0.1255
76.2779,580,1.8108e+06,9.4036e+05,8.7043e+05,0.1214
76.4094,581,1.8069e+06,9.3768e+05,8.6922e+05,0.1245
76.5391,582,1.8030e+06,9.3499e+05,8.6803e+05,0.1228
76.6687,583,1.7991e+06,9.3227e+05,8.6687e+05,0.1226
76.8009,584,1.7953e+06,9.2955e+05,8.6573e+05,0.1250
76.9307,585,1.7914e+06,9.2681e+05,8.6461e+05,0.1227
77.0630,586,1.7876e+06,9.2408e+05,8.6351e+05,0.1252
77.1934,587,1.7838e+06,9.2136e+05,8.6241e+05,0.1232
77.3276,588,1.7800e+06,9.1868e+05,8.6129e+05,0.1269
77.4562,589,1.7762e+06,9.1603e+05,8.6017e+05,0.1221
77.5882,590,1.7724e+06,9.1341e+05,8.5903e+05,0.1247
77.7174,591,1.7687e+06,9.1081e+05,8.5790e+05,0.1223
77.8495,592,1.7650e+06,9.0820e+05,8.5678e+05,0.1249
77.9798,593,1.7613e+06,9.0556e+05,8.5571e+05,0.1231
78.1128,594,1.7576e+06,9.0291e+05,8.5465e+05,0.1255
78.2424,595,1.7539e+06,9.0028e+05,8.5359e+05,0.1226
78.3729,596,1.7502e+06,8.9767e+05,8.5252e+05,0.1235
78.5035,597,1.7465e+06,8.9510e+05,8.5144e+05,0.1238
78.6333,598,1.7429e+06,8.9255e+05,8.5035e+05,0.1228
78.7648,599,1.7393e+06,8.9003e+05,8.4925e+05,0.1245
78.8939,600,1.7357e+06,8.8752e+05,8.4816e+05,0.1223
79.0296,601,1.7321e+06,8.8498e+05,8.4710e+05,0.1258
79.1612,602,1.7285e+06,8.8243e+05,8.4606e+05,0.1241
79.2932,603,1.7249e+06,8.7988e+05,8.4503e+05,0.1248
79.4223,604,1.7214e+06,8.7735e+05,8.4401e+05,0.1222
79.5548,605,1.7178e+06,8.7486e+05,8.4298e+05,0.1254
79.6896,606,1.7144e+06,8.7242e+05,8.4194e+05,0.1272
79.8208,607,1.7109e+06,8.7004e+05,8.4087e+05,0.1240
79.9511,608,1.7075e+06,8.6772e+05,8.3979e+05,0.1233
80.0848,609,1.7041e+06,8.6542e+05,8.3871e+05,0.1263
80.2172,610,1.7008e+06,8.6312e+05,8.3765e+05,0.1251
80.3502,611,1.6974e+06,8.6084e+05,8.3661e+05,0.1258
80.4820,612,1.6941e+06,8.5854e+05,8.3558e+05,0.1243
80.6143,613,1.6908e+06,8.5625e+05,8.3457e+05,0.1250
80.7455,614,1.6875e+06,8.5398e+05,8.3354e+05,0.1241
80.8774,615,1.6842e+06,8.5176e+05,8.3249e+05,0.1249
81.0086,616,1.6810e+06,8.4956e+05,8.3143e+05,0.1243
81.1407,617,1.6777e+06,8.4739e+05,8.3036e+05,0.1246
81.2731,618,1.6745e+06,8.4522e+05,8.2929e+05,0.1253
81.4051,619,1.6713e+06,8.4305e+05,8.2824e+05,0.1248
81.5370,620,1.6681e+06,8.4089e+05,8.2721e+05,0.1244
81.6669,621,1.6649e+06,8.3875e+05,8.2619e+05,0.1229
81.7958,622,1.6618e+06,8.3662e+05,8.2517e+05,0.1223
81.9289,623,1.6587e+06,8.3450e+05,8.2417e+05,0.1259
82.0588,624,1.6556e+06,8.3241e+05,8.2317e+05,0.1227
82.1924,625,1.6525e+06,8.3033e+05,8.2216e+05,0.1263
82.3239,626,1.6494e+06,8.2828e+05,8.2113e+05,0.1244
82.4571,627,1.6463e+06,8.2624e+05,8.2010e+05,0.1262
82.5887,628,1.6433e+06,8.2421e+05,8.1908e+05,0.1244
82.7214,629,1.6402e+06,8.2215e+05,8.1808e+05,0.1256
82.8547,630,1.6372e+06,8.2009e+05,8.1709e+05,0.1261
82.9864,631,1.6341e+06,8.1802e+05,8.1611e+05,0.1244
83.1201,632,1.6311e+06,8.1600e+05,8.1513e+05,0.1261
83.2513,633,1.6281e+06,8.1398e+05,8.1416e+05,0.1239
83.3850,634,1.6251e+06,8.1196e+05,8.1318e+05,0.1263
83.5160,635,1.6222e+06,8.0997e+05,8.1219e+05,0.1239
83.6504,636,1.6192e+06,8.0798e+05,8.1121e+05,0.1270
83.7796,637,1.6162e+06,8.0598e+05,8.1023e+05,0.1222
83.9120,638,1.6133e+06,8.0400e+05,8.0927e+05,0.1249
84.0417,639,1.6104e+06,8.0201e+05,8.0834e+05,0.1226
84.1751,640,1.6075e+06,8.0004e+05,8.0742e+05,0.1260
84.3063,641,1.6046e+06,7.9808e+05,8.0650e+05,0.1243
84.4408,642,1.6017e+06,7.9616e+05,8.0558e+05,0.1272
84.5718,643,1.5989e+06,7.9428e+05,8.0466e+05,0.1239
84.7093,644,1.5962e+06,7.9242e+05,8.0374e+05,0.1305
84.8417,645,1.5934e+06,7.9057e+05,8.0282e+05,0.1252
84.9736,646,1.5906e+06,7.8871e+05,8.0192e+05,0.1249
85.1078,647,1.5879e+06,7.8683e+05,8.0103e+05,0.1266
85.2386,648,1.5851e+06,7.8493e+05,8.0016e+05,0.1235
85.3723,649,1.5823e+06,7.8304e+05,7.9929e+05,0.1263
85.5036,650,1.5796e+06,7.8117e+05,7.9841e+05,0.1239
85.6373,651,1.5769e+06,7.7933e+05,7.9752e+05,0.1267
85.7687,652,1.5742e+06,7.7752e+05,7.9664e+05,0.1242
85.9012,653,1.5715e+06,7.7573e+05,7.9575e+05,0.1255
86.0302,654,1.5688e+06,7.7392e+05,7.9488e+05,0.1220
86.1631,655,1.5661e+06,7.7208e+05,7.9404e+05,0.1256
86.2920,656,1.5634e+06,7.7022e+05,7.9321e+05,0.1218
86.4250,657,1.5607e+06,7.6836e+05,7.9239e+05,0.1260
86.5537,658,1.5581e+06,7.6650e+05,7.9156e+05,0.1216
86.6866,659,1.5554e+06,7.6466e+05,7.9071e+05,0.1258
86.8171,660,1.5527e+06,7.6285e+05,7.8985e+05,0.1233
86.9511,661,1.5500e+06,7.6107e+05,7.8898e+05,0.1267
87.0813,662,1.5474e+06,7.5929e+05,7.8813e+05,0.1230
87.2138,663,1.5448e+06,7.5750e+05,7.8728e+05,0.1251
87.3435,664,1.5422e+06,7.5571e+05,7.8646e+05,0.1225
87.4762,665,1.5396e+06,7.5392e+05,7.8566e+05,0.1254
87.6058,666,1.5370e+06,7.5214e+05,7.8486e+05,0.1228
87.7371,667,1.5344e+06,7.5039e+05,7.8405e+05,0.1243
87.8680,668,1.5319e+06,7.4867e+05,7.8323e+05,0.1236
87.9995,669,1.5294e+06,7.4695e+05,7.8241e+05,0.1245
88.1330,670,1.5268e+06,7.4523e+05,7.8159e+05,0.1227
88.2642,671,1.5243e+06,7.4353e+05,7.8079e+05,0.1239
88.3955,672,1.5218e+06,7.4182e+05,7.8001e+05,0.1243
88.5254,673,1.5194e+06,7.4012e+05,7.7924e+05,0.1230
88.6567,674,1.5169e+06,7.3843e+05,7.7847e+05,0.1245
88.7865,675,1.5145e+06,7.3675e+05,7.7770e+05,0.1226
88.9185,676,1.5120e+06,7.3508e+05,7.7693e+05,0.1248
89.0474,677,1.5096e+06,7.3342e+05,7.7614e+05,0.1219
89.1803,678,1.5071e+06,7.3179e+05,7.7535e+05,0.1255
89.3091,679,1.5047e+06,7.3016e+05,7.7457e+05,0.1217
89.4416,680,1.5023e+06,7.2851e+05,7.7380e+05,0.1252
89.5713,681,1.4999e+06,7.2686e+05,7.7306e+05,0.1227
89.7028,682,1.4975e+06,7.2519e+05,7.7235e+05,0.1245
89.8328,683,1.4952e+06,7.2353e+05,7.7164e+05,0.1233
89.9619,684,1.4928e+06,7.2190e+05,7.7093e+05,0.1221
90.0934,685,1.4905e+06,7.2029e+05,7.7021e+05,0.1245
90.2220,686,1.4882e+06,7.1870e+05,7.6948e+05,0.1216
90.3544,687,1.4859e+06,7.1711e+05,7.6876e+05,0.1253
90.4843,688,1.4836e+06,7.1553e+05,7.6803e+05,0.1230
90.6158,689,1.4813e+06,7.1396e+05,7.6731e+05,0.1242
90.7471,690,1.4790e+06,7.1239e+05,7.6661e+05,0.1242
90.8801,691,1.4767e+06,7.1082e+05,7.6592e+05,0.1250
91.0116,692,1.4745e+06,7.0926e+05,7.6524e+05,0.1240
91.1459,693,1.4723e+06,7.0769e+05,7.6456e+05,0.1264
91.2760,694,1.4700e+06,7.0615e+05,7.6388e+05,0.1224
91.4089,695,1.4678e+06,7.0461e+05,7.6320e+05,0.1252
91.5399,696,1.4656e+06,7.0308e+05,7.6251e+05,0.1228
91.6734,697,1.4634e+06,7.0155e+05,7.6184e+05,0.1257
91.8030,698,1.4612e+06,7.0001e+05,7.6118e+05,0.1223
91.9357,699,1.4590e+06,6.9847e+05,7.6053e+05,0.1253
92.0665,700,1.4568e+06,6.9694e+05,7.5988e+05,0.1235
92.2030,701,1.4547e+06,6.9543e+05,7.5923e+05,0.1274
92.3333,702,1.4525e+06,6.9394e+05,7.5856e+05,0.1228
92.4667,703,1.4504e+06,6.9247e+05,7.5789e+05,0.1260
92.5967,704,1.4482e+06,6.9100e+05,7.5722e+05,0.1226
92.7293,705,1.4461e+06,6.8952e+05,7.5656e+05,0.1250
92.8595,706,1.4440e+06,6.8804e+05,7.5591e+05,0.1228
92.9928,707,1.4418e+06,6.8655e+05,7.5528e+05,0.1255
93.1226,708,1.4397e+06,6.8506e+05,7.5467e+05,0.1224
93.2562,709,1.4376e+06,6.8359e+05,7.5405e+05,0.1259
93.3859,710,1.4356e+06,6.8215e+05,7.5343e+05,0.1219
93.5188,711,1.4335e+06,6.8073e+05,7.5281e+05,0.1259
93.6490,712,1.4315e+06,6.7932e+05,7.5219e+05,0.1231
93.7835,713,1.4295e+06,6.7791e+05,7.5157e+05,0.1266
93.9135,714,1.4275e+06,6.7651e+05,7.5097e+05,0.1227
94.0459,715,1.4255e+06,6.7509e+05,7.5038e+05,0.1251
94.1782,716,1.4235e+06,6.7367e+05,7.4979e+05,0.1247
94.3133,717,1.4215e+06,6.7225e+05,7.4921e+05,0.1274
94.4461,718,1.4194e+06,6.7083e+05,7.4862e+05,0.1247
94.5779,719,1.4174e+06,6.6943e+05,7.4801e+05,0.1241
94.7111,720,1.4155e+06,6.6805e+05,7.4740e+05,0.1256
94.8416,721,1.4135e+06,6.6669e+05,7.4678e+05,0.1232
94.9734,722,1.4115e+06,6.6535e+05,7.4615e+05,0.1245
95.1058,723,1.4095e+06,6.6399e+05,7.4554e+05,0.1247
95.2404,724,1.4076e+06,6.6263e+05,7.4493e+05,0.1264
95.3720,725,1.4056e+06,6.6128e+05,7.4432e+05,0.1240
95.5066,726,1.4036e+06,6.5994e+05,7.4369e+05,0.1273
95.6380,727,1.4017e+06,6.5864e+05,7.4305e+05,0.1238
95.7724,728,1.3998e+06,6.5737e+05,7.4239e+05,0.1266
95.9051,729,1.3978e+06,6.5610e+05,7.4173e+05,0.1253
96.0381,730,1.3959e+06,6.5484e+05,7.4108e+05,0.1255
96.1706,731,1.3940e+06,6.5357e+05,7.4044e+05,0.1248
96.3013,732,1.3921e+06,6.5230e+05,7.3982e+05,0.1234
96.4339,733,1.3902e+06,6.5103e+05,7.3920e+05,0.1254
96.5651,734,1.3884e+06,6.4980e+05,7.3856e+05,0.1238
96.6989,735,1.3865e+06,6.4860e+05,7.3791e+05,0.1264
96.8299,736,1.3847e+06,6.4741e+05,7.3726e+05,0.1236
96.9631,737,1.3828e+06,6.4621e+05,7.3661e+05,0.1255
97.0923,738,1.3810e+06,6.4501e+05,7.3597e+05,0.1219
97.2237,739,1.3791e+06,6.4378e+05,7.3536e+05,0.1245
97.3557,740,1.3773e+06,6.4256e+05,7.3475e+05,0.1250
97.4884,741,1.3755e+06,6.4135e+05,7.3415e+05,0.1250
97.6182,742,1.3737e+06,6.4016e+05,7.3354e+05,0.1224
97.7490,743,1.3719e+06,6.3900e+05,7.3291e+05,0.1239
97.8811,744,1.3701e+06,6.3785e+05,7.3228e+05,0.1251
98.0121,745,1.3684e+06,6.3670e+05,7.3165e+05,0.1242
98.1462,746,1.3666e+06,6.3555e+05,7.3103e+05,0.1263
98.2812,747,1.3648e+06,6.3438e+05,7.3042e+05,0.1270
98.4122,748,1.3630e+06,6.3322e+05,7.2982e+05,0.1235
98.5480,749,1.3613e+06,6.3205e+05,7.2922e+05,0.1280
98.6820,750,1.3595e+06,6.3088e+05,7.2861e+05,0.1258
98.8141,751,1.3577e+06,6.2971e+05,7.2800e+05,0.1248
98.9462,752,1.3559e+06,6.2855e+05,7.2739e+05,0.1244
99.0771,753,1.3542e+06,6.2739e+05,7.2679e+05,0.1236
99.2088,754,1.3524e+06,6.2622e+05,7.2621e+05,0.1244
99.3404,755,1.3507e+06,6.2503e+05,7.2566e+05,0.1243
99.4723,756,1.3490e+06,6.2383e+05,7.2513e+05,0.1245
99.6038,757,1.3472e+06,6.2264e+05,7.2460e+05,0.1245
99.7383,758,1.3455e+06,6.2147e+05,7.2407e+05,0.1274
99.8689,759,1.3439e+06,6.2032e+05,7.2353e+05,0.1232
99.9996,760,1.3422e+06,6.1918e+05,7.2299e+05,0.1238
100.1308,761,1.3405e+06,6.1804e+05,7.2245e+05,0.1240
100.2613,762,1.3388e+06,6.1690e+05,7.2192e+05,0.1234
100.3928,763,1.3372e+06,6.1575e+05,7.2141e+05,0.1240
100.5225,764,1.3355e+06,6.1461e+05,7.2089e+05,0.1227
100.6545,765,1.3339e+06,6.1348e+05,7.2037e+05,0.1248
100.7839,766,1.3322e+06,6.1235e+05,7.1984e+05,0.1220
100.9164,767,1.3305e+06,6.1124e+05,7.1930e+05,0.1254
101.0480,768,1.3289e+06,6.1014e+05,7.1875e+05,0.1243
101.1826,769,1.3272e+06,6.0903e+05,7.1820e+05,0.1274
101.3135,770,1.3256e+06,6.0794e+05,7.1765e+05,0.1231
101.4481,771,1.3240e+06,6.0685e+05,7.1710e+05,0.1269
101.5792,772,1.3223e+06,6.0577e+05,7.1655e+05,0.1236
101.7136,773,1.3207e+06,6.0468e+05,7.1601e+05,0.1268
101.8483,774,1.3191e+06,6.0360e+05,7.1548e+05,0.1273
101.9798,775,1.3175e+06,6.0253e+05,7.1493e+05,0.1244
102.1130,776,1.3159e+06,6.0148e+05,7.1438e+05,0.1257
102.2445,777,1.3143e+06,6.0045e+05,7.1383e+05,0.1242
102.3794,778,1.3127e+06,5.9943e+05,7.1327e+05,0.1270
102.5109,779,1.3111e+06,5.9843e+05,7.1271e+05,0.1240
102.6448,780,1.3096e+06,5.9744e+05,7.1215e+05,0.1265
102.7762,781,1.3080e+06,5.9645e+05,7.1160e+05,0.1240
102.9100,782,1.3065e+06,5.9546e+05,7.1104e+05,0.1263
103.0423,783,1.3050e+06,5.9447e+05,7.1049e+05,0.1251
103.1733,784,1.3034e+06,5.9349e+05,7.0992e+05,0.1238
103.3042,785,1.3019e+06,5.9252e+05,7.0935e+05,0.1240
103.4361,786,1.3003e+06,5.9155e+05,7.0877e+05,0.1247
103.5667,787,1.2988e+06,5.9060e+05,7.0819e+05,0.1234
103.6987,788,1.2973e+06,5.8966e+05,7.0763e+05,0.1249
103.8292,789,1.2958e+06,5.8871e+05,7.0707e+05,0.1234
103.9621,790,1.2943e+06,5.8776e+05,7.0652e+05,0.1256
104.0922,791,1.2928e+06,5.8682e+05,7.0597e+05,0.1229
104.2238,792,1.2913e+06,5.8589e+05,7.0542e+05,0.1245
104.3537,793,1.2898e+06,5.8496e+05,7.0487e+05,0.1227
104.4863,794,1.2884e+06,5.8403e+05,7.0433e+05,0.1254
104.6155,795,1.2869e+06,5.8309e+05,7.0379e+05,0.1217
104.7533,796,1.2854e+06,5.8215e+05,7.0326e+05,0.1302
104.8834,797,1.2839e+06,5.8120e+05,7.0273e+05,0.1231
105.0141,798,1.2825e+06,5.8026e+05,7.0221e+05,0.1237
105.1439,799,1.2810e+06,5.7933e+05,7.0168e+05,0.1225
105.2760,800,1.2796e+06,5.7841e+05,7.0115e+05,0.1248
105.4107,801,1.2781e+06,5.7750e+05,7.0062e+05,0.1253
105.5445,802,1.2767e+06,5.7658e+05,7.0009e+05,0.1262
105.6768,803,1.2752e+06,5.7566e+05,6.9957e+05,0.1246
105.8098,804,1.2738e+06,5.7473e+05,6.9907e+05,0.1252
105.9440,805,1.2724e+06,5.7381e+05,6.9857e+05,0.1267
106.0730,806,1.2710e+06,5.7290e+05,6.9807e+05,0.1218
106.2048,807,1.2696e+06,5.7200e+05,6.9757e+05,0.1247
106.3378,808,1.2682e+06,5.7111e+05,6.9706e+05,0.1256
106.4710,809,1.2668e+06,5.7023e+05,6.9656e+05,0.1254
106.6001,810,1.2654e+06,5.6934e+05,6.9606e+05,0.1222
106.7325,811,1.2640e+06,5.6846e+05,6.9556e+05,0.1252
106.8625,812,1.2626e+06,5.6758e+05,6.9506e+05,0.1229
106.9941,813,1.2613e+06,5.6669e+05,6.9456e+05,0.1244
107.1241,814,1.2599e+06,5.6581e+05,6.9407e+05,0.1225
107.2572,815,1.2585e+06,5.6494e+05,6.9357e+05,0.1257
107.3902,816,1.2571e+06,5.6407e+05,6.9307e+05,0.1241
107.5253,817,1.2558e+06,5.6320e+05,6.9258e+05,0.1273
107.6553,818,1.2544e+06,5.6235e+05,6.9207e+05,0.1229
107.7891,819,1.2531e+06,5.6151e+05,6.9157e+05,0.1258
107.9182,820,1.2517e+06,5.6068e+05,6.9105e+05,0.1220
108.0514,821,1.2504e+06,5.5986e+05,6.9053e+05,0.1260
108.1802,822,1.2491e+06,5.5903e+05,6.9002e+05,0.1215
108.3118,823,1.2477e+06,5.5821e+05,6.8951e+05,0.1243
108.4420,824,1.2464e+06,5.5738e+05,6.8900e+05,0.1229
108.5725,825,1.2451e+06,5.5656e+05,6.8850e+05,0.1236
108.7054,826,1.2437e+06,5.5575e+05,6.8798e+05,0.1260
108.8368,827,1.2424e+06,5.5495e+05,6.8747e+05,0.1240
108.9680,828,1.2411e+06,5.5416e+05,6.8694e+05,0.1241
109.0980,829,1.2398e+06,5.5338e+05,6.8642e+05,0.1229
109.2298,830,1.2385e+06,5.5259e+05,6.8591e+05,0.1245
109.3612,831,1.2372e+06,5.5179e+05,6.8540e+05,0.1245
109.4931,832,1.2359e+06,5.5100e+05,6.8490e+05,0.1247
109.6229,833,1.2346e+06,5.5020e+05,6.8439e+05,0.1228
109.7609,834,1.2333e+06,5.4941e+05,6.8388e+05,0.1309
109.8931,835,1.2320e+06,5.4865e+05,6.8336e+05,0.1248
110.0237,836,1.2307e+06,5.4789e+05,6.8284e+05,0.1237
110.1542,837,1.2295e+06,5.4713e+05,6.8233e+05,0.1235
110.2853,838,1.2282e+06,5.4637e+05,6.8183e+05,0.1242
110.4179,839,1.2269e+06,5.4560e+05,6.8134e+05,0.1250
110.5491,840,1.2257e+06,5.4482e+05,6.8086e+05,0.1241
110.6780,841,1.2244e+06,5.4405e+05,6.8038e+05,0.1220
110.8107,842,1.2232e+06,5.4329e+05,6.7989e+05,0.1255
110.9402,843,1.2219e+06,5.4253e+05,6.7940e+05,0.1224
111.0721,844,1.2207e+06,5.4177e+05,6.7891e+05,0.1248
111.2013,845,1.2194e+06,5.4101e+05,6.7843e+05,0.1222
111.3344,846,1.2182e+06,5.4025e+05,6.7796e+05,0.1260
111.4640,847,1.2170e+06,5.3948e+05,6.7750e+05,0.1223
111.5950,848,1.2158e+06,5.3870e+05,6.7705e+05,0.1240
111.7276,849,1.2145e+06,5.3792e+05,6.7660e+05,0.1253
111.8594,850,1.2133e+06,5.3715e+05,6.7614e+05,0.1243
111.9897,851,1.2121e+06,5.3638e+05,6.7568e+05,0.1232
112.1196,852,1.2108e+06,5.3561e+05,6.7523e+05,0.1231
112.2512,853,1.2096e+06,5.3484e+05,6.7477e+05,0.1246
112.3812,854,1.2084e+06,5.3407e+05,6.7432e+05,0.1230
112.5154,855,1.2072e+06,5.3331e+05,6.7387e+05,0.1270
112.6454,856,1.2060e+06,5.3256e+05,6.7340e+05,0.1227
112.7764,857,1.2048e+06,5.3184e+05,6.7293e+05,0.1239
112.9058,858,1.2036e+06,5.3112e+05,6.7246e+05,0.1224
113.0391,859,1.2024e+06,5.3042e+05,6.7198e+05,0.1261
113.1678,860,1.2012e+06,5.2970e+05,6.7151e+05,0.1218
113.2996,861,1.2000e+06,5.2898e+05,6.7104e+05,0.1245
113.4319,862,1.1988e+06,5.2827e+05,6.7058e+05,0.1253
113.5656,863,1.1977e+06,5.2756e+05,6.7011e+05,0.1257
113.6942,864,1.1965e+06,5.2685e+05,6.6965e+05,0.1216
113.8251,865,1.1953e+06,5.2615e+05,6.6918e+05,0.1239
113.9573,866,1.1942e+06,5.2547e+05,6.6871e+05,0.1253
114.0886,867,1.1930e+06,5.2479e+05,6.6823e+05,0.1239
114.2201,868,1.1919e+06,5.2410e+05,6.6776e+05,0.1244
114.3515,869,1.1907e+06,5.2340e+05,6.6730e+05,0.1244
114.4825,870,1.1896e+06,5.2270e+05,6.6686e+05,0.1231
114.6126,871,1.1884e+06,5.2200e+05,6.6641e+05,0.1229
114.7441,872,1.1873e+06,5.2130e+05,6.6597e+05,0.1243
114.8747,873,1.1861e+06,5.2060e+05,6.6553e+05,0.1234
115.0083,874,1.1850e+06,5.1992e+05,6.6507e+05,0.1263
115.1403,875,1.1839e+06,5.1924e+05,6.6462e+05,0.1251
115.2738,876,1.1827e+06,5.1858e+05,6.6416e+05,0.1262
115.4069,877,1.1816e+06,5.1791e+05,6.6370e+05,0.1260
115.5385,878,1.1805e+06,5.1723e+05,6.6325e+05,0.1241
115.6714,879,1.1794e+06,5.1656e+05,6.6281e+05,0.1254
115.8011,880,1.1783e+06,5.1589e+05,6.6236e+05,0.1228
115.9329,881,1.1771e+06,5.1523e+05,6.6191e+05,0.1248
116.0628,882,1.1760e+06,5.1458e+05,6.6146e+05,0.1230
116.1926,883,1.1749e+06,5.1392e+05,6.6101e+05,0.1229
116.3234,884,1.1738e+06,5.1326e+05,6.6058e+05,0.1235
116.4537,885,1.1727e+06,5.1258e+05,6.6015e+05,0.1233
116.5861,886,1.1716e+06,5.1189e+05,6.5974e+05,0.1252
116.7150,887,1.1705e+06,5.1122e+05,6.5932e+05,0.1219
116.8481,888,1.1695e+06,5.1055e+05,6.5890e+05,0.1259
116.9770,889,1.1684e+06,5.0990e+05,6.5848e+05,0.1219
117.1096,890,1.1673e+06,5.0925e+05,6.5805e+05,0.1254
117.2391,891,1.1662e+06,5.0859e+05,6.5764e+05,0.1224
117.3702,892,1.1652e+06,5.0792e+05,6.5723e+05,0.1242
117.5017,893,1.1641e+06,5.0725e+05,6.5684e+05,0.1245
117.6330,894,1.1630e+06,5.0657e+05,6.5646e+05,0.1242
117.7662,895,1.1620e+06,5.0589e+05,6.5607e+05,0.1254
117.8981,896,1.1609e+06,5.0524e+05,6.5567e+05,0.1244
118.0287,897,1.1598e+06,5.0459e+05,6.5526e+05,0.1235
118.1597,898,1.1588e+06,5.0395e+05,6.5486e+05,0.1240
118.2915,899,1.1578e+06,5.0330e+05,6.5446e+05,0.1246
118.4238,900,1.1567e+06,5.0266e+05,6.5406e+05,0.1251
118.5568,901,1.1557e+06,5.0201e+05,6.5366e+05,0.1247
118.6906,902,1.1546e+06,5.0138e+05,6.5327e+05,0.1264
118.8213,903,1.1536e+06,5.0076e+05,6.5286e+05,0.1232
118.9548,904,1.1526e+06,5.0016e+05,6.5244e+05,0.1259
119.0853,905,1.1516e+06,4.9957e+05,6.5202e+05,0.1235
119.2187,906,1.1506e+06,4.9898e+05,6.5160e+05,0.1255
119.3473,907,1.1496e+06,4.9838e+05,6.5118e+05,0.1217
119.4790,908,1.1486e+06,4.9778e+05,6.5078e+05,0.1244
119.6094,909,1.1475e+06,4.9717e+05,6.5037e+05,0.1231
119.7408,910,1.1465e+06,4.9658e+05,6.4996e+05,0.1243
119.8719,911,1.1455e+06,4.9600e+05,6.4954e+05,0.1241
120.0018,912,1.1445e+06,4.9542e+05,6.4912e+05,0.1231
120.1337,913,1.1435e+06,4.9484e+05,6.4870e+05,0.1245
120.2625,914,1.1426e+06,4.9426e+05,6.4830e+05,0.1217
120.3956,915,1.1416e+06,4.9365e+05,6.4791e+05,0.1259
120.5254,916,1.1406e+06,4.9304e+05,6.4753e+05,0.1229
120.6585,917,1.1396e+06,4.9244e+05,6.4714e+05,0.1255
120.7872,918,1.1386e+06,4.9185e+05,6.4675e+05,0.1217
120.9195,919,1.1376e+06,4.9127e+05,6.4635e+05,0.1248
121.0494,920,1.1366e+06,4.9070e+05,6.4595e+05,0.1223
121.1811,921,1.1357e+06,4.9011e+05,6.4556e+05,0.1246
121.3118,922,1.1347e+06,4.8952e+05,6.4519e+05,0.1235
121.4447,923,1.1337e+06,4.8891e+05,6.4482e+05,0.1255
121.5750,924,1.1328e+06,4.8831e+05,6.4446e+05,0.1228
121.7066,925,1.1318e+06,4.8773e+05,6.4408e+05,0.1244
121.8376,926,1.1309e+06,4.8716e+05,6.4369e+05,0.1240
121.9689,927,1.1299e+06,4.8660e+05,6.4329e+05,0.1242
122.1009,928,1.1289e+06,4.8605e+05,6.4289e+05,0.1248
122.2326,929,1.1280e+06,4.8548e+05,6.4250e+05,0.1245
122.3641,930,1.1270e+06,4.8492e+05,6.4212e+05,0.1245
122.4947,931,1.1261e+06,4.8435e+05,6.4173e+05,0.1236
122.6261,932,1.1251e+06,4.8381e+05,6.4133e+05,0.1242
122.7559,933,1.1242e+06,4.8328e+05,6.4093e+05,0.1227
122.8887,934,1.1233e+06,4.8276e+05,6.4052e+05,0.1254
123.0189,935,1.1224e+06,4.8223e+05,6.4012e+05,0.1227
123.1533,936,1.1214e+06,4.8169e+05,6.3974e+05,0.1270
123.2853,937,1.1205e+06,4.8113e+05,6.3937e+05,0.1247
123.4184,938,1.1196e+06,4.8058e+05,6.3900e+05,0.1259
123.5545,939,1.1187e+06,4.8003e+05,6.3863e+05,0.1289
123.6853,940,1.1177e+06,4.7949e+05,6.3825e+05,0.1235
123.8202,941,1.1168e+06,4.7896e+05,6.3786e+05,0.1271
123.9509,942,1.1159e+06,4.7843e+05,6.3748e+05,0.1234
124.0832,943,1.1150e+06,4.7789e+05,6.3710e+05,0.1251
124.2127,944,1.1141e+06,4.7733e+05,6.3674e+05,0.1222
124.3446,945,1.1132e+06,4.7676e+05,6.3639e+05,0.1245
124.4746,946,1.1122e+06,4.7620e+05,6.3605e+05,0.1227
124.6094,947,1.1113e+06,4.7565e+05,6.3569e+05,0.1249
124.7392,948,1.1104e+06,4.7511e+05,6.3533e+05,0.1226
124.8715,949,1.1095e+06,4.7457e+05,6.3496e+05,0.1249
125.0005,950,1.1086e+06,4.7403e+05,6.3460e+05,0.1220
125.1337,951,1.1077e+06,4.7348e+05,6.3425e+05,0.1257
125.2622,952,1.1068e+06,4.7291e+05,6.3391e+05,0.1215
125.3936,953,1.1059e+06,4.7235e+05,6.3358e+05,0.1242
125.5254,954,1.1050e+06,4.7179e+05,6.3324e+05,0.1244
125.6576,955,1.1041e+06,4.7125e+05,6.3289e+05,0.1247
125.7890,956,1.1033e+06,4.7073e+05,6.3253e+05,0.1237
125.9212,957,1.1024e+06,4.7021e+05,6.3217e+05,0.1242
126.0512,958,1.1015e+06,4.6969e+05,6.3182e+05,0.1228
126.1808,959,1.1006e+06,4.6916e+05,6.3149e+05,0.1224
126.3121,960,1.0998e+06,4.6861e+05,6.3116e+05,0.1240
126.4421,961,1.0989e+06,4.6807e+05,6.3083e+05,0.1220
126.5744,962,1.0980e+06,4.6754e+05,6.3048e+05,0.1252
126.7036,963,1.0972e+06,4.6703e+05,6.3012e+05,0.1221
126.8368,964,1.0963e+06,4.6651e+05,6.2977e+05,0.1260
126.9668,965,1.0954e+06,4.6599e+05,6.2942e+05,0.1226
127.1000,966,1.0945e+06,4.6546e+05,6.2908e+05,0.1258
127.2290,967,1.0937e+06,4.6492e+05,6.2875e+05,0.1221
127.3615,968,1.0928e+06,4.6439e+05,6.2841e+05,0.1254
127.4910,969,1.0919e+06,4.6387e+05,6.2807e+05,0.1224
127.6225,970,1.0911e+06,4.6337e+05,6.2770e+05,0.1245
127.7535,971,1.0902e+06,4.6289e+05,6.2733e+05,0.1238
127.8844,972,1.0894e+06,4.6240e+05,6.2696e+05,0.1239
128.0164,973,1.0885e+06,4.6190e+05,6.2661e+05,0.1249
128.1470,974,1.0877e+06,4.6139e+05,6.2627e+05,0.1235
128.2782,975,1.0868e+06,4.6089e+05,6.2592e+05,0.1240
128.4082,976,1.0860e+06,4.6041e+05,6.2557e+05,0.1231
128.5404,977,1.0851e+06,4.5994e+05,6.2520e+05,0.1252
128.6704,978,1.0843e+06,4.5948e+05,6.2483e+05,0.1228
128.8041,979,1.0835e+06,4.5901e+05,6.2446e+05,0.1261
128.9341,980,1.0826e+06,4.5853e+05,6.2411e+05,0.1226
129.0654,981,1.0818e+06,4.5804e+05,6.2378e+05,0.1243
129.1943,982,1.0810e+06,4.5753e+05,6.2347e+05,0.1219
129.3264,983,1.0802e+06,4.5704e+05,6.2314e+05,0.1250
129.4551,984,1.0794e+06,4.5656e+05,6.2281e+05,0.1217
129.5862,985,1.0786e+06,4.5608e+05,6.2247e+05,0.1241
129.7188,986,1.0777e+06,4.5559e+05,6.2215e+05,0.1254
129.8561,987,1.0769e+06,4.5507e+05,6.2186e+05,0.1243
129.9859,988,1.0761e+06,4.5454e+05,6.2158e+05,0.1225
130.1205,989,1.0753e+06,4.5400e+05,6.2130e+05,0.1271
130.2516,990,1.0745e+06,4.5348e+05,6.2102e+05,0.1239
130.3843,991,1.0737e+06,4.5298e+05,6.2072e+05,0.1254
130.5133,992,1.0729e+06,4.5249e+05,6.2040e+05,0.1221
130.6492,993,1.0721e+06,4.5201e+05,6.2008e+05,0.1282
130.7817,994,1.0713e+06,4.5152e+05,6.1977e+05,0.1250
130.9153,995,1.0705e+06,4.5102e+05,6.1947e+05,0.1255
131.0488,996,1.0697e+06,4.5052e+05,6.1917e+05,0.1259
131.1789,997,1.0689e+06,4.5005e+05,6.1885e+05,0.1225
131.3116,998,1.0681e+06,4.4959e+05,6.1851e+05,0.1253
131.4409,999,1.0673e+06,4.4916e+05,6.1816e+05,0.1221
