run_time,iteration,loss,style_loss,content_loss,time
0.1234,0,7.0098e+08,7.0098e+08,0.0000e+00,0.1234
0.2563,1,5.8354e+08,5.8321e+08,3.2233e+05,0.1243
0.3879,2,4.2067e+08,4.2010e+08,5.7330e+05,0.1236
0.5202,3,2.8710e+08,2.8624e+08,8.6170e+05,0.1247
0.6562,4,2.1649e+08,2.1532e+08,1.1699e+06,0.1289
0.7847,5,1.7980e+08,1.7839e+08,1.4052e+06,0.1213
0.9173,6,1.5595e+08,1.5441e+08,1.5354e+06,0.1255
1.0483,7,1.4419e+08,1.4258e+08,1.6076e+06,0.1238
1.1804,8,1.3732e+08,1.3564e+08,1.6771e+06,0.1247
1.3098,9,1.3154e+08,1.2979e+08,1.7515e+06,0.1224
1.4397,10,1.2593e+08,1.2411e+08,1.8192e+06,0.1228
1.5708,11,1.2006e+08,1.1818e+08,1.8780e+06,0.1236
1.7008,12,1.1362e+08,1.1170e+08,1.9211e+06,0.1229
1.8324,13,1.0662e+08,1.0468e+08,1.9481e+06,0.1241
1.9615,14,9.9497e+07,9.7536e+07,1.9606e+06,0.1220
2.0945,15,9.2677e+07,9.0718e+07,1.9585e+06,0.1258
2.2233,16,8.6510e+07,8.4565e+07,1.9450e+06,0.1217
2.3548,17,8.0995e+07,7.9067e+07,1.9277e+06,0.1242
2.4846,18,7.6052e+07,7.4141e+07,1.9115e+06,0.1227
2.6174,19,7.1586e+07,6.9686e+07,1.8994e+06,0.1247
2.7490,20,6.7550e+07,6.5656e+07,1.8938e+06,0.1240
2.8822,21,6.3997e+07,6.2101e+07,1.8953e+06,0.1252
3.0142,22,6.0946e+07,5.9044e+07,1.9017e+06,0.1242
3.1455,23,5.8369e+07,5.6458e+07,1.9106e+06,0.1241
3.2762,24,5.6158e+07,5.4238e+07,1.9204e+06,0.1233
3.4057,25,5.4205e+07,5.2276e+07,1.9292e+06,0.1226
3.5376,26,5.2455e+07,5.0522e+07,1.9334e+06,0.1244
3.6678,27,5.0878e+07,4.8945e+07,1.9332e+06,0.1233
3.8003,28,4.9490e+07,4.7562e+07,1.9284e+06,0.1250
3.9295,29,4.8309e+07,4.6389e+07,1.9205e+06,0.1224
4.0637,30,4.7312e+07,4.5402e+07,1.9096e+06,0.1264
4.1961,31,4.6446e+07,4.4549e+07,1.8964e+06,0.1223
4.3280,32,4.5637e+07,4.3754e+07,1.8829e+06,0.1245
4.4567,33,4.4834e+07,4.2963e+07,1.8709e+06,0.1215
4.5887,34,4.4010e+07,4.2150e+07,1.8600e+06,0.1243
4.7185,35,4.3167e+07,4.1316e+07,1.8509e+06,0.1227
4.8506,36,4.2347e+07,4.0503e+07,1.8448e+06,0.1250
4.9815,37,4.1576e+07,3.9736e+07,1.8405e+06,0.1240
5.1147,38,4.0878e+07,3.9040e+07,1.8379e+06,0.1254
5.2451,39,4.0259e+07,3.8423e+07,1.8359e+06,0.1233
5.3761,40,3.9694e+07,3.7860e+07,1.8341e+06,0.1238
5.5071,41,3.9172e+07,3.7340e+07,1.8317e+06,0.1235
5.6391,42,3.8678e+07,3.6850e+07,1.8279e+06,0.1246
5.7702,43,3.8198e+07,3.6376e+07,1.8226e+06,0.1228
5.9012,44,3.7723e+07,3.5907e+07,1.8161e+06,0.1238
6.0310,45,3.7256e+07,3.5448e+07,1.8082e+06,0.1227
6.1605,46,3.6794e+07,3.4995e+07,1.7989e+06,0.1223
6.2930,47,3.6330e+07,3.4542e+07,1.7884e+06,0.1253
6.4224,48,3.5864e+07,3.4087e+07,1.7777e+06,0.1223
6.5553,49,3.5388e+07,3.3621e+07,1.7667e+06,0.1255
6.6835,50,3.4905e+07,3.3149e+07,1.7560e+06,0.1212
6.8156,51,3.4425e+07,3.2679e+07,1.7453e+06,0.1247
6.9460,52,3.3953e+07,3.2219e+07,1.7344e+06,0.1232
7.0785,53,3.3483e+07,3.1759e+07,1.7239e+06,0.1245
7.2086,54,3.3015e+07,3.1301e+07,1.7139e+06,0.1232
7.3395,55,3.2552e+07,3.0847e+07,1.7047e+06,0.1238
7.4693,56,3.2094e+07,3.0398e+07,1.6961e+06,0.1232
7.5987,57,3.1641e+07,2.9953e+07,1.6882e+06,0.1222
7.7334,58,3.1201e+07,2.9520e+07,1.6809e+06,0.1275
7.8647,59,3.0772e+07,2.9097e+07,1.6749e+06,0.1239
7.9962,60,3.0361e+07,2.8691e+07,1.6700e+06,0.1241
8.1257,61,2.9968e+07,2.8302e+07,1.6659e+06,0.1222
8.2579,62,2.9598e+07,2.7936e+07,1.6623e+06,0.1249
8.3865,63,2.9247e+07,2.7587e+07,1.6594e+06,0.1215
8.5208,64,2.8907e+07,2.7250e+07,1.6571e+06,0.1270
8.6538,65,2.8576e+07,2.6921e+07,1.6547e+06,0.1261
8.7865,66,2.8248e+07,2.6596e+07,1.6519e+06,0.1256
8.9201,67,2.7918e+07,2.6269e+07,1.6488e+06,0.1254
9.0522,68,2.7590e+07,2.5944e+07,1.6451e+06,0.1248
9.1816,69,2.7265e+07,2.5624e+07,1.6408e+06,0.1223
9.3122,70,2.6944e+07,2.5308e+07,1.6358e+06,0.1237
9.4407,71,2.6627e+07,2.4997e+07,1.6301e+06,0.1217
9.5720,72,2.6314e+07,2.4691e+07,1.6237e+06,0.1245
9.7021,73,2.6007e+07,2.4390e+07,1.6170e+06,0.1233
9.8327,74,2.5703e+07,2.4093e+07,1.6103e+06,0.1237
9.9641,75,2.5401e+07,2.3797e+07,1.6037e+06,0.1244
10.0936,76,2.5102e+07,2.3505e+07,1.5975e+06,0.1223
10.2262,77,2.4810e+07,2.3218e+07,1.5919e+06,0.1254
10.3546,78,2.4523e+07,2.2936e+07,1.5870e+06,0.1218
10.4966,79,2.4241e+07,2.2658e+07,1.5832e+06,0.1351
10.6290,80,2.3967e+07,2.2386e+07,1.5806e+06,0.1250
10.7575,81,2.3698e+07,2.2119e+07,1.5788e+06,0.1215
10.8893,82,2.3438e+07,2.1860e+07,1.5778e+06,0.1245
11.0204,83,2.3185e+07,2.1607e+07,1.5777e+06,0.1240
11.1512,84,2.2938e+07,2.1359e+07,1.5781e+06,0.1237
11.2820,85,2.2695e+07,2.1117e+07,1.5785e+06,0.1237
11.4113,86,2.2457e+07,2.0878e+07,1.5788e+06,0.1226
11.5438,87,2.2222e+07,2.0644e+07,1.5786e+06,0.1252
11.6741,88,2.1989e+07,2.0412e+07,1.5776e+06,0.1236
11.8085,89,2.1758e+07,2.0182e+07,1.5756e+06,0.1256
11.9372,90,2.1528e+07,1.9956e+07,1.5725e+06,0.1220
12.0693,91,2.1303e+07,1.9734e+07,1.5685e+06,0.1251
12.2024,92,2.1081e+07,1.9517e+07,1.5636e+06,0.1263
12.3334,93,2.0863e+07,1.9305e+07,1.5580e+06,0.1240
12.4623,94,2.0650e+07,1.9098e+07,1.5520e+06,0.1221
12.5949,95,2.0442e+07,1.8896e+07,1.5460e+06,0.1256
12.7258,96,2.0237e+07,1.8697e+07,1.5407e+06,0.1242
12.8609,97,2.0034e+07,1.8498e+07,1.5363e+06,0.1261
12.9946,98,1.9832e+07,1.8299e+07,1.5326e+06,0.1219
13.1249,99,1.9627e+07,1.8097e+07,1.5299e+06,0.1233
13.2546,100,1.9422e+07,1.7893e+07,1.5283e+06,0.1227
13.3885,101,1.9217e+07,1.7689e+07,1.5273e+06,0.1236
13.5187,102,1.9016e+07,1.7489e+07,1.5268e+06,0.1230
13.6506,103,1.8819e+07,1.7293e+07,1.5265e+06,0.1250
13.7802,104,1.8630e+07,1.7104e+07,1.5262e+06,0.1224
13.9117,105,1.8445e+07,1.6919e+07,1.5255e+06,0.1242
14.0406,106,1.8262e+07,1.6738e+07,1.5243e+06,0.1218
14.1723,107,1.8080e+07,1.6558e+07,1.5223e+06,0.1248
14.3023,108,1.7898e+07,1.6379e+07,1.5194e+06,0.1226
14.4341,109,1.7715e+07,1.6199e+07,1.5155e+06,0.1243
14.5651,110,1.7531e+07,1.6020e+07,1.5108e+06,0.1238
14.6961,111,1.7347e+07,1.5842e+07,1.5055e+06,0.1238
14.8297,112,1.7168e+07,1.5668e+07,1.4998e+06,0.1262
14.9612,113,1.6993e+07,1.5499e+07,1.4940e+06,0.1243
15.0915,114,1.6822e+07,1.5333e+07,1.4883e+06,0.1233
15.2216,115,1.6655e+07,1.5172e+07,1.4832e+06,0.1229
15.3535,116,1.6491e+07,1.5012e+07,1.4785e+06,0.1248
15.4825,117,1.6329e+07,1.4854e+07,1.4745e+06,0.1221
15.6141,118,1.6169e+07,1.4697e+07,1.4713e+06,0.1246
15.7427,119,1.6010e+07,1.4542e+07,1.4688e+06,0.1219
15.8761,120,1.5855e+07,1.4388e+07,1.4667e+06,0.1262
16.0060,121,1.5701e+07,1.4236e+07,1.4650e+06,0.1229
16.1385,122,1.5551e+07,1.4088e+07,1.4635e+06,0.1255
16.2684,123,1.5404e+07,1.3942e+07,1.4621e+06,0.1227
16.4000,124,1.5258e+07,1.3798e+07,1.4604e+06,0.1243
16.5315,125,1.5115e+07,1.3656e+07,1.4585e+06,0.1248
16.6632,126,1.4973e+07,1.3517e+07,1.4562e+06,0.1247
16.7962,127,1.4832e+07,1.3378e+07,1.4535e+06,0.1249
16.9290,128,1.4691e+07,1.3241e+07,1.4503e+06,0.1255
17.0586,129,1.4551e+07,1.3105e+07,1.4467e+06,0.1221
17.1898,130,1.4413e+07,1.2970e+07,1.4429e+06,0.1244
17.3232,131,1.4275e+07,1.2836e+07,1.4391e+06,0.1260
17.4568,132,1.4139e+07,1.2704e+07,1.4353e+06,0.1263
17.5884,133,1.4004e+07,1.2573e+07,1.4316e+06,0.1245
17.7211,134,1.3872e+07,1.2444e+07,1.4282e+06,0.1253
17.8501,135,1.3742e+07,1.2317e+07,1.4253e+06,0.1220
17.9840,136,1.3615e+07,1.2192e+07,1.4227e+06,0.1269
18.1133,137,1.3491e+07,1.2070e+07,1.4206e+06,0.1222
18.2444,138,1.3369e+07,1.1950e+07,1.4189e+06,0.1240
18.3747,139,1.3250e+07,1.1832e+07,1.4175e+06,0.1236
18.5036,140,1.3131e+07,1.1715e+07,1.4164e+06,0.1223
18.6351,141,1.3014e+07,1.1599e+07,1.4154e+06,0.1246
18.7634,142,1.2897e+07,1.1482e+07,1.4144e+06,0.1215
18.8970,143,1.2780e+07,1.1367e+07,1.4133e+06,0.1268
19.0270,144,1.2666e+07,1.1253e+07,1.4121e+06,0.1233
19.1603,145,1.2553e+07,1.1142e+07,1.4109e+06,0.1257
19.2908,146,1.2442e+07,1.1033e+07,1.4095e+06,0.1236
19.4245,147,1.2333e+07,1.0925e+07,1.4079e+06,0.1264
19.5547,148,1.2225e+07,1.0819e+07,1.4064e+06,0.1229
19.6870,149,1.2117e+07,1.0712e+07,1.4048e+06,0.1250
19.8175,150,1.2010e+07,1.0606e+07,1.4032e+06,0.1235
19.9503,151,1.1902e+07,1.0501e+07,1.4016e+06,0.1248
20.0801,152,1.1795e+07,1.0395e+07,1.3999e+06,0.1227
20.2119,153,1.1689e+07,1.0291e+07,1.3981e+06,0.1248
20.3433,154,1.1584e+07,1.0188e+07,1.3961e+06,0.1239
20.4756,155,1.1481e+07,1.0087e+07,1.3940e+06,0.1252
20.6051,156,1.1379e+07,9.9872e+06,1.3919e+06,0.1227
20.7362,157,1.1279e+07,9.8892e+06,1.3898e+06,0.1242
20.8673,158,1.1180e+07,9.7923e+06,1.3876e+06,0.1243
20.9992,159,1.1082e+07,9.6966e+06,1.3854e+06,0.1242
21.1321,160,1.0985e+07,9.6018e+06,1.3832e+06,0.1261
21.2625,161,1.0890e+07,9.5085e+06,1.3812e+06,0.1235
21.3931,162,1.0797e+07,9.4172e+06,1.3795e+06,0.1240
21.5231,163,1.0706e+07,9.3276e+06,1.3779e+06,0.1231
21.6548,164,1.0616e+07,9.2394e+06,1.3765e+06,0.1245
21.7857,165,1.0527e+07,9.1522e+06,1.3753e+06,0.1241
21.9182,166,1.0439e+07,9.0652e+06,1.3742e+06,0.1252
22.0475,167,1.0351e+07,8.9779e+06,1.3732e+06,0.1223
22.1797,168,1.0263e+07,8.8906e+06,1.3723e+06,0.1252
22.3080,169,1.0175e+07,8.8040e+06,1.3712e+06,0.1216
22.4387,170,1.0088e+07,8.7181e+06,1.3700e+06,0.1239
22.5704,171,1.0002e+07,8.6332e+06,1.3685e+06,0.1242
22.6999,172,9.9166e+06,8.5497e+06,1.3669e+06,0.1226
22.8317,173,9.8326e+06,8.4676e+06,1.3650e+06,0.1246
22.9618,174,9.7498e+06,8.3869e+06,1.3628e+06,0.1231
23.0949,175,9.6680e+06,8.3077e+06,1.3604e+06,0.1250
23.2236,176,9.5873e+06,8.2296e+06,1.3577e+06,0.1217
23.3559,177,9.5078e+06,8.1529e+06,1.3549e+06,0.1253
23.4845,178,9.4297e+06,8.0777e+06,1.3521e+06,0.1217
23.6181,179,9.3533e+06,8.0041e+06,1.3492e+06,0.1267
23.7483,180,9.2785e+06,7.9319e+06,1.3466e+06,0.1233
23.8816,181,9.2047e+06,7.8605e+06,1.3442e+06,0.1262
24.0121,182,9.1321e+06,7.7901e+06,1.3420e+06,0.1236
24.1467,183,9.0602e+06,7.7202e+06,1.3400e+06,0.1264
24.2770,184,8.9890e+06,7.6508e+06,1.3382e+06,0.1227
24.4094,185,8.9185e+06,7.5819e+06,1.3366e+06,0.1249
24.5404,186,8.8486e+06,7.5136e+06,1.3350e+06,0.1243
24.6793,187,8.7793e+06,7.4458e+06,1.3334e+06,0.1320
24.8104,188,8.7102e+06,7.3785e+06,1.3317e+06,0.1237
24.9420,189,8.6414e+06,7.3116e+06,1.3298e+06,0.1248
25.0720,190,8.5728e+06,7.2452e+06,1.3276e+06,0.1227
25.2031,191,8.5048e+06,7.1796e+06,1.3252e+06,0.1243
25.3322,192,8.4375e+06,7.1149e+06,1.3225e+06,0.1223
25.4656,193,8.3711e+06,7.0514e+06,1.3197e+06,0.1260
25.5953,194,8.3058e+06,6.9891e+06,1.3168e+06,0.1230
25.7288,195,8.2419e+06,6.9281e+06,1.3138e+06,0.1263
25.8589,196,8.1791e+06,6.8683e+06,1.3108e+06,0.1232
25.9931,197,8.1171e+06,6.8092e+06,1.3079e+06,0.1271
26.1214,198,8.0558e+06,6.7505e+06,1.3053e+06,0.1215
26.2548,199,7.9951e+06,6.6922e+06,1.3029e+06,0.1262
26.3849,200,7.9348e+06,6.6342e+06,1.3006e+06,0.1230
26.5212,201,7.8753e+06,6.5769e+06,1.2984e+06,0.1257
26.6514,202,7.8170e+06,6.5205e+06,1.2964e+06,0.1234
26.7920,203,7.7598e+06,6.4652e+06,1.2946e+06,0.1334
26.9256,204,7.7038e+06,6.4111e+06,1.2927e+06,0.1261
27.0549,205,7.6486e+06,6.3578e+06,1.2908e+06,0.1221
27.1860,206,7.5940e+06,6.3052e+06,1.2888e+06,0.1242
27.3152,207,7.5391e+06,6.2527e+06,1.2865e+06,0.1224
27.4463,208,7.4842e+06,6.2001e+06,1.2840e+06,0.1241
27.5772,209,7.4292e+06,6.1478e+06,1.2814e+06,0.1236
27.7065,210,7.3743e+06,6.0956e+06,1.2787e+06,0.1225
27.8377,211,7.3200e+06,6.0441e+06,1.2759e+06,0.1243
27.9662,212,7.2666e+06,5.9935e+06,1.2731e+06,0.1217
28.0989,213,7.2141e+06,5.9437e+06,1.2704e+06,0.1257
28.2285,214,7.1623e+06,5.8946e+06,1.2678e+06,0.1229
28.3596,215,7.1111e+06,5.8458e+06,1.2653e+06,0.1238
28.4903,216,7.0604e+06,5.7972e+06,1.2631e+06,0.1242
28.6216,217,7.0102e+06,5.7490e+06,1.2612e+06,0.1244
28.7539,218,6.9606e+06,5.7013e+06,1.2594e+06,0.1253
28.8849,219,6.9120e+06,5.6543e+06,1.2577e+06,0.1241
29.0180,220,6.8644e+06,5.6082e+06,1.2561e+06,0.1265
29.1483,221,6.8176e+06,5.5631e+06,1.2545e+06,0.1234
29.2782,222,6.7717e+06,5.5189e+06,1.2528e+06,0.1233
29.4071,223,6.7267e+06,5.4757e+06,1.2510e+06,0.1223
29.5394,224,6.6825e+06,5.4335e+06,1.2490e+06,0.1256
29.6694,225,6.6387e+06,5.3919e+06,1.2468e+06,0.1230
29.8031,226,6.5952e+06,5.3508e+06,1.2444e+06,0.1265
29.9332,227,6.5518e+06,5.3100e+06,1.2419e+06,0.1235
30.0680,228,6.5086e+06,5.2694e+06,1.2392e+06,0.1230
30.1964,229,6.4658e+06,5.2293e+06,1.2365e+06,0.1217
30.3285,230,6.4233e+06,5.1894e+06,1.2339e+06,0.1252
30.4580,231,6.3813e+06,5.1500e+06,1.2314e+06,0.1227
30.5894,232,6.3399e+06,5.1110e+06,1.2290e+06,0.1244
30.7212,233,6.2992e+06,5.0724e+06,1.2268e+06,0.1247
30.8538,234,6.2591e+06,5.0344e+06,1.2248e+06,0.1257
30.9831,235,6.2197e+06,4.9967e+06,1.2230e+06,0.1227
31.1126,236,6.1806e+06,4.9592e+06,1.2213e+06,0.1226
31.2433,237,6.1417e+06,4.9219e+06,1.2198e+06,0.1238
31.3719,238,6.1032e+06,4.8849e+06,1.2182e+06,0.1220
31.5042,239,6.0650e+06,4.8483e+06,1.2167e+06,0.1254
31.6332,240,6.0273e+06,4.8122e+06,1.2151e+06,0.1220
31.7646,241,5.9900e+06,4.7767e+06,1.2134e+06,0.1244
31.8974,242,5.9535e+06,4.7419e+06,1.2115e+06,0.1260
32.0303,243,5.9174e+06,4.7078e+06,1.2096e+06,0.1260
32.1595,244,5.8818e+06,4.6742e+06,1.2076e+06,0.1226
32.2889,245,5.8464e+06,4.6409e+06,1.2055e+06,0.1226
32.4203,246,5.8109e+06,4.6076e+06,1.2033e+06,0.1245
32.5499,247,5.7755e+06,4.5744e+06,1.2011e+06,0.1224
32.6812,248,5.7402e+06,4.5413e+06,1.1989e+06,0.1247
32.8119,249,5.7052e+06,4.5084e+06,1.1967e+06,0.1215
32.9441,250,5.6707e+06,4.4761e+06,1.1945e+06,0.1253
33.0735,251,5.6368e+06,4.4445e+06,1.1923e+06,0.1227
33.2054,252,5.6036e+06,4.4134e+06,1.1902e+06,0.1251
33.3351,253,5.5710e+06,4.3828e+06,1.1881e+06,0.1230
33.4653,254,5.5386e+06,4.3525e+06,1.1860e+06,0.1233
33.5963,255,5.5063e+06,4.3223e+06,1.1840e+06,0.1244
33.7254,256,5.4743e+06,4.2923e+06,1.1820e+06,0.1225
33.8574,257,5.4426e+06,4.2625e+06,1.1800e+06,0.1251
33.9894,258,5.4111e+06,4.2331e+06,1.1781e+06,0.1252
34.1227,259,5.3802e+06,4.2041e+06,1.1761e+06,0.1229
34.2517,260,5.3499e+06,4.1757e+06,1.1742e+06,0.1219
34.3841,261,5.3200e+06,4.1476e+06,1.1723e+06,0.1254
34.5136,262,5.2902e+06,4.1198e+06,1.1705e+06,0.1227
34.6446,263,5.2606e+06,4.0920e+06,1.1686e+06,0.1242
34.7765,264,5.2309e+06,4.0642e+06,1.1667e+06,0.1251
34.9083,265,5.2013e+06,4.0366e+06,1.1647e+06,0.1250
35.0393,266,5.1719e+06,4.0091e+06,1.1627e+06,0.1241
35.1693,267,5.1427e+06,3.9820e+06,1.1607e+06,0.1233
35.3007,268,5.1139e+06,3.9553e+06,1.1586e+06,0.1246
35.4295,269,5.0856e+06,3.9291e+06,1.1565e+06,0.1222
35.5614,270,5.0576e+06,3.9033e+06,1.1543e+06,0.1248
35.6897,271,5.0299e+06,3.8777e+06,1.1522e+06,0.1217
35.8210,272,5.0026e+06,3.8526e+06,1.1500e+06,0.1243
35.9513,273,4.9756e+06,3.8277e+06,1.1479e+06,0.1238
36.0801,274,4.9490e+06,3.8031e+06,1.1459e+06,0.1223
36.2122,275,4.9227e+06,3.7788e+06,1.1439e+06,0.1255
36.3424,276,4.8968e+06,3.7546e+06,1.1421e+06,0.1234
36.4756,277,4.8710e+06,3.7306e+06,1.1404e+06,0.1261
36.6048,278,4.8454e+06,3.7068e+06,1.1387e+06,0.1225
36.7371,279,4.8201e+06,3.6831e+06,1.1370e+06,0.1254
36.8660,280,4.7948e+06,3.6596e+06,1.1352e+06,0.1219
36.9991,281,4.7695e+06,3.6361e+06,1.1334e+06,0.1241
37.1285,282,4.7443e+06,3.6128e+06,1.1315e+06,0.1224
37.2632,283,4.7193e+06,3.5898e+06,1.1295e+06,0.1264
37.3930,284,4.6945e+06,3.5670e+06,1.1275e+06,0.1222
37.5257,285,4.6699e+06,3.5446e+06,1.1253e+06,0.1249
37.6548,286,4.6456e+06,3.5226e+06,1.1231e+06,0.1220
37.7860,287,4.6218e+06,3.5010e+06,1.1208e+06,0.1243
37.9168,288,4.5983e+06,3.4797e+06,1.1186e+06,0.1240
38.0475,289,4.5750e+06,3.4586e+06,1.1164e+06,0.1240
38.1790,290,4.5520e+06,3.4376e+06,1.1144e+06,0.1243
38.3092,291,4.5292e+06,3.4166e+06,1.1126e+06,0.1233
38.4417,292,4.5064e+06,3.3956e+06,1.1109e+06,0.1255
38.5715,293,4.4839e+06,3.3746e+06,1.1093e+06,0.1232
38.7040,294,4.4616e+06,3.3539e+06,1.1078e+06,0.1254
38.8330,295,4.4397e+06,3.3334e+06,1.1063e+06,0.1222
38.9657,296,4.4182e+06,3.3134e+06,1.1048e+06,0.1259
39.0944,297,4.3968e+06,3.2936e+06,1.1033e+06,0.1219
39.2266,298,4.3757e+06,3.2740e+06,1.1016e+06,0.1253
39.3564,299,4.3545e+06,3.2546e+06,1.0999e+06,0.1233
39.4867,300,4.3333e+06,3.2354e+06,1.0980e+06,0.1236
39.6210,301,4.3123e+06,3.2163e+06,1.0960e+06,0.1244
39.7536,302,4.2914e+06,3.1974e+06,1.0939e+06,0.1255
39.8848,303,4.2708e+06,3.1789e+06,1.0919e+06,0.1244
40.0172,304,4.2505e+06,3.1607e+06,1.0898e+06,0.1255
40.1514,305,4.2306e+06,3.1428e+06,1.0878e+06,0.1274
40.2850,306,4.2109e+06,3.1250e+06,1.0859e+06,0.1263
40.4146,307,4.1913e+06,3.1072e+06,1.0842e+06,0.1221
40.5472,308,4.1718e+06,3.0893e+06,1.0826e+06,0.1251
40.6762,309,4.1524e+06,3.0713e+06,1.0811e+06,0.1217
40.8093,310,4.1332e+06,3.0535e+06,1.0797e+06,0.1256
40.9390,311,4.1143e+06,3.0358e+06,1.0784e+06,0.1223
41.0718,312,4.0956e+06,3.0184e+06,1.0772e+06,0.1256
41.2070,313,4.0773e+06,3.0014e+06,1.0759e+06,0.1211
41.3396,314,4.0591e+06,2.9847e+06,1.0744e+06,0.1255
41.4713,315,4.0409e+06,2.9681e+06,1.0729e+06,0.1246
41.6045,316,4.0228e+06,2.9516e+06,1.0712e+06,0.1256
41.7372,317,4.0045e+06,2.9352e+06,1.0693e+06,0.1258
41.8690,318,3.9864e+06,2.9190e+06,1.0673e+06,0.1247
42.0008,319,3.9682e+06,2.9030e+06,1.0653e+06,0.1245
42.1321,320,3.9503e+06,2.8871e+06,1.0632e+06,0.1245
42.2627,321,3.9325e+06,2.8714e+06,1.0611e+06,0.1232
42.3935,322,3.9151e+06,2.8559e+06,1.0591e+06,0.1241
42.5252,323,3.8978e+06,2.8405e+06,1.0573e+06,0.1249
42.6558,324,3.8806e+06,2.8251e+06,1.0555e+06,0.1238
42.7851,325,3.8635e+06,2.8096e+06,1.0539e+06,0.1226
42.9163,326,3.8465e+06,2.7941e+06,1.0524e+06,0.1244
43.0454,327,3.8296e+06,2.7786e+06,1.0509e+06,0.1223
43.1776,328,3.8129e+06,2.7633e+06,1.0496e+06,0.1252
43.3084,329,3.7964e+06,2.7482e+06,1.0482e+06,0.1240
43.4401,330,3.7802e+06,2.7334e+06,1.0468e+06,0.1250
43.5709,331,3.7643e+06,2.7190e+06,1.0453e+06,0.1241
43.7011,332,3.7484e+06,2.7047e+06,1.0438e+06,0.1235
43.8330,333,3.7327e+06,2.6905e+06,1.0421e+06,0.1253
43.9621,334,3.7169e+06,2.6765e+06,1.0404e+06,0.1224
44.0942,335,3.7011e+06,2.6625e+06,1.0386e+06,0.1249
44.2244,336,3.6854e+06,2.6486e+06,1.0367e+06,0.1237
44.3574,337,3.6697e+06,2.6349e+06,1.0348e+06,0.1258
44.4876,338,3.6542e+06,2.6213e+06,1.0329e+06,0.1232
44.6208,339,3.6390e+06,2.6080e+06,1.0310e+06,0.1262
44.7511,340,3.6239e+06,2.5948e+06,1.0291e+06,0.1237
44.8846,341,3.6091e+06,2.5818e+06,1.0273e+06,0.1267
45.0146,342,3.5944e+06,2.5690e+06,1.0255e+06,0.1234
45.1487,343,3.5799e+06,2.5561e+06,1.0237e+06,0.1273
45.2807,344,3.5653e+06,2.5433e+06,1.0220e+06,0.1233
45.4137,345,3.5509e+06,2.5306e+06,1.0203e+06,0.1259
45.5457,346,3.5365e+06,2.5179e+06,1.0186e+06,0.1249
45.6772,347,3.5223e+06,2.5053e+06,1.0169e+06,0.1248
45.8071,348,3.5082e+06,2.4929e+06,1.0153e+06,0.1229
45.9385,349,3.4943e+06,2.4807e+06,1.0137e+06,0.1245
46.0680,350,3.4804e+06,2.4684e+06,1.0120e+06,0.1228
46.2002,351,3.4665e+06,2.4561e+06,1.0103e+06,0.1254
46.3301,352,3.4525e+06,2.4439e+06,1.0086e+06,0.1228
46.4631,353,3.4387e+06,2.4318e+06,1.0069e+06,0.1259
46.5931,354,3.4249e+06,2.4198e+06,1.0051e+06,0.1230
46.7268,355,3.4113e+06,2.4080e+06,1.0033e+06,0.1270
46.8688,356,3.3978e+06,2.3963e+06,1.0015e+06,0.1233
46.9988,357,3.3845e+06,2.3849e+06,9.9967e+05,0.1227
47.1318,358,3.3713e+06,2.3734e+06,9.9790e+05,0.1261
47.2598,359,3.3583e+06,2.3621e+06,9.9619e+05,0.1215
47.3919,360,3.3453e+06,2.3508e+06,9.9453e+05,0.1250
47.5214,361,3.3324e+06,2.3395e+06,9.9293e+05,0.1228
47.6525,362,3.3196e+06,2.3282e+06,9.9142e+05,0.1242
47.7839,363,3.3069e+06,2.3170e+06,9.8998e+05,0.1250
47.9131,364,3.2943e+06,2.3058e+06,9.8858e+05,0.1228
48.0450,365,3.2818e+06,2.2946e+06,9.8719e+05,0.1253
48.1738,366,3.2694e+06,2.2836e+06,9.8583e+05,0.1220
48.3061,367,3.2571e+06,2.2726e+06,9.8445e+05,0.1252
48.4344,368,3.2447e+06,2.2617e+06,9.8306e+05,0.1218
48.5644,369,3.2325e+06,2.2508e+06,9.8163e+05,0.1231
48.6946,370,3.2202e+06,2.2401e+06,9.8018e+05,0.1235
48.8238,371,3.2081e+06,2.2294e+06,9.7867e+05,0.1225
48.9563,372,3.1960e+06,2.2189e+06,9.7713e+05,0.1257
49.0845,373,3.1841e+06,2.2085e+06,9.7561e+05,0.1214
49.2170,374,3.1722e+06,2.1981e+06,9.7412e+05,0.1259
49.3485,375,3.1605e+06,2.1878e+06,9.7269e+05,0.1247
49.4817,376,3.1489e+06,2.1776e+06,9.7132e+05,0.1262
49.6107,377,3.1374e+06,2.1674e+06,9.7000e+05,0.1215
49.7408,378,3.1259e+06,2.1572e+06,9.6871e+05,0.1235
49.8716,379,3.1145e+06,2.1471e+06,9.6745e+05,0.1242
50.0006,380,3.1032e+06,2.1371e+06,9.6618e+05,0.1220
50.1324,381,3.0920e+06,2.1271e+06,9.6490e+05,0.1248
50.2615,382,3.0809e+06,2.1173e+06,9.6358e+05,0.1223
50.3957,383,3.0698e+06,2.1076e+06,9.6222e+05,0.1272
50.5268,384,3.0587e+06,2.0979e+06,9.6080e+05,0.1239
50.6605,385,3.0478e+06,2.0885e+06,9.5932e+05,0.1261
50.7906,386,3.0369e+06,2.0791e+06,9.5777e+05,0.1233
50.9235,387,3.0261e+06,2.0700e+06,9.5617e+05,0.1257
51.0527,388,3.0155e+06,2.0609e+06,9.5456e+05,0.1225
51.1859,389,3.0049e+06,2.0520e+06,9.5296e+05,0.1262
51.3145,390,2.9945e+06,2.0431e+06,9.5139e+05,0.1219
51.4489,391,2.9841e+06,2.0343e+06,9.4985e+05,0.1272
51.5810,392,2.9738e+06,2.0254e+06,9.4837e+05,0.1244
51.7131,393,2.9635e+06,2.0165e+06,9.4693e+05,0.1247
51.8435,394,2.9533e+06,2.0077e+06,9.4554e+05,0.1231
51.9757,395,2.9431e+06,1.9989e+06,9.4417e+05,0.1250
52.1049,396,2.9331e+06,1.9902e+06,9.4283e+05,0.1226
52.2382,397,2.9231e+06,1.9816e+06,9.4148e+05,0.1259
52.3674,398,2.9132e+06,1.9731e+06,9.4010e+05,0.1220
52.4998,399,2.9034e+06,1.9647e+06,9.3868e+05,0.1254
52.6299,400,2.8937e+06,1.9565e+06,9.3722e+05,0.1228
52.7628,401,2.8840e+06,1.9483e+06,9.3572e+05,0.1248
52.8928,402,2.8744e+06,1.9403e+06,9.3418e+05,0.1233
53.0237,403,2.8649e+06,1.9323e+06,9.3263e+05,0.1237
53.1549,404,2.8555e+06,1.9244e+06,9.3108e+05,0.1244
53.2841,405,2.8462e+06,1.9167e+06,9.2954e+05,0.1224
53.4160,406,2.8370e+06,1.9089e+06,9.2803e+05,0.1248
53.5450,407,2.8278e+06,1.9012e+06,9.2657e+05,0.1222
53.6773,408,2.8186e+06,1.8935e+06,9.2514e+05,0.1253
53.8060,409,2.8095e+06,1.8857e+06,9.2375e+05,0.1220
53.9377,410,2.8004e+06,1.8780e+06,9.2239e+05,0.1248
54.0701,411,2.7914e+06,1.8704e+06,9.2105e+05,0.1246
54.2041,412,2.7825e+06,1.8627e+06,9.1972e+05,0.1262
54.3335,413,2.7736e+06,1.8552e+06,9.1840e+05,0.1218
54.4660,414,2.7648e+06,1.8477e+06,9.1708e+05,0.1251
54.5958,415,2.7560e+06,1.8403e+06,9.1576e+05,0.1226
54.7282,416,2.7473e+06,1.8329e+06,9.1443e+05,0.1251
54.8579,417,2.7386e+06,1.8255e+06,9.1309e+05,0.1231
54.9884,418,2.7300e+06,1.8182e+06,9.1175e+05,0.1235
55.1204,419,2.7214e+06,1.8110e+06,9.1042e+05,0.1252
55.2514,420,2.7128e+06,1.8037e+06,9.0907e+05,0.1242
55.3842,421,2.7042e+06,1.7965e+06,9.0772e+05,0.1245
55.5142,422,2.6958e+06,1.7894e+06,9.0638e+05,0.1231
55.6465,423,2.6874e+06,1.7824e+06,9.0502e+05,0.1252
55.7752,424,2.6791e+06,1.7755e+06,9.0365e+05,0.1218
55.9072,425,2.6709e+06,1.7686e+06,9.0227e+05,0.1252
56.0358,426,2.6626e+06,1.7618e+06,9.0089e+05,0.1219
56.1669,427,2.6545e+06,1.7550e+06,8.9950e+05,0.1243
56.2985,428,2.6465e+06,1.7484e+06,8.9811e+05,0.1247
56.4290,429,2.6385e+06,1.7418e+06,8.9672e+05,0.1238
56.5593,430,2.6307e+06,1.7353e+06,8.9535e+05,0.1234
56.6883,431,2.6229e+06,1.7289e+06,8.9402e+05,0.1225
56.8192,432,2.6151e+06,1.7224e+06,8.9271e+05,0.1243
56.9476,433,2.6073e+06,1.7159e+06,8.9140e+05,0.1216
57.0790,434,2.5995e+06,1.7094e+06,8.9010e+05,0.1247
57.2111,435,2.5917e+06,1.7029e+06,8.8878e+05,0.1254
57.3432,436,2.5840e+06,1.6965e+06,8.8746e+05,0.1252
57.4745,437,2.5763e+06,1.6902e+06,8.8614e+05,0.1246
57.6060,438,2.5688e+06,1.6840e+06,8.8482e+05,0.1248
57.7365,439,2.5612e+06,1.6777e+06,8.8350e+05,0.1236
57.8654,440,2.5537e+06,1.6715e+06,8.8218e+05,0.1223
57.9965,441,2.5462e+06,1.6653e+06,8.8087e+05,0.1244
58.1245,442,2.5387e+06,1.6591e+06,8.7958e+05,0.1211
58.2574,443,2.5312e+06,1.6529e+06,8.7833e+05,0.1259
58.3872,444,2.5239e+06,1.6468e+06,8.7710e+05,0.1231
58.5185,445,2.5165e+06,1.6406e+06,8.7589e+05,0.1242
58.6495,446,2.5092e+06,1.6345e+06,8.7470e+05,0.1243
58.7800,447,2.5020e+06,1.6285e+06,8.7352e+05,0.1238
58.9111,448,2.4949e+06,1.6225e+06,8.7234e+05,0.1244
59.0409,449,2.4878e+06,1.6166e+06,8.7114e+05,0.1232
59.1723,450,2.4807e+06,1.6107e+06,8.6993e+05,0.1243
59.3004,451,2.4736e+06,1.6049e+06,8.6870e+05,0.1215
59.4342,452,2.4667e+06,1.5992e+06,8.6745e+05,0.1250
59.5643,453,2.4597e+06,1.5935e+06,8.6620e+05,0.1232
59.6958,454,2.4529e+06,1.5879e+06,8.6495e+05,0.1247
59.8259,455,2.4460e+06,1.5823e+06,8.6372e+05,0.1222
59.9563,456,2.4393e+06,1.5768e+06,8.6252e+05,0.1235
60.0870,457,2.4325e+06,1.5712e+06,8.6134e+05,0.1241
60.2175,458,2.4258e+06,1.5656e+06,8.6019e+05,0.1239
60.3490,459,2.4191e+06,1.5601e+06,8.5907e+05,0.1247
60.4791,460,2.4125e+06,1.5546e+06,8.5797e+05,0.1234
60.6117,461,2.4060e+06,1.5491e+06,8.5686e+05,0.1257
60.7400,462,2.3995e+06,1.5437e+06,8.5576e+05,0.1215
60.8710,463,2.3930e+06,1.5384e+06,8.5466e+05,0.1240
61.0006,464,2.3866e+06,1.5331e+06,8.5352e+05,0.1227
61.1294,465,2.3802e+06,1.5279e+06,8.5236e+05,0.1223
61.2603,466,2.3739e+06,1.5227e+06,8.5117e+05,0.1242
61.3904,467,2.3676e+06,1.5176e+06,8.4999e+05,0.1234
61.5230,468,2.3613e+06,1.5125e+06,8.4881e+05,0.1259
61.6518,469,2.3551e+06,1.5075e+06,8.4767e+05,0.1221
61.7821,470,2.3490e+06,1.5025e+06,8.4656e+05,0.1237
61.9130,471,2.3430e+06,1.4975e+06,8.4551e+05,0.1244
62.0438,472,2.3369e+06,1.4924e+06,8.4450e+05,0.1239
62.1757,473,2.3309e+06,1.4873e+06,8.4354e+05,0.1251
62.3044,474,2.3249e+06,1.4823e+06,8.4261e+05,0.1221
62.4365,475,2.3189e+06,1.4772e+06,8.4169e+05,0.1254
62.5649,476,2.3130e+06,1.4723e+06,8.4077e+05,0.1216
62.6966,477,2.3072e+06,1.4674e+06,8.3982e+05,0.1252
62.8265,478,2.3014e+06,1.4625e+06,8.3884e+05,0.1229
62.9560,479,2.2956e+06,1.4578e+06,8.3781e+05,0.1228
63.0882,480,2.2899e+06,1.4531e+06,8.3675e+05,0.1253
63.2174,481,2.2841e+06,1.4485e+06,8.3567e+05,0.1225
63.3539,482,2.2784e+06,1.4439e+06,8.3457e+05,0.1295
63.4831,483,2.2728e+06,1.4393e+06,8.3347e+05,0.1217
63.6156,484,2.2671e+06,1.4347e+06,8.3238e+05,0.1258
63.7455,485,2.2615e+06,1.4302e+06,8.3131e+05,0.1231
63.8765,486,2.2560e+06,1.4257e+06,8.3026e+05,0.1243
64.0052,487,2.2504e+06,1.4212e+06,8.2923e+05,0.1221
64.1372,488,2.2449e+06,1.4167e+06,8.2824e+05,0.1250
64.2657,489,2.2395e+06,1.4122e+06,8.2726e+05,0.1217
64.3946,490,2.2341e+06,1.4078e+06,8.2628e+05,0.1224
64.5268,491,2.2287e+06,1.4034e+06,8.2529e+05,0.1253
64.6558,492,2.2234e+06,1.3991e+06,8.2428e+05,0.1223
64.7879,493,2.2181e+06,1.3948e+06,8.2325e+05,0.1253
64.9163,494,2.2128e+06,1.3906e+06,8.2222e+05,0.1216
65.0477,495,2.2076e+06,1.3864e+06,8.2119e+05,0.1245
65.1787,496,2.2023e+06,1.3822e+06,8.2016e+05,0.1244
65.3097,497,2.1971e+06,1.3779e+06,8.1914e+05,0.1243
65.4398,498,2.1919e+06,1.3737e+06,8.1813e+05,0.1236
65.5706,499,2.1867e+06,1.3696e+06,8.1715e+05,0.1239
65.7020,500,2.1816e+06,1.3654e+06,8.1620e+05,0.1243
65.8323,501,2.1765e+06,1.3613e+06,8.1527e+05,0.1230
65.9643,502,2.1715e+06,1.3572e+06,8.1435e+05,0.1248
66.0923,503,2.1665e+06,1.3531e+06,8.1344e+05,0.1209
66.2239,504,2.1616e+06,1.3491e+06,8.1251e+05,0.1251
66.3536,505,2.1566e+06,1.3450e+06,8.1158e+05,0.1230
66.4858,506,2.1517e+06,1.3411e+06,8.1064e+05,0.1254
66.6186,507,2.1469e+06,1.3372e+06,8.0971e+05,0.1259
66.7500,508,2.1420e+06,1.3333e+06,8.0877e+05,0.1242
66.8809,509,2.1372e+06,1.3294e+06,8.0784e+05,0.1240
67.0121,510,2.1324e+06,1.3255e+06,8.0692e+05,0.1246
67.1427,511,2.1275e+06,1.3215e+06,8.0600e+05,0.1239
67.2733,512,2.1227e+06,1.3177e+06,8.0508e+05,0.1238
67.4098,513,2.1180e+06,1.3138e+06,8.0416e+05,0.1294
67.5417,514,2.1133e+06,1.3100e+06,8.0325e+05,0.1250
67.6731,515,2.1086e+06,1.3063e+06,8.0234e+05,0.1247
67.8039,516,2.1040e+06,1.3025e+06,8.0141e+05,0.1241
67.9356,517,2.0993e+06,1.2988e+06,8.0049e+05,0.1249
68.0664,518,2.0947e+06,1.2951e+06,7.9957e+05,0.1240
68.1971,519,2.0901e+06,1.2915e+06,7.9864e+05,0.1240
68.3255,520,2.0856e+06,1.2879e+06,7.9772e+05,0.1220
68.4573,521,2.0810e+06,1.2843e+06,7.9679e+05,0.1249
68.5860,522,2.0765e+06,1.2807e+06,7.9586e+05,0.1218
68.7175,523,2.0720e+06,1.2771e+06,7.9491e+05,0.1248
68.8472,524,2.0676e+06,1.2736e+06,7.9395e+05,0.1229
68.9764,525,2.0631e+06,1.2701e+06,7.9297e+05,0.1227
69.1088,526,2.0587e+06,1.2667e+06,7.9198e+05,0.1254
69.2385,527,2.0542e+06,1.2633e+06,7.9097e+05,0.1229
69.3702,528,2.0498e+06,1.2599e+06,7.8994e+05,0.1250
69.4994,529,2.0455e+06,1.2566e+06,7.8891e+05,0.1227
69.6320,530,2.0411e+06,1.2532e+06,7.8789e+05,0.1255
69.7608,531,2.0368e+06,1.2499e+06,7.8688e+05,0.1220
69.8914,532,2.0325e+06,1.2466e+06,7.8589e+05,0.1239
70.0222,533,2.0282e+06,1.2433e+06,7.8493e+05,0.1240
70.1523,534,2.0240e+06,1.2400e+06,7.8400e+05,0.1233
70.2840,535,2.0198e+06,1.2367e+06,7.8309e+05,0.1249
70.4126,536,2.0156e+06,1.2335e+06,7.8219e+05,0.1221
70.5451,537,2.0115e+06,1.2302e+06,7.8130e+05,0.1254
70.6734,538,2.0074e+06,1.2270e+06,7.8041e+05,0.1216
70.8053,539,2.0034e+06,1.2239e+06,7.7949e+05,0.1255
70.9354,540,1.9993e+06,1.2208e+06,7.7854e+05,0.1232
71.0660,541,1.9953e+06,1.2177e+06,7.7757e+05,0.1240
71.1976,542,1.9913e+06,1.2147e+06,7.7658e+05,0.1247
71.3280,543,1.9873e+06,1.2117e+06,7.7559e+05,0.1237
71.4585,544,1.9834e+06,1.2088e+06,7.7461e+05,0.1242
71.5896,545,1.9795e+06,1.2058e+06,7.7367e+05,0.1217
71.7220,546,1.9756e+06,1.2028e+06,7.7275e+05,0.1251
71.8506,547,1.9717e+06,1.1998e+06,7.7187e+05,0.1217
71.9828,548,1.9678e+06,1.1968e+06,7.7103e+05,0.1251
72.1114,549,1.9640e+06,1.1938e+06,7.7021e+05,0.1219
72.2420,550,1.9602e+06,1.1908e+06,7.6940e+05,0.1239
72.3718,551,1.9564e+06,1.1878e+06,7.6859e+05,0.1230
72.5005,552,1.9527e+06,1.1849e+06,7.6777e+05,0.1220
72.6330,553,1.9489e+06,1.1820e+06,7.6694e+05,0.1246
72.7611,554,1.9452e+06,1.1791e+06,7.6608e+05,0.1217
72.8929,555,1.9415e+06,1.1763e+06,7.6520e+05,0.1252
73.0226,556,1.9377e+06,1.1734e+06,7.6431e+05,0.1229
73.1576,557,1.9340e+06,1.1706e+06,7.6341e+05,0.1265
73.2862,558,1.9303e+06,1.1678e+06,7.6252e+05,0.1216
73.4176,559,1.9267e+06,1.1650e+06,7.6165e+05,0.1248
73.5487,560,1.9230e+06,1.1622e+06,7.6081e+05,0.1245
73.6788,561,1.9194e+06,1.1594e+06,7.5998e+05,0.1234
73.8091,562,1.9158e+06,1.1566e+06,7.5918e+05,0.1235
73.9378,563,1.9122e+06,1.1538e+06,7.5839e+05,0.1220
74.0695,564,1.9086e+06,1.1510e+06,7.5761e+05,0.1248
74.1982,565,1.9050e+06,1.1482e+06,7.5682e+05,0.1218
74.3292,566,1.9015e+06,1.1455e+06,7.5601e+05,0.1244
74.4596,567,1.8979e+06,1.1427e+06,7.5519e+05,0.1238
74.5921,568,1.8944e+06,1.1400e+06,7.5436e+05,0.1248
74.7237,569,1.8909e+06,1.1374e+06,7.5353e+05,0.1243
74.8551,570,1.8874e+06,1.1347e+06,7.5269e+05,0.1246
74.9888,571,1.8839e+06,1.1321e+06,7.5186e+05,0.1255
75.1242,572,1.8805e+06,1.1295e+06,7.5104e+05,0.1269
75.2557,573,1.8771e+06,1.1269e+06,7.5024e+05,0.1240
75.3899,574,1.8737e+06,1.1243e+06,7.4946e+05,0.1264
75.5211,575,1.8704e+06,1.1217e+06,7.4869e+05,0.1240
75.6545,576,1.8671e+06,1.1191e+06,7.4793e+05,0.1252
75.7852,577,1.8638e+06,1.1166e+06,7.4719e+05,0.1238
75.9182,578,1.8605e+06,1.1140e+06,7.4646e+05,0.1257
76.0495,579,1.8572e+06,1.1115e+06,7.4573e+05,0.1245
76.1847,580,1.8540e+06,1.1090e+06,7.4500e+05,0.1215
76.3157,581,1.8507e+06,1.1065e+06,7.4427e+05,0.1243
76.4461,582,1.8475e+06,1.1040e+06,7.4355e+05,0.1239
76.5763,583,1.8443e+06,1.1015e+06,7.4282e+05,0.1236
76.7074,584,1.8411e+06,1.0989e+06,7.4211e+05,0.1246
76.8363,585,1.8378e+06,1.0964e+06,7.4141e+05,0.1223
76.9688,586,1.8346e+06,1.0939e+06,7.4074e+05,0.1253
77.0973,587,1.8314e+06,1.0914e+06,7.4008e+05,0.1220
77.2289,588,1.8283e+06,1.0888e+06,7.3945e+05,0.1247
77.3583,589,1.8251e+06,1.0863e+06,7.3882e+05,0.1227
77.4879,590,1.8220e+06,1.0838e+06,7.3821e+05,0.1229
77.6231,591,1.8188e+06,1.0812e+06,7.3762e+05,0.1287
77.7532,592,1.8157e+06,1.0787e+06,7.3703e+05,0.1233
77.8830,593,1.8126e+06,1.0762e+06,7.3644e+05,0.1235
78.0129,594,1.8096e+06,1.0737e+06,7.3585e+05,0.1233
78.1451,595,1.8065e+06,1.0713e+06,7.3527e+05,0.1252
78.2732,596,1.8035e+06,1.0688e+06,7.3467e+05,0.1214
78.4045,597,1.8005e+06,1.0664e+06,7.3407e+05,0.1248
78.5341,598,1.7975e+06,1.0640e+06,7.3346e+05,0.1231
78.6679,599,1.7945e+06,1.0616e+06,7.3284e+05,0.1244
78.7974,600,1.7915e+06,1.0593e+06,7.3220e+05,0.1229
78.9283,601,1.7886e+06,1.0570e+06,7.3156e+05,0.1233
79.0595,602,1.7856e+06,1.0547e+06,7.3091e+05,0.1246
79.1893,603,1.7827e+06,1.0525e+06,7.3026e+05,0.1228
79.3210,604,1.7798e+06,1.0502e+06,7.2961e+05,0.1250
79.4516,605,1.7769e+06,1.0479e+06,7.2897e+05,0.1238
79.5835,606,1.7740e+06,1.0457e+06,7.2835e+05,0.1247
79.7118,607,1.7712e+06,1.0434e+06,7.2773e+05,0.1217
79.8435,608,1.7683e+06,1.0412e+06,7.2713e+05,0.1248
79.9735,609,1.7655e+06,1.0390e+06,7.2652e+05,0.1233
80.1050,610,1.7627e+06,1.0368e+06,7.2592e+05,0.1244
80.2374,611,1.7599e+06,1.0346e+06,7.2531e+05,0.1250
80.3701,612,1.7571e+06,1.0324e+06,7.2469e+05,0.1256
80.5008,613,1.7543e+06,1.0303e+06,7.2405e+05,0.1240
80.6324,614,1.7515e+06,1.0281e+06,7.2340e+05,0.1246
80.7633,615,1.7488e+06,1.0260e+06,7.2274e+05,0.1239
80.8933,616,1.7460e+06,1.0239e+06,7.2208e+05,0.1232
81.0247,617,1.7433e+06,1.0219e+06,7.2142e+05,0.1245
81.1539,618,1.7405e+06,1.0198e+06,7.2077e+05,0.1222
81.2872,619,1.7378e+06,1.0177e+06,7.2013e+05,0.1265
81.4164,620,1.7351e+06,1.0156e+06,7.1952e+05,0.1223
81.5489,621,1.7324e+06,1.0135e+06,7.1893e+05,0.1255
81.6782,622,1.7297e+06,1.0114e+06,7.1834e+05,0.1226
81.8110,623,1.7271e+06,1.0093e+06,7.1776e+05,0.1260
81.9402,624,1.7244e+06,1.0072e+06,7.1717e+05,0.1225
82.0728,625,1.7218e+06,1.0052e+06,7.1656e+05,0.1254
82.2028,626,1.7191e+06,1.0032e+06,7.1595e+05,0.1233
82.3346,627,1.7165e+06,1.0012e+06,7.1531e+05,0.1246
82.4646,628,1.7139e+06,9.9920e+05,7.1466e+05,0.1233
82.5956,629,1.7113e+06,9.9724e+05,7.1401e+05,0.1244
82.7294,630,1.7087e+06,9.9529e+05,7.1337e+05,0.1247
82.8608,631,1.7061e+06,9.9334e+05,7.1274e+05,0.1246
82.9927,632,1.7035e+06,9.9139e+05,7.1212e+05,0.1250
83.1263,633,1.7009e+06,9.8943e+05,7.1152e+05,0.1250
83.2568,634,1.6984e+06,9.8748e+05,7.1092e+05,0.1222
83.3901,635,1.6959e+06,9.8554e+05,7.1033e+05,0.1252
83.5193,636,1.6933e+06,9.8361e+05,7.0974e+05,0.1221
83.6507,637,1.6908e+06,9.8170e+05,7.0914e+05,0.1244
83.7808,638,1.6884e+06,9.7982e+05,7.0854e+05,0.1232
83.9110,639,1.6859e+06,9.7795e+05,7.0792e+05,0.1234
84.0429,640,1.6834e+06,9.7609e+05,7.0730e+05,0.1252
84.1721,641,1.6809e+06,9.7424e+05,7.0668e+05,0.1225
84.3036,642,1.6785e+06,9.7240e+05,7.0606e+05,0.1250
84.4318,643,1.6760e+06,9.7056e+05,7.0545e+05,0.1219
84.5635,644,1.6736e+06,9.6871e+05,7.0486e+05,0.1249
84.6932,645,1.6711e+06,9.6686e+05,7.0428e+05,0.1230
84.8233,646,1.6687e+06,9.6499e+05,7.0371e+05,0.1236
84.9552,647,1.6663e+06,9.6313e+05,7.0316e+05,0.1250
85.0842,648,1.6639e+06,9.6128e+05,7.0261e+05,0.1224
85.2156,649,1.6615e+06,9.5945e+05,7.0206e+05,0.1246
85.3432,650,1.6591e+06,9.5763e+05,7.0151e+05,0.1213
85.4740,651,1.6568e+06,9.5585e+05,7.0094e+05,0.1242
85.6048,652,1.6545e+06,9.5409e+05,7.0037e+05,0.1245
85.7353,653,1.6521e+06,9.5235e+05,6.9979e+05,0.1239
85.8658,654,1.6498e+06,9.5062e+05,6.9921e+05,0.1235
85.9962,655,1.6475e+06,9.4891e+05,6.9863e+05,0.1238
86.1280,656,1.6453e+06,9.4721e+05,6.9805e+05,0.1244
86.2573,657,1.6430e+06,9.4552e+05,6.9749e+05,0.1226
86.3896,658,1.6408e+06,9.4382e+05,6.9693e+05,0.1255
86.5190,659,1.6385e+06,9.4212e+05,6.9639e+05,0.1218
86.6521,660,1.6363e+06,9.4041e+05,6.9585e+05,0.1263
86.7816,661,1.6340e+06,9.3872e+05,6.9532e+05,0.1227
86.9127,662,1.6318e+06,9.3703e+05,6.9479e+05,0.1246
87.0437,663,1.6296e+06,9.3535e+05,6.9427e+05,0.1243
87.1760,664,1.6274e+06,9.3368e+05,6.9375e+05,0.1251
87.3085,665,1.6252e+06,9.3202e+05,6.9323e+05,0.1245
87.4402,666,1.6231e+06,9.3036e+05,6.9269e+05,0.1244
87.5706,667,1.6209e+06,9.2872e+05,6.9216e+05,0.1238
87.7036,668,1.6187e+06,9.2709e+05,6.9161e+05,0.1231
87.8339,669,1.6165e+06,9.2547e+05,6.9106e+05,0.1234
87.9634,670,1.6144e+06,9.2387e+05,6.9050e+05,0.1229
88.0957,671,1.6122e+06,9.2228e+05,6.8995e+05,0.1255
88.2238,672,1.6101e+06,9.2071e+05,6.8940e+05,0.1213
88.3552,673,1.6080e+06,9.1913e+05,6.8885e+05,0.1247
88.4836,674,1.6059e+06,9.1755e+05,6.8832e+05,0.1218
88.6145,675,1.6038e+06,9.1596e+05,6.8781e+05,0.1244
88.7473,676,1.6017e+06,9.1439e+05,6.8729e+05,0.1262
88.8775,677,1.5996e+06,9.1281e+05,6.8679e+05,0.1235
89.0087,678,1.5975e+06,9.1124e+05,6.8628e+05,0.1243
89.1382,679,1.5954e+06,9.0968e+05,6.8577e+05,0.1226
89.2714,680,1.5934e+06,9.0813e+05,6.8525e+05,0.1262
89.4022,681,1.5913e+06,9.0660e+05,6.8472e+05,0.1241
89.5343,682,1.5893e+06,9.0510e+05,6.8417e+05,0.1254
89.6637,683,1.5872e+06,9.0362e+05,6.8362e+05,0.1228
89.7959,684,1.5852e+06,9.0215e+05,6.8305e+05,0.1252
89.9239,685,1.5832e+06,9.0069e+05,6.8249e+05,0.1214
90.0564,686,1.5812e+06,8.9924e+05,6.8193e+05,0.1256
90.1865,687,1.5792e+06,8.9779e+05,6.8137e+05,0.1232
90.3179,688,1.5772e+06,8.9635e+05,6.8082e+05,0.1243
90.4480,689,1.5752e+06,8.9492e+05,6.8029e+05,0.1233
90.5775,690,1.5732e+06,8.9348e+05,6.7976e+05,0.1227
90.7081,691,1.5713e+06,8.9204e+05,6.7924e+05,0.1242
90.8385,692,1.5693e+06,8.9061e+05,6.7872e+05,0.1232
90.9708,693,1.5674e+06,8.8917e+05,6.7821e+05,0.1251
91.0994,694,1.5654e+06,8.8774e+05,6.7770e+05,0.1219
91.2298,695,1.5635e+06,8.8631e+05,6.7718e+05,0.1238
91.3607,696,1.5616e+06,8.8488e+05,6.7667e+05,0.1242
91.4898,697,1.5596e+06,8.8346e+05,6.7616e+05,0.1222
91.6221,698,1.5577e+06,8.8205e+05,6.7565e+05,0.1256
91.7523,699,1.5558e+06,8.8063e+05,6.7514e+05,0.1234
91.8840,700,1.5539e+06,8.7922e+05,6.7463e+05,0.1249
92.0147,701,1.5519e+06,8.7782e+05,6.7412e+05,0.1233
92.1464,702,1.5500e+06,8.7643e+05,6.7361e+05,0.1248
92.2750,703,1.5482e+06,8.7505e+05,6.7310e+05,0.1219
92.4058,704,1.5463e+06,8.7370e+05,6.7258e+05,0.1237
92.5354,705,1.5444e+06,8.7236e+05,6.7206e+05,0.1233
92.6651,706,1.5426e+06,8.7104e+05,6.7152e+05,0.1234
92.7979,707,1.5407e+06,8.6973e+05,6.7099e+05,0.1259
92.9265,708,1.5389e+06,8.6843e+05,6.7045e+05,0.1220
93.0591,709,1.5371e+06,8.6713e+05,6.6992e+05,0.1259
93.1875,710,1.5352e+06,8.6584e+05,6.6939e+05,0.1213
93.3178,711,1.5334e+06,8.6454e+05,6.6888e+05,0.1236
93.4484,712,1.5316e+06,8.6323e+05,6.6838e+05,0.1236
93.5772,713,1.5298e+06,8.6191e+05,6.6788e+05,0.1218
93.7085,714,1.5280e+06,8.6059e+05,6.6740e+05,0.1246
93.8374,715,1.5262e+06,8.5927e+05,6.6693e+05,0.1219
93.9688,716,1.5244e+06,8.5795e+05,6.6646e+05,0.1245
94.0989,717,1.5226e+06,8.5664e+05,6.6599e+05,0.1233
94.2283,718,1.5208e+06,8.5534e+05,6.6551e+05,0.1229
94.3597,719,1.5191e+06,8.5406e+05,6.6502e+05,0.1243
94.4888,720,1.5173e+06,8.5279e+05,6.6452e+05,0.1226
94.6207,721,1.5156e+06,8.5154e+05,6.6402e+05,0.1250
94.7518,722,1.5138e+06,8.5029e+05,6.6352e+05,0.1241
94.8844,723,1.5121e+06,8.4905e+05,6.6302e+05,0.1248
95.0130,724,1.5103e+06,8.4781e+05,6.6254e+05,0.1219
95.1440,725,1.5086e+06,8.4656e+05,6.6207e+05,0.1242
95.2747,726,1.5069e+06,8.4530e+05,6.6160e+05,0.1238
95.4033,727,1.5052e+06,8.4405e+05,6.6115e+05,0.1222
95.5356,728,1.5035e+06,8.4280e+05,6.6070e+05,0.1259
95.6657,729,1.5018e+06,8.4155e+05,6.6025e+05,0.1230
95.7995,730,1.5001e+06,8.4032e+05,6.5980e+05,0.1265
95.9298,731,1.4984e+06,8.3910e+05,6.5934e+05,0.1236
96.0625,732,1.4968e+06,8.3790e+05,6.5888e+05,0.1259
96.1907,733,1.4951e+06,8.3671e+05,6.5841e+05,0.1215
96.3232,734,1.4935e+06,8.3553e+05,6.5794e+05,0.1257
96.4529,735,1.4918e+06,8.3436e+05,6.5748e+05,0.1224
96.5831,736,1.4902e+06,8.3319e+05,6.5701e+05,0.1230
96.7183,737,1.4886e+06,8.3202e+05,6.5654e+05,0.1287
96.8505,738,1.4869e+06,8.3086e+05,6.5608e+05,0.1251
96.9825,739,1.4853e+06,8.2970e+05,6.5563e+05,0.1227
97.1148,740,1.4837e+06,8.2854e+05,6.5518e+05,0.1256
97.2443,741,1.4821e+06,8.2738e+05,6.5473e+05,0.1228
97.3781,742,1.4805e+06,8.2623e+05,6.5429e+05,0.1269
97.5081,743,1.4789e+06,8.2508e+05,6.5386e+05,0.1232
97.6418,744,1.4773e+06,8.2393e+05,6.5342e+05,0.1263
97.7725,745,1.4758e+06,8.2277e+05,6.5299e+05,0.1237
97.9057,746,1.4742e+06,8.2161e+05,6.5257e+05,0.1259
98.0349,747,1.4726e+06,8.2046e+05,6.5214e+05,0.1223
98.1664,748,1.4710e+06,8.1931e+05,6.5172e+05,0.1246
98.2967,749,1.4695e+06,8.1816e+05,6.5129e+05,0.1233
98.4256,750,1.4679e+06,8.1703e+05,6.5087e+05,0.1221
98.5586,751,1.4664e+06,8.1590e+05,6.5045e+05,0.1256
98.6874,752,1.4648e+06,8.1478e+05,6.5002e+05,0.1219
98.8194,753,1.4633e+06,8.1367e+05,6.4959e+05,0.1249
98.9483,754,1.4617e+06,8.1255e+05,6.4916e+05,0.1219
99.0803,755,1.4602e+06,8.1144e+05,6.4873e+05,0.1246
99.2100,756,1.4586e+06,8.1033e+05,6.4831e+05,0.1229
99.3390,757,1.4571e+06,8.0922e+05,6.4789e+05,0.1221
99.4707,758,1.4556e+06,8.0811e+05,6.4747e+05,0.1250
99.6011,759,1.4541e+06,8.0700e+05,6.4706e+05,0.1235
99.7319,760,1.4525e+06,8.0589e+05,6.4665e+05,0.1241
99.8607,761,1.4510e+06,8.0479e+05,6.4625e+05,0.1218
99.9915,762,1.4495e+06,8.0370e+05,6.4585e+05,0.1238
100.1218,763,1.4481e+06,8.0260e+05,6.4545e+05,0.1236
100.2508,764,1.4466e+06,8.0150e+05,6.4506e+05,0.1220
100.3821,765,1.4451e+06,8.0040e+05,6.4468e+05,0.1244
100.5106,766,1.4436e+06,7.9931e+05,6.4429e+05,0.1220
100.6423,767,1.4421e+06,7.9822e+05,6.4392e+05,0.1247
100.7730,768,1.4407e+06,7.9712e+05,6.4355e+05,0.1240
100.9055,769,1.4392e+06,7.9603e+05,6.4318e+05,0.1258
101.0365,770,1.4378e+06,7.9495e+05,6.4282e+05,0.1241
101.1669,771,1.4363e+06,7.9386e+05,6.4245e+05,0.1236
101.2979,772,1.4349e+06,7.9279e+05,6.4209e+05,0.1238
101.4265,773,1.4334e+06,7.9172e+05,6.4172e+05,0.1220
101.5585,774,1.4320e+06,7.9065e+05,6.4135e+05,0.1245
101.6894,775,1.4306e+06,7.8960e+05,6.4098e+05,0.1235
101.8237,776,1.4291e+06,7.8854e+05,6.4061e+05,0.1269
101.9547,777,1.4277e+06,7.8748e+05,6.4024e+05,0.1236
102.0884,778,1.4263e+06,7.8642e+05,6.3989e+05,0.1263
102.2179,779,1.4249e+06,7.8535e+05,6.3954e+05,0.1223
102.3517,780,1.4235e+06,7.8429e+05,6.3919e+05,0.1270
102.4834,781,1.4221e+06,7.8322e+05,6.3885e+05,0.1247
102.6152,782,1.4207e+06,7.8217e+05,6.3850e+05,0.1243
102.7440,783,1.4193e+06,7.8112e+05,6.3815e+05,0.1222
102.8759,784,1.4179e+06,7.8009e+05,6.3778e+05,0.1250
103.0057,785,1.4165e+06,7.7906e+05,6.3741e+05,0.1231
103.1382,786,1.4151e+06,7.7805e+05,6.3703e+05,0.1253
103.2674,787,1.4137e+06,7.7705e+05,6.3665e+05,0.1223
103.3989,788,1.4123e+06,7.7606e+05,6.3627e+05,0.1247
103.5290,789,1.4110e+06,7.7507e+05,6.3588e+05,0.1231
103.6580,790,1.4096e+06,7.7408e+05,6.3551e+05,0.1223
103.7893,791,1.4082e+06,7.7308e+05,6.3514e+05,0.1243
103.9175,792,1.4069e+06,7.7208e+05,6.3477e+05,0.1216
104.0502,793,1.4055e+06,7.7109e+05,6.3441e+05,0.1256
104.1795,794,1.4041e+06,7.7010e+05,6.3404e+05,0.1224
104.3105,795,1.4028e+06,7.6911e+05,6.3367e+05,0.1242
104.4411,796,1.4014e+06,7.6814e+05,6.3329e+05,0.1238
104.5697,797,1.4001e+06,7.6717e+05,6.3292e+05,0.1221
104.7007,798,1.3988e+06,7.6621e+05,6.3254e+05,0.1242
104.8287,799,1.3974e+06,7.6526e+05,6.3216e+05,0.1217
104.9631,800,1.3961e+06,7.6431e+05,6.3179e+05,0.1280
105.0951,801,1.3948e+06,7.6336e+05,6.3143e+05,0.1226
105.2275,802,1.3935e+06,7.6241e+05,6.3106e+05,0.1253
105.3562,803,1.3922e+06,7.6146e+05,6.3071e+05,0.1217
105.4864,804,1.3909e+06,7.6051e+05,6.3036e+05,0.1235
105.6171,805,1.3896e+06,7.5957e+05,6.3002e+05,0.1241
105.7459,806,1.3883e+06,7.5862e+05,6.2968e+05,0.1223
105.8776,807,1.3870e+06,7.5768e+05,6.2934e+05,0.1248
106.0060,808,1.3857e+06,7.5674e+05,6.2900e+05,0.1217
106.1375,809,1.3845e+06,7.5581e+05,6.2867e+05,0.1243
106.2676,810,1.3832e+06,7.5488e+05,6.2833e+05,0.1233
106.3979,811,1.3819e+06,7.5396e+05,6.2799e+05,0.1235
106.5291,812,1.3807e+06,7.5304e+05,6.2765e+05,0.1247
106.6577,813,1.3794e+06,7.5212e+05,6.2731e+05,0.1219
106.7894,814,1.3782e+06,7.5121e+05,6.2696e+05,0.1249
106.9189,815,1.3769e+06,7.5031e+05,6.2661e+05,0.1228
107.0548,816,1.3757e+06,7.4941e+05,6.2625e+05,0.1254
107.1831,817,1.3744e+06,7.4852e+05,6.2590e+05,0.1218
107.3155,818,1.3732e+06,7.4763e+05,6.2554e+05,0.1256
107.4448,819,1.3719e+06,7.4674e+05,6.2519e+05,0.1221
107.5754,820,1.3707e+06,7.4586e+05,6.2484e+05,0.1239
107.7054,821,1.3695e+06,7.4497e+05,6.2450e+05,0.1234
107.8342,822,1.3683e+06,7.4409e+05,6.2416e+05,0.1222
107.9661,823,1.3670e+06,7.4321e+05,6.2382e+05,0.1250
108.0960,824,1.3658e+06,7.4233e+05,6.2348e+05,0.1233
108.2278,825,1.3646e+06,7.4145e+05,6.2314e+05,0.1250
108.3563,826,1.3634e+06,7.4058e+05,6.2280e+05,0.1218
108.4865,827,1.3622e+06,7.3972e+05,6.2245e+05,0.1236
108.6174,828,1.3610e+06,7.3886e+05,6.2210e+05,0.1244
108.7464,829,1.3598e+06,7.3801e+05,6.2175e+05,0.1223
108.8768,830,1.3586e+06,7.3716e+05,6.2140e+05,0.1240
109.0051,831,1.3574e+06,7.3632e+05,6.2106e+05,0.1218
109.1363,832,1.3562e+06,7.3546e+05,6.2073e+05,0.1246
109.2660,833,1.3550e+06,7.3461e+05,6.2040e+05,0.1232
109.3941,834,1.3538e+06,7.3375e+05,6.2008e+05,0.1216
109.5257,835,1.3526e+06,7.3289e+05,6.1975e+05,0.1249
109.6539,836,1.3515e+06,7.3205e+05,6.1943e+05,0.1217
109.7844,837,1.3503e+06,7.3121e+05,6.1909e+05,0.1239
109.9148,838,1.3491e+06,7.3038e+05,6.1875e+05,0.1241
110.0447,839,1.3480e+06,7.2955e+05,6.1841e+05,0.1232
110.1757,840,1.3468e+06,7.2873e+05,6.1807e+05,0.1245
110.3040,841,1.3456e+06,7.2791e+05,6.1773e+05,0.1215
110.4350,842,1.3445e+06,7.2710e+05,6.1739e+05,0.1242
110.5648,843,1.3433e+06,7.2629e+05,6.1706e+05,0.1233
110.6934,844,1.3422e+06,7.2548e+05,6.1673e+05,0.1220
110.8245,845,1.3411e+06,7.2467e+05,6.1640e+05,0.1240
110.9538,846,1.3399e+06,7.2386e+05,6.1607e+05,0.1228
111.0875,847,1.3388e+06,7.2306e+05,6.1574e+05,0.1236
111.2160,848,1.3377e+06,7.2227e+05,6.1541e+05,0.1217
111.3484,849,1.3366e+06,7.2149e+05,6.1508e+05,0.1256
111.4793,850,1.3354e+06,7.2070e+05,6.1474e+05,0.1241
111.6108,851,1.3343e+06,7.1992e+05,6.1441e+05,0.1242
111.7424,852,1.3332e+06,7.1915e+05,6.1408e+05,0.1246
111.8761,853,1.3321e+06,7.1837e+05,6.1375e+05,0.1265
112.0064,854,1.3310e+06,7.1758e+05,6.1343e+05,0.1228
112.1377,855,1.3299e+06,7.1679e+05,6.1311e+05,0.1236
112.2670,856,1.3288e+06,7.1601e+05,6.1280e+05,0.1229
112.3962,857,1.3277e+06,7.1522e+05,6.1248e+05,0.1224
112.5277,858,1.3266e+06,7.1444e+05,6.1217e+05,0.1248
112.6561,859,1.3255e+06,7.1367e+05,6.1185e+05,0.1220
112.7894,860,1.3244e+06,7.1290e+05,6.1153e+05,0.1263
112.9200,861,1.3234e+06,7.1214e+05,6.1121e+05,0.1236
113.0525,862,1.3223e+06,7.1139e+05,6.1088e+05,0.1257
113.1824,863,1.3212e+06,7.1064e+05,6.1056e+05,0.1231
113.3140,864,1.3201e+06,7.0988e+05,6.1024e+05,0.1247
113.4430,865,1.3191e+06,7.0913e+05,6.0993e+05,0.1224
113.5717,866,1.3180e+06,7.0838e+05,6.0962e+05,0.1222
113.7033,867,1.3169e+06,7.0762e+05,6.0931e+05,0.1249
113.8315,868,1.3159e+06,7.0688e+05,6.0901e+05,0.1216
113.9627,869,1.3148e+06,7.0613e+05,6.0870e+05,0.1246
114.0929,870,1.3138e+06,7.0540e+05,6.0839e+05,0.1232
114.2248,871,1.3127e+06,7.0467e+05,6.0808e+05,0.1250
114.3566,872,1.3117e+06,7.0394e+05,6.0776e+05,0.1251
114.4890,873,1.3107e+06,7.0322e+05,6.0745e+05,0.1250
114.6186,874,1.3096e+06,7.0250e+05,6.0714e+05,0.1230
114.7472,875,1.3086e+06,7.0178e+05,6.0682e+05,0.1224
114.8791,876,1.3076e+06,7.0106e+05,6.0651e+05,0.1253
115.0096,877,1.3066e+06,7.0035e+05,6.0620e+05,0.1235
115.1425,878,1.3055e+06,6.9963e+05,6.0590e+05,0.1256
115.2712,879,1.3045e+06,6.9892e+05,6.0559e+05,0.1219
115.4027,880,1.3035e+06,6.9821e+05,6.0528e+05,0.1246
115.5309,881,1.3025e+06,6.9750e+05,6.0497e+05,0.1217
115.6600,882,1.3015e+06,6.9680e+05,6.0467e+05,0.1227
115.7931,883,1.3005e+06,6.9610e+05,6.0436e+05,0.1259
115.9239,884,1.2995e+06,6.9541e+05,6.0406e+05,0.1240
116.0569,885,1.2985e+06,6.9471e+05,6.0375e+05,0.1260
116.1859,886,1.2975e+06,6.9401e+05,6.0345e+05,0.1224
116.3179,887,1.2965e+06,6.9331e+05,6.0315e+05,0.1254
116.4464,888,1.2955e+06,6.9261e+05,6.0286e+05,0.1219
116.5785,889,1.2945e+06,6.9192e+05,6.0256e+05,0.1254
116.7075,890,1.2935e+06,6.9122e+05,6.0226e+05,0.1226
116.8392,891,1.2925e+06,6.9053e+05,6.0197e+05,0.1246
116.9725,892,1.2915e+06,6.8985e+05,6.0167e+05,0.1265
117.1084,893,1.2905e+06,6.8916e+05,6.0137e+05,0.1290
117.2396,894,1.2896e+06,6.8848e+05,6.0108e+05,0.1234
117.3764,895,1.2886e+06,6.8779e+05,6.0078e+05,0.1273
117.5114,896,1.2876e+06,6.8710e+05,6.0049e+05,0.1273
117.6400,897,1.2866e+06,6.8642e+05,6.0020e+05,0.1212
117.7719,898,1.2857e+06,6.8574e+05,5.9992e+05,0.1249
117.9015,899,1.2847e+06,6.8506e+05,5.9963e+05,0.1230
118.0311,900,1.2837e+06,6.8439e+05,5.9933e+05,0.1230
118.1690,901,1.2828e+06,6.8373e+05,5.9904e+05,0.1211
118.3016,902,1.2818e+06,6.8307e+05,5.9874e+05,0.1256
118.4303,903,1.2809e+06,6.8241e+05,5.9844e+05,0.1220
118.5610,904,1.2799e+06,6.8176e+05,5.9814e+05,0.1239
118.6923,905,1.2789e+06,6.8110e+05,5.9785e+05,0.1247
118.8224,906,1.2780e+06,6.8044e+05,5.9756e+05,0.1234
118.9527,907,1.2771e+06,6.7979e+05,5.9727e+05,0.1237
119.0816,908,1.2761e+06,6.7914e+05,5.9698e+05,0.1225
119.2162,909,1.2752e+06,6.7849e+05,5.9669e+05,0.1271
119.3458,910,1.2742e+06,6.7785e+05,5.9640e+05,0.1227
119.4777,911,1.2733e+06,6.7722e+05,5.9610e+05,0.1248
119.6070,912,1.2724e+06,6.7658e+05,5.9581e+05,0.1229
119.7398,913,1.2715e+06,6.7595e+05,5.9552e+05,0.1259
119.8685,914,1.2705e+06,6.7532e+05,5.9523e+05,0.1221
119.9998,915,1.2696e+06,6.7468e+05,5.9495e+05,0.1244
120.1300,916,1.2687e+06,6.7403e+05,5.9467e+05,0.1236
120.2606,917,1.2678e+06,6.7339e+05,5.9440e+05,0.1231
120.3914,918,1.2669e+06,6.7274e+05,5.9414e+05,0.1242
120.5209,919,1.2660e+06,6.7210e+05,5.9387e+05,0.1228
120.6529,920,1.2651e+06,6.7146e+05,5.9360e+05,0.1252
120.7817,921,1.2641e+06,6.7082e+05,5.9333e+05,0.1222
120.9140,922,1.2632e+06,6.7019e+05,5.9305e+05,0.1258
121.0438,923,1.2623e+06,6.6956e+05,5.9278e+05,0.1232
121.1786,924,1.2614e+06,6.6893e+05,5.9251e+05,0.1279
121.3069,925,1.2605e+06,6.6830e+05,5.9223e+05,0.1215
121.4386,926,1.2596e+06,6.6766e+05,5.9197e+05,0.1250
121.5683,927,1.2587e+06,6.6703e+05,5.9170e+05,0.1230
121.6987,928,1.2578e+06,6.6640e+05,5.9144e+05,0.1241
121.8301,929,1.2570e+06,6.6577e+05,5.9118e+05,0.1246
121.9616,930,1.2561e+06,6.6515e+05,5.9092e+05,0.1249
122.0958,931,1.2552e+06,6.6453e+05,5.9065e+05,0.1272
122.2271,932,1.2543e+06,6.6393e+05,5.9039e+05,0.1224
122.3569,933,1.2534e+06,6.6332e+05,5.9012e+05,0.1234
122.4861,934,1.2526e+06,6.6272e+05,5.8985e+05,0.1224
122.6174,935,1.2517e+06,6.6212e+05,5.8958e+05,0.1248
122.7461,936,1.2508e+06,6.6151e+05,5.8931e+05,0.1219
122.8790,937,1.2500e+06,6.6091e+05,5.8905e+05,0.1262
123.0079,938,1.2491e+06,6.6030e+05,5.8878e+05,0.1222
123.1397,939,1.2482e+06,6.5970e+05,5.8852e+05,0.1253
123.2709,940,1.2474e+06,6.5910e+05,5.8826e+05,0.1244
123.4036,941,1.2465e+06,6.5850e+05,5.8800e+05,0.1258
123.5348,942,1.2456e+06,6.5791e+05,5.8773e+05,0.1241
123.6670,943,1.2448e+06,6.5732e+05,5.8747e+05,0.1253
123.7961,944,1.2439e+06,6.5673e+05,5.8720e+05,0.1226
123.9245,945,1.2431e+06,6.5615e+05,5.8693e+05,0.1218
124.0560,946,1.2422e+06,6.5556e+05,5.8666e+05,0.1248
124.1851,947,1.2414e+06,6.5498e+05,5.8640e+05,0.1226
124.3186,948,1.2405e+06,6.5440e+05,5.8613e+05,0.1263
124.4484,949,1.2397e+06,6.5381e+05,5.8587e+05,0.1231
124.5820,950,1.2388e+06,6.5323e+05,5.8561e+05,0.1268
124.7101,951,1.2380e+06,6.5264e+05,5.8535e+05,0.1214
124.8414,952,1.2372e+06,6.5206e+05,5.8509e+05,0.1246
124.9713,953,1.2363e+06,6.5149e+05,5.8483e+05,0.1232
125.0996,954,1.2355e+06,6.5091e+05,5.8456e+05,0.1219
125.2311,955,1.2346e+06,6.5035e+05,5.8429e+05,0.1248
125.3593,956,1.2338e+06,6.4978e+05,5.8402e+05,0.1216
125.4901,957,1.2330e+06,6.4922e+05,5.8374e+05,0.1240
125.6203,958,1.2321e+06,6.4866e+05,5.8347e+05,0.1235
125.7500,959,1.2313e+06,6.4811e+05,5.8319e+05,0.1228
125.8815,960,1.2305e+06,6.4756e+05,5.8292e+05,0.1247
126.0100,961,1.2297e+06,6.4700e+05,5.8265e+05,0.1219
126.1423,962,1.2288e+06,6.4645e+05,5.8239e+05,0.1259
126.2734,963,1.2280e+06,6.4589e+05,5.8213e+05,0.1220
126.4058,964,1.2272e+06,6.4533e+05,5.8187e+05,0.1256
126.5342,965,1.2264e+06,6.4477e+05,5.8162e+05,0.1220
126.6642,966,1.2256e+06,6.4420e+05,5.8137e+05,0.1236
126.7948,967,1.2248e+06,6.4364e+05,5.8112e+05,0.1240
126.9235,968,1.2240e+06,6.4309e+05,5.8087e+05,0.1221
127.0550,969,1.2232e+06,6.4254e+05,5.8062e+05,0.1245
127.1832,970,1.2224e+06,6.4200e+05,5.8036e+05,0.1215
127.3155,971,1.2216e+06,6.4146e+05,5.8011e+05,0.1255
127.4454,972,1.2208e+06,6.4092e+05,5.7984e+05,0.1233
127.5813,973,1.2200e+06,6.4039e+05,5.7958e+05,0.1290
127.7097,974,1.2192e+06,6.3986e+05,5.7932e+05,0.1214
127.8406,975,1.2184e+06,6.3933e+05,5.7906e+05,0.1241
127.9712,976,1.2176e+06,6.3880e+05,5.7880e+05,0.1238
128.1001,977,1.2168e+06,6.3827e+05,5.7855e+05,0.1224
128.2316,978,1.2160e+06,6.3775e+05,5.7829e+05,0.1250
128.3604,979,1.2153e+06,6.3722e+05,5.7803e+05,0.1221
128.4924,980,1.2145e+06,6.3670e+05,5.7778e+05,0.1249
128.6211,981,1.2137e+06,6.3618e+05,5.7752e+05,0.1220
128.7534,982,1.2129e+06,6.3566e+05,5.7726e+05,0.1250
128.8830,983,1.2122e+06,6.3515e+05,5.7700e+05,0.1230
129.0139,984,1.2114e+06,6.3463e+05,5.7675e+05,0.1243
129.1468,985,1.2106e+06,6.3412e+05,5.7650e+05,0.1262
129.2786,986,1.2099e+06,6.3361e+05,5.7625e+05,0.1249
129.4108,987,1.2091e+06,6.3310e+05,5.7600e+05,0.1254
129.5428,988,1.2084e+06,6.3260e+05,5.7575e+05,0.1251
129.6744,989,1.2076e+06,6.3210e+05,5.7551e+05,0.1248
129.8072,990,1.2069e+06,6.3160e+05,5.7526e+05,0.1258
129.9385,991,1.2061e+06,6.3110e+05,5.7501e+05,0.1247
130.0688,992,1.2054e+06,6.3060e+05,5.7475e+05,0.1233
130.1997,993,1.2046e+06,6.3010e+05,5.7450e+05,0.1242
130.3285,994,1.2039e+06,6.2960e+05,5.7426e+05,0.1224
130.4597,995,1.2031e+06,6.2910e+05,5.7401e+05,0.1246
130.5876,996,1.2024e+06,6.2859e+05,5.7378e+05,0.1214
130.7183,997,1.2016e+06,6.2808e+05,5.7355e+05,0.1241
130.8485,998,1.2009e+06,6.2757e+05,5.7332e+05,0.1236
130.9771,999,1.2001e+06,6.2706e+05,5.7309e+05,0.1220
