run_time,iteration,loss,style_loss,content_loss,time
0.1164,0,6.1571e+06,6.1571e+06,0.0000e+00,0.1164
0.2461,1,4.9957e+06,4.4439e+06,5.5171e+05,0.1201
0.3771,2,3.9392e+06,3.3485e+06,5.9072e+05,0.1234
0.5056,3,3.2267e+06,2.6321e+06,5.9458e+05,0.1213
0.6331,4,2.7666e+06,2.1617e+06,6.0488e+05,0.1203
0.7649,5,2.4656e+06,1.8460e+06,6.1959e+05,0.1234
0.8967,6,2.2566e+06,1.6378e+06,6.1886e+05,0.1243
1.0281,7,2.1106e+06,1.4986e+06,6.1203e+05,0.1233
1.1564,8,1.9994e+06,1.4010e+06,5.9840e+05,0.1210
1.2850,9,1.9156e+06,1.3301e+06,5.8551e+05,0.1214
1.4147,10,1.8507e+06,1.2755e+06,5.7515e+05,0.1226
1.5425,11,1.7973e+06,1.2302e+06,5.6708e+05,0.1205
1.6733,12,1.7533e+06,1.1919e+06,5.6143e+05,0.1235
1.8020,13,1.7152e+06,1.1594e+06,5.5577e+05,0.1213
1.9295,14,1.6807e+06,1.1312e+06,5.4954e+05,0.1202
2.0606,15,1.6501e+06,1.1064e+06,5.4374e+05,0.1232
2.1890,16,1.6228e+06,1.0846e+06,5.3817e+05,0.1213
2.3164,17,1.5971e+06,1.0646e+06,5.3243e+05,0.1202
2.4468,18,1.5721e+06,1.0460e+06,5.2612e+05,0.1230
2.5738,19,1.5483e+06,1.0287e+06,5.1960e+05,0.1199
2.7020,20,1.5259e+06,1.0125e+06,5.1342e+05,0.1207
2.8335,21,1.5050e+06,9.9643e+05,5.0855e+05,0.1235
2.9620,22,1.4849e+06,9.8085e+05,5.0404e+05,0.1204
3.0931,23,1.4658e+06,9.6558e+05,5.0021e+05,0.1228
3.2214,24,1.4474e+06,9.5101e+05,4.9644e+05,0.1210
3.3493,25,1.4299e+06,9.3707e+05,4.9279e+05,0.1203
3.4812,26,1.4128e+06,9.2400e+05,4.8877e+05,0.1243
3.6100,27,1.3962e+06,9.1156e+05,4.8462e+05,0.1213
3.7409,28,1.3801e+06,8.9957e+05,4.8055e+05,0.1232
3.8704,29,1.3649e+06,8.8816e+05,4.7674e+05,0.1222
3.9978,30,1.3502e+06,8.7704e+05,4.7314e+05,0.1202
4.1296,31,1.3361e+06,8.6605e+05,4.7000e+05,0.1236
4.2590,32,1.3225e+06,8.5536e+05,4.6713e+05,0.1215
4.3893,33,1.3092e+06,8.4501e+05,4.6418e+05,0.1232
4.5189,34,1.2961e+06,8.3511e+05,4.6101e+05,0.1217
4.6472,35,1.2832e+06,8.2551e+05,4.5765e+05,0.1207
4.7794,36,1.2707e+06,8.1632e+05,4.5434e+05,0.1244
4.9073,37,1.2587e+06,8.0763e+05,4.5110e+05,0.1203
5.0379,38,1.2474e+06,7.9909e+05,4.4828e+05,0.1230
5.1677,39,1.2365e+06,7.9073e+05,4.4572e+05,0.1218
5.2958,40,1.2258e+06,7.8271e+05,4.4304e+05,0.1207
5.4275,41,1.2152e+06,7.7504e+05,4.4019e+05,0.1245
5.5567,42,1.2049e+06,7.6775e+05,4.3710e+05,0.1217
5.6883,43,1.1947e+06,7.6087e+05,4.3385e+05,0.1235
5.8188,44,1.1849e+06,7.5436e+05,4.3049e+05,0.1226
5.9520,45,1.1752e+06,7.4808e+05,4.2711e+05,0.1255
6.0836,46,1.1658e+06,7.4185e+05,4.2390e+05,0.1209
6.2135,47,1.1565e+06,7.3562e+05,4.2089e+05,0.1221
6.3441,48,1.1475e+06,7.2932e+05,4.1818e+05,0.1230
6.4719,49,1.1387e+06,7.2291e+05,4.1578e+05,0.1201
6.6042,50,1.1301e+06,7.1643e+05,4.1372e+05,0.1246
6.7333,51,1.1217e+06,7.0999e+05,4.1176e+05,0.1209
6.8661,52,1.1135e+06,7.0357e+05,4.0996e+05,0.1246
6.9963,53,1.1054e+06,6.9722e+05,4.0822e+05,0.1225
7.1294,54,1.0975e+06,6.9103e+05,4.0652e+05,0.1244
7.2586,55,1.0899e+06,6.8508e+05,4.0484e+05,0.1213
7.3884,56,1.0826e+06,6.7937e+05,4.0321e+05,0.1221
7.5198,57,1.0755e+06,6.7386e+05,4.0167e+05,0.1233
7.6493,58,1.0688e+06,6.6855e+05,4.0021e+05,0.1212
7.7802,59,1.0621e+06,6.6346e+05,3.9868e+05,0.1231
7.9079,60,1.0556e+06,6.5851e+05,3.9705e+05,0.1203
8.0384,61,1.0490e+06,6.5371e+05,3.9531e+05,0.1222
8.1694,62,1.0425e+06,6.4900e+05,3.9352e+05,0.1229
8.2962,63,1.0361e+06,6.4437e+05,3.9177e+05,0.1194
8.4275,64,1.0298e+06,6.3981e+05,3.8996e+05,0.1236
8.5571,65,1.0235e+06,6.3533e+05,3.8814e+05,0.1216
8.6899,66,1.0173e+06,6.3093e+05,3.8635e+05,0.1252
8.8213,67,1.0112e+06,6.2666e+05,3.8455e+05,0.1233
8.9515,68,1.0053e+06,6.2256e+05,3.8275e+05,0.1223
9.0865,69,9.9950e+05,6.1854e+05,3.8096e+05,0.1256
9.2215,70,9.9381e+05,6.1467e+05,3.7914e+05,0.1259
9.3526,71,9.8813e+05,6.1089e+05,3.7724e+05,0.1221
9.4861,72,9.8252e+05,6.0718e+05,3.7533e+05,0.1244
9.6155,73,9.7697e+05,6.0354e+05,3.7343e+05,0.1210
9.7487,74,9.7155e+05,5.9996e+05,3.7159e+05,0.1247
9.8789,75,9.6622e+05,5.9636e+05,3.6986e+05,0.1216
10.0136,76,9.6096e+05,5.9266e+05,3.6830e+05,0.1257
10.1448,77,9.5574e+05,5.8888e+05,3.6686e+05,0.1219
10.2783,78,9.5054e+05,5.8501e+05,3.6553e+05,0.1243
10.4072,79,9.4544e+05,5.8110e+05,3.6434e+05,0.1207
10.5462,80,9.4039e+05,5.7716e+05,3.6323e+05,0.1303
10.6800,81,9.3549e+05,5.7324e+05,3.6225e+05,0.1217
10.8106,82,9.3071e+05,5.6939e+05,3.6132e+05,0.1222
10.9449,83,9.2600e+05,5.6559e+05,3.6041e+05,0.1252
11.0769,84,9.2140e+05,5.6186e+05,3.5954e+05,0.1223
11.2101,85,9.1683e+05,5.5823e+05,3.5860e+05,0.1246
11.3424,86,9.1235e+05,5.5480e+05,3.5756e+05,0.1219
11.4779,87,9.0798e+05,5.5153e+05,3.5645e+05,0.1244
11.6100,88,9.0368e+05,5.4845e+05,3.5523e+05,0.1238
11.7408,89,8.9946e+05,5.4557e+05,3.5389e+05,0.1222
11.8730,90,8.9533e+05,5.4281e+05,3.5252e+05,0.1236
12.0089,91,8.9127e+05,5.4011e+05,3.5115e+05,0.1278
12.1403,92,8.8724e+05,5.3742e+05,3.4982e+05,0.1216
12.2690,93,8.8328e+05,5.3471e+05,3.4856e+05,0.1197
12.4013,94,8.7933e+05,5.3197e+05,3.4736e+05,0.1237
12.5317,95,8.7537e+05,5.2921e+05,3.4616e+05,0.1220
12.6654,96,8.7144e+05,5.2644e+05,3.4500e+05,0.1245
12.7950,97,8.6758e+05,5.2369e+05,3.4388e+05,0.1212
12.9282,98,8.6372e+05,5.2097e+05,3.4275e+05,0.1239
13.0590,99,8.5988e+05,5.1830e+05,3.4158e+05,0.1216
13.1915,100,8.5610e+05,5.1571e+05,3.4040e+05,0.1239
13.3241,101,8.5238e+05,5.1318e+05,3.3920e+05,0.1216
13.4573,102,8.4871e+05,5.1073e+05,3.3798e+05,0.1250
13.5869,103,8.4511e+05,5.0836e+05,3.3675e+05,0.1211
13.7235,104,8.4160e+05,5.0605e+05,3.3555e+05,0.1225
13.8525,105,8.3816e+05,5.0377e+05,3.3439e+05,0.1210
13.9854,106,8.3475e+05,5.0147e+05,3.3328e+05,0.1241
14.1145,107,8.3134e+05,4.9916e+05,3.3219e+05,0.1208
14.2474,108,8.2795e+05,4.9683e+05,3.3112e+05,0.1244
14.3843,109,8.2462e+05,4.9451e+05,3.3011e+05,0.1212
14.5145,110,8.2133e+05,4.9222e+05,3.2912e+05,0.1219
14.6445,111,8.1810e+05,4.8996e+05,3.2814e+05,0.1215
14.7762,112,8.1491e+05,4.8774e+05,3.2717e+05,0.1237
14.9051,113,8.1174e+05,4.8553e+05,3.2620e+05,0.1207
15.0431,114,8.0857e+05,4.8332e+05,3.2525e+05,0.1293
15.1779,115,8.0542e+05,4.8110e+05,3.2431e+05,0.1259
15.3083,116,8.0228e+05,4.7889e+05,3.2339e+05,0.1220
15.4423,117,7.9919e+05,4.7667e+05,3.2253e+05,0.1255
15.5709,118,7.9617e+05,4.7443e+05,3.2174e+05,0.1201
15.7037,119,7.9318e+05,4.7218e+05,3.2100e+05,0.1239
15.8334,120,7.9026e+05,4.6992e+05,3.2034e+05,0.1213
15.9660,121,7.8737e+05,4.6769e+05,3.1968e+05,0.1243
16.0967,122,7.8448e+05,4.6553e+05,3.1895e+05,0.1215
16.2314,123,7.8161e+05,4.6346e+05,3.1815e+05,0.1255
16.3618,124,7.7878e+05,4.6148e+05,3.1730e+05,0.1215
16.4958,125,7.7599e+05,4.5959e+05,3.1641e+05,0.1244
16.6317,126,7.7323e+05,4.5776e+05,3.1547e+05,0.1273
16.7631,127,7.7046e+05,4.5598e+05,3.1449e+05,0.1220
16.8921,128,7.6768e+05,4.5418e+05,3.1350e+05,0.1203
17.0244,129,7.6489e+05,4.5235e+05,3.1254e+05,0.1236
17.1529,130,7.6217e+05,4.5053e+05,3.1163e+05,0.1199
17.2859,131,7.5953e+05,4.4876e+05,3.1077e+05,0.1239
17.4156,132,7.5695e+05,4.4702e+05,3.0993e+05,0.1211
17.5527,133,7.5443e+05,4.4533e+05,3.0910e+05,0.1285
17.6838,134,7.5194e+05,4.4373e+05,3.0821e+05,0.1224
17.8169,135,7.4950e+05,4.4220e+05,3.0729e+05,0.1237
17.9489,136,7.4709e+05,4.4072e+05,3.0637e+05,0.1230
18.0812,137,7.4474e+05,4.3928e+05,3.0546e+05,0.1227
18.2135,138,7.4243e+05,4.3787e+05,3.0456e+05,0.1236
18.3449,139,7.4015e+05,4.3647e+05,3.0367e+05,0.1228
18.4783,140,7.3787e+05,4.3508e+05,3.0278e+05,0.1249
18.6081,141,7.3559e+05,4.3369e+05,3.0191e+05,0.1212
18.7400,142,7.3333e+05,4.3227e+05,3.0106e+05,0.1230
18.8705,143,7.3107e+05,4.3084e+05,3.0023e+05,0.1223
19.0036,144,7.2883e+05,4.2944e+05,2.9940e+05,0.1242
19.1353,145,7.2661e+05,4.2803e+05,2.9858e+05,0.1232
19.2689,146,7.2437e+05,4.2661e+05,2.9776e+05,0.1244
19.4001,147,7.2212e+05,4.2520e+05,2.9692e+05,0.1227
19.5327,148,7.1988e+05,4.2379e+05,2.9609e+05,0.1231
19.6629,149,7.1769e+05,4.2240e+05,2.9530e+05,0.1216
19.7948,150,7.1553e+05,4.2100e+05,2.9453e+05,0.1234
19.9230,151,7.1339e+05,4.1961e+05,2.9377e+05,0.1206
20.0527,152,7.1124e+05,4.1824e+05,2.9301e+05,0.1215
20.1847,153,7.0913e+05,4.1687e+05,2.9226e+05,0.1235
20.3131,154,7.0704e+05,4.1551e+05,2.9153e+05,0.1205
20.4449,155,7.0496e+05,4.1417e+05,2.9080e+05,0.1236
20.5746,156,7.0290e+05,4.1288e+05,2.9002e+05,0.1216
20.7049,157,7.0085e+05,4.1162e+05,2.8922e+05,0.1225
20.8366,158,6.9883e+05,4.1040e+05,2.8843e+05,0.1237
20.9662,159,6.9685e+05,4.0919e+05,2.8766e+05,0.1218
21.0975,160,6.9489e+05,4.0797e+05,2.8693e+05,0.1227
21.2299,161,6.9295e+05,4.0671e+05,2.8624e+05,0.1249
21.3608,162,6.9101e+05,4.0543e+05,2.8558e+05,0.1232
21.4892,163,6.8907e+05,4.0411e+05,2.8496e+05,0.1206
21.6219,164,6.8717e+05,4.0279e+05,2.8438e+05,0.1231
21.7517,165,6.8526e+05,4.0146e+05,2.8380e+05,0.1215
21.8841,166,6.8335e+05,4.0016e+05,2.8320e+05,0.1240
22.0135,167,6.8142e+05,3.9887e+05,2.8256e+05,0.1214
22.1438,168,6.7947e+05,3.9759e+05,2.8189e+05,0.1222
22.2747,169,6.7753e+05,3.9634e+05,2.8119e+05,0.1207
22.4032,170,6.7561e+05,3.9511e+05,2.8051e+05,0.1209
22.5359,171,6.7375e+05,3.9389e+05,2.7986e+05,0.1241
22.6661,172,6.7194e+05,3.9267e+05,2.7928e+05,0.1205
22.7986,173,6.7016e+05,3.9141e+05,2.7875e+05,0.1236
22.9287,174,6.6841e+05,3.9015e+05,2.7825e+05,0.1217
23.0625,175,6.6666e+05,3.8889e+05,2.7778e+05,0.1245
23.1917,176,6.6492e+05,3.8763e+05,2.7729e+05,0.1205
23.3232,177,6.6319e+05,3.8639e+05,2.7680e+05,0.1236
23.4519,178,6.6146e+05,3.8518e+05,2.7628e+05,0.1213
23.5844,179,6.5976e+05,3.8403e+05,2.7573e+05,0.1245
23.7154,180,6.5807e+05,3.8293e+05,2.7515e+05,0.1231
23.8487,181,6.5642e+05,3.8188e+05,2.7453e+05,0.1250
23.9794,182,6.5478e+05,3.8087e+05,2.7391e+05,0.1228
24.1130,183,6.5315e+05,3.7985e+05,2.7331e+05,0.1247
24.2431,184,6.5154e+05,3.7882e+05,2.7272e+05,0.1221
24.3757,185,6.4990e+05,3.7777e+05,2.7214e+05,0.1244
24.5051,186,6.4825e+05,3.7668e+05,2.7157e+05,0.1213
24.6355,187,6.4659e+05,3.7558e+05,2.7100e+05,0.1227
24.7661,188,6.4493e+05,3.7449e+05,2.7044e+05,0.1226
24.8939,189,6.4330e+05,3.7343e+05,2.6987e+05,0.1204
25.0265,190,6.4171e+05,3.7242e+05,2.6929e+05,0.1243
25.1552,191,6.4017e+05,3.7142e+05,2.6874e+05,0.1210
25.2865,192,6.3865e+05,3.7043e+05,2.6823e+05,0.1233
25.4153,193,6.3716e+05,3.6942e+05,2.6773e+05,0.1211
25.5439,194,6.3567e+05,3.6841e+05,2.6726e+05,0.1211
25.6768,195,6.3418e+05,3.6736e+05,2.6682e+05,0.1250
25.8059,196,6.3271e+05,3.6628e+05,2.6642e+05,0.1211
25.9383,197,6.3125e+05,3.6518e+05,2.6606e+05,0.1246
26.0686,198,6.2977e+05,3.6407e+05,2.6570e+05,0.1218
26.2026,199,6.2829e+05,3.6297e+05,2.6532e+05,0.1255
26.3339,200,6.2678e+05,3.6189e+05,2.6489e+05,0.1205
26.4689,201,6.2528e+05,3.6085e+05,2.6443e+05,0.1228
26.5982,202,6.2377e+05,3.5987e+05,2.6390e+05,0.1209
26.7319,203,6.2227e+05,3.5894e+05,2.6333e+05,0.1243
26.8619,204,6.2079e+05,3.5807e+05,2.6272e+05,0.1217
26.9950,205,6.1934e+05,3.5723e+05,2.6211e+05,0.1247
27.1251,206,6.1789e+05,3.5639e+05,2.6150e+05,0.1217
27.2575,207,6.1645e+05,3.5556e+05,2.6089e+05,0.1242
27.3869,208,6.1503e+05,3.5471e+05,2.6032e+05,0.1216
27.5200,209,6.1362e+05,3.5384e+05,2.5978e+05,0.1250
27.6491,210,6.1222e+05,3.5297e+05,2.5925e+05,0.1213
27.7812,211,6.1085e+05,3.5211e+05,2.5875e+05,0.1240
27.9102,212,6.0951e+05,3.5126e+05,2.5825e+05,0.1211
28.0396,213,6.0820e+05,3.5044e+05,2.5776e+05,0.1215
28.1710,214,6.0692e+05,3.4965e+05,2.5727e+05,0.1234
28.3000,215,6.0565e+05,3.4889e+05,2.5676e+05,0.1207
28.4317,216,6.0439e+05,3.4816e+05,2.5623e+05,0.1234
28.5608,217,6.0313e+05,3.4746e+05,2.5566e+05,0.1214
28.6953,218,6.0187e+05,3.4676e+05,2.5511e+05,0.1261
28.8256,219,6.0062e+05,3.4603e+05,2.5459e+05,0.1215
28.9578,220,5.9938e+05,3.4526e+05,2.5412e+05,0.1242
29.0891,221,5.9816e+05,3.4446e+05,2.5370e+05,0.1227
29.2222,222,5.9694e+05,3.4363e+05,2.5331e+05,0.1249
29.3522,223,5.9572e+05,3.4277e+05,2.5295e+05,0.1224
29.4856,224,5.9448e+05,3.4189e+05,2.5259e+05,0.1256
29.6149,225,5.9326e+05,3.4103e+05,2.5223e+05,0.1208
29.7448,226,5.9204e+05,3.4019e+05,2.5185e+05,0.1225
29.8749,227,5.9085e+05,3.3938e+05,2.5147e+05,0.1225
30.0030,228,5.8968e+05,3.3860e+05,2.5108e+05,0.1207
30.1351,229,5.8852e+05,3.3783e+05,2.5068e+05,0.1243
30.2643,230,5.8736e+05,3.3707e+05,2.5029e+05,0.1208
30.3961,231,5.8620e+05,3.3631e+05,2.4989e+05,0.1236
30.5259,232,5.8504e+05,3.3555e+05,2.4949e+05,0.1216
30.6575,233,5.8389e+05,3.3481e+05,2.4908e+05,0.1239
30.7880,234,5.8274e+05,3.3408e+05,2.4866e+05,0.1227
30.9162,235,5.8159e+05,3.3336e+05,2.4822e+05,0.1205
31.0483,236,5.8044e+05,3.3267e+05,2.4777e+05,0.1245
31.1770,237,5.7929e+05,3.3199e+05,2.4730e+05,0.1207
31.3078,238,5.7816e+05,3.3131e+05,2.4684e+05,0.1234
31.4362,239,5.7703e+05,3.3064e+05,2.4638e+05,0.1210
31.5649,240,5.7591e+05,3.2995e+05,2.4596e+05,0.1209
31.6983,241,5.7479e+05,3.2922e+05,2.4557e+05,0.1250
31.8271,242,5.7371e+05,3.2848e+05,2.4523e+05,0.1203
31.9601,243,5.7264e+05,3.2772e+05,2.4491e+05,0.1250
32.0908,244,5.7157e+05,3.2696e+05,2.4461e+05,0.1221
32.2230,245,5.7050e+05,3.2622e+05,2.4428e+05,0.1238
32.3517,246,5.6943e+05,3.2550e+05,2.4393e+05,0.1211
32.4837,247,5.6838e+05,3.2481e+05,2.4357e+05,0.1240
32.6136,248,5.6735e+05,3.2415e+05,2.4321e+05,0.1218
32.7433,249,5.6635e+05,3.2351e+05,2.4284e+05,0.1217
32.8740,250,5.6534e+05,3.2287e+05,2.4246e+05,0.1230
33.0024,251,5.6431e+05,3.2225e+05,2.4206e+05,0.1206
33.1347,252,5.6328e+05,3.2163e+05,2.4165e+05,0.1241
33.2634,253,5.6224e+05,3.2100e+05,2.4124e+05,0.1208
33.3953,254,5.6120e+05,3.2035e+05,2.4085e+05,0.1242
33.5245,255,5.6017e+05,3.1969e+05,2.4047e+05,0.1213
33.6528,256,5.5914e+05,3.1902e+05,2.4012e+05,0.1205
33.7862,257,5.5814e+05,3.1836e+05,2.3978e+05,0.1249
33.9139,258,5.5716e+05,3.1770e+05,2.3946e+05,0.1202
34.0446,259,5.5619e+05,3.1705e+05,2.3914e+05,0.1230
34.1741,260,5.5521e+05,3.1641e+05,2.3880e+05,0.1219
34.3060,261,5.5426e+05,3.1581e+05,2.3844e+05,0.1242
34.4366,262,5.5330e+05,3.1525e+05,2.3805e+05,0.1223
34.5656,263,5.5235e+05,3.1472e+05,2.3763e+05,0.1209
34.6983,264,5.5142e+05,3.1423e+05,2.3719e+05,0.1246
34.8266,265,5.5051e+05,3.1377e+05,2.3675e+05,0.1208
34.9580,266,5.4962e+05,3.1331e+05,2.3631e+05,0.1235
35.0874,267,5.4874e+05,3.1286e+05,2.3588e+05,0.1211
35.2177,268,5.4786e+05,3.1238e+05,2.3548e+05,0.1223
35.3474,269,5.4698e+05,3.1187e+05,2.3510e+05,0.1219
35.4757,270,5.4607e+05,3.1133e+05,2.3475e+05,0.1206
35.6082,271,5.4518e+05,3.1075e+05,2.3442e+05,0.1238
35.7374,272,5.4428e+05,3.1015e+05,2.3412e+05,0.1213
35.8686,273,5.4338e+05,3.0953e+05,2.3385e+05,0.1236
35.9978,274,5.4248e+05,3.0889e+05,2.3358e+05,0.1215
36.1269,275,5.4158e+05,3.0827e+05,2.3332e+05,0.1208
36.2587,276,5.4070e+05,3.0766e+05,2.3304e+05,0.1240
36.3873,277,5.3983e+05,3.0709e+05,2.3274e+05,0.1213
36.5195,278,5.3896e+05,3.0656e+05,2.3240e+05,0.1236
36.6490,279,5.3809e+05,3.0607e+05,2.3202e+05,0.1215
36.7816,280,5.3724e+05,3.0560e+05,2.3164e+05,0.1247
36.9110,281,5.3641e+05,3.0514e+05,2.3127e+05,0.1216
37.0405,282,5.3559e+05,3.0468e+05,2.3090e+05,0.1221
37.1713,283,5.3477e+05,3.0420e+05,2.3057e+05,0.1229
37.2991,284,5.3395e+05,3.0368e+05,2.3026e+05,0.1205
37.4329,285,5.3312e+05,3.0312e+05,2.3000e+05,0.1257
37.5631,286,5.3229e+05,3.0253e+05,2.2977e+05,0.1223
37.6960,287,5.3147e+05,3.0192e+05,2.2955e+05,0.1247
37.8243,288,5.3066e+05,3.0133e+05,2.2932e+05,0.1204
37.9559,289,5.2984e+05,3.0077e+05,2.2907e+05,0.1237
38.0864,290,5.2902e+05,3.0023e+05,2.2879e+05,0.1220
38.2154,291,5.2821e+05,2.9973e+05,2.2847e+05,0.1212
38.3469,292,5.2739e+05,2.9926e+05,2.2813e+05,0.1236
38.4805,293,5.2657e+05,2.9880e+05,2.2777e+05,0.1205
38.6119,294,5.2575e+05,2.9834e+05,2.2742e+05,0.1237
38.7410,295,5.2495e+05,2.9786e+05,2.2709e+05,0.1204
38.8731,296,5.2416e+05,2.9737e+05,2.2679e+05,0.1240
39.0017,297,5.2337e+05,2.9685e+05,2.2652e+05,0.1209
39.1336,298,5.2260e+05,2.9630e+05,2.2630e+05,0.1242
39.2633,299,5.2183e+05,2.9574e+05,2.2609e+05,0.1220
39.3935,300,5.2107e+05,2.9517e+05,2.2590e+05,0.1226
39.5248,301,5.2032e+05,2.9463e+05,2.2569e+05,0.1220
39.6532,302,5.1955e+05,2.9412e+05,2.2543e+05,0.1204
39.7853,303,5.1879e+05,2.9367e+05,2.2512e+05,0.1238
39.9137,304,5.1801e+05,2.9327e+05,2.2475e+05,0.1205
40.0457,305,5.1724e+05,2.9289e+05,2.2434e+05,0.1237
40.1750,306,5.1646e+05,2.9253e+05,2.2393e+05,0.1212
40.3057,307,5.1572e+05,2.9218e+05,2.2354e+05,0.1225
40.4375,308,5.1500e+05,2.9182e+05,2.2318e+05,0.1235
40.5673,309,5.1430e+05,2.9144e+05,2.2286e+05,0.1219
40.6997,310,5.1361e+05,2.9105e+05,2.2257e+05,0.1242
40.8283,311,5.1292e+05,2.9064e+05,2.2229e+05,0.1208
40.9606,312,5.1222e+05,2.9020e+05,2.2202e+05,0.1247
41.0896,313,5.1153e+05,2.8975e+05,2.2178e+05,0.1206
41.2222,314,5.1083e+05,2.8927e+05,2.2156e+05,0.1247
41.3515,315,5.1013e+05,2.8877e+05,2.2137e+05,0.1218
41.4833,316,5.0945e+05,2.8825e+05,2.2120e+05,0.1238
41.6127,317,5.0877e+05,2.8772e+05,2.2105e+05,0.1215
41.7411,318,5.0811e+05,2.8719e+05,2.2091e+05,0.1206
41.8725,319,5.0745e+05,2.8666e+05,2.2078e+05,0.1238
42.0009,320,5.0678e+05,2.8616e+05,2.2062e+05,0.1208
42.1329,321,5.0612e+05,2.8570e+05,2.2041e+05,0.1239
42.2624,322,5.0545e+05,2.8529e+05,2.2017e+05,0.1219
42.3915,323,5.0478e+05,2.8491e+05,2.1987e+05,0.1215
42.5250,324,5.0411e+05,2.8457e+05,2.1953e+05,0.1228
42.6537,325,5.0343e+05,2.8425e+05,2.1918e+05,0.1207
42.7845,326,5.0276e+05,2.8393e+05,2.1883e+05,0.1227
42.9135,327,5.0209e+05,2.8359e+05,2.1850e+05,0.1214
43.0450,328,5.0143e+05,2.8323e+05,2.1820e+05,0.1239
43.1751,329,5.0077e+05,2.8284e+05,2.1793e+05,0.1223
43.3060,330,5.0012e+05,2.8244e+05,2.1768e+05,0.1228
43.4355,331,4.9947e+05,2.8203e+05,2.1743e+05,0.1221
43.5643,332,4.9881e+05,2.8161e+05,2.1720e+05,0.1212
43.6971,333,4.9815e+05,2.8116e+05,2.1699e+05,0.1248
43.8267,334,4.9750e+05,2.8071e+05,2.1679e+05,0.1211
43.9588,335,4.9686e+05,2.8025e+05,2.1660e+05,0.1244
44.0880,336,4.9621e+05,2.7979e+05,2.1642e+05,0.1213
44.2190,337,4.9558e+05,2.7933e+05,2.1624e+05,0.1232
44.3492,338,4.9495e+05,2.7889e+05,2.1606e+05,0.1227
44.4776,339,4.9432e+05,2.7848e+05,2.1584e+05,0.1211
44.6090,340,4.9370e+05,2.7809e+05,2.1561e+05,0.1233
44.7372,341,4.9308e+05,2.7771e+05,2.1536e+05,0.1200
44.8690,342,4.9246e+05,2.7735e+05,2.1510e+05,0.1239
44.9982,343,4.9183e+05,2.7699e+05,2.1484e+05,0.1216
45.1285,344,4.9122e+05,2.7663e+05,2.1458e+05,0.1223
45.2611,345,4.9060e+05,2.7627e+05,2.1433e+05,0.1241
45.3906,346,4.8998e+05,2.7591e+05,2.1408e+05,0.1222
45.5255,347,4.8938e+05,2.7556e+05,2.1382e+05,0.1266
45.6559,348,4.8878e+05,2.7522e+05,2.1355e+05,0.1225
45.7869,349,4.8819e+05,2.7488e+05,2.1331e+05,0.1230
45.9155,350,4.8759e+05,2.7453e+05,2.1306e+05,0.1207
46.0474,351,4.8699e+05,2.7419e+05,2.1281e+05,0.1242
46.1758,352,4.8640e+05,2.7385e+05,2.1254e+05,0.1205
46.3071,353,4.8580e+05,2.7352e+05,2.1228e+05,0.1233
46.4359,354,4.8521e+05,2.7318e+05,2.1203e+05,0.1214
46.5656,355,4.8463e+05,2.7283e+05,2.1181e+05,0.1206
46.6986,356,4.8407e+05,2.7245e+05,2.1162e+05,0.1250
46.8281,357,4.8351e+05,2.7207e+05,2.1144e+05,0.1214
46.9603,358,4.8296e+05,2.7169e+05,2.1126e+05,0.1243
47.0894,359,4.8240e+05,2.7133e+05,2.1107e+05,0.1206
47.2215,360,4.8184e+05,2.7100e+05,2.1084e+05,0.1244
47.3501,361,4.8127e+05,2.7067e+05,2.1060e+05,0.1213
47.4799,362,4.8070e+05,2.7035e+05,2.1035e+05,0.1223
47.6110,363,4.8013e+05,2.7003e+05,2.1010e+05,0.1230
47.7389,364,4.7956e+05,2.6971e+05,2.0986e+05,0.1199
47.8707,365,4.7899e+05,2.6936e+05,2.0963e+05,0.1238
48.0005,366,4.7843e+05,2.6899e+05,2.0944e+05,0.1221
48.1322,367,4.7788e+05,2.6862e+05,2.0925e+05,0.1235
48.2629,368,4.7734e+05,2.6827e+05,2.0907e+05,0.1228
48.3956,369,4.7680e+05,2.6795e+05,2.0885e+05,0.1249
48.5253,370,4.7627e+05,2.6765e+05,2.0862e+05,0.1219
48.6561,371,4.7574e+05,2.6738e+05,2.0836e+05,0.1230
48.7864,372,4.7522e+05,2.6711e+05,2.0810e+05,0.1226
48.9148,373,4.7469e+05,2.6684e+05,2.0786e+05,0.1206
49.0469,374,4.7417e+05,2.6653e+05,2.0764e+05,0.1241
49.1743,375,4.7364e+05,2.6619e+05,2.0745e+05,0.1195
49.3049,376,4.7311e+05,2.6582e+05,2.0729e+05,0.1230
49.4342,377,4.7257e+05,2.6545e+05,2.0712e+05,0.1218
49.5639,378,4.7203e+05,2.6508e+05,2.0695e+05,0.1221
49.6960,379,4.7148e+05,2.6473e+05,2.0675e+05,0.1240
49.8262,380,4.7094e+05,2.6442e+05,2.0652e+05,0.1221
49.9614,381,4.7042e+05,2.6414e+05,2.0628e+05,0.1270
50.0910,382,4.6991e+05,2.6387e+05,2.0604e+05,0.1209
50.2228,383,4.6940e+05,2.6359e+05,2.0581e+05,0.1236
50.3517,384,4.6890e+05,2.6331e+05,2.0559e+05,0.1211
50.4848,385,4.6840e+05,2.6303e+05,2.0537e+05,0.1252
50.6158,386,4.6791e+05,2.6273e+05,2.0518e+05,0.1213
50.7480,387,4.6741e+05,2.6241e+05,2.0500e+05,0.1240
50.8771,388,4.6691e+05,2.6208e+05,2.0483e+05,0.1217
51.0086,389,4.6640e+05,2.6174e+05,2.0466e+05,0.1237
51.1381,390,4.6589e+05,2.6142e+05,2.0448e+05,0.1217
51.2680,391,4.6539e+05,2.6109e+05,2.0429e+05,0.1224
51.4002,392,4.6489e+05,2.6077e+05,2.0412e+05,0.1246
51.5285,393,4.6440e+05,2.6044e+05,2.0396e+05,0.1206
51.6614,394,4.6392e+05,2.6012e+05,2.0380e+05,0.1251
51.7926,395,4.6344e+05,2.5979e+05,2.0364e+05,0.1195
51.9265,396,4.6296e+05,2.5949e+05,2.0347e+05,0.1254
52.0550,397,4.6248e+05,2.5919e+05,2.0329e+05,0.1207
52.1878,398,4.6201e+05,2.5890e+05,2.0311e+05,0.1249
52.3169,399,4.6154e+05,2.5863e+05,2.0291e+05,0.1215
52.4492,400,4.6106e+05,2.5837e+05,2.0268e+05,0.1245
52.5805,401,4.6057e+05,2.5814e+05,2.0243e+05,0.1208
52.7126,402,4.6009e+05,2.5793e+05,2.0217e+05,0.1241
52.8434,403,4.5962e+05,2.5771e+05,2.0191e+05,0.1223
52.9761,404,4.5914e+05,2.5748e+05,2.0167e+05,0.1247
53.1050,405,4.5867e+05,2.5723e+05,2.0144e+05,0.1213
53.2341,406,4.5821e+05,2.5698e+05,2.0122e+05,0.1212
53.3649,407,4.5775e+05,2.5673e+05,2.0102e+05,0.1229
53.4937,408,4.5728e+05,2.5649e+05,2.0079e+05,0.1211
53.6271,409,4.5682e+05,2.5626e+05,2.0056e+05,0.1254
53.7567,410,4.5637e+05,2.5603e+05,2.0034e+05,0.1210
53.8906,411,4.5592e+05,2.5579e+05,2.0013e+05,0.1256
54.0213,412,4.5548e+05,2.5553e+05,1.9995e+05,0.1226
54.1552,413,4.5504e+05,2.5525e+05,1.9978e+05,0.1256
54.2848,414,4.5460e+05,2.5497e+05,1.9963e+05,0.1212
54.4174,415,4.5417e+05,2.5469e+05,1.9949e+05,0.1240
54.5478,416,4.5374e+05,2.5440e+05,1.9933e+05,0.1224
54.6805,417,4.5330e+05,2.5412e+05,1.9918e+05,0.1228
54.8092,418,4.5286e+05,2.5384e+05,1.9902e+05,0.1206
54.9409,419,4.5242e+05,2.5356e+05,1.9886e+05,0.1238
55.0705,420,4.5197e+05,2.5329e+05,1.9868e+05,0.1217
55.2000,421,4.5153e+05,2.5304e+05,1.9849e+05,0.1215
55.3304,422,4.5110e+05,2.5280e+05,1.9830e+05,0.1224
55.4595,423,4.5068e+05,2.5256e+05,1.9812e+05,0.1215
55.5922,424,4.5026e+05,2.5232e+05,1.9794e+05,0.1245
55.7218,425,4.4985e+05,2.5211e+05,1.9774e+05,0.1215
55.8544,426,4.4943e+05,2.5189e+05,1.9754e+05,0.1248
55.9846,427,4.4902e+05,2.5167e+05,1.9735e+05,0.1224
56.1169,428,4.4861e+05,2.5147e+05,1.9714e+05,0.1241
56.2478,429,4.4820e+05,2.5126e+05,1.9694e+05,0.1232
56.3785,430,4.4779e+05,2.5105e+05,1.9674e+05,0.1233
56.5088,431,4.4739e+05,2.5083e+05,1.9656e+05,0.1228
56.6378,432,4.4699e+05,2.5059e+05,1.9640e+05,0.1206
56.7711,433,4.4659e+05,2.5033e+05,1.9625e+05,0.1250
56.9008,434,4.4618e+05,2.5005e+05,1.9613e+05,0.1216
57.0343,435,4.4577e+05,2.4975e+05,1.9602e+05,0.1254
57.1657,436,4.4538e+05,2.4944e+05,1.9593e+05,0.1231
57.3001,437,4.4499e+05,2.4913e+05,1.9586e+05,0.1261
57.4308,438,4.4461e+05,2.4884e+05,1.9578e+05,0.1224
57.5618,439,4.4424e+05,2.4857e+05,1.9567e+05,0.1224
57.6912,440,4.4385e+05,2.4834e+05,1.9552e+05,0.1209
57.8233,441,4.4346e+05,2.4813e+05,1.9534e+05,0.1238
57.9526,442,4.4307e+05,2.4794e+05,1.9513e+05,0.1214
58.0860,443,4.4267e+05,2.4775e+05,1.9492e+05,0.1247
58.2166,444,4.4228e+05,2.4757e+05,1.9471e+05,0.1226
58.3489,445,4.4190e+05,2.4736e+05,1.9454e+05,0.1247
58.4780,446,4.4153e+05,2.4714e+05,1.9439e+05,0.1217
58.6102,447,4.4117e+05,2.4690e+05,1.9426e+05,0.1240
58.7406,448,4.4080e+05,2.4666e+05,1.9414e+05,0.1222
58.8730,449,4.4044e+05,2.4643e+05,1.9401e+05,0.1238
59.0019,450,4.4007e+05,2.4621e+05,1.9387e+05,0.1212
59.1314,451,4.3971e+05,2.4600e+05,1.9371e+05,0.1218
59.2631,452,4.3934e+05,2.4579e+05,1.9355e+05,0.1234
59.3916,453,4.3898e+05,2.4558e+05,1.9340e+05,0.1203
59.5244,454,4.3862e+05,2.4536e+05,1.9327e+05,0.1248
59.6538,455,4.3827e+05,2.4512e+05,1.9315e+05,0.1214
59.7872,456,4.3791e+05,2.4487e+05,1.9304e+05,0.1253
59.9179,457,4.3754e+05,2.4461e+05,1.9293e+05,0.1227
60.0512,458,4.3717e+05,2.4435e+05,1.9282e+05,0.1253
60.1805,459,4.3680e+05,2.4410e+05,1.9270e+05,0.1211
60.3134,460,4.3644e+05,2.4386e+05,1.9258e+05,0.1250
60.4438,461,4.3608e+05,2.4363e+05,1.9245e+05,0.1213
60.5754,462,4.3572e+05,2.4339e+05,1.9233e+05,0.1237
60.7074,463,4.3536e+05,2.4315e+05,1.9221e+05,0.1241
60.8400,464,4.3501e+05,2.4289e+05,1.9212e+05,0.1244
60.9712,465,4.3466e+05,2.4262e+05,1.9204e+05,0.1236
61.1051,466,4.3430e+05,2.4235e+05,1.9195e+05,0.1260
61.2359,467,4.3395e+05,2.4210e+05,1.9185e+05,0.1228
61.3700,468,4.3361e+05,2.4187e+05,1.9174e+05,0.1253
61.4994,469,4.3326e+05,2.4166e+05,1.9161e+05,0.1217
61.6352,470,4.3292e+05,2.4146e+05,1.9146e+05,0.1276
61.7651,471,4.3258e+05,2.4127e+05,1.9131e+05,0.1197
61.8970,472,4.3223e+05,2.4107e+05,1.9116e+05,0.1239
62.0257,473,4.3189e+05,2.4086e+05,1.9103e+05,0.1209
62.1585,474,4.3154e+05,2.4063e+05,1.9091e+05,0.1251
62.2896,475,4.3120e+05,2.4040e+05,1.9080e+05,0.1231
62.4232,476,4.3085e+05,2.4016e+05,1.9069e+05,0.1258
62.5531,477,4.3051e+05,2.3993e+05,1.9058e+05,0.1225
62.6862,478,4.3017e+05,2.3971e+05,1.9046e+05,0.1251
62.8158,479,4.2983e+05,2.3951e+05,1.9033e+05,0.1214
62.9475,480,4.2951e+05,2.3931e+05,1.9020e+05,0.1240
63.0771,481,4.2920e+05,2.3912e+05,1.9008e+05,0.1211
63.2058,482,4.2889e+05,2.3892e+05,1.8997e+05,0.1207
63.3377,483,4.2858e+05,2.3872e+05,1.8986e+05,0.1237
63.4664,484,4.2826e+05,2.3852e+05,1.8974e+05,0.1214
63.5987,485,4.2794e+05,2.3832e+05,1.8962e+05,0.1239
63.7280,486,4.2763e+05,2.3814e+05,1.8949e+05,0.1214
63.8586,487,4.2731e+05,2.3797e+05,1.8934e+05,0.1228
63.9895,488,4.2700e+05,2.3782e+05,1.8918e+05,0.1235
64.1193,489,4.2668e+05,2.3768e+05,1.8901e+05,0.1217
64.2520,490,4.2637e+05,2.3753e+05,1.8885e+05,0.1245
64.3821,491,4.2607e+05,2.3736e+05,1.8872e+05,0.1221
64.5147,492,4.2577e+05,2.3717e+05,1.8860e+05,0.1240
64.6440,493,4.2545e+05,2.3697e+05,1.8848e+05,0.1216
64.7781,494,4.2513e+05,2.3678e+05,1.8835e+05,0.1261
64.9079,495,4.2481e+05,2.3661e+05,1.8820e+05,0.1215
65.0416,496,4.2450e+05,2.3646e+05,1.8804e+05,0.1253
65.1719,497,4.2418e+05,2.3632e+05,1.8786e+05,0.1226
65.3043,498,4.2387e+05,2.3619e+05,1.8768e+05,0.1243
65.4335,499,4.2356e+05,2.3604e+05,1.8752e+05,0.1215
65.5668,500,4.2324e+05,2.3586e+05,1.8739e+05,0.1250
65.6989,501,4.2293e+05,2.3563e+05,1.8730e+05,0.1229
65.8319,502,4.2262e+05,2.3537e+05,1.8725e+05,0.1243
65.9632,503,4.2232e+05,2.3512e+05,1.8719e+05,0.1232
66.0953,504,4.2202e+05,2.3489e+05,1.8713e+05,0.1237
66.2227,505,4.2172e+05,2.3467e+05,1.8705e+05,0.1196
66.3545,506,4.2143e+05,2.3449e+05,1.8694e+05,0.1237
66.4847,507,4.2114e+05,2.3433e+05,1.8680e+05,0.1228
66.6143,508,4.2084e+05,2.3419e+05,1.8665e+05,0.1212
66.7475,509,4.2054e+05,2.3404e+05,1.8650e+05,0.1250
66.8771,510,4.2024e+05,2.3387e+05,1.8637e+05,0.1217
67.0095,511,4.1994e+05,2.3369e+05,1.8625e+05,0.1246
67.1378,512,4.1964e+05,2.3349e+05,1.8616e+05,0.1203
67.2692,513,4.1935e+05,2.3328e+05,1.8607e+05,0.1233
67.4003,514,4.1905e+05,2.3309e+05,1.8596e+05,0.1231
67.5319,515,4.1876e+05,2.3291e+05,1.8585e+05,0.1234
67.6630,516,4.1846e+05,2.3275e+05,1.8571e+05,0.1228
67.7973,517,4.1817e+05,2.3260e+05,1.8557e+05,0.1265
67.9274,518,4.1789e+05,2.3244e+05,1.8545e+05,0.1221
68.0609,519,4.1760e+05,2.3227e+05,1.8533e+05,0.1257
68.1913,520,4.1732e+05,2.3210e+05,1.8522e+05,0.1222
68.3253,521,4.1703e+05,2.3193e+05,1.8510e+05,0.1258
68.4548,522,4.1674e+05,2.3177e+05,1.8496e+05,0.1222
68.5885,523,4.1644e+05,2.3162e+05,1.8483e+05,0.1257
68.7208,524,4.1616e+05,2.3145e+05,1.8470e+05,0.1239
68.8555,525,4.1587e+05,2.3127e+05,1.8460e+05,0.1232
68.9853,526,4.1559e+05,2.3107e+05,1.8452e+05,0.1220
69.1178,527,4.1530e+05,2.3086e+05,1.8445e+05,0.1246
69.2470,528,4.1502e+05,2.3065e+05,1.8437e+05,0.1213
69.3803,529,4.1474e+05,2.3046e+05,1.8429e+05,0.1254
69.5091,530,4.1446e+05,2.3029e+05,1.8417e+05,0.1208
69.6415,531,4.1418e+05,2.3014e+05,1.8405e+05,0.1241
69.7704,532,4.1390e+05,2.2998e+05,1.8393e+05,0.1216
69.8996,533,4.1363e+05,2.2980e+05,1.8383e+05,0.1211
70.0310,534,4.1336e+05,2.2961e+05,1.8375e+05,0.1229
70.1595,535,4.1310e+05,2.2941e+05,1.8369e+05,0.1202
70.2918,536,4.1283e+05,2.2920e+05,1.8363e+05,0.1245
70.4218,537,4.1257e+05,2.2900e+05,1.8357e+05,0.1220
70.5544,538,4.1231e+05,2.2883e+05,1.8348e+05,0.1245
70.6840,539,4.1204e+05,2.2868e+05,1.8336e+05,0.1217
70.8136,540,4.1178e+05,2.2855e+05,1.8323e+05,0.1217
70.9465,541,4.1151e+05,2.2843e+05,1.8308e+05,0.1246
71.0770,542,4.1125e+05,2.2830e+05,1.8295e+05,0.1220
71.2090,543,4.1100e+05,2.2815e+05,1.8284e+05,0.1242
71.3388,544,4.1074e+05,2.2800e+05,1.8274e+05,0.1218
71.4721,545,4.1049e+05,2.2786e+05,1.8263e+05,0.1252
71.6006,546,4.1024e+05,2.2773e+05,1.8251e+05,0.1204
71.7326,547,4.0998e+05,2.2760e+05,1.8238e+05,0.1237
71.8621,548,4.0973e+05,2.2746e+05,1.8227e+05,0.1214
71.9937,549,4.0948e+05,2.2730e+05,1.8218e+05,0.1239
72.1241,550,4.0922e+05,2.2711e+05,1.8210e+05,0.1220
72.2525,551,4.0895e+05,2.2693e+05,1.8202e+05,0.1208
72.3836,552,4.0869e+05,2.2676e+05,1.8193e+05,0.1233
72.5141,553,4.0843e+05,2.2661e+05,1.8182e+05,0.1223
72.6467,554,4.0817e+05,2.2647e+05,1.8170e+05,0.1243
72.7767,555,4.0793e+05,2.2635e+05,1.8158e+05,0.1222
72.9089,556,4.0768e+05,2.2621e+05,1.8147e+05,0.1240
73.0389,557,4.0744e+05,2.2607e+05,1.8137e+05,0.1222
73.1702,558,4.0719e+05,2.2592e+05,1.8127e+05,0.1236
73.2996,559,4.0695e+05,2.2576e+05,1.8118e+05,0.1217
73.4276,560,4.0670e+05,2.2559e+05,1.8111e+05,0.1208
73.5592,561,4.0646e+05,2.2542e+05,1.8104e+05,0.1240
73.6879,562,4.0622e+05,2.2525e+05,1.8097e+05,0.1211
73.8214,563,4.0597e+05,2.2509e+05,1.8088e+05,0.1253
73.9520,564,4.0573e+05,2.2494e+05,1.8079e+05,0.1228
74.0866,565,4.0549e+05,2.2481e+05,1.8068e+05,0.1256
74.2165,566,4.0525e+05,2.2468e+05,1.8057e+05,0.1219
74.3497,567,4.0501e+05,2.2454e+05,1.8047e+05,0.1248
74.4793,568,4.0477e+05,2.2440e+05,1.8037e+05,0.1215
74.6127,569,4.0454e+05,2.2427e+05,1.8027e+05,0.1249
74.7424,570,4.0431e+05,2.2413e+05,1.8017e+05,0.1217
74.8771,571,4.0407e+05,2.2400e+05,1.8007e+05,0.1270
75.0063,572,4.0384e+05,2.2387e+05,1.7997e+05,0.1210
75.1400,573,4.0360e+05,2.2374e+05,1.7986e+05,0.1251
75.2699,574,4.0336e+05,2.2362e+05,1.7974e+05,0.1223
75.4028,575,4.0312e+05,2.2351e+05,1.7962e+05,0.1246
75.5314,576,4.0289e+05,2.2339e+05,1.7950e+05,0.1211
75.6633,577,4.0266e+05,2.2327e+05,1.7938e+05,0.1237
75.7934,578,4.0243e+05,2.2315e+05,1.7927e+05,0.1227
75.9229,579,4.0220e+05,2.2302e+05,1.7918e+05,0.1215
76.0546,580,4.0198e+05,2.2287e+05,1.7911e+05,0.1241
76.1832,581,4.0175e+05,2.2272e+05,1.7903e+05,0.1206
76.3153,582,4.0152e+05,2.2257e+05,1.7895e+05,0.1242
76.4446,583,4.0129e+05,2.2242e+05,1.7887e+05,0.1217
76.5765,584,4.0107e+05,2.2229e+05,1.7878e+05,0.1240
76.7064,585,4.0085e+05,2.2216e+05,1.7869e+05,0.1220
76.8365,586,4.0063e+05,2.2203e+05,1.7859e+05,0.1221
76.9677,587,4.0040e+05,2.2190e+05,1.7850e+05,0.1236
77.0965,588,4.0018e+05,2.2177e+05,1.7841e+05,0.1210
77.2279,589,3.9995e+05,2.2164e+05,1.7831e+05,0.1237
77.3570,590,3.9972e+05,2.2150e+05,1.7822e+05,0.1216
77.4876,591,3.9950e+05,2.2136e+05,1.7814e+05,0.1233
77.6194,592,3.9927e+05,2.2122e+05,1.7805e+05,0.1235
77.7493,593,3.9905e+05,2.2107e+05,1.7798e+05,0.1218
77.8825,594,3.9883e+05,2.2092e+05,1.7791e+05,0.1252
78.0141,595,3.9861e+05,2.2077e+05,1.7785e+05,0.1232
78.1465,596,3.9840e+05,2.2062e+05,1.7778e+05,0.1240
78.2768,597,3.9817e+05,2.2045e+05,1.7772e+05,0.1223
78.4087,598,3.9795e+05,2.2028e+05,1.7767e+05,0.1239
78.5372,599,3.9774e+05,2.2010e+05,1.7764e+05,0.1211
78.6719,600,3.9753e+05,2.1991e+05,1.7762e+05,0.1266
78.8098,601,3.9732e+05,2.1973e+05,1.7758e+05,0.1216
78.9409,602,3.9710e+05,2.1957e+05,1.7753e+05,0.1230
79.0731,603,3.9688e+05,2.1943e+05,1.7746e+05,0.1238
79.2032,604,3.9667e+05,2.1930e+05,1.7737e+05,0.1221
79.3358,605,3.9646e+05,2.1919e+05,1.7727e+05,0.1249
79.4664,606,3.9625e+05,2.1911e+05,1.7714e+05,0.1229
79.5979,607,3.9605e+05,2.1903e+05,1.7702e+05,0.1239
79.7281,608,3.9585e+05,2.1895e+05,1.7690e+05,0.1225
79.8601,609,3.9563e+05,2.1885e+05,1.7679e+05,0.1243
79.9908,610,3.9542e+05,2.1874e+05,1.7668e+05,0.1216
80.1274,611,3.9521e+05,2.1863e+05,1.7657e+05,0.1289
80.2565,612,3.9500e+05,2.1852e+05,1.7647e+05,0.1213
80.3880,613,3.9478e+05,2.1841e+05,1.7638e+05,0.1236
80.5176,614,3.9457e+05,2.1828e+05,1.7629e+05,0.1216
80.6470,615,3.9436e+05,2.1815e+05,1.7621e+05,0.1218
80.7792,616,3.9415e+05,2.1802e+05,1.7614e+05,0.1241
80.9096,617,3.9396e+05,2.1788e+05,1.7608e+05,0.1221
81.0438,618,3.9376e+05,2.1775e+05,1.7601e+05,0.1259
81.1738,619,3.9356e+05,2.1763e+05,1.7593e+05,0.1222
81.3060,620,3.9335e+05,2.1752e+05,1.7584e+05,0.1238
81.4352,621,3.9315e+05,2.1739e+05,1.7576e+05,0.1218
81.5681,622,3.9296e+05,2.1727e+05,1.7569e+05,0.1252
81.6976,623,3.9276e+05,2.1714e+05,1.7562e+05,0.1218
81.8304,624,3.9256e+05,2.1704e+05,1.7553e+05,0.1252
81.9612,625,3.9236e+05,2.1695e+05,1.7542e+05,0.1226
82.0938,626,3.9217e+05,2.1686e+05,1.7531e+05,0.1234
82.2233,627,3.9198e+05,2.1676e+05,1.7522e+05,0.1215
82.3565,628,3.9179e+05,2.1664e+05,1.7515e+05,0.1253
82.4865,629,3.9160e+05,2.1650e+05,1.7510e+05,0.1223
82.6194,630,3.9141e+05,2.1637e+05,1.7504e+05,0.1250
82.7494,631,3.9121e+05,2.1624e+05,1.7497e+05,0.1222
82.8830,632,3.9101e+05,2.1612e+05,1.7489e+05,0.1259
83.0135,633,3.9082e+05,2.1601e+05,1.7481e+05,0.1227
83.1473,634,3.9063e+05,2.1591e+05,1.7473e+05,0.1253
83.2764,635,3.9045e+05,2.1581e+05,1.7463e+05,0.1213
83.4092,636,3.9025e+05,2.1572e+05,1.7453e+05,0.1249
83.5381,637,3.9006e+05,2.1564e+05,1.7442e+05,0.1213
83.6680,638,3.8987e+05,2.1557e+05,1.7430e+05,0.1224
83.8040,639,3.8968e+05,2.1548e+05,1.7420e+05,0.1183
83.9362,640,3.8949e+05,2.1537e+05,1.7412e+05,0.1244
84.0653,641,3.8929e+05,2.1524e+05,1.7406e+05,0.1213
84.1957,642,3.8910e+05,2.1509e+05,1.7402e+05,0.1227
84.3256,643,3.8891e+05,2.1493e+05,1.7398e+05,0.1224
84.4540,644,3.8872e+05,2.1479e+05,1.7393e+05,0.1209
84.5878,645,3.8853e+05,2.1464e+05,1.7388e+05,0.1257
84.7171,646,3.8833e+05,2.1451e+05,1.7383e+05,0.1217
84.8501,647,3.8814e+05,2.1438e+05,1.7376e+05,0.1249
84.9799,648,3.8796e+05,2.1427e+05,1.7368e+05,0.1222
85.1123,649,3.8778e+05,2.1419e+05,1.7359e+05,0.1244
85.2418,650,3.8761e+05,2.1411e+05,1.7349e+05,0.1222
85.3735,651,3.8743e+05,2.1403e+05,1.7340e+05,0.1242
85.5032,652,3.8724e+05,2.1391e+05,1.7333e+05,0.1220
85.6324,653,3.8706e+05,2.1377e+05,1.7329e+05,0.1216
85.7652,654,3.8687e+05,2.1361e+05,1.7327e+05,0.1252
85.8942,655,3.8670e+05,2.1346e+05,1.7324e+05,0.1209
86.0309,656,3.8652e+05,2.1334e+05,1.7318e+05,0.1282
86.1633,657,3.8635e+05,2.1324e+05,1.7310e+05,0.1238
86.2939,658,3.8617e+05,2.1314e+05,1.7303e+05,0.1226
86.4241,659,3.8599e+05,2.1303e+05,1.7296e+05,0.1223
86.5560,660,3.8582e+05,2.1293e+05,1.7288e+05,0.1240
86.6865,661,3.8564e+05,2.1284e+05,1.7280e+05,0.1222
86.8185,662,3.8547e+05,2.1276e+05,1.7271e+05,0.1237
86.9486,663,3.8529e+05,2.1271e+05,1.7258e+05,0.1225
87.0832,664,3.8511e+05,2.1266e+05,1.7245e+05,0.1210
87.2114,665,3.8494e+05,2.1260e+05,1.7234e+05,0.1205
87.3429,666,3.8477e+05,2.1250e+05,1.7227e+05,0.1235
87.4717,667,3.8460e+05,2.1239e+05,1.7221e+05,0.1215
87.6040,668,3.8443e+05,2.1228e+05,1.7215e+05,0.1244
87.7332,669,3.8426e+05,2.1218e+05,1.7208e+05,0.1216
87.8628,670,3.8409e+05,2.1209e+05,1.7200e+05,0.1218
87.9936,671,3.8392e+05,2.1200e+05,1.7192e+05,0.1234
88.1230,672,3.8375e+05,2.1189e+05,1.7185e+05,0.1211
88.2563,673,3.8358e+05,2.1178e+05,1.7180e+05,0.1252
88.3848,674,3.8341e+05,2.1167e+05,1.7174e+05,0.1208
88.5172,675,3.8323e+05,2.1156e+05,1.7168e+05,0.1242
88.6474,676,3.8306e+05,2.1146e+05,1.7160e+05,0.1223
88.7805,677,3.8289e+05,2.1136e+05,1.7152e+05,0.1247
88.9094,678,3.8272e+05,2.1127e+05,1.7145e+05,0.1213
89.0394,679,3.8257e+05,2.1116e+05,1.7140e+05,0.1227
89.1714,680,3.8241e+05,2.1105e+05,1.7135e+05,0.1240
89.3015,681,3.8224e+05,2.1094e+05,1.7130e+05,0.1225
89.4342,682,3.8208e+05,2.1084e+05,1.7123e+05,0.1251
89.5635,683,3.8192e+05,2.1076e+05,1.7116e+05,0.1213
89.6941,684,3.8176e+05,2.1069e+05,1.7107e+05,0.1229
89.8222,685,3.8159e+05,2.1062e+05,1.7097e+05,0.1207
89.9551,686,3.8143e+05,2.1057e+05,1.7086e+05,0.1256
90.0859,687,3.8127e+05,2.1051e+05,1.7077e+05,0.1227
90.2200,688,3.8112e+05,2.1041e+05,1.7071e+05,0.1255
90.3500,689,3.8096e+05,2.1029e+05,1.7067e+05,0.1224
90.4831,690,3.8081e+05,2.1015e+05,1.7066e+05,0.1256
90.6125,691,3.8065e+05,2.1002e+05,1.7063e+05,0.1214
90.7463,692,3.8049e+05,2.0991e+05,1.7058e+05,0.1256
90.8758,693,3.8033e+05,2.0979e+05,1.7054e+05,0.1217
91.0088,694,3.8018e+05,2.0965e+05,1.7052e+05,0.1249
91.1392,695,3.8002e+05,2.0950e+05,1.7052e+05,0.1224
91.2707,696,3.7986e+05,2.0935e+05,1.7051e+05,0.1235
91.3996,697,3.7970e+05,2.0922e+05,1.7048e+05,0.1215
91.5285,698,3.7954e+05,2.0913e+05,1.7042e+05,0.1215
91.6599,699,3.7938e+05,2.0905e+05,1.7033e+05,0.1235
91.7888,700,3.7922e+05,2.0896e+05,1.7026e+05,0.1208
91.9217,701,3.7907e+05,2.0887e+05,1.7019e+05,0.1244
92.0526,702,3.7891e+05,2.0878e+05,1.7014e+05,0.1229
92.1859,703,3.7876e+05,2.0869e+05,1.7008e+05,0.1249
92.3157,704,3.7861e+05,2.0859e+05,1.7002e+05,0.1217
92.4492,705,3.7845e+05,2.0850e+05,1.6996e+05,0.1244
92.5782,706,3.7830e+05,2.0840e+05,1.6990e+05,0.1211
92.7102,707,3.7815e+05,2.0831e+05,1.6984e+05,0.1242
92.8391,708,3.7800e+05,2.0822e+05,1.6979e+05,0.1216
92.9685,709,3.7785e+05,2.0811e+05,1.6974e+05,0.1220
93.1001,710,3.7771e+05,2.0801e+05,1.6969e+05,0.1236
93.2273,711,3.7756e+05,2.0793e+05,1.6963e+05,0.1195
93.3603,712,3.7741e+05,2.0785e+05,1.6956e+05,0.1251
93.4887,713,3.7726e+05,2.0776e+05,1.6950e+05,0.1209
93.6197,714,3.7711e+05,2.0767e+05,1.6945e+05,0.1229
93.7507,715,3.7696e+05,2.0756e+05,1.6940e+05,0.1231
93.8784,716,3.7681e+05,2.0745e+05,1.6936e+05,0.1204
94.0096,717,3.7666e+05,2.0736e+05,1.6930e+05,0.1234
94.1394,718,3.7651e+05,2.0730e+05,1.6921e+05,0.1216
94.2725,719,3.7636e+05,2.0727e+05,1.6909e+05,0.1243
94.4021,720,3.7621e+05,2.0725e+05,1.6896e+05,0.1220
94.5345,721,3.7606e+05,2.0719e+05,1.6886e+05,0.1246
94.6633,722,3.7591e+05,2.0710e+05,1.6880e+05,0.1210
94.7923,723,3.7576e+05,2.0700e+05,1.6876e+05,0.1210
94.9230,724,3.7561e+05,2.0691e+05,1.6871e+05,0.1232
95.0520,725,3.7546e+05,2.0682e+05,1.6863e+05,0.1214
95.1847,726,3.7531e+05,2.0675e+05,1.6856e+05,0.1225
95.3130,727,3.7516e+05,2.0667e+05,1.6849e+05,0.1210
95.4428,728,3.7502e+05,2.0658e+05,1.6844e+05,0.1224
95.5743,729,3.7488e+05,2.0649e+05,1.6839e+05,0.1237
95.7030,730,3.7474e+05,2.0639e+05,1.6835e+05,0.1210
95.8361,731,3.7460e+05,2.0629e+05,1.6831e+05,0.1252
95.9655,732,3.7446e+05,2.0618e+05,1.6828e+05,0.1219
96.0992,733,3.7432e+05,2.0607e+05,1.6824e+05,0.1252
96.2292,734,3.7417e+05,2.0597e+05,1.6820e+05,0.1220
96.3622,735,3.7402e+05,2.0588e+05,1.6814e+05,0.1252
96.4902,736,3.7388e+05,2.0579e+05,1.6808e+05,0.1207
96.6228,737,3.7373e+05,2.0571e+05,1.6802e+05,0.1248
96.7534,738,3.7359e+05,2.0563e+05,1.6797e+05,0.1224
96.8869,739,3.7345e+05,2.0555e+05,1.6790e+05,0.1253
97.0161,740,3.7331e+05,2.0546e+05,1.6785e+05,0.1217
97.1489,741,3.7317e+05,2.0536e+05,1.6781e+05,0.1240
97.2786,742,3.7303e+05,2.0527e+05,1.6776e+05,0.1221
97.4094,743,3.7290e+05,2.0518e+05,1.6772e+05,0.1233
97.5390,744,3.7277e+05,2.0508e+05,1.6769e+05,0.1219
97.6665,745,3.7263e+05,2.0498e+05,1.6765e+05,0.1198
97.7984,746,3.7248e+05,2.0489e+05,1.6759e+05,0.1238
97.9269,747,3.7234e+05,2.0483e+05,1.6752e+05,0.1208
98.0581,748,3.7221e+05,2.0478e+05,1.6743e+05,0.1237
98.1884,749,3.7208e+05,2.0474e+05,1.6734e+05,0.1225
98.3165,750,3.7195e+05,2.0467e+05,1.6728e+05,0.1205
98.4485,751,3.7181e+05,2.0457e+05,1.6723e+05,0.1245
98.5770,752,3.7167e+05,2.0447e+05,1.6720e+05,0.1211
98.7083,753,3.7154e+05,2.0439e+05,1.6714e+05,0.1240
98.8377,754,3.7141e+05,2.0435e+05,1.6706e+05,0.1212
98.9666,755,3.7128e+05,2.0432e+05,1.6696e+05,0.1211
99.0991,756,3.7115e+05,2.0428e+05,1.6687e+05,0.1242
99.2287,757,3.7102e+05,2.0421e+05,1.6682e+05,0.1197
99.3600,758,3.7089e+05,2.0411e+05,1.6678e+05,0.1235
99.4885,759,3.7076e+05,2.0400e+05,1.6676e+05,0.1212
99.6201,760,3.7063e+05,2.0391e+05,1.6672e+05,0.1240
99.7494,761,3.7050e+05,2.0383e+05,1.6667e+05,0.1220
99.8775,762,3.7037e+05,2.0374e+05,1.6662e+05,0.1204
100.0091,763,3.7024e+05,2.0365e+05,1.6659e+05,0.1236
100.1370,764,3.7011e+05,2.0356e+05,1.6655e+05,0.1203
100.2707,765,3.6998e+05,2.0347e+05,1.6651e+05,0.1234
100.4003,766,3.6986e+05,2.0340e+05,1.6646e+05,0.1219
100.5322,767,3.6974e+05,2.0331e+05,1.6643e+05,0.1236
100.6629,768,3.6962e+05,2.0321e+05,1.6641e+05,0.1226
100.7943,769,3.6950e+05,2.0311e+05,1.6639e+05,0.1237
100.9253,770,3.6938e+05,2.0302e+05,1.6636e+05,0.1233
101.0548,771,3.6925e+05,2.0295e+05,1.6630e+05,0.1218
101.1860,772,3.6912e+05,2.0289e+05,1.6623e+05,0.1234
101.3138,773,3.6900e+05,2.0284e+05,1.6616e+05,0.1203
101.4461,774,3.6888e+05,2.0277e+05,1.6611e+05,0.1240
101.5753,775,3.6875e+05,2.0268e+05,1.6608e+05,0.1211
101.7067,776,3.6862e+05,2.0259e+05,1.6604e+05,0.1239
101.8359,777,3.6850e+05,2.0252e+05,1.6598e+05,0.1216
101.9645,778,3.6837e+05,2.0246e+05,1.6591e+05,0.1212
102.0964,779,3.6825e+05,2.0242e+05,1.6583e+05,0.1234
102.2251,780,3.6813e+05,2.0237e+05,1.6576e+05,0.1209
102.3566,781,3.6800e+05,2.0231e+05,1.6569e+05,0.1238
102.4863,782,3.6787e+05,2.0223e+05,1.6565e+05,0.1219
102.6152,783,3.6775e+05,2.0214e+05,1.6561e+05,0.1211
102.7463,784,3.6763e+05,2.0205e+05,1.6558e+05,0.1231
102.8744,785,3.6750e+05,2.0195e+05,1.6555e+05,0.1204
103.0059,786,3.6738e+05,2.0186e+05,1.6552e+05,0.1240
103.1355,787,3.6726e+05,2.0177e+05,1.6548e+05,0.1215
103.2666,788,3.6714e+05,2.0169e+05,1.6545e+05,0.1235
103.3971,789,3.6702e+05,2.0162e+05,1.6540e+05,0.1231
103.5253,790,3.6691e+05,2.0157e+05,1.6534e+05,0.1205
103.6578,791,3.6679e+05,2.0153e+05,1.6526e+05,0.1241
103.7900,792,3.6667e+05,2.0149e+05,1.6518e+05,0.1247
103.9218,793,3.6655e+05,2.0146e+05,1.6510e+05,0.1239
104.0498,794,3.6644e+05,2.0141e+05,1.6502e+05,0.1208
104.1816,795,3.6632e+05,2.0135e+05,1.6497e+05,0.1237
104.3106,796,3.6620e+05,2.0125e+05,1.6494e+05,0.1214
104.4411,797,3.6607e+05,2.0114e+05,1.6493e+05,0.1227
104.5713,798,3.6596e+05,2.0103e+05,1.6492e+05,0.1222
104.6989,799,3.6584e+05,2.0093e+05,1.6491e+05,0.1202
104.8319,800,3.6572e+05,2.0083e+05,1.6489e+05,0.1248
104.9650,801,3.6560e+05,2.0074e+05,1.6486e+05,0.1217
105.0977,802,3.6548e+05,2.0065e+05,1.6483e+05,0.1242
105.2292,803,3.6536e+05,2.0058e+05,1.6478e+05,0.1222
105.3608,804,3.6525e+05,2.0055e+05,1.6469e+05,0.1235
105.4908,805,3.6513e+05,2.0053e+05,1.6460e+05,0.1221
105.6225,806,3.6502e+05,2.0048e+05,1.6454e+05,0.1241
105.7515,807,3.6490e+05,2.0038e+05,1.6452e+05,0.1212
105.8832,808,3.6478e+05,2.0025e+05,1.6453e+05,0.1242
106.0119,809,3.6466e+05,2.0016e+05,1.6451e+05,0.1216
106.1411,810,3.6455e+05,2.0011e+05,1.6444e+05,0.1212
106.2748,811,3.6443e+05,2.0009e+05,1.6435e+05,0.1253
106.4048,812,3.6432e+05,2.0006e+05,1.6426e+05,0.1223
106.5373,813,3.6420e+05,2.0000e+05,1.6421e+05,0.1246
106.6664,814,3.6409e+05,1.9991e+05,1.6417e+05,0.1213
106.7992,815,3.6397e+05,1.9982e+05,1.6414e+05,0.1242
106.9285,816,3.6385e+05,1.9974e+05,1.6411e+05,0.1209
107.0610,817,3.6373e+05,1.9965e+05,1.6409e+05,0.1247
107.1909,818,3.6362e+05,1.9957e+05,1.6405e+05,0.1218
107.3272,819,3.6351e+05,1.9950e+05,1.6401e+05,0.1240
107.4571,820,3.6339e+05,1.9944e+05,1.6396e+05,0.1221
107.5891,821,3.6328e+05,1.9938e+05,1.6389e+05,0.1240
107.7173,822,3.6316e+05,1.9933e+05,1.6383e+05,0.1205
107.8485,823,3.6304e+05,1.9929e+05,1.6375e+05,0.1233
107.9774,824,3.6294e+05,1.9926e+05,1.6368e+05,0.1215
108.1061,825,3.6283e+05,1.9922e+05,1.6361e+05,0.1208
108.2401,826,3.6272e+05,1.9917e+05,1.6355e+05,0.1260
108.3700,827,3.6260e+05,1.9909e+05,1.6352e+05,0.1220
108.5018,828,3.6249e+05,1.9900e+05,1.6349e+05,0.1239
108.6296,829,3.6239e+05,1.9891e+05,1.6347e+05,0.1201
108.7629,830,3.6227e+05,1.9884e+05,1.6343e+05,0.1249
108.8932,831,3.6216e+05,1.9877e+05,1.6339e+05,0.1227
109.0266,832,3.6206e+05,1.9871e+05,1.6335e+05,0.1255
109.1572,833,3.6195e+05,1.9865e+05,1.6330e+05,0.1227
109.2896,834,3.6183e+05,1.9859e+05,1.6324e+05,0.1244
109.4197,835,3.6171e+05,1.9852e+05,1.6319e+05,0.1226
109.5511,836,3.6160e+05,1.9844e+05,1.6316e+05,0.1239
109.6811,837,3.6149e+05,1.9835e+05,1.6314e+05,0.1226
109.8095,838,3.6137e+05,1.9827e+05,1.6310e+05,0.1212
109.9401,839,3.6127e+05,1.9822e+05,1.6305e+05,0.1231
110.0683,840,3.6116e+05,1.9818e+05,1.6298e+05,0.1208
110.2093,841,3.6105e+05,1.9813e+05,1.6291e+05,0.1331
110.3401,842,3.6094e+05,1.9806e+05,1.6288e+05,0.1225
110.4701,843,3.6083e+05,1.9796e+05,1.6287e+05,0.1225
110.5990,844,3.6071e+05,1.9785e+05,1.6286e+05,0.1214
110.7320,845,3.6061e+05,1.9778e+05,1.6283e+05,0.1245
110.8610,846,3.6050e+05,1.9774e+05,1.6275e+05,0.1211
110.9931,847,3.6039e+05,1.9773e+05,1.6266e+05,0.1244
111.1220,848,3.6028e+05,1.9771e+05,1.6257e+05,0.1211
111.2531,849,3.6018e+05,1.9766e+05,1.6252e+05,0.1236
111.3839,850,3.6007e+05,1.9758e+05,1.6249e+05,0.1217
111.5125,851,3.5996e+05,1.9747e+05,1.6249e+05,0.1211
111.6432,852,3.5985e+05,1.9737e+05,1.6248e+05,0.1227
111.7718,853,3.5975e+05,1.9728e+05,1.6247e+05,0.1208
111.9033,854,3.5964e+05,1.9720e+05,1.6245e+05,0.1237
112.0327,855,3.5953e+05,1.9714e+05,1.6240e+05,0.1218
112.1627,856,3.5942e+05,1.9707e+05,1.6235e+05,0.1219
112.2939,857,3.5932e+05,1.9701e+05,1.6230e+05,0.1227
112.4225,858,3.5921e+05,1.9695e+05,1.6226e+05,0.1204
112.5551,859,3.5911e+05,1.9688e+05,1.6222e+05,0.1250
112.6838,860,3.5900e+05,1.9683e+05,1.6218e+05,0.1212
112.8171,861,3.5890e+05,1.9678e+05,1.6212e+05,0.1253
112.9460,862,3.5879e+05,1.9675e+05,1.6205e+05,0.1211
113.0794,863,3.5868e+05,1.9672e+05,1.6196e+05,0.1255
113.2091,864,3.5858e+05,1.9668e+05,1.6189e+05,0.1219
113.3423,865,3.5847e+05,1.9663e+05,1.6184e+05,0.1250
113.4723,866,3.5837e+05,1.9658e+05,1.6180e+05,0.1224
113.6039,867,3.5827e+05,1.9650e+05,1.6177e+05,0.1237
113.7336,868,3.5816e+05,1.9642e+05,1.6174e+05,0.1222
113.8624,869,3.5806e+05,1.9634e+05,1.6172e+05,0.1207
113.9937,870,3.5796e+05,1.9629e+05,1.6167e+05,0.1232
114.1220,871,3.5786e+05,1.9624e+05,1.6161e+05,0.1201
114.2544,872,3.5775e+05,1.9620e+05,1.6155e+05,0.1245
114.3838,873,3.5765e+05,1.9614e+05,1.6151e+05,0.1219
114.5142,874,3.5755e+05,1.9608e+05,1.6147e+05,0.1228
114.6446,875,3.5744e+05,1.9602e+05,1.6142e+05,0.1231
114.7738,876,3.5733e+05,1.9596e+05,1.6137e+05,0.1214
114.9066,877,3.5723e+05,1.9590e+05,1.6133e+05,0.1245
115.0375,878,3.5712e+05,1.9582e+05,1.6130e+05,0.1226
115.1710,879,3.5702e+05,1.9574e+05,1.6129e+05,0.1255
115.3021,880,3.5692e+05,1.9565e+05,1.6128e+05,0.1233
115.4346,881,3.5682e+05,1.9558e+05,1.6124e+05,0.1236
115.5632,882,3.5672e+05,1.9553e+05,1.6119e+05,0.1209
115.6953,883,3.5662e+05,1.9549e+05,1.6113e+05,0.1242
115.8248,884,3.5652e+05,1.9545e+05,1.6107e+05,0.1217
115.9580,885,3.5643e+05,1.9541e+05,1.6102e+05,0.1253
116.0872,886,3.5633e+05,1.9536e+05,1.6096e+05,0.1208
116.2201,887,3.5622e+05,1.9531e+05,1.6091e+05,0.1245
116.3500,888,3.5612e+05,1.9525e+05,1.6088e+05,0.1222
116.4809,889,3.5602e+05,1.9518e+05,1.6085e+05,0.1233
116.6126,890,3.5593e+05,1.9511e+05,1.6081e+05,0.1238
116.7426,891,3.5582e+05,1.9504e+05,1.6078e+05,0.1216
116.8745,892,3.5572e+05,1.9498e+05,1.6074e+05,0.1240
117.0044,893,3.5562e+05,1.9492e+05,1.6070e+05,0.1222
117.1374,894,3.5552e+05,1.9487e+05,1.6065e+05,0.1252
117.2682,895,3.5542e+05,1.9483e+05,1.6059e+05,0.1227
117.4026,896,3.5532e+05,1.9480e+05,1.6052e+05,0.1261
117.5350,897,3.5522e+05,1.9476e+05,1.6046e+05,0.1236
117.6671,898,3.5512e+05,1.9470e+05,1.6042e+05,0.1237
117.7981,899,3.5502e+05,1.9463e+05,1.6038e+05,0.1227
117.9285,900,3.5492e+05,1.9458e+05,1.6034e+05,0.1225
118.0584,901,3.5482e+05,1.9455e+05,1.6027e+05,0.1211
118.1909,902,3.5472e+05,1.9454e+05,1.6018e+05,0.1246
118.3204,903,3.5463e+05,1.9451e+05,1.6012e+05,0.1212
118.4522,904,3.5453e+05,1.9445e+05,1.6008e+05,0.1240
118.5810,905,3.5444e+05,1.9437e+05,1.6007e+05,0.1210
118.7143,906,3.5434e+05,1.9427e+05,1.6007e+05,0.1252
118.8455,907,3.5423e+05,1.9419e+05,1.6004e+05,0.1192
118.9779,908,3.5414e+05,1.9413e+05,1.6000e+05,0.1240
119.1070,909,3.5405e+05,1.9410e+05,1.5995e+05,0.1215
119.2396,910,3.5396e+05,1.9406e+05,1.5989e+05,0.1245
119.3706,911,3.5386e+05,1.9399e+05,1.5987e+05,0.1229
119.5032,912,3.5376e+05,1.9389e+05,1.5987e+05,0.1244
119.6326,913,3.5366e+05,1.9379e+05,1.5987e+05,0.1218
119.7618,914,3.5356e+05,1.9371e+05,1.5985e+05,0.1212
119.8923,915,3.5346e+05,1.9365e+05,1.5981e+05,0.1228
120.0201,916,3.5337e+05,1.9362e+05,1.5975e+05,0.1206
120.1540,917,3.5328e+05,1.9360e+05,1.5968e+05,0.1262
120.2833,918,3.5319e+05,1.9358e+05,1.5961e+05,0.1216
120.4159,919,3.5310e+05,1.9355e+05,1.5955e+05,0.1249
120.5464,920,3.5300e+05,1.9349e+05,1.5951e+05,0.1228
120.6805,921,3.5290e+05,1.9341e+05,1.5949e+05,0.1260
120.8113,922,3.5280e+05,1.9333e+05,1.5947e+05,0.1221
120.9451,923,3.5271e+05,1.9326e+05,1.5945e+05,0.1253
121.0751,924,3.5262e+05,1.9321e+05,1.5941e+05,0.1216
121.2086,925,3.5253e+05,1.9316e+05,1.5936e+05,0.1251
121.3385,926,3.5243e+05,1.9311e+05,1.5932e+05,0.1220
121.4720,927,3.5233e+05,1.9304e+05,1.5929e+05,0.1254
121.6024,928,3.5224e+05,1.9297e+05,1.5927e+05,0.1222
121.7354,929,3.5216e+05,1.9291e+05,1.5925e+05,0.1246
121.8650,930,3.5207e+05,1.9284e+05,1.5923e+05,0.1215
121.9984,931,3.5198e+05,1.9278e+05,1.5920e+05,0.1248
122.1289,932,3.5188e+05,1.9272e+05,1.5917e+05,0.1226
122.2625,933,3.5179e+05,1.9265e+05,1.5914e+05,0.1250
122.3930,934,3.5170e+05,1.9258e+05,1.5912e+05,0.1227
122.5248,935,3.5161e+05,1.9253e+05,1.5908e+05,0.1232
122.6538,936,3.5152e+05,1.9249e+05,1.5903e+05,0.1218
122.7871,937,3.5143e+05,1.9245e+05,1.5897e+05,0.1255
122.9180,938,3.5134e+05,1.9241e+05,1.5893e+05,0.1226
123.0508,939,3.5125e+05,1.9235e+05,1.5890e+05,0.1249
123.1815,940,3.5115e+05,1.9229e+05,1.5886e+05,0.1224
123.3130,941,3.5107e+05,1.9225e+05,1.5881e+05,0.1237
123.4441,942,3.5097e+05,1.9220e+05,1.5877e+05,0.1236
123.5726,943,3.5088e+05,1.9213e+05,1.5875e+05,0.1206
123.7046,944,3.5079e+05,1.9204e+05,1.5875e+05,0.1242
123.8335,945,3.5070e+05,1.9195e+05,1.5875e+05,0.1210
123.9671,946,3.5061e+05,1.9191e+05,1.5870e+05,0.1250
124.0956,947,3.5052e+05,1.9189e+05,1.5863e+05,0.1207
124.2282,948,3.5042e+05,1.9185e+05,1.5858e+05,0.1245
124.3574,949,3.5033e+05,1.9177e+05,1.5856e+05,0.1214
124.4890,950,3.5024e+05,1.9169e+05,1.5856e+05,0.1242
124.6188,951,3.5016e+05,1.9163e+05,1.5853e+05,0.1220
124.7473,952,3.5007e+05,1.9161e+05,1.5847e+05,0.1210
124.8787,953,3.4999e+05,1.9158e+05,1.5840e+05,0.1239
125.0075,954,3.4989e+05,1.9153e+05,1.5836e+05,0.1208
125.1404,955,3.4980e+05,1.9146e+05,1.5833e+05,0.1248
125.2690,956,3.4971e+05,1.9141e+05,1.5830e+05,0.1209
125.3987,957,3.4962e+05,1.9136e+05,1.5826e+05,0.1220
125.5294,958,3.4953e+05,1.9130e+05,1.5824e+05,0.1230
125.6579,959,3.4945e+05,1.9122e+05,1.5823e+05,0.1208
125.7899,960,3.4936e+05,1.9115e+05,1.5821e+05,0.1244
125.9198,961,3.4928e+05,1.9111e+05,1.5817e+05,0.1222
126.0531,962,3.4920e+05,1.9107e+05,1.5813e+05,0.1256
126.1827,963,3.4911e+05,1.9102e+05,1.5808e+05,0.1212
126.3152,964,3.4902e+05,1.9097e+05,1.5805e+05,0.1248
126.4455,965,3.4894e+05,1.9092e+05,1.5801e+05,0.1223
126.5769,966,3.4886e+05,1.9085e+05,1.5800e+05,0.1228
126.7073,967,3.4878e+05,1.9077e+05,1.5801e+05,0.1225
126.8391,968,3.4870e+05,1.9071e+05,1.5799e+05,0.1235
126.9710,969,3.4861e+05,1.9069e+05,1.5791e+05,0.1240
127.1013,970,3.4852e+05,1.9067e+05,1.5784e+05,0.1222
127.2340,971,3.4843e+05,1.9062e+05,1.5781e+05,0.1241
127.3642,972,3.4835e+05,1.9055e+05,1.5780e+05,0.1222
127.4969,973,3.4827e+05,1.9046e+05,1.5781e+05,0.1251
127.6271,974,3.4819e+05,1.9037e+05,1.5781e+05,0.1221
127.7595,975,3.4810e+05,1.9030e+05,1.5780e+05,0.1240
127.8897,976,3.4802e+05,1.9026e+05,1.5776e+05,0.1219
128.0226,977,3.4793e+05,1.9026e+05,1.5767e+05,0.1254
128.1525,978,3.4785e+05,1.9028e+05,1.5758e+05,0.1223
128.2858,979,3.4777e+05,1.9028e+05,1.5749e+05,0.1248
128.4155,980,3.4769e+05,1.9025e+05,1.5744e+05,0.1220
128.5518,981,3.4761e+05,1.9019e+05,1.5742e+05,0.1284
128.6817,982,3.4752e+05,1.9013e+05,1.5739e+05,0.1221
128.8168,983,3.4744e+05,1.9007e+05,1.5737e+05,0.1276
128.9494,984,3.4736e+05,1.9001e+05,1.5735e+05,0.1249
129.0782,985,3.4728e+05,1.8997e+05,1.5731e+05,0.1207
129.2072,986,3.4720e+05,1.8993e+05,1.5727e+05,0.1212
129.3384,987,3.4713e+05,1.8988e+05,1.5724e+05,0.1234
129.4669,988,3.4705e+05,1.8983e+05,1.5721e+05,0.1209
129.6020,989,3.4696e+05,1.8978e+05,1.5718e+05,0.1222
129.7304,990,3.4688e+05,1.8974e+05,1.5714e+05,0.1203
129.8617,991,3.4680e+05,1.8971e+05,1.5709e+05,0.1233
129.9915,992,3.4672e+05,1.8969e+05,1.5703e+05,0.1216
130.1213,993,3.4665e+05,1.8967e+05,1.5698e+05,0.1221
130.2514,994,3.4657e+05,1.8961e+05,1.5696e+05,0.1225
130.3796,995,3.4649e+05,1.8951e+05,1.5697e+05,0.1206
130.5124,996,3.4641e+05,1.8942e+05,1.5699e+05,0.1249
130.6415,997,3.4633e+05,1.8936e+05,1.5697e+05,0.1216
130.7750,998,3.4626e+05,1.8933e+05,1.5692e+05,0.1250
130.9049,999,3.4618e+05,1.8929e+05,1.5689e+05,0.1221
