run_time,iteration,loss,style_loss,content_loss,time
0.1232,0,6.4011e+08,6.4011e+08,0.0000e+00,0.1232
0.2537,1,4.8446e+08,4.8411e+08,3.5020e+05,0.1216
0.3858,2,3.1632e+08,3.1552e+08,7.9498e+05,0.1245
0.5138,3,2.2390e+08,2.2277e+08,1.1329e+06,0.1212
0.6470,4,1.8589e+08,1.8458e+08,1.3087e+06,0.1255
0.7767,5,1.5520e+08,1.5384e+08,1.3662e+06,0.1227
0.9142,6,1.3777e+08,1.3637e+08,1.4028e+06,0.1302
1.0434,7,1.2958e+08,1.2811e+08,1.4718e+06,0.1220
1.1754,8,1.2272e+08,1.2116e+08,1.5645e+06,0.1246
1.3040,9,1.1573e+08,1.1406e+08,1.6653e+06,0.1216
1.4356,10,1.0927e+08,1.0751e+08,1.7588e+06,0.1245
1.5676,11,1.0304e+08,1.0121e+08,1.8274e+06,0.1252
1.6990,12,9.6133e+07,9.4273e+07,1.8598e+06,0.1242
1.8299,13,8.8691e+07,8.6832e+07,1.8590e+06,0.1240
1.9607,14,8.1626e+07,7.9789e+07,1.8361e+06,0.1237
2.0931,15,7.5719e+07,7.3915e+07,1.8044e+06,0.1246
2.2229,16,7.1103e+07,6.9328e+07,1.7749e+06,0.1227
2.3543,17,6.7295e+07,6.5539e+07,1.7560e+06,0.1243
2.4833,18,6.3844e+07,6.2095e+07,1.7489e+06,0.1221
2.6151,19,6.0598e+07,5.8845e+07,1.7534e+06,0.1247
2.7442,20,5.7631e+07,5.5865e+07,1.7664e+06,0.1220
2.8774,21,5.5053e+07,5.3270e+07,1.7824e+06,0.1259
3.0066,22,5.2878e+07,5.1080e+07,1.7979e+06,0.1223
3.1384,23,5.1063e+07,4.9254e+07,1.8085e+06,0.1243
3.2700,24,4.9493e+07,4.7681e+07,1.8126e+06,0.1246
3.4015,25,4.8087e+07,4.6278e+07,1.8090e+06,0.1243
3.5327,26,4.6842e+07,4.5044e+07,1.7982e+06,0.1243
3.6651,27,4.5772e+07,4.3991e+07,1.7816e+06,0.1253
3.7975,28,4.4851e+07,4.3089e+07,1.7620e+06,0.1250
3.9306,29,4.4020e+07,4.2277e+07,1.7424e+06,0.1255
4.0617,30,4.3205e+07,4.1481e+07,1.7242e+06,0.1236
4.1955,31,4.2354e+07,4.0644e+07,1.7093e+06,0.1265
4.3267,32,4.1456e+07,3.9757e+07,1.6996e+06,0.1239
4.4594,33,4.0546e+07,3.8852e+07,1.6942e+06,0.1252
4.5888,34,3.9674e+07,3.7982e+07,1.6925e+06,0.1224
4.7199,35,3.8869e+07,3.7175e+07,1.6940e+06,0.1239
4.8525,36,3.8138e+07,3.6440e+07,1.6980e+06,0.1253
4.9847,37,3.7473e+07,3.5770e+07,1.7028e+06,0.1247
5.1163,38,3.6856e+07,3.5150e+07,1.7067e+06,0.1240
5.2504,39,3.6276e+07,3.4568e+07,1.7083e+06,0.1264
5.3824,40,3.5740e+07,3.4033e+07,1.7077e+06,0.1238
5.5166,41,3.5241e+07,3.3536e+07,1.7052e+06,0.1265
5.6469,42,3.4762e+07,3.3061e+07,1.7007e+06,0.1226
5.7806,43,3.4285e+07,3.2590e+07,1.6947e+06,0.1259
5.9164,44,3.3787e+07,3.2100e+07,1.6873e+06,0.1283
6.0474,45,3.3273e+07,3.1593e+07,1.6796e+06,0.1234
6.1787,46,3.2761e+07,3.1089e+07,1.6716e+06,0.1240
6.3099,47,3.2272e+07,3.0609e+07,1.6636e+06,0.1240
6.4409,48,3.1821e+07,3.0166e+07,1.6554e+06,0.1238
6.5736,49,3.1410e+07,2.9763e+07,1.6471e+06,0.1257
6.7063,50,3.1022e+07,2.9383e+07,1.6392e+06,0.1253
6.8378,51,3.0639e+07,2.9007e+07,1.6319e+06,0.1241
6.9714,52,3.0244e+07,2.8619e+07,1.6248e+06,0.1259
7.1031,53,2.9825e+07,2.8207e+07,1.6181e+06,0.1243
7.2378,54,2.9391e+07,2.7779e+07,1.6118e+06,0.1272
7.3689,55,2.8960e+07,2.7354e+07,1.6060e+06,0.1237
7.5029,56,2.8552e+07,2.6950e+07,1.6012e+06,0.1266
7.6337,57,2.8175e+07,2.6578e+07,1.5972e+06,0.1235
7.7669,58,2.7828e+07,2.6234e+07,1.5941e+06,0.1258
7.8982,59,2.7501e+07,2.5909e+07,1.5916e+06,0.1240
8.0404,60,2.7184e+07,2.5595e+07,1.5898e+06,0.1347
8.1740,61,2.6868e+07,2.5281e+07,1.5878e+06,0.1260
8.3066,62,2.6551e+07,2.4966e+07,1.5855e+06,0.1253
8.4366,63,2.6238e+07,2.4655e+07,1.5824e+06,0.1228
8.5665,64,2.5936e+07,2.4358e+07,1.5783e+06,0.1227
8.6992,65,2.5647e+07,2.4074e+07,1.5732e+06,0.1253
8.8311,66,2.5368e+07,2.3801e+07,1.5669e+06,0.1245
8.9646,67,2.5095e+07,2.3536e+07,1.5596e+06,0.1241
9.0987,68,2.4823e+07,2.3272e+07,1.5514e+06,0.1264
9.2299,69,2.4547e+07,2.3004e+07,1.5426e+06,0.1241
9.3642,70,2.4267e+07,2.2734e+07,1.5336e+06,0.1268
9.4953,71,2.3988e+07,2.2463e+07,1.5250e+06,0.1237
9.6289,72,2.3712e+07,2.2194e+07,1.5171e+06,0.1258
9.7603,73,2.3436e+07,2.1926e+07,1.5104e+06,0.1241
9.8941,74,2.3165e+07,2.1660e+07,1.5050e+06,0.1263
10.0266,75,2.2897e+07,2.1396e+07,1.5009e+06,0.1252
10.1602,76,2.2631e+07,2.1133e+07,1.4980e+06,0.1261
10.2943,77,2.2370e+07,2.0874e+07,1.4961e+06,0.1269
10.4243,78,2.2115e+07,2.0620e+07,1.4948e+06,0.1227
10.5554,79,2.1869e+07,2.0375e+07,1.4934e+06,0.1242
10.6882,80,2.1632e+07,2.0140e+07,1.4919e+06,0.1256
10.8223,81,2.1401e+07,1.9911e+07,1.4898e+06,0.1266
10.9690,82,2.1172e+07,1.9686e+07,1.4868e+06,0.1203
11.0997,83,2.0942e+07,1.9459e+07,1.4826e+06,0.1232
11.2323,84,2.0710e+07,1.9232e+07,1.4774e+06,0.1254
11.3634,85,2.0481e+07,1.9010e+07,1.4713e+06,0.1240
11.4971,86,2.0258e+07,1.8794e+07,1.4646e+06,0.1262
11.6321,87,2.0046e+07,1.8588e+07,1.4575e+06,0.1237
11.7625,88,1.9844e+07,1.8393e+07,1.4507e+06,0.1233
11.8956,89,1.9650e+07,1.8205e+07,1.4445e+06,0.1260
12.0251,90,1.9459e+07,1.8019e+07,1.4391e+06,0.1224
12.1566,91,1.9266e+07,1.7831e+07,1.4348e+06,0.1243
12.2873,92,1.9068e+07,1.7636e+07,1.4318e+06,0.1231
12.4172,93,1.8865e+07,1.7435e+07,1.4302e+06,0.1226
12.5490,94,1.8660e+07,1.7231e+07,1.4294e+06,0.1242
12.6786,95,1.8455e+07,1.7026e+07,1.4291e+06,0.1225
12.8122,96,1.8255e+07,1.6826e+07,1.4292e+06,0.1265
12.9444,97,1.8062e+07,1.6633e+07,1.4293e+06,0.1251
13.0768,98,1.7874e+07,1.6445e+07,1.4292e+06,0.1253
13.2069,99,1.7688e+07,1.6260e+07,1.4286e+06,0.1230
13.3386,100,1.7499e+07,1.6072e+07,1.4269e+06,0.1243
13.4694,101,1.7306e+07,1.5882e+07,1.4244e+06,0.1227
13.6027,102,1.7112e+07,1.5690e+07,1.4212e+06,0.1260
13.7323,103,1.6918e+07,1.5501e+07,1.4177e+06,0.1224
13.8656,104,1.6729e+07,1.5315e+07,1.4138e+06,0.1259
13.9990,105,1.6547e+07,1.5137e+07,1.4100e+06,0.1230
14.1302,106,1.6371e+07,1.4964e+07,1.4064e+06,0.1240
14.2593,107,1.6201e+07,1.4797e+07,1.4034e+06,0.1224
14.3924,108,1.6033e+07,1.4632e+07,1.4011e+06,0.1261
14.5220,109,1.5867e+07,1.4468e+07,1.3994e+06,0.1226
14.6543,110,1.5702e+07,1.4304e+07,1.3985e+06,0.1250
14.7831,111,1.5540e+07,1.4141e+07,1.3982e+06,0.1220
14.9160,112,1.5379e+07,1.3981e+07,1.3983e+06,0.1257
15.0453,113,1.5221e+07,1.3822e+07,1.3987e+06,0.1222
15.1792,114,1.5066e+07,1.3666e+07,1.3993e+06,0.1250
15.3084,115,1.4912e+07,1.3512e+07,1.3998e+06,0.1221
15.4408,116,1.4759e+07,1.3359e+07,1.4000e+06,0.1255
15.5711,117,1.4607e+07,1.3208e+07,1.3996e+06,0.1234
15.7039,118,1.4457e+07,1.3059e+07,1.3986e+06,0.1256
15.8360,119,1.4309e+07,1.2912e+07,1.3969e+06,0.1248
15.9700,120,1.4164e+07,1.2769e+07,1.3948e+06,0.1265
16.0992,121,1.4022e+07,1.2629e+07,1.3925e+06,0.1218
16.2312,122,1.3881e+07,1.2491e+07,1.3900e+06,0.1253
16.3616,123,1.3741e+07,1.2353e+07,1.3876e+06,0.1235
16.4937,124,1.3600e+07,1.2214e+07,1.3853e+06,0.1254
16.6247,125,1.3459e+07,1.2075e+07,1.3835e+06,0.1240
16.7569,126,1.3318e+07,1.1936e+07,1.3820e+06,0.1244
16.8863,127,1.3179e+07,1.1798e+07,1.3809e+06,0.1224
17.0162,128,1.3044e+07,1.1664e+07,1.3802e+06,0.1230
17.1476,129,1.2914e+07,1.1534e+07,1.3797e+06,0.1240
17.2768,130,1.2787e+07,1.1407e+07,1.3792e+06,0.1221
17.4101,131,1.2661e+07,1.1282e+07,1.3789e+06,0.1262
17.5396,132,1.2535e+07,1.1156e+07,1.3784e+06,0.1226
17.6743,133,1.2408e+07,1.1030e+07,1.3777e+06,0.1274
17.8081,134,1.2281e+07,1.0904e+07,1.3768e+06,0.1256
17.9420,135,1.2155e+07,1.0779e+07,1.3756e+06,0.1261
18.0765,136,1.2032e+07,1.0658e+07,1.3742e+06,0.1266
18.2112,137,1.1914e+07,1.0541e+07,1.3727e+06,0.1273
18.3441,138,1.1799e+07,1.0428e+07,1.3713e+06,0.1252
18.4738,139,1.1687e+07,1.0317e+07,1.3698e+06,0.1225
18.6060,140,1.1576e+07,1.0207e+07,1.3684e+06,0.1253
18.7365,141,1.1464e+07,1.0097e+07,1.3672e+06,0.1236
18.8693,142,1.1353e+07,9.9868e+06,1.3659e+06,0.1253
18.9991,143,1.1242e+07,9.8774e+06,1.3646e+06,0.1223
19.1318,144,1.1133e+07,9.7698e+06,1.3634e+06,0.1253
19.2604,145,1.1027e+07,9.6648e+06,1.3621e+06,0.1218
19.3929,146,1.0923e+07,9.5626e+06,1.3606e+06,0.1254
19.5222,147,1.0821e+07,9.4624e+06,1.3587e+06,0.1223
19.6525,148,1.0721e+07,9.3640e+06,1.3567e+06,0.1236
19.7841,149,1.0621e+07,9.2669e+06,1.3545e+06,0.1247
19.9143,150,1.0524e+07,9.1713e+06,1.3522e+06,0.1232
20.0475,151,1.0427e+07,9.0773e+06,1.3500e+06,0.1260
20.1784,152,1.0333e+07,8.9851e+06,1.3480e+06,0.1235
20.3100,153,1.0241e+07,8.8947e+06,1.3461e+06,0.1246
20.4449,154,1.0150e+07,8.8051e+06,1.3445e+06,0.1280
20.5755,155,1.0059e+07,8.7154e+06,1.3432e+06,0.1234
20.7064,156,9.9670e+06,8.6248e+06,1.3423e+06,0.1239
20.8379,157,9.8756e+06,8.5341e+06,1.3415e+06,0.1247
20.9689,158,9.7855e+06,8.4447e+06,1.3408e+06,0.1239
21.1004,159,9.6971e+06,8.3570e+06,1.3401e+06,0.1220
21.2312,160,9.6110e+06,8.2716e+06,1.3394e+06,0.1239
21.3622,161,9.5270e+06,8.1886e+06,1.3384e+06,0.1239
21.4914,162,9.4451e+06,8.1079e+06,1.3372e+06,0.1223
21.6250,163,9.3637e+06,8.0282e+06,1.3355e+06,0.1265
21.7550,164,9.2824e+06,7.9488e+06,1.3336e+06,0.1228
21.8880,165,9.2014e+06,7.8700e+06,1.3314e+06,0.1256
22.0172,166,9.1214e+06,7.7924e+06,1.3290e+06,0.1223
22.1494,167,9.0435e+06,7.7169e+06,1.3266e+06,0.1250
22.2784,168,8.9686e+06,7.6444e+06,1.3242e+06,0.1219
22.4115,169,8.8958e+06,7.5738e+06,1.3220e+06,0.1258
22.5440,170,8.8244e+06,7.5044e+06,1.3201e+06,0.1248
22.6786,171,8.7534e+06,7.4350e+06,1.3184e+06,0.1268
22.8101,172,8.6817e+06,7.3646e+06,1.3171e+06,0.1243
22.9440,173,8.6094e+06,7.2933e+06,1.3161e+06,0.1268
23.0798,174,8.5372e+06,7.2218e+06,1.3154e+06,0.1288
23.2103,175,8.4658e+06,7.1510e+06,1.3147e+06,0.1232
23.3441,176,8.3957e+06,7.0817e+06,1.3141e+06,0.1266
23.4742,177,8.3272e+06,7.0140e+06,1.3133e+06,0.1230
23.6070,178,8.2603e+06,6.9481e+06,1.3122e+06,0.1256
23.7380,179,8.1946e+06,6.8839e+06,1.3107e+06,0.1241
23.8721,180,8.1296e+06,6.8207e+06,1.3089e+06,0.1266
24.0061,181,8.0655e+06,6.7587e+06,1.3068e+06,0.1267
24.1396,182,8.0022e+06,6.6978e+06,1.3044e+06,0.1230
24.2693,183,7.9399e+06,6.6380e+06,1.3019e+06,0.1228
24.4016,184,7.8788e+06,6.5794e+06,1.2994e+06,0.1252
24.5311,185,7.8188e+06,6.5218e+06,1.2970e+06,0.1223
24.6628,186,7.7595e+06,6.4648e+06,1.2947e+06,0.1248
24.7932,187,7.7007e+06,6.4079e+06,1.2927e+06,0.1233
24.9277,188,7.6428e+06,6.3518e+06,1.2911e+06,0.1271
25.0598,189,7.5866e+06,6.2969e+06,1.2896e+06,0.1251
25.1932,190,7.5315e+06,6.2432e+06,1.2884e+06,0.1258
25.3250,191,7.4774e+06,6.1903e+06,1.2871e+06,0.1247
25.4575,192,7.4237e+06,6.1379e+06,1.2859e+06,0.1255
25.5888,193,7.3700e+06,6.0855e+06,1.2845e+06,0.1245
25.7190,194,7.3155e+06,6.0326e+06,1.2830e+06,0.1232
25.8484,195,7.2607e+06,5.9795e+06,1.2812e+06,0.1224
25.9808,196,7.2063e+06,5.9270e+06,1.2792e+06,0.1252
26.1105,197,7.1528e+06,5.8757e+06,1.2771e+06,0.1228
26.2425,198,7.1012e+06,5.8263e+06,1.2749e+06,0.1249
26.3713,199,7.0512e+06,5.7785e+06,1.2727e+06,0.1219
26.5040,200,7.0022e+06,5.7316e+06,1.2706e+06,0.1260
26.6348,201,6.9536e+06,5.6848e+06,1.2688e+06,0.1231
26.7669,202,6.9051e+06,5.6379e+06,1.2671e+06,0.1252
26.8969,203,6.8563e+06,5.5908e+06,1.2656e+06,0.1231
27.0303,204,6.8079e+06,5.5437e+06,1.2642e+06,0.1264
27.1614,205,6.7603e+06,5.4975e+06,1.2628e+06,0.1241
27.2954,206,6.7141e+06,5.4526e+06,1.2615e+06,0.1264
27.4253,207,6.6692e+06,5.4090e+06,1.2602e+06,0.1229
27.5589,208,6.6254e+06,5.3667e+06,1.2587e+06,0.1266
27.6879,209,6.5820e+06,5.3249e+06,1.2571e+06,0.1222
27.8214,210,6.5385e+06,5.2833e+06,1.2552e+06,0.1261
27.9504,211,6.4948e+06,5.2416e+06,1.2532e+06,0.1223
28.0825,212,6.4510e+06,5.2001e+06,1.2509e+06,0.1250
28.2135,213,6.4075e+06,5.1588e+06,1.2487e+06,0.1240
28.3440,214,6.3646e+06,5.1183e+06,1.2464e+06,0.1238
28.4750,215,6.3223e+06,5.0783e+06,1.2441e+06,0.1242
28.6062,216,6.2807e+06,5.0388e+06,1.2419e+06,0.1244
28.7393,217,6.2395e+06,4.9997e+06,1.2398e+06,0.1262
28.8716,218,6.1987e+06,4.9609e+06,1.2378e+06,0.1251
29.0040,219,6.1584e+06,4.9225e+06,1.2359e+06,0.1255
29.1372,220,6.1185e+06,4.8844e+06,1.2341e+06,0.1260
29.2707,221,6.0791e+06,4.8468e+06,1.2322e+06,0.1252
29.4055,222,6.0399e+06,4.8096e+06,1.2303e+06,0.1270
29.5353,223,6.0011e+06,4.7728e+06,1.2283e+06,0.1226
29.6668,224,5.9626e+06,4.7366e+06,1.2260e+06,0.1243
29.7952,225,5.9246e+06,4.7010e+06,1.2236e+06,0.1213
29.9279,226,5.8872e+06,4.6662e+06,1.2210e+06,0.1257
30.0574,227,5.8507e+06,4.6324e+06,1.2183e+06,0.1224
30.1896,228,5.8149e+06,4.5994e+06,1.2156e+06,0.1249
30.3204,229,5.7793e+06,4.5665e+06,1.2129e+06,0.1239
30.4526,230,5.7436e+06,4.5334e+06,1.2102e+06,0.1253
30.5841,231,5.7075e+06,4.4997e+06,1.2077e+06,0.1243
30.7160,232,5.6709e+06,4.4656e+06,1.2054e+06,0.1249
30.8476,233,5.6343e+06,4.4311e+06,1.2032e+06,0.1247
30.9820,234,5.5983e+06,4.3971e+06,1.2012e+06,0.1272
31.1110,235,5.5631e+06,4.3638e+06,1.1993e+06,0.1220
31.2424,236,5.5291e+06,4.3316e+06,1.1975e+06,0.1241
31.3726,237,5.4959e+06,4.3002e+06,1.1958e+06,0.1234
31.5025,238,5.4631e+06,4.2692e+06,1.1939e+06,0.1230
31.6344,239,5.4305e+06,4.2385e+06,1.1920e+06,0.1250
31.7637,240,5.3979e+06,4.2080e+06,1.1899e+06,0.1227
31.8972,241,5.3656e+06,4.1779e+06,1.1877e+06,0.1260
32.0273,242,5.3341e+06,4.1486e+06,1.1855e+06,0.1229
32.1580,243,5.3033e+06,4.1201e+06,1.1832e+06,0.1238
32.2869,244,5.2733e+06,4.0923e+06,1.1810e+06,0.1220
32.4182,245,5.2438e+06,4.0650e+06,1.1788e+06,0.1244
32.5485,246,5.2143e+06,4.0375e+06,1.1768e+06,0.1233
32.6779,247,5.1845e+06,4.0097e+06,1.1748e+06,0.1227
32.8099,248,5.1545e+06,3.9815e+06,1.1730e+06,0.1250
32.9392,249,5.1246e+06,3.9533e+06,1.1713e+06,0.1226
33.0717,250,5.0950e+06,3.9253e+06,1.1697e+06,0.1255
33.2011,251,5.0657e+06,3.8976e+06,1.1681e+06,0.1228
33.3337,252,5.0367e+06,3.8703e+06,1.1664e+06,0.1256
33.4629,253,5.0079e+06,3.8432e+06,1.1647e+06,0.1224
33.5954,254,4.9794e+06,3.8165e+06,1.1629e+06,0.1257
33.7250,255,4.9512e+06,3.7901e+06,1.1611e+06,0.1227
33.8561,256,4.9236e+06,3.7642e+06,1.1594e+06,0.1244
33.9883,257,4.8963e+06,3.7387e+06,1.1576e+06,0.1253
34.1223,258,4.8692e+06,3.7134e+06,1.1558e+06,0.1265
34.2519,259,4.8421e+06,3.6880e+06,1.1542e+06,0.1227
34.3830,260,4.8150e+06,3.6625e+06,1.1526e+06,0.1243
34.5134,261,4.7879e+06,3.6369e+06,1.1510e+06,0.1236
34.6437,262,4.7609e+06,3.6114e+06,1.1495e+06,0.1236
34.7745,263,4.7343e+06,3.5863e+06,1.1480e+06,0.1242
34.9043,264,4.7084e+06,3.5620e+06,1.1464e+06,0.1231
35.0367,265,4.6831e+06,3.5383e+06,1.1448e+06,0.1255
35.1653,266,4.6583e+06,3.5152e+06,1.1431e+06,0.1219
35.2977,267,4.6336e+06,3.4922e+06,1.1414e+06,0.1254
35.4271,268,4.6090e+06,3.4695e+06,1.1395e+06,0.1226
35.5599,269,4.5846e+06,3.4470e+06,1.1376e+06,0.1258
35.6912,270,4.5608e+06,3.4251e+06,1.1357e+06,0.1244
35.8252,271,4.5374e+06,3.4037e+06,1.1337e+06,0.1269
35.9552,272,4.5146e+06,3.3828e+06,1.1318e+06,0.1231
36.0895,273,4.4921e+06,3.3621e+06,1.1300e+06,0.1268
36.2183,274,4.4697e+06,3.3414e+06,1.1283e+06,0.1217
36.3509,275,4.4472e+06,3.3206e+06,1.1267e+06,0.1257
36.4801,276,4.4248e+06,3.2997e+06,1.1251e+06,0.1223
36.6106,277,4.4024e+06,3.2789e+06,1.1235e+06,0.1239
36.7423,278,4.3802e+06,3.2583e+06,1.1219e+06,0.1250
36.8725,279,4.3584e+06,3.2382e+06,1.1202e+06,0.1234
37.0041,280,4.3369e+06,3.2186e+06,1.1183e+06,0.1252
37.1337,281,4.3156e+06,3.1993e+06,1.1163e+06,0.1224
37.2676,282,4.2945e+06,3.1803e+06,1.1142e+06,0.1270
37.3975,283,4.2734e+06,3.1614e+06,1.1119e+06,0.1229
37.5314,284,4.2524e+06,3.1427e+06,1.1097e+06,0.1264
37.6598,285,4.2316e+06,3.1242e+06,1.1074e+06,0.1216
37.7916,286,4.2109e+06,3.1057e+06,1.1051e+06,0.1252
37.9201,287,4.1902e+06,3.0872e+06,1.1030e+06,0.1219
38.0513,288,4.1697e+06,3.0686e+06,1.1011e+06,0.1243
38.1806,289,4.1493e+06,3.0500e+06,1.0992e+06,0.1221
38.3173,290,4.1291e+06,3.0316e+06,1.0975e+06,0.1227
38.4477,291,4.1093e+06,3.0134e+06,1.0959e+06,0.1235
38.5802,292,4.0899e+06,2.9957e+06,1.0942e+06,0.1255
38.7096,293,4.0708e+06,2.9783e+06,1.0925e+06,0.1225
38.8405,294,4.0519e+06,2.9612e+06,1.0907e+06,0.1242
38.9716,295,4.0329e+06,2.9441e+06,1.0888e+06,0.1241
39.1032,296,4.0140e+06,2.9273e+06,1.0867e+06,0.1244
39.2352,297,3.9951e+06,2.9106e+06,1.0845e+06,0.1252
39.3650,298,3.9765e+06,2.8944e+06,1.0821e+06,0.1231
39.4987,299,3.9582e+06,2.8785e+06,1.0797e+06,0.1267
39.6305,300,3.9402e+06,2.8629e+06,1.0773e+06,0.1249
39.7622,301,3.9223e+06,2.8474e+06,1.0749e+06,0.1242
39.8921,302,3.9044e+06,2.8317e+06,1.0726e+06,0.1233
40.0240,303,3.8862e+06,2.8158e+06,1.0704e+06,0.1251
40.1542,304,3.8680e+06,2.7996e+06,1.0684e+06,0.1231
40.2855,305,3.8499e+06,2.7835e+06,1.0664e+06,0.1243
40.4147,306,3.8321e+06,2.7676e+06,1.0646e+06,0.1224
40.5474,307,3.8147e+06,2.7520e+06,1.0627e+06,0.1256
40.6763,308,3.7976e+06,2.7368e+06,1.0608e+06,0.1222
40.8096,309,3.7807e+06,2.7218e+06,1.0588e+06,0.1262
40.9389,310,3.7638e+06,2.7070e+06,1.0568e+06,0.1225
41.0719,311,3.7469e+06,2.6923e+06,1.0547e+06,0.1250
41.2023,312,3.7302e+06,2.6778e+06,1.0524e+06,0.1235
41.3329,313,3.7136e+06,2.6634e+06,1.0502e+06,0.1238
41.4646,314,3.6971e+06,2.6492e+06,1.0478e+06,0.1248
41.5950,315,3.6806e+06,2.6351e+06,1.0456e+06,0.1236
41.7270,316,3.6643e+06,2.6209e+06,1.0434e+06,0.1251
41.8567,317,3.6481e+06,2.6068e+06,1.0413e+06,0.1229
41.9899,318,3.6321e+06,2.5928e+06,1.0393e+06,0.1265
42.1200,319,3.6164e+06,2.5790e+06,1.0374e+06,0.1226
42.2529,320,3.6008e+06,2.5653e+06,1.0355e+06,0.1256
42.3817,321,3.5853e+06,2.5517e+06,1.0337e+06,0.1222
42.5137,322,3.5698e+06,2.5379e+06,1.0318e+06,0.1250
42.6440,323,3.5543e+06,2.5243e+06,1.0300e+06,0.1236
42.7782,324,3.5389e+06,2.5108e+06,1.0281e+06,0.1272
42.9096,325,3.5239e+06,2.4976e+06,1.0263e+06,0.1244
43.0427,326,3.5092e+06,2.4847e+06,1.0244e+06,0.1255
43.1732,327,3.4946e+06,2.4720e+06,1.0226e+06,0.1234
43.3064,328,3.4801e+06,2.4592e+06,1.0208e+06,0.1262
43.4367,329,3.4655e+06,2.4464e+06,1.0191e+06,0.1232
43.5689,330,3.4507e+06,2.4333e+06,1.0174e+06,0.1252
43.6980,331,3.4358e+06,2.4201e+06,1.0157e+06,0.1222
43.8302,332,3.4211e+06,2.4072e+06,1.0140e+06,0.1254
43.9599,333,3.4067e+06,2.3945e+06,1.0122e+06,0.1229
44.0938,334,3.3926e+06,2.3821e+06,1.0104e+06,0.1264
44.2248,335,3.3786e+06,2.3700e+06,1.0086e+06,0.1240
44.3599,336,3.3647e+06,2.3579e+06,1.0068e+06,0.1279
44.4907,337,3.3508e+06,2.3459e+06,1.0049e+06,0.1237
44.6240,338,3.3370e+06,2.3339e+06,1.0031e+06,0.1262
44.7546,339,3.3234e+06,2.3221e+06,1.0013e+06,0.1238
44.8876,340,3.3100e+06,2.3104e+06,9.9954e+05,0.1261
45.0182,341,3.2968e+06,2.2989e+06,9.9789e+05,0.1237
45.1514,342,3.2838e+06,2.2875e+06,9.9631e+05,0.1258
45.2819,343,3.2709e+06,2.2761e+06,9.9478e+05,0.1236
45.4159,344,3.2580e+06,2.2648e+06,9.9327e+05,0.1262
45.5449,345,3.2453e+06,2.2536e+06,9.9172e+05,0.1222
45.6774,346,3.2327e+06,2.2426e+06,9.9012e+05,0.1258
45.8073,347,3.2202e+06,2.2317e+06,9.8844e+05,0.1231
45.9392,348,3.2077e+06,2.2210e+06,9.8669e+05,0.1248
46.0702,349,3.1951e+06,2.2103e+06,9.8484e+05,0.1242
46.2023,350,3.1827e+06,2.1997e+06,9.8294e+05,0.1249
46.3309,351,3.1703e+06,2.1893e+06,9.8102e+05,0.1220
46.4632,352,3.1582e+06,2.1790e+06,9.7912e+05,0.1252
46.5922,353,3.1462e+06,2.1689e+06,9.7728e+05,0.1221
46.7227,354,3.1342e+06,2.1586e+06,9.7552e+05,0.1237
46.8529,355,3.1221e+06,2.1482e+06,9.7386e+05,0.1236
46.9823,356,3.1099e+06,2.1376e+06,9.7230e+05,0.1227
47.1147,357,3.0977e+06,2.1269e+06,9.7081e+05,0.1255
47.2442,358,3.0857e+06,2.1163e+06,9.6939e+05,0.1225
47.3759,359,3.0740e+06,2.1060e+06,9.6801e+05,0.1250
47.5051,360,3.0626e+06,2.0960e+06,9.6660e+05,0.1221
47.6371,361,3.0513e+06,2.0861e+06,9.6515e+05,0.1247
47.7677,362,3.0400e+06,2.0764e+06,9.6361e+05,0.1236
47.8986,363,3.0287e+06,2.0667e+06,9.6199e+05,0.1241
48.0302,364,3.0174e+06,2.0571e+06,9.6029e+05,0.1249
48.1614,365,3.0063e+06,2.0477e+06,9.5856e+05,0.1240
48.2962,366,2.9954e+06,2.0385e+06,9.5683e+05,0.1278
48.4287,367,2.9847e+06,2.0295e+06,9.5518e+05,0.1252
48.5581,368,2.9742e+06,2.0205e+06,9.5363e+05,0.1225
48.6886,369,2.9637e+06,2.0115e+06,9.5220e+05,0.1237
48.8193,370,2.9533e+06,2.0025e+06,9.5086e+05,0.1240
48.9489,371,2.9430e+06,1.9934e+06,9.4962e+05,0.1229
49.0811,372,2.9329e+06,1.9845e+06,9.4841e+05,0.1254
49.2106,373,2.9228e+06,1.9756e+06,9.4724e+05,0.1225
49.3432,374,2.9128e+06,1.9668e+06,9.4605e+05,0.1256
49.4717,375,2.9028e+06,1.9580e+06,9.4482e+05,0.1215
49.6045,376,2.8928e+06,1.9493e+06,9.4354e+05,0.1257
49.7333,377,2.8829e+06,1.9407e+06,9.4222e+05,0.1222
49.8640,378,2.8730e+06,1.9322e+06,9.4086e+05,0.1241
49.9944,379,2.8632e+06,1.9237e+06,9.3949e+05,0.1236
50.1237,380,2.8535e+06,1.9153e+06,9.3814e+05,0.1225
50.2562,381,2.8437e+06,1.9069e+06,9.3682e+05,0.1254
50.3856,382,2.8340e+06,1.8984e+06,9.3556e+05,0.1227
50.5183,383,2.8244e+06,1.8900e+06,9.3439e+05,0.1253
50.6471,384,2.8149e+06,1.8817e+06,9.3324e+05,0.1220
50.7789,385,2.8057e+06,1.8736e+06,9.3212e+05,0.1248
50.9089,386,2.7966e+06,1.8656e+06,9.3102e+05,0.1228
51.0398,387,2.7876e+06,1.8577e+06,9.2991e+05,0.1237
51.1716,388,2.7785e+06,1.8497e+06,9.2878e+05,0.1247
51.3023,389,2.7694e+06,1.8417e+06,9.2763e+05,0.1238
51.4374,390,2.7603e+06,1.8339e+06,9.2642e+05,0.1282
51.5700,391,2.7513e+06,1.8261e+06,9.2518e+05,0.1255
51.7002,392,2.7425e+06,1.8185e+06,9.2393e+05,0.1234
51.8315,393,2.7337e+06,1.8110e+06,9.2266e+05,0.1243
51.9658,394,2.7249e+06,1.8035e+06,9.2137e+05,0.1275
52.0987,395,2.7161e+06,1.7960e+06,9.2008e+05,0.1250
52.2271,396,2.7072e+06,1.7884e+06,9.1877e+05,0.1217
52.3585,397,2.6984e+06,1.7809e+06,9.1746e+05,0.1244
52.4902,398,2.6896e+06,1.7735e+06,9.1617e+05,0.1222
52.6218,399,2.6811e+06,1.7662e+06,9.1486e+05,0.1245
52.7520,400,2.6725e+06,1.7590e+06,9.1354e+05,0.1230
52.8846,401,2.6640e+06,1.7518e+06,9.1221e+05,0.1234
53.0169,402,2.6555e+06,1.7447e+06,9.1086e+05,0.1249
53.1490,403,2.6471e+06,1.7376e+06,9.0953e+05,0.1243
53.2810,404,2.6388e+06,1.7306e+06,9.0822e+05,0.1246
53.4163,405,2.6306e+06,1.7237e+06,9.0692e+05,0.1275
53.5448,406,2.6224e+06,1.7167e+06,9.0567e+05,0.1216
53.6780,407,2.6141e+06,1.7097e+06,9.0445e+05,0.1263
53.8073,408,2.6060e+06,1.7027e+06,9.0327e+05,0.1225
53.9379,409,2.5978e+06,1.6958e+06,9.0209e+05,0.1236
54.0682,410,2.5899e+06,1.6890e+06,9.0090e+05,0.1237
54.1975,411,2.5820e+06,1.6823e+06,8.9966e+05,0.1226
54.3295,412,2.5741e+06,1.6757e+06,8.9836e+05,0.1252
54.4593,413,2.5662e+06,1.6692e+06,8.9701e+05,0.1231
54.5938,414,2.5583e+06,1.6627e+06,8.9562e+05,0.1275
54.7249,415,2.5505e+06,1.6563e+06,8.9420e+05,0.1240
54.8575,416,2.5428e+06,1.6500e+06,8.9280e+05,0.1254
54.9867,417,2.5352e+06,1.6438e+06,8.9141e+05,0.1225
55.1183,418,2.5276e+06,1.6375e+06,8.9008e+05,0.1243
55.2469,419,2.5200e+06,1.6312e+06,8.8879e+05,0.1218
55.3794,420,2.5124e+06,1.6248e+06,8.8757e+05,0.1253
55.5102,421,2.5047e+06,1.6183e+06,8.8640e+05,0.1237
55.6418,422,2.4971e+06,1.6118e+06,8.8524e+05,0.1247
55.7717,423,2.4895e+06,1.6054e+06,8.8408e+05,0.1232
55.9023,424,2.4821e+06,1.5992e+06,8.8290e+05,0.1238
56.0339,425,2.4747e+06,1.5930e+06,8.8167e+05,0.1249
56.1627,426,2.4673e+06,1.5869e+06,8.8041e+05,0.1220
56.2968,427,2.4599e+06,1.5808e+06,8.7909e+05,0.1251
56.4279,428,2.4526e+06,1.5749e+06,8.7776e+05,0.1226
56.5599,429,2.4454e+06,1.5690e+06,8.7642e+05,0.1247
56.6891,430,2.4382e+06,1.5631e+06,8.7513e+05,0.1225
56.8211,431,2.4311e+06,1.5572e+06,8.7387e+05,0.1253
56.9506,432,2.4240e+06,1.5514e+06,8.7265e+05,0.1226
57.0852,433,2.4170e+06,1.5455e+06,8.7148e+05,0.1270
57.2137,434,2.4100e+06,1.5396e+06,8.7034e+05,0.1219
57.3459,435,2.4031e+06,1.5339e+06,8.6921e+05,0.1253
57.4775,436,2.3963e+06,1.5282e+06,8.6807e+05,0.1245
57.6099,437,2.3895e+06,1.5226e+06,8.6691e+05,0.1251
57.7406,438,2.3828e+06,1.5171e+06,8.6572e+05,0.1239
57.8733,439,2.3762e+06,1.5117e+06,8.6449e+05,0.1257
58.0043,440,2.3696e+06,1.5064e+06,8.6325e+05,0.1242
58.1376,441,2.3631e+06,1.5011e+06,8.6199e+05,0.1261
58.2680,442,2.3566e+06,1.4959e+06,8.6073e+05,0.1234
58.4004,443,2.3502e+06,1.4907e+06,8.5949e+05,0.1255
58.5361,444,2.3437e+06,1.4854e+06,8.5829e+05,0.1287
58.6691,445,2.3371e+06,1.4800e+06,8.5711e+05,0.1257
58.7991,446,2.3307e+06,1.4747e+06,8.5597e+05,0.1231
58.9329,447,2.3243e+06,1.4695e+06,8.5485e+05,0.1266
59.0646,448,2.3181e+06,1.4643e+06,8.5372e+05,0.1242
59.1979,449,2.3119e+06,1.4593e+06,8.5259e+05,0.1264
59.3299,450,2.3057e+06,1.4543e+06,8.5143e+05,0.1249
59.4623,451,2.2996e+06,1.4493e+06,8.5025e+05,0.1256
59.5953,452,2.2935e+06,1.4444e+06,8.4904e+05,0.1252
59.7283,453,2.2874e+06,1.4395e+06,8.4783e+05,0.1251
59.8632,454,2.2814e+06,1.4347e+06,8.4663e+05,0.1272
59.9949,455,2.2754e+06,1.4300e+06,8.4545e+05,0.1245
60.1279,456,2.2695e+06,1.4252e+06,8.4430e+05,0.1255
60.2591,457,2.2636e+06,1.4205e+06,8.4318e+05,0.1242
60.3919,458,2.2578e+06,1.4157e+06,8.4211e+05,0.1255
60.5216,459,2.2520e+06,1.4109e+06,8.4107e+05,0.1229
60.6536,460,2.2463e+06,1.4062e+06,8.4002e+05,0.1249
60.7837,461,2.2405e+06,1.4016e+06,8.3896e+05,0.1233
60.9165,462,2.2349e+06,1.3970e+06,8.3788e+05,0.1255
61.0451,463,2.2292e+06,1.3925e+06,8.3676e+05,0.1218
61.1773,464,2.2236e+06,1.3880e+06,8.3563e+05,0.1252
61.3062,465,2.2180e+06,1.3835e+06,8.3448e+05,0.1222
61.4368,466,2.2125e+06,1.3791e+06,8.3333e+05,0.1237
61.5717,467,2.2069e+06,1.3747e+06,8.3219e+05,0.1282
61.7044,468,2.2013e+06,1.3703e+06,8.3107e+05,0.1257
61.8344,469,2.1958e+06,1.3658e+06,8.2998e+05,0.1232
61.9673,470,2.1902e+06,1.3613e+06,8.2892e+05,0.1258
62.0979,471,2.1848e+06,1.3569e+06,8.2786e+05,0.1231
62.2306,472,2.1794e+06,1.3526e+06,8.2679e+05,0.1257
62.3606,473,2.1740e+06,1.3483e+06,8.2573e+05,0.1231
62.4957,474,2.1686e+06,1.3439e+06,8.2464e+05,0.1285
62.6259,475,2.1632e+06,1.3396e+06,8.2354e+05,0.1214
62.7576,476,2.1578e+06,1.3354e+06,8.2242e+05,0.1248
62.8882,477,2.1525e+06,1.3312e+06,8.2131e+05,0.1237
63.0185,478,2.1473e+06,1.3271e+06,8.2022e+05,0.1235
63.1502,479,2.1421e+06,1.3230e+06,8.1915e+05,0.1249
63.2800,480,2.1370e+06,1.3189e+06,8.1811e+05,0.1231
63.4129,481,2.1319e+06,1.3148e+06,8.1709e+05,0.1260
63.5427,482,2.1267e+06,1.3106e+06,8.1608e+05,0.1224
63.6748,483,2.1216e+06,1.3065e+06,8.1507e+05,0.1251
63.8029,484,2.1165e+06,1.3025e+06,8.1406e+05,0.1211
63.9346,485,2.1115e+06,1.2984e+06,8.1303e+05,0.1249
64.0654,486,2.1065e+06,1.2945e+06,8.1199e+05,0.1239
64.1977,487,2.1015e+06,1.2905e+06,8.1094e+05,0.1252
64.3293,488,2.0965e+06,1.2867e+06,8.0988e+05,0.1247
64.4615,489,2.0916e+06,1.2828e+06,8.0881e+05,0.1251
64.5922,490,2.0868e+06,1.2790e+06,8.0774e+05,0.1241
64.7233,491,2.0819e+06,1.2752e+06,8.0670e+05,0.1241
64.8542,492,2.0771e+06,1.2715e+06,8.0567e+05,0.1241
64.9849,493,2.0724e+06,1.2677e+06,8.0466e+05,0.1238
65.1168,494,2.0677e+06,1.2640e+06,8.0367e+05,0.1250
65.2459,495,2.0630e+06,1.2603e+06,8.0268e+05,0.1222
65.3775,496,2.0583e+06,1.2566e+06,8.0168e+05,0.1251
65.5076,497,2.0537e+06,1.2530e+06,8.0066e+05,0.1231
65.6417,498,2.0490e+06,1.2494e+06,7.9963e+05,0.1270
65.7727,499,2.0444e+06,1.2458e+06,7.9858e+05,0.1239
65.9064,500,2.0398e+06,1.2423e+06,7.9753e+05,0.1265
66.0439,501,2.0353e+06,1.2388e+06,7.9649e+05,0.1279
66.1755,502,2.0308e+06,1.2353e+06,7.9547e+05,0.1245
66.3114,503,2.0264e+06,1.2319e+06,7.9448e+05,0.1285
66.4418,504,2.0219e+06,1.2284e+06,7.9350e+05,0.1232
66.5744,505,2.0174e+06,1.2249e+06,7.9254e+05,0.1258
66.7034,506,2.0130e+06,1.2214e+06,7.9159e+05,0.1221
66.8358,507,2.0086e+06,1.2180e+06,7.9063e+05,0.1256
66.9663,508,2.0042e+06,1.2146e+06,7.8966e+05,0.1237
67.1000,509,1.9999e+06,1.2112e+06,7.8868e+05,0.1261
67.2305,510,1.9955e+06,1.2078e+06,7.8770e+05,0.1237
67.3631,511,1.9911e+06,1.2044e+06,7.8670e+05,0.1256
67.4921,512,1.9868e+06,1.2011e+06,7.8571e+05,0.1222
67.6229,513,1.9825e+06,1.1978e+06,7.8474e+05,0.1241
67.7541,514,1.9783e+06,1.1945e+06,7.8380e+05,0.1244
67.8844,515,1.9741e+06,1.1912e+06,7.8288e+05,0.1232
68.0159,516,1.9699e+06,1.1880e+06,7.8199e+05,0.1248
68.1447,517,1.9658e+06,1.1847e+06,7.8111e+05,0.1219
68.2765,518,1.9617e+06,1.1815e+06,7.8023e+05,0.1249
68.4047,519,1.9576e+06,1.1783e+06,7.7934e+05,0.1213
68.5369,520,1.9536e+06,1.1752e+06,7.7843e+05,0.1252
68.6678,521,1.9496e+06,1.1721e+06,7.7749e+05,0.1241
68.7985,522,1.9456e+06,1.1690e+06,7.7653e+05,0.1241
68.9292,523,1.9416e+06,1.1660e+06,7.7557e+05,0.1238
69.0591,524,1.9376e+06,1.1630e+06,7.7460e+05,0.1232
69.1902,525,1.9337e+06,1.1600e+06,7.7364e+05,0.1245
69.3188,526,1.9298e+06,1.1571e+06,7.7270e+05,0.1218
69.4513,527,1.9258e+06,1.1540e+06,7.7179e+05,0.1257
69.5840,528,1.9219e+06,1.1510e+06,7.7092e+05,0.1258
69.7175,529,1.9181e+06,1.1480e+06,7.7007e+05,0.1230
69.8464,530,1.9142e+06,1.1450e+06,7.6924e+05,0.1220
69.9795,531,1.9105e+06,1.1420e+06,7.6841e+05,0.1260
70.1088,532,1.9067e+06,1.1391e+06,7.6756e+05,0.1225
70.2422,533,1.9029e+06,1.1362e+06,7.6670e+05,0.1268
70.3724,534,1.8991e+06,1.1333e+06,7.6582e+05,0.1233
70.5038,535,1.8954e+06,1.1305e+06,7.6493e+05,0.1243
70.6342,536,1.8917e+06,1.1276e+06,7.6402e+05,0.1235
70.7652,537,1.8880e+06,1.1249e+06,7.6312e+05,0.1240
70.8959,538,1.8843e+06,1.1221e+06,7.6223e+05,0.1240
71.0251,539,1.8807e+06,1.1193e+06,7.6137e+05,0.1224
71.1569,540,1.8770e+06,1.1165e+06,7.6053e+05,0.1246
71.2854,541,1.8734e+06,1.1137e+06,7.5971e+05,0.1219
71.4192,542,1.8698e+06,1.1109e+06,7.5890e+05,0.1268
71.5479,543,1.8662e+06,1.1081e+06,7.5809e+05,0.1219
71.6790,544,1.8626e+06,1.1053e+06,7.5729e+05,0.1244
71.8092,545,1.8591e+06,1.1026e+06,7.5649e+05,0.1233
71.9391,546,1.8556e+06,1.0999e+06,7.5567e+05,0.1231
72.0703,547,1.8521e+06,1.0972e+06,7.5486e+05,0.1245
72.1994,548,1.8486e+06,1.0945e+06,7.5404e+05,0.1226
72.3319,549,1.8451e+06,1.0919e+06,7.5324e+05,0.1255
72.4613,550,1.8417e+06,1.0892e+06,7.5245e+05,0.1225
72.5934,551,1.8382e+06,1.0865e+06,7.5167e+05,0.1251
72.7226,552,1.8348e+06,1.0839e+06,7.5090e+05,0.1225
72.8528,553,1.8314e+06,1.0813e+06,7.5014e+05,0.1232
72.9835,554,1.8281e+06,1.0787e+06,7.4938e+05,0.1237
73.1129,555,1.8248e+06,1.0761e+06,7.4861e+05,0.1226
73.2445,556,1.8214e+06,1.0736e+06,7.4784e+05,0.1249
73.3734,557,1.8182e+06,1.0711e+06,7.4705e+05,0.1223
73.5061,558,1.8149e+06,1.0686e+06,7.4627e+05,0.1254
73.6366,559,1.8117e+06,1.0662e+06,7.4548e+05,0.1236
73.7722,560,1.8084e+06,1.0637e+06,7.4471e+05,0.1255
73.9028,561,1.8052e+06,1.0613e+06,7.4394e+05,0.1237
74.0360,562,1.8020e+06,1.0588e+06,7.4318e+05,0.1261
74.1663,563,1.7988e+06,1.0564e+06,7.4242e+05,0.1235
74.3002,564,1.7956e+06,1.0539e+06,7.4166e+05,0.1265
74.4307,565,1.7924e+06,1.0515e+06,7.4091e+05,0.1237
74.5639,566,1.7893e+06,1.0491e+06,7.4015e+05,0.1261
74.6926,567,1.7861e+06,1.0467e+06,7.3940e+05,0.1221
74.8240,568,1.7830e+06,1.0443e+06,7.3864e+05,0.1246
74.9525,569,1.7798e+06,1.0419e+06,7.3790e+05,0.1220
75.0835,570,1.7767e+06,1.0395e+06,7.3717e+05,0.1245
75.2140,571,1.7736e+06,1.0372e+06,7.3645e+05,0.1236
75.3441,572,1.7705e+06,1.0348e+06,7.3575e+05,0.1234
75.4753,573,1.7675e+06,1.0324e+06,7.3506e+05,0.1244
75.6053,574,1.7644e+06,1.0300e+06,7.3438e+05,0.1228
75.7372,575,1.7614e+06,1.0277e+06,7.3368e+05,0.1250
75.8665,576,1.7584e+06,1.0254e+06,7.3298e+05,0.1224
75.9989,577,1.7554e+06,1.0231e+06,7.3225e+05,0.1256
76.1276,578,1.7524e+06,1.0209e+06,7.3150e+05,0.1219
76.2620,579,1.7494e+06,1.0187e+06,7.3072e+05,0.1277
76.3920,580,1.7465e+06,1.0166e+06,7.2993e+05,0.1231
76.5254,581,1.7436e+06,1.0145e+06,7.2912e+05,0.1262
76.6544,582,1.7407e+06,1.0124e+06,7.2832e+05,0.1221
76.7860,583,1.7378e+06,1.0103e+06,7.2752e+05,0.1249
76.9166,584,1.7349e+06,1.0081e+06,7.2674e+05,0.1237
77.0476,585,1.7320e+06,1.0060e+06,7.2597e+05,0.1243
77.1780,586,1.7291e+06,1.0039e+06,7.2522e+05,0.1236
77.3073,587,1.7262e+06,1.0017e+06,7.2448e+05,0.1227
77.4389,588,1.7234e+06,9.9964e+05,7.2373e+05,0.1249
77.5687,589,1.7206e+06,9.9757e+05,7.2298e+05,0.1229
77.7019,590,1.7177e+06,9.9552e+05,7.2221e+05,0.1262
77.8331,591,1.7149e+06,9.9348e+05,7.2144e+05,0.1233
77.9669,592,1.7121e+06,9.9146e+05,7.2066e+05,0.1262
78.0978,593,1.7093e+06,9.8945e+05,7.1990e+05,0.1226
78.2294,594,1.7066e+06,9.8744e+05,7.1915e+05,0.1248
78.3600,595,1.7038e+06,9.8543e+05,7.1842e+05,0.1238
78.4925,596,1.7011e+06,9.8340e+05,7.1771e+05,0.1252
78.6236,597,1.6984e+06,9.8135e+05,7.1702e+05,0.1238
78.7549,598,1.6957e+06,9.7932e+05,7.1635e+05,0.1243
78.8829,599,1.6930e+06,9.7731e+05,7.1568e+05,0.1211
79.0156,600,1.6903e+06,9.7533e+05,7.1500e+05,0.1256
79.1465,601,1.6877e+06,9.7337e+05,7.1432e+05,0.1221
79.2790,602,1.6851e+06,9.7142e+05,7.1363e+05,0.1254
79.4092,603,1.6824e+06,9.6949e+05,7.1293e+05,0.1234
79.5420,604,1.6798e+06,9.6756e+05,7.1223e+05,0.1257
79.6759,605,1.6772e+06,9.6564e+05,7.1153e+05,0.1270
79.8093,606,1.6746e+06,9.6372e+05,7.1084e+05,0.1265
79.9380,607,1.6720e+06,9.6180e+05,7.1017e+05,0.1219
80.0700,608,1.6694e+06,9.5988e+05,7.0951e+05,0.1253
80.1985,609,1.6668e+06,9.5798e+05,7.0886e+05,0.1219
80.3291,610,1.6643e+06,9.5610e+05,7.0821e+05,0.1241
80.4598,611,1.6618e+06,9.5423e+05,7.0757e+05,0.1241
80.5913,612,1.6593e+06,9.5238e+05,7.0693e+05,0.1246
80.7235,613,1.6568e+06,9.5055e+05,7.0628e+05,0.1254
80.8581,614,1.6544e+06,9.4874e+05,7.0563e+05,0.1240
80.9911,615,1.6519e+06,9.4694e+05,7.0498e+05,0.1262
81.1236,616,1.6495e+06,9.4515e+05,7.0433e+05,0.1237
81.2526,617,1.6470e+06,9.4334e+05,7.0369e+05,0.1222
81.3836,618,1.6446e+06,9.4153e+05,7.0305e+05,0.1241
81.5140,619,1.6421e+06,9.3971e+05,7.0243e+05,0.1235
81.6449,620,1.6397e+06,9.3791e+05,7.0181e+05,0.1238
81.7758,621,1.6373e+06,9.3613e+05,7.0119e+05,0.1243
81.9055,622,1.6349e+06,9.3436e+05,7.0058e+05,0.1227
82.0376,623,1.6326e+06,9.3259e+05,6.9996e+05,0.1253
82.1669,624,1.6302e+06,9.3083e+05,6.9933e+05,0.1225
82.2992,625,1.6278e+06,9.2907e+05,6.9869e+05,0.1255
82.4279,626,1.6254e+06,9.2734e+05,6.9805e+05,0.1221
82.5594,627,1.6230e+06,9.2562e+05,6.9741e+05,0.1247
82.6907,628,1.6207e+06,9.2390e+05,6.9677e+05,0.1242
82.8233,629,1.6183e+06,9.2221e+05,6.9612e+05,0.1258
82.9548,630,1.6160e+06,9.2053e+05,6.9548e+05,0.1244
83.0862,631,1.6137e+06,9.1887e+05,6.9483e+05,0.1244
83.2167,632,1.6114e+06,9.1723e+05,6.9417e+05,0.1233
83.3475,633,1.6091e+06,9.1560e+05,6.9351e+05,0.1240
83.4801,634,1.6068e+06,9.1398e+05,6.9284e+05,0.1257
83.6110,635,1.6045e+06,9.1236e+05,6.9217e+05,0.1237
83.7423,636,1.6023e+06,9.1076e+05,6.9151e+05,0.1245
83.8728,637,1.6000e+06,9.0915e+05,6.9085e+05,0.1237
84.0043,638,1.5978e+06,9.0754e+05,6.9021e+05,0.1243
84.1341,639,1.5955e+06,9.0595e+05,6.8957e+05,0.1229
84.2659,640,1.5933e+06,9.0435e+05,6.8894e+05,0.1248
84.3940,641,1.5911e+06,9.0276e+05,6.8831e+05,0.1215
84.5274,642,1.5889e+06,9.0118e+05,6.8768e+05,0.1265
84.6573,643,1.5867e+06,8.9962e+05,6.8704e+05,0.1231
84.7897,644,1.5845e+06,8.9808e+05,6.8640e+05,0.1252
84.9191,645,1.5823e+06,8.9655e+05,6.8575e+05,0.1229
85.0504,646,1.5801e+06,8.9502e+05,6.8510e+05,0.1244
85.1811,647,1.5780e+06,8.9351e+05,6.8445e+05,0.1238
85.3110,648,1.5758e+06,8.9200e+05,6.8380e+05,0.1230
85.4429,649,1.5737e+06,8.9050e+05,6.8318e+05,0.1252
85.5729,650,1.5715e+06,8.8898e+05,6.8256e+05,0.1230
85.7060,651,1.5694e+06,8.8745e+05,6.8197e+05,0.1258
85.8361,652,1.5673e+06,8.8592e+05,6.8137e+05,0.1231
85.9699,653,1.5652e+06,8.8440e+05,6.8078e+05,0.1266
86.1023,654,1.5631e+06,8.8289e+05,6.8020e+05,0.1251
86.2355,655,1.5610e+06,8.8141e+05,6.7961e+05,0.1259
86.3663,656,1.5589e+06,8.7993e+05,6.7901e+05,0.1240
86.4978,657,1.5569e+06,8.7847e+05,6.7840e+05,0.1249
86.6293,658,1.5548e+06,8.7702e+05,6.7779e+05,0.1244
86.7623,659,1.5528e+06,8.7558e+05,6.7719e+05,0.1256
86.8942,660,1.5507e+06,8.7413e+05,6.7661e+05,0.1249
87.0273,661,1.5487e+06,8.7268e+05,6.7604e+05,0.1261
87.1593,662,1.5467e+06,8.7122e+05,6.7550e+05,0.1250
87.2920,663,1.5447e+06,8.6975e+05,6.7497e+05,0.1257
87.4243,664,1.5427e+06,8.6829e+05,6.7445e+05,0.1253
87.5546,665,1.5408e+06,8.6683e+05,6.7393e+05,0.1234
87.6840,666,1.5388e+06,8.6539e+05,6.7341e+05,0.1225
87.8191,667,1.5368e+06,8.6396e+05,6.7289e+05,0.1279
87.9496,668,1.5349e+06,8.6254e+05,6.7236e+05,0.1223
88.0809,669,1.5330e+06,8.6114e+05,6.7183e+05,0.1246
88.2109,670,1.5310e+06,8.5975e+05,6.7129e+05,0.1232
88.3428,671,1.5291e+06,8.5835e+05,6.7076e+05,0.1251
88.4743,672,1.5272e+06,8.5694e+05,6.7023e+05,0.1247
88.6056,673,1.5252e+06,8.5554e+05,6.6971e+05,0.1244
88.7356,674,1.5233e+06,8.5414e+05,6.6918e+05,0.1230
88.8681,675,1.5214e+06,8.5275e+05,6.6866e+05,0.1255
88.9977,676,1.5195e+06,8.5137e+05,6.6813e+05,0.1226
89.1307,677,1.5176e+06,8.5000e+05,6.6760e+05,0.1257
89.2604,678,1.5157e+06,8.4865e+05,6.6706e+05,0.1226
89.3936,679,1.5138e+06,8.4730e+05,6.6652e+05,0.1262
89.5236,680,1.5120e+06,8.4596e+05,6.6599e+05,0.1231
89.6570,681,1.5101e+06,8.4462e+05,6.6547e+05,0.1262
89.7862,682,1.5082e+06,8.4328e+05,6.6496e+05,0.1218
89.9173,683,1.5064e+06,8.4194e+05,6.6445e+05,0.1241
90.0483,684,1.5046e+06,8.4060e+05,6.6397e+05,0.1240
90.1788,685,1.5027e+06,8.3926e+05,6.6349e+05,0.1235
90.3105,686,1.5009e+06,8.3794e+05,6.6301e+05,0.1250
90.4407,687,1.4992e+06,8.3663e+05,6.6253e+05,0.1235
90.5726,688,1.4974e+06,8.3533e+05,6.6206e+05,0.1251
90.7020,689,1.4956e+06,8.3405e+05,6.6158e+05,0.1225
90.8340,690,1.4939e+06,8.3277e+05,6.6110e+05,0.1252
90.9631,691,1.4921e+06,8.3149e+05,6.6063e+05,0.1224
91.1012,692,1.4904e+06,8.3022e+05,6.6016e+05,0.1311
91.2317,693,1.4886e+06,8.2894e+05,6.5971e+05,0.1237
91.3635,694,1.4869e+06,8.2765e+05,6.5926e+05,0.1252
91.4946,695,1.4852e+06,8.2637e+05,6.5881e+05,0.1240
91.6285,696,1.4835e+06,8.2510e+05,6.5837e+05,0.1256
91.7602,697,1.4818e+06,8.2383e+05,6.5793e+05,0.1239
91.8921,698,1.4801e+06,8.2256e+05,6.5749e+05,0.1245
92.0230,699,1.4783e+06,8.2131e+05,6.5704e+05,0.1236
92.1549,700,1.4766e+06,8.2006e+05,6.5659e+05,0.1249
92.2889,701,1.4750e+06,8.1883e+05,6.5613e+05,0.1239
92.4206,702,1.4733e+06,8.1760e+05,6.5567e+05,0.1249
92.5522,703,1.4716e+06,8.1638e+05,6.5521e+05,0.1243
92.6835,704,1.4699e+06,8.1515e+05,6.5476e+05,0.1244
92.8144,705,1.4682e+06,8.1393e+05,6.5430e+05,0.1240
92.9454,706,1.4666e+06,8.1272e+05,6.5385e+05,0.1241
93.0760,707,1.4649e+06,8.1152e+05,6.5339e+05,0.1239
93.2078,708,1.4633e+06,8.1034e+05,6.5292e+05,0.1250
93.3381,709,1.4616e+06,8.0917e+05,6.5245e+05,0.1236
93.4719,710,1.4600e+06,8.0801e+05,6.5198e+05,0.1266
93.6011,711,1.4584e+06,8.0685e+05,6.5150e+05,0.1223
93.7343,712,1.4567e+06,8.0571e+05,6.5102e+05,0.1263
93.8649,713,1.4551e+06,8.0457e+05,6.5055e+05,0.1237
93.9985,714,1.4535e+06,8.0342e+05,6.5008e+05,0.1266
94.1289,715,1.4519e+06,8.0228e+05,6.4961e+05,0.1233
94.2627,716,1.4503e+06,8.0114e+05,6.4914e+05,0.1270
94.3932,717,1.4487e+06,8.0000e+05,6.4866e+05,0.1236
94.5270,718,1.4471e+06,7.9887e+05,6.4819e+05,0.1267
94.6566,719,1.4455e+06,7.9776e+05,6.4771e+05,0.1224
94.7891,720,1.4439e+06,7.9665e+05,6.4723e+05,0.1254
94.9189,721,1.4423e+06,7.9556e+05,6.4675e+05,0.1230
95.0508,722,1.4407e+06,7.9447e+05,6.4626e+05,0.1248
95.1795,723,1.4392e+06,7.9338e+05,6.4579e+05,0.1217
95.3118,724,1.4376e+06,7.9228e+05,6.4532e+05,0.1255
95.4413,725,1.4360e+06,7.9119e+05,6.4485e+05,0.1227
95.5725,726,1.4345e+06,7.9011e+05,6.4439e+05,0.1242
95.7029,727,1.4330e+06,7.8902e+05,6.4394e+05,0.1236
95.8321,728,1.4314e+06,7.8795e+05,6.4348e+05,0.1224
95.9638,729,1.4299e+06,7.8688e+05,6.4302e+05,0.1248
96.0939,730,1.4284e+06,7.8582e+05,6.4255e+05,0.1233
96.2258,731,1.4269e+06,7.8476e+05,6.4209e+05,0.1249
96.3542,732,1.4253e+06,7.8372e+05,6.4163e+05,0.1218
96.4848,733,1.4238e+06,7.8268e+05,6.4116e+05,0.1234
96.6156,734,1.4224e+06,7.8165e+05,6.4071e+05,0.1242
96.7449,735,1.4209e+06,7.8061e+05,6.4025e+05,0.1226
96.8765,736,1.4194e+06,7.7956e+05,6.3981e+05,0.1247
97.0055,737,1.4179e+06,7.7852e+05,6.3937e+05,0.1223
97.1380,738,1.4164e+06,7.7749e+05,6.3893e+05,0.1253
97.2671,739,1.4150e+06,7.7647e+05,6.3849e+05,0.1223
97.4014,740,1.4135e+06,7.7545e+05,6.3806e+05,0.1276
97.5304,741,1.4121e+06,7.7443e+05,6.3763e+05,0.1218
97.6621,742,1.4106e+06,7.7342e+05,6.3720e+05,0.1249
97.7921,743,1.4092e+06,7.7241e+05,6.3678e+05,0.1234
97.9223,744,1.4078e+06,7.7141e+05,6.3637e+05,0.1236
98.0533,745,1.4064e+06,7.7040e+05,6.3596e+05,0.1243
98.1828,746,1.4050e+06,7.6939e+05,6.3556e+05,0.1225
98.3153,747,1.4035e+06,7.6838e+05,6.3517e+05,0.1256
98.4445,748,1.4021e+06,7.6736e+05,6.3478e+05,0.1225
98.5764,749,1.4007e+06,7.6634e+05,6.3439e+05,0.1251
98.7053,750,1.3993e+06,7.6534e+05,6.3400e+05,0.1222
98.8381,751,1.3980e+06,7.6434e+05,6.3361e+05,0.1257
98.9670,752,1.3966e+06,7.6336e+05,6.3321e+05,0.1222
99.0983,753,1.3952e+06,7.6238e+05,6.3282e+05,0.1241
99.2306,754,1.3938e+06,7.6140e+05,6.3242e+05,0.1253
99.3624,755,1.3924e+06,7.6042e+05,6.3202e+05,0.1249
99.4947,756,1.3911e+06,7.5945e+05,6.3163e+05,0.1254
99.6260,757,1.3897e+06,7.5848e+05,6.3125e+05,0.1242
99.7561,758,1.3884e+06,7.5751e+05,6.3087e+05,0.1235
99.8850,759,1.3870e+06,7.5654e+05,6.3049e+05,0.1223
100.0175,760,1.3857e+06,7.5558e+05,6.3011e+05,0.1253
100.1471,761,1.3843e+06,7.5462e+05,6.2972e+05,0.1226
100.2788,762,1.3830e+06,7.5367e+05,6.2933e+05,0.1247
100.4066,763,1.3817e+06,7.5273e+05,6.2894e+05,0.1212
100.5374,764,1.3803e+06,7.5180e+05,6.2855e+05,0.1242
100.6691,765,1.3790e+06,7.5088e+05,6.2815e+05,0.1248
100.7999,766,1.3777e+06,7.4995e+05,6.2776e+05,0.1240
100.9307,767,1.3764e+06,7.4903e+05,6.2737e+05,0.1242
101.0633,768,1.3751e+06,7.4811e+05,6.2699e+05,0.1259
101.1965,769,1.3738e+06,7.4719e+05,6.2661e+05,0.1257
101.3284,770,1.3725e+06,7.4627e+05,6.2624e+05,0.1251
101.4591,771,1.3712e+06,7.4535e+05,6.2587e+05,0.1239
101.5882,772,1.3699e+06,7.4444e+05,6.2549e+05,0.1224
101.7206,773,1.3686e+06,7.4353e+05,6.2512e+05,0.1254
101.8493,774,1.3674e+06,7.4262e+05,6.2474e+05,0.1220
101.9810,775,1.3661e+06,7.4172e+05,6.2436e+05,0.1250
102.1103,776,1.3648e+06,7.4082e+05,6.2399e+05,0.1223
102.2417,777,1.3635e+06,7.3993e+05,6.2361e+05,0.1247
102.3717,778,1.3623e+06,7.3905e+05,6.2324e+05,0.1234
102.5012,779,1.3610e+06,7.3817e+05,6.2287e+05,0.1230
102.6342,780,1.3598e+06,7.3729e+05,6.2250e+05,0.1259
102.7649,781,1.3585e+06,7.3642e+05,6.2213e+05,0.1236
102.8963,782,1.3573e+06,7.3556e+05,6.2176e+05,0.1246
103.0273,783,1.3561e+06,7.3469e+05,6.2139e+05,0.1242
103.1613,784,1.3548e+06,7.3383e+05,6.2102e+05,0.1268
103.2926,785,1.3536e+06,7.3296e+05,6.2065e+05,0.1244
103.4240,786,1.3524e+06,7.3209e+05,6.2029e+05,0.1245
103.5543,787,1.3512e+06,7.3122e+05,6.1993e+05,0.1232
103.6881,788,1.3499e+06,7.3035e+05,6.1958e+05,0.1261
103.8210,789,1.3487e+06,7.2949e+05,6.1923e+05,0.1257
103.9536,790,1.3475e+06,7.2864e+05,6.1887e+05,0.1256
104.0879,791,1.3463e+06,7.2779e+05,6.1852e+05,0.1269
104.2185,792,1.3451e+06,7.2696e+05,6.1816e+05,0.1235
104.3515,793,1.3439e+06,7.2612e+05,6.1779e+05,0.1259
104.4817,794,1.3427e+06,7.2530e+05,6.1743e+05,0.1232
104.6126,795,1.3415e+06,7.2447e+05,6.1707e+05,0.1238
104.7429,796,1.3404e+06,7.2365e+05,6.1672e+05,0.1232
104.8736,797,1.3392e+06,7.2282e+05,6.1637e+05,0.1238
105.0060,798,1.3380e+06,7.2199e+05,6.1601e+05,0.1254
105.1374,799,1.3368e+06,7.2117e+05,6.1566e+05,0.1245
105.2700,800,1.3357e+06,7.2036e+05,6.1531e+05,0.1254
105.4050,801,1.3345e+06,7.1956e+05,6.1495e+05,0.1253
105.5346,802,1.3334e+06,7.1876e+05,6.1459e+05,0.1225
105.6674,803,1.3322e+06,7.1796e+05,6.1423e+05,0.1256
105.7975,804,1.3310e+06,7.1717e+05,6.1388e+05,0.1232
105.9300,805,1.3299e+06,7.1638e+05,6.1352e+05,0.1253
106.0602,806,1.3288e+06,7.1558e+05,6.1318e+05,0.1234
106.1915,807,1.3276e+06,7.1479e+05,6.1283e+05,0.1243
106.3225,808,1.3265e+06,7.1400e+05,6.1249e+05,0.1239
106.4520,809,1.3254e+06,7.1322e+05,6.1215e+05,0.1229
106.5842,810,1.3242e+06,7.1244e+05,6.1181e+05,0.1251
106.7147,811,1.3231e+06,7.1166e+05,6.1147e+05,0.1234
106.8481,812,1.3220e+06,7.1090e+05,6.1112e+05,0.1261
106.9797,813,1.3209e+06,7.1014e+05,6.1077e+05,0.1245
107.1133,814,1.3198e+06,7.0938e+05,6.1043e+05,0.1266
107.2466,815,1.3187e+06,7.0863e+05,6.1009e+05,0.1257
107.3781,816,1.3176e+06,7.0786e+05,6.0976e+05,0.1246
107.5109,817,1.3165e+06,7.0710e+05,6.0944e+05,0.1257
107.6425,818,1.3155e+06,7.0634e+05,6.0912e+05,0.1245
107.7764,819,1.3144e+06,7.0558e+05,6.0880e+05,0.1266
107.9074,820,1.3133e+06,7.0482e+05,6.0848e+05,0.1238
108.0416,821,1.3122e+06,7.0408e+05,6.0815e+05,0.1273
108.1746,822,1.3112e+06,7.0334e+05,6.0782e+05,0.1259
108.3080,823,1.3101e+06,7.0261e+05,6.0749e+05,0.1260
108.4388,824,1.3090e+06,7.0188e+05,6.0716e+05,0.1235
108.5703,825,1.3080e+06,7.0115e+05,6.0683e+05,0.1244
108.6995,826,1.3069e+06,7.0042e+05,6.0651e+05,0.1224
108.8326,827,1.3059e+06,6.9968e+05,6.0619e+05,0.1254
108.9632,828,1.3048e+06,6.9893e+05,6.0589e+05,0.1233
109.0963,829,1.3038e+06,6.9819e+05,6.0559e+05,0.1256
109.2269,830,1.3027e+06,6.9744e+05,6.0529e+05,0.1230
109.3586,831,1.3017e+06,6.9670e+05,6.0498e+05,0.1250
109.4880,832,1.3006e+06,6.9596e+05,6.0467e+05,0.1227
109.6215,833,1.2996e+06,6.9524e+05,6.0436e+05,0.1268
109.7503,834,1.2986e+06,6.9452e+05,6.0404e+05,0.1220
109.8826,835,1.2975e+06,6.9381e+05,6.0372e+05,0.1253
110.0129,836,1.2965e+06,6.9310e+05,6.0340e+05,0.1235
110.1452,837,1.2955e+06,6.9240e+05,6.0308e+05,0.1251
110.2743,838,1.2945e+06,6.9170e+05,6.0276e+05,0.1223
110.4061,839,1.2934e+06,6.9100e+05,6.0245e+05,0.1250
110.5369,840,1.2924e+06,6.9030e+05,6.0214e+05,0.1239
110.6687,841,1.2914e+06,6.8960e+05,6.0182e+05,0.1251
110.8015,842,1.2904e+06,6.8891e+05,6.0150e+05,0.1259
110.9350,843,1.2894e+06,6.8822e+05,6.0118e+05,0.1265
111.0667,844,1.2884e+06,6.8753e+05,6.0087e+05,0.1248
111.2028,845,1.2874e+06,6.8684e+05,6.0055e+05,0.1289
111.3337,846,1.2864e+06,6.8616e+05,6.0023e+05,0.1238
111.4667,847,1.2854e+06,6.8548e+05,5.9991e+05,0.1263
111.5967,848,1.2844e+06,6.8480e+05,5.9960e+05,0.1233
111.7300,849,1.2834e+06,6.8412e+05,5.9928e+05,0.1264
111.8603,850,1.2824e+06,6.8346e+05,5.9896e+05,0.1235
111.9925,851,1.2814e+06,6.8280e+05,5.9864e+05,0.1252
112.1235,852,1.2805e+06,6.8215e+05,5.9832e+05,0.1239
112.2568,853,1.2795e+06,6.8150e+05,5.9799e+05,0.1264
112.3873,854,1.2785e+06,6.8085e+05,5.9767e+05,0.1234
112.5188,855,1.2776e+06,6.8020e+05,5.9735e+05,0.1247
112.6491,856,1.2766e+06,6.7955e+05,5.9704e+05,0.1231
112.7817,857,1.2756e+06,6.7890e+05,5.9673e+05,0.1251
112.9109,858,1.2747e+06,6.7825e+05,5.9642e+05,0.1223
113.0445,859,1.2737e+06,6.7761e+05,5.9611e+05,0.1260
113.1751,860,1.2728e+06,6.7696e+05,5.9581e+05,0.1232
113.3087,861,1.2718e+06,6.7632e+05,5.9550e+05,0.1258
113.4379,862,1.2709e+06,6.7568e+05,5.9521e+05,0.1221
113.5706,863,1.2699e+06,6.7503e+05,5.9491e+05,0.1258
113.7016,864,1.2690e+06,6.7438e+05,5.9462e+05,0.1242
113.8348,865,1.2681e+06,6.7373e+05,5.9434e+05,0.1261
113.9653,866,1.2671e+06,6.7307e+05,5.9406e+05,0.1236
114.1001,867,1.2662e+06,6.7242e+05,5.9379e+05,0.1272
114.2313,868,1.2653e+06,6.7177e+05,5.9352e+05,0.1241
114.3640,869,1.2644e+06,6.7113e+05,5.9325e+05,0.1257
114.4929,870,1.2635e+06,6.7049e+05,5.9298e+05,0.1224
114.6250,871,1.2626e+06,6.6986e+05,5.9270e+05,0.1253
114.7536,872,1.2617e+06,6.6924e+05,5.9242e+05,0.1223
114.8862,873,1.2608e+06,6.6862e+05,5.9213e+05,0.1255
115.0159,874,1.2598e+06,6.6800e+05,5.9185e+05,0.1227
115.1489,875,1.2589e+06,6.6738e+05,5.9156e+05,0.1253
115.2793,876,1.2581e+06,6.6676e+05,5.9129e+05,0.1235
115.4106,877,1.2572e+06,6.6614e+05,5.9101e+05,0.1243
115.5418,878,1.2563e+06,6.6552e+05,5.9074e+05,0.1245
115.6733,879,1.2554e+06,6.6491e+05,5.9047e+05,0.1246
115.8063,880,1.2545e+06,6.6429e+05,5.9020e+05,0.1260
115.9385,881,1.2536e+06,6.6368e+05,5.8993e+05,0.1254
116.0710,882,1.2527e+06,6.6307e+05,5.8966e+05,0.1258
116.2049,883,1.2518e+06,6.6246e+05,5.8938e+05,0.1259
116.3361,884,1.2510e+06,6.6185e+05,5.8912e+05,0.1242
116.4684,885,1.2501e+06,6.6123e+05,5.8885e+05,0.1255
116.5965,886,1.2492e+06,6.6061e+05,5.8860e+05,0.1214
116.7280,887,1.2483e+06,6.5999e+05,5.8835e+05,0.1247
116.8586,888,1.2475e+06,6.5937e+05,5.8809e+05,0.1239
116.9909,889,1.2466e+06,6.5876e+05,5.8784e+05,0.1252
117.1229,890,1.2457e+06,6.5815e+05,5.8759e+05,0.1247
117.2561,891,1.2449e+06,6.5754e+05,5.8732e+05,0.1260
117.3870,892,1.2440e+06,6.5693e+05,5.8706e+05,0.1239
117.5181,893,1.2431e+06,6.5634e+05,5.8679e+05,0.1240
117.6496,894,1.2423e+06,6.5574e+05,5.8652e+05,0.1248
117.7832,895,1.2414e+06,6.5515e+05,5.8625e+05,0.1263
117.9140,896,1.2405e+06,6.5455e+05,5.8598e+05,0.1237
118.0481,897,1.2397e+06,6.5396e+05,5.8571e+05,0.1269
118.1767,898,1.2388e+06,6.5337e+05,5.8544e+05,0.1215
118.3103,899,1.2380e+06,6.5278e+05,5.8517e+05,0.1268
118.4413,900,1.2371e+06,6.5219e+05,5.8490e+05,0.1238
118.5762,901,1.2362e+06,6.5161e+05,5.8463e+05,0.1271
118.7067,902,1.2354e+06,6.5103e+05,5.8436e+05,0.1236
118.8383,903,1.2345e+06,6.5046e+05,5.8408e+05,0.1246
118.9688,904,1.2337e+06,6.4990e+05,5.8381e+05,0.1237
119.1032,905,1.2329e+06,6.4933e+05,5.8353e+05,0.1271
119.2327,906,1.2320e+06,6.4877e+05,5.8326e+05,0.1228
119.3663,907,1.2312e+06,6.4821e+05,5.8298e+05,0.1264
119.4952,908,1.2304e+06,6.4766e+05,5.8270e+05,0.1223
119.6286,909,1.2295e+06,6.4711e+05,5.8242e+05,0.1268
119.7576,910,1.2287e+06,6.4656e+05,5.8215e+05,0.1225
119.8894,911,1.2279e+06,6.4602e+05,5.8187e+05,0.1249
120.0201,912,1.2271e+06,6.4547e+05,5.8159e+05,0.1241
120.1524,913,1.2262e+06,6.4493e+05,5.8132e+05,0.1253
120.2839,914,1.2254e+06,6.4438e+05,5.8105e+05,0.1245
120.4173,915,1.2246e+06,6.4383e+05,5.8078e+05,0.1262
120.5484,916,1.2238e+06,6.4329e+05,5.8051e+05,0.1239
120.6820,917,1.2230e+06,6.4274e+05,5.8024e+05,0.1266
120.8112,918,1.2222e+06,6.4220e+05,5.7996e+05,0.1227
120.9428,919,1.2214e+06,6.4167e+05,5.7968e+05,0.1246
121.0755,920,1.2205e+06,6.4114e+05,5.7940e+05,0.1258
121.2096,921,1.2197e+06,6.4061e+05,5.7913e+05,0.1230
121.3448,922,1.2189e+06,6.4008e+05,5.7885e+05,0.1282
121.4780,923,1.2181e+06,6.3954e+05,5.7858e+05,0.1261
121.6094,924,1.2173e+06,6.3901e+05,5.7832e+05,0.1244
121.7408,925,1.2165e+06,6.3848e+05,5.7806e+05,0.1245
121.8703,926,1.2157e+06,6.3795e+05,5.7780e+05,0.1229
122.0021,927,1.2150e+06,6.3742e+05,5.7754e+05,0.1251
122.1318,928,1.2142e+06,6.3689e+05,5.7729e+05,0.1228
122.2653,929,1.2134e+06,6.3637e+05,5.7703e+05,0.1267
122.3955,930,1.2126e+06,6.3584e+05,5.7677e+05,0.1208
122.5291,931,1.2118e+06,6.3532e+05,5.7651e+05,0.1264
122.6593,932,1.2111e+06,6.3480e+05,5.7626e+05,0.1225
122.7924,933,1.2103e+06,6.3427e+05,5.7601e+05,0.1254
122.9227,934,1.2095e+06,6.3374e+05,5.7577e+05,0.1227
123.0556,935,1.2087e+06,6.3321e+05,5.7553e+05,0.1258
123.1856,936,1.2080e+06,6.3266e+05,5.7529e+05,0.1230
123.3175,937,1.2072e+06,6.3212e+05,5.7507e+05,0.1252
123.4470,938,1.2064e+06,6.3157e+05,5.7484e+05,0.1226
123.5793,939,1.2056e+06,6.3103e+05,5.7462e+05,0.1252
123.7085,940,1.2049e+06,6.3047e+05,5.7441e+05,0.1227
123.8410,941,1.2041e+06,6.2992e+05,5.7419e+05,0.1258
123.9712,942,1.2034e+06,6.2937e+05,5.7399e+05,0.1235
124.1056,943,1.2026e+06,6.2882e+05,5.7378e+05,0.1267
124.2363,944,1.2019e+06,6.2827e+05,5.7358e+05,0.1238
124.3719,945,1.2011e+06,6.2773e+05,5.7338e+05,0.1283
124.5011,946,1.2004e+06,6.2718e+05,5.7317e+05,0.1222
124.6335,947,1.1996e+06,6.2665e+05,5.7296e+05,0.1256
124.7629,948,1.1989e+06,6.2612e+05,5.7274e+05,0.1227
124.8946,949,1.1981e+06,6.2560e+05,5.7252e+05,0.1249
125.0245,950,1.1974e+06,6.2508e+05,5.7229e+05,0.1231
125.1551,951,1.1966e+06,6.2457e+05,5.7206e+05,0.1238
125.2862,952,1.1959e+06,6.2406e+05,5.7183e+05,0.1243
125.4154,953,1.1951e+06,6.2354e+05,5.7161e+05,0.1226
125.5475,954,1.1944e+06,6.2303e+05,5.7138e+05,0.1250
125.6768,955,1.1937e+06,6.2252e+05,5.7115e+05,0.1225
125.8104,956,1.1929e+06,6.2202e+05,5.7091e+05,0.1268
125.9387,957,1.1922e+06,6.2152e+05,5.7067e+05,0.1217
126.0711,958,1.1915e+06,6.2103e+05,5.7043e+05,0.1260
126.2014,959,1.1907e+06,6.2054e+05,5.7019e+05,0.1228
126.3324,960,1.1900e+06,6.2006e+05,5.6994e+05,0.1243
126.4637,961,1.1893e+06,6.1957e+05,5.6970e+05,0.1244
126.5945,962,1.1885e+06,6.1909e+05,5.6946e+05,0.1242
126.7283,963,1.1878e+06,6.1861e+05,5.6921e+05,0.1267
126.8608,964,1.1871e+06,6.1813e+05,5.6897e+05,0.1256
126.9931,965,1.1864e+06,6.1766e+05,5.6872e+05,0.1255
127.1264,966,1.1857e+06,6.1718e+05,5.6847e+05,0.1263
127.2567,967,1.1849e+06,6.1671e+05,5.6822e+05,0.1235
127.3882,968,1.1842e+06,6.1624e+05,5.6797e+05,0.1249
127.5205,969,1.1835e+06,6.1578e+05,5.6771e+05,0.1257
127.6541,970,1.1828e+06,6.1532e+05,5.6746e+05,0.1265
127.7848,971,1.1821e+06,6.1487e+05,5.6720e+05,0.1239
127.9187,972,1.1814e+06,6.1441e+05,5.6695e+05,0.1269
128.0495,973,1.1807e+06,6.1395e+05,5.6670e+05,0.1239
128.1839,974,1.1799e+06,6.1350e+05,5.6645e+05,0.1271
128.3146,975,1.1792e+06,6.1304e+05,5.6620e+05,0.1236
128.4472,976,1.1785e+06,6.1259e+05,5.6595e+05,0.1254
128.5772,977,1.1778e+06,6.1213e+05,5.6570e+05,0.1231
128.7104,978,1.1771e+06,6.1168e+05,5.6546e+05,0.1263
128.8414,979,1.1764e+06,6.1122e+05,5.6522e+05,0.1242
128.9760,980,1.1757e+06,6.1076e+05,5.6498e+05,0.1276
129.1077,981,1.1751e+06,6.1030e+05,5.6475e+05,0.1243
129.2407,982,1.1744e+06,6.0983e+05,5.6453e+05,0.1258
129.3717,983,1.1737e+06,6.0936e+05,5.6430e+05,0.1240
129.5054,984,1.1730e+06,6.0890e+05,5.6407e+05,0.1264
129.6348,985,1.1723e+06,6.0843e+05,5.6385e+05,0.1223
129.7666,986,1.1716e+06,6.0797e+05,5.6361e+05,0.1252
129.8956,987,1.1709e+06,6.0752e+05,5.6338e+05,0.1225
130.0280,988,1.1702e+06,6.0706e+05,5.6315e+05,0.1254
130.1571,989,1.1695e+06,6.0661e+05,5.6292e+05,0.1222
130.2895,990,1.1688e+06,6.0616e+05,5.6268e+05,0.1256
130.4191,991,1.1682e+06,6.0571e+05,5.6245e+05,0.1229
130.5496,992,1.1675e+06,6.0527e+05,5.6222e+05,0.1234
130.6806,993,1.1668e+06,6.0483e+05,5.6198e+05,0.1242
130.8096,994,1.1661e+06,6.0439e+05,5.6175e+05,0.1223
130.9406,995,1.1655e+06,6.0395e+05,5.6152e+05,0.1245
131.0703,996,1.1648e+06,6.0351e+05,5.6129e+05,0.1230
131.2023,997,1.1641e+06,6.0307e+05,5.6107e+05,0.1248
131.3334,998,1.1635e+06,6.0263e+05,5.6084e+05,0.1243
131.4699,999,1.1628e+06,6.0218e+05,5.6062e+05,0.1291
