1629728655.839456 0.0000000 0.0000000 0.0000000 0.0000000 0.0000000 0.0000000 1.0000000
1629728656.739506 -0.0781088 0.0103096 -0.0590654 -0.0077029 0.0016934 0.0141576 0.9998687
1629728657.039506 -0.0782577 0.0087723 -0.0539699 -0.0075258 0.0009893 0.0140670 0.9998723
1629728657.339556 -0.0781744 0.0090465 -0.0552691 -0.0069038 0.0023960 0.0128392 0.9998909
