1629803969.543784 0.0000000 0.0000000 0.0000000 0.0000000 0.0000000 0.0000000 1.0000000
1629803969.643784 0.0134475 -0.0016418 0.0426306 -0.0029439 0.0081284 0.0008207 0.9999623
1629803969.743784 0.0284548 -0.0054158 0.0850723 -0.0064202 0.0129527 -0.0011932 0.9998948
1629803969.843785 0.0440613 -0.0105100 0.1301595 -0.0082546 0.0249404 -0.0038733 0.9996474
1629803969.943785 0.0592600 -0.0132562 0.1788675 -0.0062389 0.0369692 -0.0055230 0.9992816
1629803970.043785 0.0735961 -0.0150836 0.2258585 -0.0051852 0.0299163 -0.0080550 0.9995065
1629803970.143844 0.0878689 -0.0168892 0.2717844 -0.0045409 0.0321777 -0.0097140 0.9994246
1629803970.243844 0.1024793 -0.0211224 0.3179596 -0.0033850 0.0511767 -0.0100455 0.9986333
1629803970.343844 0.1186281 -0.0261486 0.3631505 -0.0035043 0.0591573 -0.0127388 0.9981613
1629803970.643844 0.1590322 -0.0324772 0.4997393 -0.0016562 0.0265987 -0.0154713 0.9995251
1629803970.743845 0.1713890 -0.0383938 0.5450851 -0.0023836 0.0365498 -0.0125360 0.9992504
1629803970.843845 0.1858607 -0.0457065 0.5906560 -0.0027886 0.0425382 -0.0119913 0.9990190
1629803970.943845 0.2019546 -0.0495886 0.6388717 0.0000653 0.0457924 -0.0127717 0.9988694
1629803971.043845 0.2177725 -0.0505875 0.6880143 0.0041881 0.0503266 -0.0129261 0.9986404
1629803971.243884 0.2542769 -0.0569950 0.7838589 0.0092426 0.0733218 -0.0140049 0.9971672
1629803971.343884 0.2748421 -0.0634121 0.8287420 0.0075304 0.0832951 -0.0154932 0.9963760
1629803971.443884 0.2960643 -0.0669029 0.8723111 0.0037943 0.0675024 -0.0198668 0.9975141
1629803971.643884 0.3307544 -0.0693600 0.9643759 -0.0002085 0.0483804 -0.0166878 0.9986895
1629803971.843884 0.3688210 -0.0809219 1.0538017 -0.0086051 0.0597249 -0.0118812 0.9981071
1629803972.043885 0.4143335 -0.0823301 1.1499249 -0.0081906 0.1010522 -0.0083741 0.9948121
1629803972.243938 0.4630732 -0.0876576 1.2411122 -0.0096860 0.1288279 -0.0069189 0.9915955
1629803972.443938 0.5228827 -0.0971304 1.3292305 -0.0109606 0.1340023 -0.0148850 0.9908086
1629803972.643939 0.5766434 -0.1019236 1.4178755 -0.0116503 0.1280912 -0.0126931 0.9916127
1629803972.843939 0.6364604 -0.1113297 1.5025146 -0.0158918 0.1601440 -0.0084518 0.9869295
1629803973.043939 0.7036619 -0.1158311 1.5947653 -0.0083548 0.1921888 -0.0034383 0.9813164
1629803973.243995 0.7720603 -0.1249004 1.6788747 -0.0056550 0.2095791 0.0023624 0.9777725
1629803973.443995 0.8413238 -0.1328068 1.7590361 -0.0050777 0.1949867 0.0031565 0.9807876
1629803973.643995 0.9031036 -0.1350868 1.8364941 -0.0068982 0.1837598 0.0128607 0.9828628
1629803973.843995 0.9685109 -0.1409928 1.9129597 -0.0124855 0.2204779 0.0210928 0.9750839
1629803973.943995 1.0035152 -0.1420586 1.9502317 -0.0146980 0.2325494 0.0218114 0.9722289
1629803974.144047 1.0733210 -0.1463659 2.0208375 -0.0171443 0.2417029 0.0187268 0.9700181
1629803974.344048 1.1382062 -0.1553084 2.0856886 -0.0208640 0.2116108 0.0145272 0.9770233
1629803974.544048 1.1915640 -0.1626548 2.1489613 -0.0206361 0.1387503 0.0185249 0.9899390
1629803974.844048 1.2672441 -0.1738458 2.2365460 -0.0182745 0.0804902 0.0251281 0.9962710
1629803975.044049 1.3172619 -0.1760443 2.2876227 -0.0152431 0.0479850 0.0229464 0.9984681
1629803975.244098 1.3660811 -0.1805978 2.3273566 -0.0164652 0.0302306 0.0146447 0.9993000
1629803975.444098 1.4163349 -0.1863230 2.3598480 -0.0203190 -0.0393798 -0.0028296 0.9990137
1629803975.644098 1.4516302 -0.1898024 2.3969133 -0.0183558 -0.0759243 -0.0070883 0.9969194
1629803975.944098 1.4982746 -0.1991655 2.4636443 -0.0037368 -0.0673212 -0.0086664 0.9976867
1629803976.244135 1.5429984 -0.2052291 2.5295708 0.0101068 -0.0218770 -0.0072487 0.9996833
1629803977.044136 1.6065047 -0.2295201 2.6030407 -0.0016173 -0.0980755 0.0048824 0.9951657
1629803977.444186 1.6151271 -0.2298849 2.6190352 0.0112529 -0.0840653 -0.0015722 0.9963955
1629803978.344258 1.5995018 -0.2302454 2.5953794 -0.0046610 -0.1501677 0.0118515 0.9885785
1629803978.544258 1.6047459 -0.2295992 2.5919192 -0.0067196 -0.1781560 0.0075996 0.9839500
1629803986.344658 1.6145437 -0.2299536 2.6264529 0.0231748 -0.2392049 -0.0089619 0.9706511
1629803986.744659 1.6020253 -0.2135753 2.6427383 0.0276085 -0.3204281 -0.0161589 0.9467325
1629803986.944659 1.5881202 -0.1998325 2.6530032 0.0173601 -0.3583652 -0.0257500 0.9330648
1629803987.144731 1.5612757 -0.1919662 2.6701863 0.0109934 -0.3838496 -0.0288272 0.9228801
1629803987.344731 1.5258867 -0.1867930 2.6942997 0.0051698 -0.4168216 -0.0303224 0.9084677
1629803987.544731 1.4922359 -0.1841165 2.7283301 0.0006451 -0.4272701 -0.0341622 0.9034781
1629803987.744731 1.4550228 -0.1913442 2.7797160 0.0092036 -0.4565048 -0.0370947 0.8888997
1629803987.944731 1.4154630 -0.1926136 2.8434968 0.0171604 -0.4905636 -0.0346123 0.8705485
1629803988.244780 1.3612534 -0.1904681 2.9242556 0.0021854 -0.5233144 -0.0405014 0.8511738
1629803988.444780 1.3196269 -0.1959121 2.9766846 -0.0104813 -0.5336370 -0.0441173 0.8444971
1629803988.644780 1.2734011 -0.1964201 3.0407183 -0.0126519 -0.5323106 -0.0432600 0.8453484
1629803988.844780 1.2256155 -0.2036427 3.1096485 -0.0143373 -0.5314920 -0.0475729 0.8456048
1629803989.144832 1.1514062 -0.2065712 3.2082276 -0.0260658 -0.5696074 -0.0499529 0.8199834
1629803989.444832 1.0660700 -0.2177530 3.2911580 -0.0372278 -0.5707860 -0.0530715 0.8185358
1629803989.644832 1.0044819 -0.2202899 3.3499730 -0.0344892 -0.5675796 -0.0527728 0.8209013
1629803989.944833 0.9104627 -0.2330255 3.4404209 -0.0241177 -0.5829578 -0.0560953 0.8102048
1629803990.244886 0.8077577 -0.2332041 3.5271914 -0.0208540 -0.6080784 -0.0537265 0.7917824
1629803990.544887 0.7081450 -0.2448796 3.6040812 -0.0392589 -0.5875513 -0.0637962 0.8057123
1629803990.844887 0.5955258 -0.2524437 3.6908875 -0.0443069 -0.5683561 -0.0621503 0.8192347
1629803991.144933 0.4760501 -0.2579725 3.7797387 -0.0527383 -0.5820738 -0.0503172 0.8098623
1629803991.544933 0.3218546 -0.2663298 3.8803906 -0.0751598 -0.5512396 -0.0499762 0.8294506
1629803991.944934 0.1590102 -0.2776411 3.9878824 -0.0761144 -0.5509312 -0.0505288 0.8295349
1629803992.244994 0.0297406 -0.2750613 4.0495501 -0.0754278 -0.5864117 -0.0440636 0.8052890
1629803992.544995 -0.1028344 -0.2832223 4.1100392 -0.0758939 -0.5594094 -0.0430807 0.8242847
1629803992.844995 -0.2323164 -0.2898956 4.1726513 -0.0704203 -0.5784344 -0.0427424 0.8115588
1629803993.245044 -0.4021003 -0.2901903 4.2339072 -0.0713720 -0.6254667 -0.0392860 0.7759858
1629803993.545044 -0.5276130 -0.2884721 4.2844381 -0.0672665 -0.5992610 -0.0442371 0.7964952
1629803993.845044 -0.6466402 -0.2966536 4.3488884 -0.0656604 -0.6047536 -0.0608321 0.7913667
1629803994.145095 -0.7717161 -0.2909851 4.4057403 -0.0726997 -0.6151285 -0.0585007 0.7828853
1629803994.445095 -0.9066439 -0.2938955 4.4628301 -0.0803532 -0.5681927 -0.0601332 0.8167524
1629803994.745095 -1.0426815 -0.2953263 4.5210919 -0.0763695 -0.5668402 -0.0614363 0.8179764
1629803995.045096 -1.1767207 -0.2889571 4.5688658 -0.0759119 -0.5988592 -0.0585737 0.7950938
1629803995.345151 -1.3163056 -0.2901597 4.6044345 -0.0802817 -0.5836032 -0.0614102 0.8057238
1629803995.645151 -1.4566520 -0.2869832 4.6534562 -0.0765926 -0.5916772 -0.0660710 0.7998039
1629803995.845151 -1.5476534 -0.2852530 4.6847649 -0.0797014 -0.6218289 -0.0636582 0.7764819
1629803996.045151 -1.6407195 -0.2813680 4.7053142 -0.0836918 -0.6401219 -0.0573875 0.7615421
1629803996.245203 -1.7395526 -0.2831829 4.7344480 -0.0838989 -0.6086211 -0.0615805 0.7866061
1629803996.445203 -1.8374944 -0.2763733 4.7702384 -0.0735051 -0.5896010 -0.0575071 0.8022846
1629803996.645203 -1.9268670 -0.2813646 4.8026066 -0.0743874 -0.6076263 -0.0618976 0.7883054
1629803996.845203 -2.0135288 -0.2726769 4.8294477 -0.0785786 -0.6430995 -0.0599397 0.7593784
1629803997.045204 -2.0985456 -0.2709477 4.8486543 -0.0851064 -0.6597083 -0.0622128 0.7440910
1629803997.245262 -2.1804497 -0.2743607 4.8695736 -0.0962007 -0.6366088 -0.0694290 0.7620068
1629803997.445263 -2.2598526 -0.2711593 4.8855524 -0.0980106 -0.6523088 -0.0669918 0.7485982
1629803997.645263 -2.3413711 -0.2758104 4.9038644 -0.0938372 -0.6743134 -0.0734463 0.7287672
1629803997.845263 -2.4188824 -0.2698837 4.9118075 -0.0904012 -0.7065635 -0.0690017 0.6984514
1629803998.045263 -2.4912720 -0.2688533 4.9159856 -0.0858725 -0.7209978 -0.0708748 0.6839333
1629803998.245310 -2.5658748 -0.2687231 4.9231420 -0.0751893 -0.6972790 -0.0748176 0.7089083
1629803998.445310 -2.6381612 -0.2668310 4.9285984 -0.0630832 -0.7050931 -0.0715947 0.7026652
1629803998.645310 -2.7043428 -0.2708675 4.9354854 -0.0583201 -0.7330719 -0.0752942 0.6734502
1629803999.145375 -2.8323519 -0.2772428 4.9284844 -0.0623302 -0.7445275 -0.0786330 0.6600080
1629803999.845376 -2.9271123 -0.2977089 4.9430175 -0.0318713 -0.7273685 -0.0762251 0.6812555
1629804002.245526 -2.9600360 -0.3074479 4.9345512 -0.0037795 -0.7410141 -0.0442908 0.6700165
1629804011.146028 -2.9697258 -0.3074047 4.9496961 0.0119197 -0.7186916 -0.0478786 0.6935762
1629804012.046029 -2.9720113 -0.3072160 4.9375200 0.0066706 -0.7554135 -0.0406586 0.6539518
1629804012.346081 -2.9831913 -0.2967454 4.9088550 -0.0010506 -0.7831155 -0.0197093 0.6215630
1629804012.546081 -2.9864905 -0.2682868 4.8652320 -0.0212807 -0.8127771 -0.0206802 0.5818185
1629804012.746081 -2.9876795 -0.2419737 4.8150516 -0.0519547 -0.8288906 -0.0309835 0.5561305
1629804012.946081 -2.9954321 -0.2290937 4.7586832 -0.0886683 -0.8540550 -0.0323473 0.5115483
1629804013.246131 -3.0263429 -0.2305882 4.6673317 0.1174747 0.8849695 0.0216314 -0.4500676
1629804013.446131 -3.0579331 -0.2240337 4.6008377 0.1163555 0.9055361 0.0238735 -0.4073032
1629804013.746131 -3.0974672 -0.2202638 4.4890122 0.1206780 0.9300229 0.0308474 -0.3457495
1629804013.946132 -3.1298251 -0.2139269 4.4043736 0.1312355 0.9185467 0.0387990 -0.3708690
1629804014.246184 -3.1796906 -0.2096252 4.2737694 0.1355979 0.9302517 0.0342285 -0.3392247
1629804014.546184 -3.2156782 -0.1935184 4.1383100 0.1415645 0.9460804 0.0399802 -0.2886053
1629804014.746184 -3.2275262 -0.1904952 4.0482349 0.1468478 0.9613631 0.0579651 -0.2255145
1629804014.946184 -3.2453346 -0.1788345 3.9598303 0.1472147 0.9499828 0.0845671 -0.2621241
1629804015.246236 -3.2746897 -0.1716777 3.8239889 0.1316778 0.9659849 0.0978892 -0.1998797
1629804015.546236 -3.2839365 -0.1532937 3.6801450 0.1312477 0.9743671 0.1047079 -0.1497298
1629804015.746236 -3.2801299 -0.1548292 3.5802166 0.1359321 0.9770367 0.1127721 -0.1191820
1629804016.046237 -3.2902703 -0.1310772 3.4327490 0.1229714 0.9761926 0.1185507 -0.1336852
1629804016.346287 -3.3041532 -0.1233367 3.2833016 0.1045038 0.9800716 0.1277462 -0.1105420
1629804016.546288 -3.3077953 -0.1093295 3.1812580 0.0950339 0.9840358 0.1269357 -0.0808049
1629804016.746288 -3.3159223 -0.1036739 3.0797851 0.0774889 0.9804391 0.1426047 -0.1113486
1629804017.046288 -3.3363667 -0.0746649 2.9333332 0.0508937 0.9778553 0.1456197 -0.1414349
1629804017.346344 -3.3462672 -0.0640034 2.7834747 0.0447351 0.9769382 0.1425866 -0.1525105
1629804017.546344 -3.3353186 -0.0586081 2.6844816 0.0603561 0.9806153 0.1454408 -0.1166092
1629804017.746344 -3.3295429 -0.0564749 2.5882387 0.0698666 0.9733626 0.1633406 -0.1449264
1629804017.946344 -3.3332033 -0.0444533 2.4898891 0.0718949 0.9720956 0.1585849 -0.1572009
1629804018.146400 -3.3404763 -0.0459772 2.3913541 0.0715179 0.9785587 0.1529895 -0.1179078
1629804018.346401 -3.3452704 -0.0365596 2.2907188 0.0722619 0.9818247 0.1450569 -0.0987772
1629804018.546401 -3.3438694 -0.0346587 2.1887326 0.0747482 0.9832335 0.1419859 -0.0866300
1629804018.746401 -3.3453238 -0.0264209 2.0889907 0.0778882 0.9744630 0.1490122 -0.1488310
1629804019.046401 -3.3511264 -0.0163038 1.9461410 0.0811710 0.9787923 0.1539510 -0.1080555
1629804019.246459 -3.3583653 -0.0101982 1.8521941 0.0770244 0.9771573 0.1659148 -0.1081808
1629804019.446459 -3.3570905 -0.0050929 1.7553788 0.0812802 0.9792366 0.1692774 -0.0763835
1629804019.646459 -3.3603065 -0.0022276 1.6532725 0.0798042 0.9717184 0.1779510 -0.1331472
1629804019.946460 -3.3754690 0.0108708 1.5042168 0.0806069 0.9778235 0.1545371 -0.1161123
1629804020.146514 -3.3869860 0.0161647 1.4101458 0.0771922 0.9774846 0.1564170 -0.1187388
1629804020.446514 -3.3924329 0.0258564 1.2740470 0.0830327 0.9798568 0.1687321 -0.0671991
1629804020.646515 -3.4028432 0.0336862 1.1814955 0.0742903 0.9717270 0.1861753 -0.1247649
1629804020.946515 -3.4189730 0.0456051 1.0389397 0.0652624 0.9773750 0.1792678 -0.0913349
1629804021.146564 -3.4295909 0.0491253 0.9453442 0.0597634 0.9797778 0.1776655 -0.0699906
1629804021.346564 -3.4283764 0.0570238 0.8503991 0.0616379 0.9831988 0.1681252 -0.0354224
1629804021.546564 -3.4326963 0.0576789 0.7562311 0.0560663 0.9809299 0.1750024 -0.0633034
1629804021.746565 -3.4416642 0.0684869 0.6577473 0.0458129 0.9795236 0.1717288 -0.0945720
1629804021.946565 -3.4505856 0.0692528 0.5664564 0.0390605 0.9820499 0.1731057 -0.0639263
1629804022.146617 -3.4569423 0.0759424 0.4786165 0.0397436 0.9832287 0.1751599 -0.0316354
1629804022.346617 -3.4505422 0.0784759 0.3901252 0.0456713 0.9830859 0.1768610 -0.0132823
1629804022.546617 -3.4467843 0.0830120 0.2997679 0.0469095 0.9806079 0.1812863 -0.0578185
1629804022.846617 -3.4494531 0.0900485 0.1627337 0.0425242 0.9811522 0.1802226 -0.0552428
1629804023.146670 -3.4514630 0.1008485 0.0355426 0.0432984 0.9806034 0.1903061 -0.0180517
1629804023.446670 -3.4390640 0.1018246 -0.0904176 0.0426706 0.9793602 0.1936899 -0.0389506
1629804023.646670 -3.4372849 0.1086488 -0.1802263 0.0399420 0.9788084 0.1809785 -0.0870949
1629804024.046670 -3.4395411 0.1092985 -0.3479074 0.0347756 0.9824858 0.1802166 -0.0321620
1629804024.246718 -3.4330046 0.1127208 -0.4270934 0.0401144 0.9823484 0.1805051 -0.0282911
1629804024.546718 -3.4249296 0.1095138 -0.5433639 0.0434269 0.9773569 0.1824176 -0.0980381
1629804030.147051 -3.4771264 0.0793496 -0.9373355 0.0239398 0.9747646 0.0691423 -0.2109034
1629804032.947159 -3.4803047 0.0789893 -0.9302557 0.0197689 0.9724988 0.0759785 -0.2192771
1629804036.247370 -3.4813416 0.0793473 -0.9315786 0.0169100 0.9621630 0.0756817 -0.2612064
1629804037.047370 -3.4653697 0.0788819 -0.9414223 0.0325927 0.9575020 0.0720879 -0.2773643
1629804037.247422 -3.4491794 0.0804577 -0.9640000 0.0509886 0.9624438 0.0563985 -0.2606173
1629804037.447423 -3.4262669 0.0968790 -0.9902467 0.0658824 0.9720234 0.0431250 -0.2212925
1629804037.747423 -3.4045718 0.1254702 -1.0259496 0.0650933 0.9734244 0.0479331 -0.2142668
1629804038.047423 -3.4233758 0.1464338 -1.0579104 0.0400142 0.9684044 0.0793097 -0.2330273
1629804038.347493 -3.4735069 0.1571327 -1.1090293 0.0051160 0.9566049 0.1019583 -0.2729201
1629804038.647493 -3.5219722 0.1658889 -1.1716795 0.0069770 0.9320385 0.1136192 -0.3440147
1629804039.047493 -3.6166508 0.1713930 -1.2496012 -0.0239986 -0.8468342 -0.1058040 0.5206740
1629804039.347532 -3.7103798 0.1676616 -1.2895458 -0.0383384 -0.8257743 -0.0994335 0.5538412
1629804039.547532 -3.7745988 0.1715446 -1.3188412 -0.0567931 -0.8167450 -0.0984960 0.5656861
1629804039.847533 -3.8784018 0.1663758 -1.3672540 -0.0714238 -0.7919230 -0.1013591 0.5978988
1629804040.147594 -4.0057588 0.1733123 -1.4047970 -0.0570350 -0.7551908 -0.0850135 0.6474617
1629804040.547594 -4.1709461 0.1723461 -1.4388220 -0.0462951 -0.7528893 -0.0719918 0.6525577
1629804040.947595 -4.3215117 0.1747782 -1.4772774 -0.0555913 -0.7178901 -0.0864658 0.6885253
1629804041.347640 -4.4738398 0.1746846 -1.5072644 -0.0505086 -0.7210720 -0.0940072 0.6845924
1629804041.647640 -4.5852637 0.1785194 -1.5442106 -0.0510405 -0.7645447 -0.0833385 0.6371193
1629804042.047640 -4.7292032 0.1820499 -1.6019754 -0.0549553 -0.7584147 -0.0895283 0.6432508
1629804042.347703 -4.8412566 0.1800868 -1.6429235 -0.0525932 -0.7799422 -0.0995475 0.6156415
1629804042.747704 -4.9955454 0.1873068 -1.7021894 -0.0508620 -0.7953135 -0.0986421 0.5959524
1629804043.147748 -5.1587167 0.1936118 -1.7484802 -0.0460716 -0.7290812 -0.0935485 0.6764368
1629804043.547749 -5.3233213 0.1941192 -1.7682295 -0.0438653 -0.7203401 -0.0889121 0.6864988
1629804044.047749 -5.5466094 0.1967660 -1.7571273 -0.0340197 -0.6141687 -0.0700260 0.7853253
1629804044.547815 -5.7637620 0.1957374 -1.7023935 -0.0417623 -0.6188316 -0.0538666 0.7825611
1629804044.847815 -5.8875299 0.1917320 -1.6829052 -0.0599745 -0.6260186 -0.0606688 0.7751278
1629804045.247873 -6.0551310 0.1952111 -1.6301032 -0.0555291 -0.6352828 -0.0691701 0.7671686
1629804045.547873 -6.1773338 0.2010489 -1.5825839 -0.0553326 -0.6647586 -0.0693899 0.7417678
1629804045.847873 -6.2965088 0.1960661 -1.5409006 -0.0643946 -0.6454043 -0.0754982 0.7573683
1629804046.147921 -6.4198108 0.1985043 -1.4966027 -0.0738705 -0.6383315 -0.0737818 0.7626482
1629804046.447922 -6.5508528 0.1957446 -1.4472975 -0.0713046 -0.6697887 -0.0748765 0.7353178
1629804046.847922 -6.7240872 0.1924496 -1.4068309 -0.0737299 -0.6690046 -0.0695184 0.7363179
1629804047.247969 -6.8942833 0.1926779 -1.3581959 -0.0662398 -0.6891776 -0.0734100 0.7178144
1629804047.647970 -7.0613656 0.1969046 -1.3190578 -0.0904450 -0.7174678 -0.0743638 0.6866803
1629804047.947970 -7.1993170 0.1963315 -1.2865481 -0.0819188 -0.6978556 -0.0758311 0.7074860
1629804048.348032 -7.3714328 0.1943465 -1.2509710 -0.0719540 -0.7350557 -0.0876522 0.6684556
1629804048.648032 -7.4957008 0.2013991 -1.2447820 -0.0797589 -0.7599586 -0.0833194 0.6396556
1629804049.048033 -7.6734872 0.2074983 -1.2315654 -0.0593114 -0.7320748 -0.0745622 0.6745288
1629804049.348078 -7.8023372 0.2054190 -1.2181811 -0.0519840 -0.7411469 -0.0766070 0.6649288
1629804049.648079 -7.9201317 0.2133924 -1.2195327 -0.0610869 -0.7455225 -0.0742128 0.6595128
1629804049.948079 -8.0322084 0.2121069 -1.2284025 -0.0684951 -0.7137562 -0.0799703 0.6924343
1629804050.348134 -8.1783514 0.2116135 -1.2330887 -0.0720581 -0.7395785 -0.0869500 0.6635292
1629804050.748134 -8.3062983 0.2163954 -1.2476102 -0.0827145 -0.7393282 -0.0892825 0.6622543
1629804051.148191 -8.4242239 0.2170843 -1.2644554 -0.0648895 -0.7121857 -0.0847789 0.6938252
1629804051.548191 -8.5328579 0.2127315 -1.2580040 -0.0496306 -0.7594600 -0.0791613 0.6438096
1629804051.848192 -8.5983438 0.2126085 -1.2632970 -0.0564315 -0.7615247 -0.0789482 0.6408297
1629804052.448250 -8.6777592 0.1996781 -1.2666699 -0.0376183 -0.7309466 -0.0796293 0.6767282
1629804053.748297 -8.7158937 0.1699823 -1.2580056 -0.0025222 -0.7147117 -0.0545866 0.6972813
1629804055.848399 -8.7255392 0.1699686 -1.2491550 0.0084503 -0.7395778 -0.0547061 0.6707910
1629804056.348447 -8.7218790 0.1693969 -1.2433017 0.0096170 -0.7306750 -0.0608445 0.6799408
1629804056.648447 -8.7222166 0.1691347 -1.2392498 0.0125076 -0.7261329 -0.0631632 0.6845326
1629804057.148507 -8.7210627 0.1690951 -1.2377108 0.0125643 -0.7251948 -0.0644120 0.6854092
1629804058.448574 -8.7167006 0.1688142 -1.2343878 0.0119583 -0.7213104 -0.0689064 0.6890720
1629804059.248622 -8.7161283 0.1682962 -1.2342770 0.0113690 -0.7197868 -0.0697024 0.6905934
1629804061.248724 -8.7006760 0.1680400 -1.2371088 -0.0005462 -0.7473438 -0.0777317 0.6598749
1629804062.048725 -8.6441278 0.2094565 -1.4152466 0.1058142 0.9156820 0.0450818 -0.3850942
1629804062.348777 -8.6171999 0.2132405 -1.4841477 0.1325667 0.9572766 0.0634463 -0.2490426
1629804062.648777 -8.6237383 0.2226057 -1.5680491 0.1215081 0.9764581 0.0842567 -0.1570543
1629804062.948777 -8.6213799 0.2332479 -1.6567361 0.1268770 0.9860418 0.0974391 -0.0461458
1629804063.148844 -8.6097126 0.2316119 -1.7288970 0.1339065 0.9856213 0.1016299 -0.0170631
1629804063.548845 -8.5912571 0.2490118 -1.8778415 0.1356663 0.9827955 0.1250837 -0.0078534
1629804063.748845 -8.5834122 0.2532040 -1.9524611 0.1372217 0.9802312 0.1420493 0.0117915
1629804063.948845 -8.5724373 0.2625991 -2.0276868 0.1346984 0.9780379 0.1438208 0.0679247
1629804064.148895 -8.5623245 0.2620089 -2.1139212 0.1200691 0.9773726 0.1508520 0.0870049
1629804064.248895 -8.5582895 0.2652684 -2.1560585 0.1128851 0.9783089 0.1579175 0.0723233
1629804064.448895 -8.5464602 0.2808241 -2.2408447 0.1039843 0.9782743 0.1568807 0.0869204
1629804064.548895 -8.5403957 0.2835093 -2.2822893 0.0996478 0.9771215 0.1536970 0.1080795
1629804064.748895 -8.5267057 0.2841147 -2.3686802 0.0934462 0.9762053 0.1457829 0.1305311
1629804064.948896 -8.5036173 0.2914824 -2.4518797 0.0945313 0.9704757 0.1341382 0.1767701
1629804065.148950 -8.4703083 0.2979233 -2.5418115 0.0939976 0.9698877 0.1252369 0.1865425
1629804065.348950 -8.4415140 0.3136939 -2.6255023 0.0854370 0.9767679 0.1369172 0.1409915
1629804065.548950 -8.4195623 0.3199562 -2.6928232 0.0829880 0.9753309 0.1613761 0.1256995
1629804065.748951 -8.4034986 0.3202362 -2.7706916 0.0833437 0.9694786 0.1675874 0.1583650
1629804066.048951 -8.3670473 0.3266141 -2.9030216 0.0799028 0.9662581 0.1556239 0.1890556
1629804066.248998 -8.3334293 0.3262207 -2.9951921 0.0745829 0.9698082 0.1560346 0.1719381
1629804066.448998 -8.3004093 0.3422312 -3.0869265 0.0704569 0.9737239 0.1555551 0.1506660
1629804066.648998 -8.2697840 0.3438897 -3.1743543 0.0698310 0.9690529 0.1621977 0.1724877
1629804066.848999 -8.2370501 0.3493640 -3.2637162 0.0706629 0.9659314 0.1655724 0.1859275
1629804067.048999 -8.1929388 0.3543165 -3.3548176 0.0735883 0.9632897 0.1582844 0.2039701
1629804067.249060 -8.1498613 0.3586056 -3.4471231 0.0718520 0.9653872 0.1610235 0.1921879
1629804067.449060 -8.1108761 0.3706172 -3.5358782 0.0716418 0.9658220 0.1564202 0.1938764
1629804067.649060 -8.0753317 0.3674853 -3.6238706 0.0706339 0.9643076 0.1603375 0.1985286
1629804067.849060 -8.0344973 0.3773578 -3.7131326 0.0781117 0.9631496 0.1509328 0.2084722
1629804068.049060 -7.9904947 0.3776065 -3.8013556 0.0847086 0.9600626 0.1509640 0.2198047
1629804068.249106 -7.9517989 0.3854787 -3.8901739 0.0790773 0.9659768 0.1652087 0.1825970
1629804068.449106 -7.9213080 0.3977524 -3.9743922 0.0749128 0.9668579 0.1678806 0.1771720
1629804068.649106 -7.8924179 0.3959102 -4.0608234 0.0702267 0.9659151 0.1733998 0.1789100
1629804068.849107 -7.8588138 0.4063327 -4.1472120 0.0692267 0.9651539 0.1663374 0.1897828
1629804069.049107 -7.8239932 0.4086266 -4.2377872 0.0662256 0.9658597 0.1620735 0.1909487
1629804069.249151 -7.7924075 0.4159136 -4.3265772 0.0650080 0.9712916 0.1614778 0.1621466
1629804069.449151 -7.7653294 0.4259947 -4.4106827 0.0663340 0.9693975 0.1529526 0.1802047
1629804069.649151 -7.7468681 0.4247196 -4.4924574 0.0581330 0.9647925 0.1620717 0.1988181
1629804069.849151 -7.7218566 0.4340589 -4.5688767 0.0590723 0.9535843 0.1711518 0.2406126
1629804070.049151 -7.6893134 0.4369949 -4.6461902 0.0561133 0.9532377 0.1809108 0.2355007
1629804070.249214 -7.6538057 0.4440646 -4.7279859 0.0530178 0.9587304 0.1837611 0.2103735
1629804070.449214 -7.6176639 0.4507559 -4.8102083 0.0522694 0.9594008 0.1744953 0.2153355
1629804070.649214 -7.5856395 0.4498907 -4.8872108 0.0555634 0.9510155 0.1696928 0.2523622
1629804070.949214 -7.5215631 0.4602711 -4.9991732 0.0625291 0.9386923 0.1544040 0.3018380
1629804071.149271 -7.4786553 0.4637597 -5.0669694 0.0563529 0.9414808 0.1577710 0.2924835
1629804071.349271 -7.4365630 0.4719727 -5.1385837 0.0493037 0.9430369 0.1484533 0.2936190
1629804071.549271 -7.4017344 0.4717129 -5.2105355 0.0363747 0.9382999 0.1451413 0.3117759
1629804071.749271 -7.3653932 0.4765503 -5.2745047 0.0333931 0.9231562 0.1463383 0.3539104
1629804071.949272 -7.3231850 0.4832410 -5.3283272 0.0331069 0.9162399 0.1485910 0.3705793
1629804072.649330 -7.1844640 0.4859674 -5.5226545 0.0169839 0.9332084 0.1437383 0.3288966
1629804072.849330 -7.1549554 0.4854735 -5.5708876 0.0153208 0.9275106 0.1421243 0.3453838
1629804073.249379 -7.0892539 0.4815409 -5.6480522 0.0193497 0.9405574 0.1372199 0.3100777
1629804073.449379 -7.0671630 0.4814071 -5.6862359 0.0153342 0.9489504 0.1304566 0.2867737
1629804073.949380 -7.0292645 0.4683130 -5.7634168 0.0196071 0.9489837 0.0894190 0.3017446
1629804074.249422 -7.0228405 0.4634616 -5.7857509 0.0142714 0.9558057 0.0723787 0.2845929
1629804074.649422 -7.0189753 0.4622552 -5.7969856 0.0144262 0.9573032 0.0618204 0.2820297
1629804075.849491 -7.0012240 0.4620975 -5.8032274 0.0274818 0.9618348 0.0533398 0.2669707
1629804081.049751 -7.0142188 0.4631197 -5.8063660 0.0155791 0.9621016 0.0532446 0.2669882
1629804082.049795 -7.0142775 0.4629213 -5.8073134 0.0155341 0.9602997 0.0522463 0.2735936
1629804083.149921 -7.0046258 0.4602866 -5.7889681 0.0313422 0.9259009 0.0567823 0.3721572
1629804083.449921 -6.9950881 0.4580016 -5.7762032 0.0454822 0.9118649 0.0605449 0.4034451
1629804083.749921 -6.9816346 0.4672384 -5.7540150 0.0658663 0.9045996 0.0638215 0.4162787
1629804084.149975 -6.9426489 0.4755386 -5.7038069 0.0840271 0.8717925 0.0772956 0.4763851
1629804084.549975 -6.8847523 0.4813606 -5.6484942 0.0756342 0.8651437 0.1060456 0.4843142
1629804084.849976 -6.8433685 0.4814168 -5.6211019 0.0732256 0.8399490 0.1172699 0.5247586
1629804085.450029 -6.7108083 0.4737206 -5.5815315 0.0795612 0.8051166 0.1168428 0.5760253
1629804085.750030 -6.6336474 0.4742549 -5.5498190 0.0805002 0.8316593 0.1200258 0.5361495
1629804086.050030 -6.5753031 0.4801736 -5.5357137 0.0608401 0.8417822 0.1154508 0.5238056
1629804086.550081 -6.4578085 0.4795815 -5.5452571 0.0470571 0.8240156 0.1009023 0.5555201
1629804086.850081 -6.3834147 0.4768912 -5.5576782 0.0485349 0.8432375 0.1159572 0.5226364
1629804087.150123 -6.2998686 0.4819968 -5.5699997 0.0534298 0.8763232 0.1304922 0.4606242
1629804087.450123 -6.2303033 0.4835466 -5.6079936 0.0480424 0.8989955 0.1312193 0.4150669
1629804087.750123 -6.1553240 0.4860030 -5.6616020 0.0596408 0.9002255 0.1212568 0.4139248
1629804088.350190 -6.0304861 0.4906902 -5.7546291 0.0613181 0.9193821 0.1467377 0.3597842
1629804088.650190 -5.9913907 0.4947652 -5.8003564 0.0657276 0.9267445 0.1509424 0.3376995
1629804088.950191 -5.9713264 0.4960282 -5.8351650 0.0747857 0.9171445 0.1431009 0.3643832
1629804089.550233 -5.9583344 0.4953484 -5.8723927 0.0735377 0.9210923 0.1233221 0.3619017
1629804089.850233 -5.9563046 0.4957799 -5.8871007 0.0752369 0.9317439 0.1179475 0.3350838
1629804090.150299 -5.9555855 0.4944609 -5.8987088 0.0820464 0.9405742 0.1177855 0.3077581
1629804090.750299 -5.9390407 0.4948046 -5.9221234 0.0973864 0.9442928 0.1354224 0.2837035
1629804091.050299 -5.9073110 0.4926629 -5.9567976 0.1020084 0.9458520 0.1364662 0.2762885
1629804091.350358 -5.8885880 0.4970622 -5.9806180 0.0993495 0.9434193 0.1511903 0.2779051
1629804091.650358 -5.8835816 0.5008124 -6.0040035 0.0881484 0.9400492 0.1405873 0.2979472
1629804091.950358 -5.8895507 0.5063500 -6.0563650 0.0734300 0.9581116 0.1239593 0.2475162
1629804092.250410 -5.9063501 0.5163398 -6.1412697 0.0607633 0.9742593 0.1215565 0.1798626
1629804092.550410 -5.9156842 0.5294160 -6.2328172 0.0606923 0.9702604 0.1338799 0.1923211
1629804092.850410 -5.9089098 0.5364978 -6.3320966 0.0469585 0.9775077 0.1519321 0.1385292
1629804093.150449 -5.9064059 0.5485798 -6.4341764 0.0399722 0.9827948 0.1499269 0.1001924
1629804093.350450 -5.9099412 0.5492129 -6.5028310 0.0396062 0.9802881 0.1483733 0.1243063
1629804093.650450 -5.9008312 0.5625259 -6.6079302 0.0515836 0.9772902 0.1390833 0.1513236
1629804093.950450 -5.8786530 0.5640312 -6.7191377 0.0499483 0.9811206 0.1468451 0.1155168
1629804094.150508 -5.8589849 0.5733230 -6.7976375 0.0509934 0.9834622 0.1428267 0.0990073
1629804094.450509 -5.8385901 0.5752230 -6.9131436 0.0487175 0.9820191 0.1447450 0.1109680
1629804094.750509 -5.8035197 0.5860199 -7.0244913 0.0583346 0.9783203 0.1391525 0.1418559
1629804095.050509 -5.7648501 0.5921578 -7.1341853 0.0532515 0.9830889 0.1464023 0.0962641
1629804095.250559 -5.7454286 0.5986887 -7.2074189 0.0486004 0.9855196 0.1417784 0.0792969
1629804095.450559 -5.7304840 0.6001176 -7.2792735 0.0437037 0.9844784 0.1388953 0.0979812
1629804095.650559 -5.7134576 0.6050804 -7.3476472 0.0469836 0.9817665 0.1348378 0.1254827
1629804095.850560 -5.6881599 0.6076126 -7.4124961 0.0492312 0.9806926 0.1338321 0.1338184
1629804096.050560 -5.6605148 0.6104976 -7.4772220 0.0489521 0.9836190 0.1385044 0.1044690
1629804096.250619 -5.6394458 0.6172744 -7.5413694 0.0459527 0.9849651 0.1367841 0.0949854
1629804096.450619 -5.6273942 0.6205448 -7.6073461 0.0377635 0.9855055 0.1356862 0.0945629
1629804096.650620 -5.6147270 0.6258492 -7.6717677 0.0390577 0.9827797 0.1307467 0.1245942
1629804096.850620 -5.5967727 0.6298351 -7.7323232 0.0429855 0.9815184 0.1299212 0.1337700
1629804097.050620 -5.5766149 0.6322596 -7.7985578 0.0390719 0.9849386 0.1274094 0.1101648
1629804097.350678 -5.5603700 0.6407416 -7.8894501 0.0294702 0.9882855 0.1264603 0.0801943
1629804097.650678 -5.5540504 0.6416999 -7.9706736 0.0243573 0.9838018 0.1346541 0.1157968
1629804097.850679 -5.5398068 0.6473857 -8.0239391 0.0328606 0.9811590 0.1314214 0.1377521
1629804097.950679 -5.5296917 0.6472057 -8.0535154 0.0348477 0.9804070 0.1286779 0.1450165
1629804098.150725 -5.5075545 0.6457366 -8.1120949 0.0357407 0.9820588 0.1281617 0.1336331
1629804098.350725 -5.4820991 0.6538442 -8.1734982 0.0368404 0.9856015 0.1260763 0.1064765
1629804098.550725 -5.4636626 0.6586224 -8.2295275 0.0311397 0.9853418 0.1293214 0.1068067
1629804098.750726 -5.4468083 0.6614721 -8.2884331 0.0295396 0.9822446 0.1318178 0.1301811
1629804098.950726 -5.4298267 0.6662294 -8.3459473 0.0288494 0.9799322 0.1315709 0.1469344
1629804099.150779 -5.4080100 0.6668268 -8.4032974 0.0319683 0.9821735 0.1279251 0.1339717
1629804099.350779 -5.3892350 0.6695678 -8.4584913 0.0326220 0.9877548 0.1271008 0.0843894
1629804099.650780 -5.3814793 0.6696019 -8.5315657 0.0335977 0.9904271 0.1218082 0.0555716
1629804099.850780 -5.3850021 0.6682315 -8.5766287 0.0330788 0.9905266 0.1187260 0.0605564
1629804100.050780 -5.3891144 0.6663899 -8.6117611 0.0284878 0.9901555 0.1154740 0.0737982
1629804100.750833 -5.3943434 0.6562132 -8.6704226 0.0078901 0.9939900 0.0997363 0.0444331
1629804101.550875 -5.3967967 0.6450796 -8.6774416 0.0089676 0.9935974 0.0904471 0.0671050
1629804108.351261 -5.3929987 0.6465395 -8.6958265 0.0114166 0.9959950 0.0744571 0.0481643
1629804108.551261 -5.3957901 0.6461553 -8.6951857 0.0088392 0.9959880 0.0758802 0.0466038
1629804109.051262 -5.3921800 0.6466582 -8.6940660 0.0121061 0.9944775 0.0745975 0.0728225
1629804109.351321 -5.3587885 0.6453272 -8.7104998 0.0419420 0.9909500 0.0546490 0.1152062
1629804109.651321 -5.2973313 0.6614444 -8.7351151 0.0783816 0.9766473 0.0414108 0.1957077
1629804109.951321 -5.2279706 0.6839502 -8.7579374 0.1112758 0.9711964 0.0777297 0.1958403
1629804110.151370 -5.1920619 0.6873521 -8.7768450 0.1319641 0.9562936 0.1056181 0.2386058
1629804110.451370 -5.1280613 0.6879447 -8.8446589 0.1524165 0.9474297 0.1274405 0.2508087
1629804110.651370 -5.0772152 0.6947129 -8.8961363 0.1630151 0.9362912 0.1333607 0.2810691
1629804110.851371 -5.0208292 0.6931150 -8.9526396 0.1644232 0.9279677 0.1437566 0.3019518
1629804111.051371 -4.9629841 0.6996665 -9.0127478 0.1552459 0.9333588 0.1585655 0.2821295
1629804111.251435 -4.9118271 0.7090228 -9.0670853 0.1448429 0.9260564 0.1597122 0.3097291
1629804111.451435 -4.8630753 0.7107281 -9.1234970 0.1301271 0.9219024 0.1608448 0.3275543
1629804111.551435 -4.8402562 0.7153122 -9.1514759 0.1236849 0.9218772 0.1600948 0.3304757
1629804111.751436 -4.7933612 0.7254137 -9.1950951 0.1137754 0.9040720 0.1573840 0.3807089
1629804111.851436 -4.7720613 0.7289962 -9.2146759 0.1043303 0.8951005 0.1577367 0.4037689
1629804112.051436 -4.7282925 0.7316284 -9.2586403 0.0790584 0.8959446 0.1640504 0.4051179
1629804112.251485 -4.6835361 0.7498270 -9.3030434 0.0571179 0.8893427 0.1619197 0.4237795
1629804112.351485 -4.6637516 0.7530251 -9.3194151 0.0503118 0.8791707 0.1654854 0.4440070
1629804112.451485 -4.6458049 0.7522792 -9.3351345 0.0480375 0.8684622 0.1714540 0.4626763
1629804112.651486 -4.6061592 0.7560706 -9.3827209 0.0380092 0.8572865 0.1700833 0.4844449
1629804112.751486 -4.5841660 0.7599781 -9.4085808 0.0331389 0.8477359 0.1679877 0.5020216
1629804112.851486 -4.5620241 0.7664639 -9.4344168 0.0272277 0.8404341 0.1663101 0.5150437
1629804113.051486 -4.5104103 0.7674369 -9.4721136 0.0238453 0.8327904 0.1703165 0.5261976
1629804113.251536 -4.4593101 0.7652307 -9.5102968 0.0160559 0.8237034 0.1683239 0.5412226
1629804113.451536 -4.4045577 0.7702029 -9.5560923 0.0029207 0.8438681 0.1566917 0.5131527
1629804113.651536 -4.3479300 0.7738323 -9.6021500 -0.0062207 0.8493205 0.1353434 0.5101943
1629804113.851536 -4.2869859 0.7787631 -9.6537189 -0.0073578 0.8556871 0.1137331 0.5047872
1629804113.951536 -4.2553282 0.7829318 -9.6750031 -0.0031841 0.8484641 0.1079862 0.5181096
1629804114.151586 -4.1899590 0.7854819 -9.7062235 0.0115499 0.8406696 0.1061325 0.5309210
1629804114.351587 -4.1198263 0.7834485 -9.7327299 0.0217049 0.8519921 0.1137910 0.5105782
1629804114.451587 -4.0859356 0.7845796 -9.7451963 0.0248689 0.8595095 0.1199825 0.4962149
1629804114.651587 -4.0222211 0.7903501 -9.7743073 0.0271713 0.8638449 0.1272267 0.4866694
1629804114.751587 -3.9934978 0.7909082 -9.7923307 0.0239715 0.8677887 0.1309661 0.4787652
1629804114.851587 -3.9649251 0.7907702 -9.8126717 0.0199789 0.8716533 0.1347174 0.4708213
1629804115.051587 -3.9064548 0.7924106 -9.8538504 0.0192728 0.8618923 0.1391495 0.4872449
1629804115.251642 -3.8443418 0.7967579 -9.8899984 0.0238178 0.8607218 0.1426244 0.4881075
1629804115.451643 -3.7843728 0.7948126 -9.9312382 0.0173965 0.8730007 0.1521290 0.4630594
1629804115.651643 -3.7236376 0.8004311 -9.9759302 0.0140166 0.8952449 0.1568643 0.4168137
1629804115.851643 -3.6635880 0.8028300 -10.0242214 0.0170582 0.9011120 0.1558848 0.4042353
1629804116.051643 -3.6101415 0.8055316 -10.0736876 0.0208200 0.8945971 0.1568139 0.4179377
1629804116.251702 -3.5572762 0.8092756 -10.1261654 0.0278453 0.8853028 0.1601987 0.4356605
1629804116.451702 -3.5054414 0.8087950 -10.1742687 0.0242750 0.8926116 0.1679808 0.4176574
1629804116.651702 -3.4503851 0.8160934 -10.2220211 0.0200083 0.9053329 0.1706877 0.3883784
1629804116.751702 -3.4243846 0.8225058 -10.2480087 0.0210230 0.9094687 0.1670482 0.3801574
1629804117.051702 -3.3445020 0.8194930 -10.3347969 0.0234721 0.9074305 0.1663127 0.3851741
1629804117.251748 -3.2937012 0.8279338 -10.3899431 0.0360092 0.8918002 0.1702484 0.4176256
1629804117.351748 -3.2691903 0.8301504 -10.4164047 0.0388479 0.8912731 0.1746204 0.4166902
1629804117.451748 -3.2450266 0.8306493 -10.4445896 0.0381901 0.8937370 0.1796432 0.4092727
1629804117.551749 -3.2207065 0.8289182 -10.4744101 0.0346244 0.8990968 0.1864521 0.3945400
1629804117.651749 -3.1979511 0.8325151 -10.5028362 0.0312778 0.9077820 0.1922419 0.3714788
1629804117.751749 -3.1730106 0.8350195 -10.5341997 0.0313373 0.9183881 0.1957188 0.3424551
1629804117.851749 -3.1487708 0.8385184 -10.5656443 0.0361024 0.9201779 0.1932815 0.3385432
1629804117.951749 -3.1249089 0.8413737 -10.5979137 0.0403416 0.9175501 0.1872491 0.3484424
1629804118.151802 -3.0901887 0.8396024 -10.6665964 0.0402039 0.9175704 0.1799946 0.3522075
1629804118.351802 -3.0597255 0.8498312 -10.7390718 0.0429856 0.9167674 0.1748549 0.3565327
1629804118.551803 -3.0277832 0.8579036 -10.8091993 0.0430372 0.9299206 0.1794399 0.3181144
1629804118.651803 -3.0146642 0.8573900 -10.8476143 0.0405599 0.9342167 0.1833054 0.3033037
1629804118.751803 -3.0006144 0.8587955 -10.8867331 0.0388275 0.9420571 0.1885259 0.2747342
1629804118.951803 -2.9713452 0.8689474 -10.9621744 0.0464798 0.9556682 0.1922279 0.2181429
1629804119.151856 -2.9488878 0.8728643 -11.0407543 0.0545167 0.9581064 0.1918167 0.2055879
1629804119.251856 -2.9400043 0.8728231 -11.0815353 0.0565422 0.9588140 0.1918043 0.2017174
1629804119.351856 -2.9322140 0.8761413 -11.1253147 0.0609686 0.9579220 0.1893293 0.2069363
1629804119.451857 -2.9220335 0.8808232 -11.1667099 0.0666237 0.9575595 0.1874146 0.2086071
1629804119.551857 -2.9115565 0.8846843 -11.2068682 0.0714695 0.9579886 0.1868086 0.2055540
1629804119.751857 -2.8944070 0.8866596 -11.2918625 0.0729279 0.9600876 0.1904978 0.1913738
1629804119.851857 -2.8867300 0.8885832 -11.3352098 0.0695144 0.9648187 0.1955532 0.1614053
1629804119.951857 -2.8784306 0.8939382 -11.3778515 0.0702245 0.9679731 0.1967278 0.1392651
1629804120.051857 -2.8717263 0.8999593 -11.4233379 0.0724652 0.9685754 0.1922104 0.1402346
1629804120.151916 -2.8651738 0.9022702 -11.4685946 0.0734925 0.9691935 0.1898730 0.1386038
1629804120.251916 -2.8597679 0.9004094 -11.5140114 0.0727347 0.9691502 0.1920127 0.1363402
1629804120.351916 -2.8568158 0.9028652 -11.5568743 0.0740545 0.9669225 0.1927567 0.1497388
1629804120.451916 -2.8509839 0.9086618 -11.5988131 0.0781018 0.9634539 0.1924062 0.1692231
1629804120.551916 -2.8454969 0.9136982 -11.6388426 0.0805492 0.9616104 0.1927651 0.1779290
1629804120.651916 -2.8364899 0.9156176 -11.6789026 0.0800233 0.9611460 0.1936641 0.1796909
1629804120.851916 -2.8234742 0.9177600 -11.7597904 0.0727224 0.9628584 0.1962999 0.1705331
1629804121.051917 -2.8139014 0.9249123 -11.8310709 0.0708096 0.9605019 0.1933527 0.1871811
1629804121.251965 -2.8035245 0.9284058 -11.9021072 0.0746364 0.9531605 0.1829523 0.2290043
1629804121.551965 -2.7895672 0.9339452 -11.9963179 0.0827882 0.9296274 0.1731028 0.3146021
1629804121.751966 -2.7736471 0.9376978 -12.0598984 0.0727487 0.9324684 0.1651253 0.3129601
1629804121.951966 -2.7564096 0.9427558 -12.1328430 0.0565545 0.9502189 0.1571125 0.2630612
1629804122.152018 -2.7385631 0.9497794 -12.2066956 0.0498358 0.9630324 0.1549063 0.2146838
1629804122.352018 -2.7230902 0.9497092 -12.2810392 0.0514055 0.9654037 0.1623425 0.1974791
1629804122.552018 -2.7091060 0.9500903 -12.3502216 0.0574841 0.9608905 0.1730766 0.2083975
1629804122.752018 -2.6862209 0.9526512 -12.4128189 0.0694844 0.9644544 0.1739337 0.1864046
1629804122.852018 -2.6756907 0.9490452 -12.4417973 0.0742005 0.9673162 0.1731582 0.1697349
1629804123.452073 -2.6744359 0.9335947 -12.5623531 0.0592378 0.9765570 0.1470824 0.1455818
1629804123.752073 -2.6850371 0.9269408 -12.5994577 0.0410151 0.9822090 0.1192900 0.1391156
1629804124.152131 -2.6904149 0.9230195 -12.6170473 0.0333570 0.9844257 0.1031734 0.1383789
1629804124.452131 -2.6862862 0.9224551 -12.6243076 0.0358210 0.9862072 0.0984038 0.1281752
1629804124.652132 -2.6840868 0.9235590 -12.6336241 0.0357215 0.9882657 0.0910973 0.1172869
1629804124.852132 -2.6820865 0.9256932 -12.6453362 0.0362307 0.9889556 0.0795103 0.1197180
1629804125.052132 -2.6816688 0.9260554 -12.6534281 0.0371624 0.9884016 0.0726925 0.1280511
1629804125.452184 -2.6941752 0.9293541 -12.6632519 0.0249943 0.9901391 0.0655347 0.1212644
1629804126.052185 -2.7113662 0.9300004 -12.6548576 0.0199040 0.9420332 0.0607533 0.3293725
1629804126.252234 -2.7174823 0.9295682 -12.6507511 0.0191043 0.9142430 0.0616704 0.3999894
1629804126.852235 -2.7225528 0.9291919 -12.6515818 0.0179639 0.8931038 0.0602621 0.4454340
1629804128.652332 -2.7259200 0.9285099 -12.6558952 0.0134641 0.8577565 0.0530634 0.5111328
1629804134.852660 -2.7287579 0.9292706 -12.6576357 0.0116651 0.8557501 0.0535149 0.5144821
1629804138.452867 -2.7217059 0.9304444 -12.6556768 0.0313227 0.8681970 0.0585839 0.4917528
1629804139.152927 -2.6489406 0.9560077 -12.6624966 0.0765859 0.9235826 0.0755335 0.3680008
1629804139.352928 -2.6335866 0.9718555 -12.6970139 0.0763391 0.9334639 0.0809499 0.3409761
1629804139.552928 -2.6233664 0.9813242 -12.7368336 0.0646903 0.9381469 0.0953974 0.3264887
1629804139.752928 -2.6128252 0.9898335 -12.7766056 0.0473491 0.9361331 0.1158047 0.3286366
1629804140.052928 -2.5705786 0.9958677 -12.8518333 0.0369081 0.9482604 0.1279556 0.2882143
1629804140.352982 -2.5170400 1.0091977 -12.9468460 0.0407147 0.9710004 0.1211345 0.2020569
1629804140.552982 -2.4901259 1.0066352 -13.0159492 0.0463233 0.9733904 0.1210174 0.1889975
1629804140.752983 -2.4629304 1.0114789 -13.0817919 0.0583499 0.9702442 0.1215066 0.2011410
1629804141.052983 -2.4199152 1.0197668 -13.1784286 0.0667928 0.9512528 0.1419161 0.2655498
1629804141.353029 -2.3788574 1.0293369 -13.2890797 0.0551650 0.9557379 0.1665774 0.2361649
1629804141.653030 -2.3414295 1.0383983 -13.4105844 0.0564493 0.9511436 0.1674576 0.2531743
1629804141.953030 -2.3058581 1.0491900 -13.5369062 0.0626309 0.9380922 0.1563690 0.3026700
1629804142.153086 -2.2772591 1.0504330 -13.6242914 0.0595149 0.9438248 0.1532317 0.2866578
1629804142.453086 -2.2394814 1.0675547 -13.7591124 0.0518064 0.9564415 0.1509400 0.2444438
1629804142.753087 -2.2083342 1.0747885 -13.8926754 0.0447436 0.9498429 0.1477359 0.2719752
1629804143.053087 -2.1645496 1.0851786 -14.0076256 0.0563758 0.9342531 0.1428280 0.3218588
1629804143.353137 -2.1151257 1.0926920 -14.1278954 0.0575096 0.9351102 0.1437253 0.3187547
1629804143.653137 -2.0699296 1.0968282 -14.2503099 0.0485340 0.9256440 0.1450883 0.3460882
1629804143.953138 -2.0132189 1.1120721 -14.3676128 0.0547218 0.9081641 0.1394937 0.3908773
1629804144.153190 -1.9707166 1.1153072 -14.4441214 0.0558441 0.9271881 0.1403736 0.3427811
1629804144.353190 -1.9311055 1.1241033 -14.5225773 0.0489726 0.9442996 0.1411123 0.2932360
1629804144.553190 -1.8931653 1.1322938 -14.6029463 0.0431624 0.9429711 0.1341926 0.3015541
1629804144.753191 -1.8606672 1.1401573 -14.6884365 0.0329347 0.9459710 0.1339828 0.2934327
1629804144.953191 -1.8195243 1.1488520 -14.7683449 0.0347466 0.9470682 0.1328638 0.2901753
1629804145.153234 -1.7774056 1.1515714 -14.8565674 0.0313555 0.9570211 0.1290780 0.2578107
1629804145.353234 -1.7459728 1.1650635 -14.9501410 0.0270050 0.9708890 0.1203454 0.2053343
1629804145.553234 -1.7222474 1.1689184 -15.0418386 0.0181676 0.9747133 0.1170764 0.1894649
1629804145.853235 -1.6899830 1.1897811 -15.1796389 0.0110188 0.9723390 0.1105562 0.2054574
1629804146.053235 -1.6582544 1.1948328 -15.2674351 0.0112334 0.9760706 0.1144467 0.1845586
1629804146.353293 -1.6231205 1.2047826 -15.4001245 0.0088652 0.9796245 0.1231805 0.1583789
1629804146.653294 -1.5875434 1.2098144 -15.5465403 0.0187212 0.9769601 0.1228257 0.1735289
1629804146.953294 -1.5524440 1.2135140 -15.6916924 0.0269179 0.9754980 0.1281405 0.1768025
1629804147.153352 -1.5390130 1.2233945 -15.7946157 0.0184620 0.9820214 0.1331582 0.1325217
1629804147.353352 -1.5215579 1.2282557 -15.8986435 0.0203421 0.9806182 0.1319691 0.1433818
1629804147.653352 -1.4928367 1.2426358 -16.0510521 0.0284806 0.9755654 0.1318171 0.1734507
1629804147.953353 -1.4636086 1.2465233 -16.1961632 0.0285879 0.9707549 0.1382153 0.1942013
1629804148.153408 -1.4498742 1.2578002 -16.2886295 0.0245167 0.9690520 0.1399621 0.2018606
1629804148.353409 -1.4304820 1.2588491 -16.3844795 0.0303275 0.9631193 0.1428946 0.2259703
1629804148.653409 -1.3918740 1.2699592 -16.5269680 0.0465571 0.9570753 0.1439567 0.2472160
1629804148.853409 -1.3701593 1.2752501 -16.6196365 0.0440574 0.9596401 0.1579671 0.2284647
1629804149.053409 -1.3501568 1.2888700 -16.7158852 0.0347842 0.9632516 0.1689287 0.2059113
1629804149.353459 -1.3188646 1.2969657 -16.8598671 0.0311363 0.9592459 0.1842237 0.2119893
1629804149.653460 -1.2740335 1.3090775 -17.0015240 0.0361135 0.9596396 0.1878293 0.2061743
1629804149.853460 -1.2480184 1.3171228 -17.1004734 0.0344452 0.9660482 0.1866328 0.1753070
1629804150.053460 -1.2248670 1.3266824 -17.1984711 0.0370369 0.9674974 0.1791388 0.1746034
1629804150.253511 -1.2035056 1.3288779 -17.2933540 0.0397686 0.9625770 0.1764943 0.2017764
1629804150.453511 -1.1795481 1.3388205 -17.3818989 0.0446838 0.9620021 0.1725576 0.2068315
1629804150.653511 -1.1552054 1.3428247 -17.4672108 0.0473396 0.9624002 0.1674487 0.2085803
1629804150.853512 -1.1348830 1.3537154 -17.5531101 0.0445920 0.9657702 0.1618462 0.1977505
1629804151.053512 -1.1176020 1.3558331 -17.6387482 0.0379660 0.9637601 0.1537985 0.2146417
1629804151.253568 -1.1011719 1.3631736 -17.7251110 0.0388295 0.9632872 0.1483915 0.2203405
1629804151.453568 -1.0766890 1.3760532 -17.8003635 0.0481618 0.9631028 0.1487801 0.2190385
1629804151.653569 -1.0570297 1.3763632 -17.8739719 0.0445649 0.9679259 0.1553546 0.1923495
1629804151.853569 -1.0390331 1.3835181 -17.9510288 0.0398208 0.9757987 0.1541693 0.1498765
1629804152.053569 -1.0222719 1.3867712 -18.0288467 0.0374534 0.9765225 0.1437899 0.1559664
1629804152.253624 -1.0055052 1.3896356 -18.1065102 0.0417864 0.9733146 0.1368869 0.1793726
1629804152.453624 -0.9802893 1.3966501 -18.1691933 0.0511887 0.9647765 0.1379392 0.2180797
1629804152.653625 -0.9552637 1.3965157 -18.2270489 0.0502405 0.9627486 0.1440580 0.2232451
1629804152.853625 -0.9340124 1.3995411 -18.2829266 0.0467648 0.9668509 0.1529898 0.1990135
1629804153.153670 -0.9110697 1.4009604 -18.3670673 0.0436851 0.9551821 0.1489929 0.2520313
1629804153.353671 -0.9005486 1.4035499 -18.4195900 0.0359008 0.9531591 0.1456865 0.2626296
1629804153.553671 -0.8845733 1.4053367 -18.4619331 0.0322312 0.9542418 0.1373663 0.2636556
1629804153.953671 -0.8620250 1.3971595 -18.5312710 0.0219648 0.9717726 0.1049391 0.2101511
1629804154.953722 -0.8585192 1.3846728 -18.5873775 0.0092346 0.9718703 0.0721231 0.2240113
1629804155.653788 -0.8350598 1.3853055 -18.6049747 0.0267046 0.9684383 0.0509412 0.2425267
1629804155.853789 -0.8361455 1.3853425 -18.6066227 0.0255317 0.9640806 0.0485381 0.2598863
1629804156.453835 -0.8514169 1.3857983 -18.6013737 0.0130149 0.9682881 0.0577150 0.2427299
1629804158.153944 -0.8638094 1.3881916 -18.6247959 -0.0017800 0.9623443 0.0393415 0.2689658
1629804158.353944 -0.8636580 1.3879229 -18.6236115 -0.0013423 0.9612358 0.0401593 0.2727841
1629804160.254062 -0.8647202 1.3873788 -18.6174965 -0.0003249 0.9576333 0.0451790 0.2844242
1629804168.154495 -0.8213970 1.3865629 -18.5781059 0.0508141 0.8545837 0.0454845 0.5148162
1629804168.454496 -0.7727363 1.3929695 -18.5472507 0.0639916 0.8284282 0.0593743 0.5532508
1629804168.654496 -0.7437620 1.3965348 -18.5331898 0.0431065 0.8147681 0.0711070 0.5737932
1629804168.854496 -0.7111826 1.3961743 -18.5282097 0.0110477 0.7881110 0.0701883 0.6114184
1629804169.154556 -0.6420876 1.3974001 -18.5349026 -0.0178977 0.7511926 0.0479360 0.6580968
1629804169.454556 -0.5820143 1.3993406 -18.5288258 -0.0238085 0.7064467 0.0563076 0.7051210
1629804171.654655 -0.4962278 1.3757725 -18.5287342 -0.0030134 0.6854512 0.0590551 0.7257135
1629804171.954655 -0.4992459 1.3760076 -18.5261612 -0.0026537 0.6752294 0.0618003 0.7350096
1629804172.854712 -0.4842206 1.3749400 -18.5185757 0.0111644 0.6805885 0.0566396 0.7303879
1629804173.254761 -0.4819873 1.3754541 -18.5219212 0.0098457 0.6886001 0.0543127 0.7230374
1629804174.454825 -0.4823923 1.3755422 -18.5216312 0.0099901 0.6771946 0.0538684 0.7337614
1629804181.855201 -0.4894290 1.3745142 -18.5209064 0.0072088 0.6731071 0.0589943 0.7371531
1629804186.255477 -0.4265268 1.3807267 -18.5146732 0.0513428 0.8023415 0.0463119 0.5928468
1629804186.555478 -0.4003277 1.4078383 -18.5505810 0.0654680 0.8489959 0.0526092 0.5216820
1629804186.855478 -0.3845675 1.4308808 -18.6188068 0.0540782 0.8915808 0.0630397 0.4451801
1629804187.155533 -0.3648621 1.4471723 -18.6951122 0.0386516 0.9042950 0.0696019 0.4194188
1629804187.555533 -0.3011173 1.4480573 -18.8058643 0.0391562 0.9443015 0.0649215 0.3202290
1629804187.855533 -0.2481857 1.4627106 -18.8993263 0.0494850 0.9566852 0.0628073 0.2799283
1629804188.155588 -0.2219362 1.4741489 -18.9985523 0.0506711 0.9461363 0.0853960 0.3081657
1629804188.455588 -0.2006689 1.4910276 -19.0943089 0.0545601 0.9370033 0.1216262 0.3228856
1629804188.755589 -0.1829000 1.5027723 -19.2143860 0.0357532 0.9511713 0.1277827 0.2786871
1629804189.055589 -0.1621934 1.5079330 -19.3520012 0.0298846 0.9589693 0.1166485 0.2566670
1629804189.355641 -0.1369112 1.5177373 -19.4760685 0.0498608 0.9498932 0.1259319 0.2817055
1629804189.755641 -0.0939370 1.5285585 -19.6332378 0.0484180 0.9469538 0.1552471 0.2771869
1629804190.055642 -0.0548469 1.5311077 -19.7582264 0.0438573 0.9336401 0.1534922 0.3206757
1629804190.455682 0.0162401 1.5402673 -19.9143467 0.0507700 0.9068573 0.1563305 0.3880631
1629804190.755682 0.0809480 1.5486135 -20.0413971 0.0456954 0.9133758 0.1482264 0.3764113
1629804191.055682 0.1444474 1.5565015 -20.1755981 0.0363022 0.9112194 0.1419233 0.3849923
1629804191.355743 0.2103005 1.5706494 -20.2990665 0.0383788 0.8993474 0.1549996 0.4070338
1629804191.755744 0.3023593 1.5851668 -20.4848614 0.0301266 0.9232255 0.1633942 0.3464815
1629804192.055744 0.3611926 1.5924066 -20.6283779 0.0183427 0.9237927 0.1638849 0.3455608
1629804192.355793 0.4302191 1.6003364 -20.7622643 0.0289631 0.9159712 0.1626244 0.3656655
1629804192.655794 0.5009384 1.6127210 -20.9071789 0.0331005 0.9332045 0.1580129 0.3210383
1629804193.055794 0.5821252 1.6264445 -21.0960598 0.0299237 0.9292024 0.1496253 0.3366002
1629804193.355850 0.6476180 1.6350706 -21.2186852 0.0355977 0.9213694 0.1594188 0.3526995
1629804193.655850 0.7083541 1.6487472 -21.3471031 0.0340731 0.9345778 0.1721432 0.3094676
1629804193.955851 0.7608917 1.6565028 -21.4792080 0.0271681 0.9315721 0.1711791 0.3195827
1629804194.255897 0.8207137 1.6669629 -21.6036797 0.0326856 0.9235652 0.1684781 0.3428908
1629804194.555897 0.8794276 1.6798844 -21.7312241 0.0352168 0.9316657 0.1709148 0.3186642
1629804194.855897 0.9264412 1.6874331 -21.8636398 0.0249952 0.9301868 0.1592714 0.3297884
1629804195.155962 0.9743775 1.6965393 -21.9894199 0.0259854 0.9121820 0.1594497 0.3765959
1629804195.455962 1.0274966 1.6984990 -22.1158733 0.0251910 0.9148656 0.1692967 0.3656844
1629804195.755962 1.0816691 1.7124027 -22.2493229 0.0206202 0.9176392 0.1656245 0.3606682
1629804195.955962 1.1131259 1.7154709 -22.3355331 0.0183211 0.9033207 0.1666761 0.3948357
1629804196.156018 1.1537777 1.7253611 -22.4116344 0.0234810 0.8986294 0.1688000 0.4042529
1629804196.456019 1.2184669 1.7285764 -22.5367851 0.0222149 0.9091986 0.1732433 0.3779564
1629804196.756019 1.2813530 1.7408384 -22.6623211 0.0237270 0.9134846 0.1700776 0.3688583
1629804197.056019 1.3402683 1.7519732 -22.7848225 0.0202912 0.9052348 0.1750228 0.3866590
1629804197.356076 1.4123868 1.7516416 -22.9005871 0.0269589 0.8983393 0.1756804 0.4017414
1629804197.556076 1.4639764 1.7617629 -22.9850330 0.0326633 0.9116887 0.1671855 0.3739061
1629804197.756076 1.5131326 1.7656362 -23.0695992 0.0368247 0.9096858 0.1577013 0.3824213
1629804197.956076 1.5575882 1.7712978 -23.1544456 0.0401353 0.9037132 0.1632408 0.3937564
1629804198.156122 1.6054040 1.7802519 -23.2258873 0.0515012 0.8978537 0.1742947 0.4010333
1629804198.456122 1.6706296 1.7843776 -23.3420296 0.0471043 0.9076074 0.1874245 0.3726958
1629804198.656122 1.7108271 1.7951844 -23.4177303 0.0454664 0.9132963 0.1863531 0.3592981
1629804198.856122 1.7451333 1.7949529 -23.4934902 0.0394401 0.9097646 0.1892958 0.3673416
1629804199.056123 1.7792689 1.8048388 -23.5628319 0.0381959 0.9046689 0.1930465 0.3779528
1629804199.256178 1.8175232 1.8091019 -23.6237469 0.0389602 0.9031845 0.1953690 0.3802248
1629804199.456178 1.8573642 1.8107520 -23.6878471 0.0370819 0.9135706 0.1939090 0.3555460
1629804199.656178 1.8944083 1.8166394 -23.7532883 0.0425980 0.9231436 0.1849187 0.3343596
1629804200.156229 1.9700986 1.8173022 -23.8861084 0.0531953 0.8916848 0.1807663 0.4115725
1629804200.256229 1.9849434 1.8159976 -23.9050694 0.0539547 0.8847529 0.1813469 0.4259277
1629804200.456229 2.0179250 1.8143947 -23.9426479 0.0511215 0.8913360 0.1824888 0.4118308
1629804200.656230 2.0503490 1.8151265 -23.9777050 0.0543318 0.8978609 0.1801388 0.3980500
1629804200.756230 2.0617216 1.8152679 -23.9955425 0.0530994 0.8995401 0.1781084 0.3953294
1629804201.056230 2.0918674 1.8115095 -24.0528069 0.0543457 0.8849049 0.1651972 0.4320877
1629804201.256282 2.1104329 1.8091785 -24.0941677 0.0516337 0.8734776 0.1514924 0.4598053
1629804201.456282 2.1198463 1.8049909 -24.1266994 0.0372450 0.8651752 0.1401002 0.4800590
1629804201.556282 2.1243894 1.8034912 -24.1398029 0.0295778 0.8678222 0.1346524 0.4773661
1629804201.856282 2.1383154 1.7990433 -24.1675262 0.0183707 0.8742642 0.1087797 0.4727489
1629804202.256348 2.1532202 1.7966142 -24.1775894 0.0239453 0.8753967 0.0891248 0.4745144
1629804202.556349 2.1598628 1.7970145 -24.1855049 0.0264524 0.8745171 0.0799427 0.4776287
1629804202.756349 2.1618671 1.7980834 -24.1898422 0.0257375 0.8762836 0.0763162 0.4750162
1629804203.556393 2.1448097 1.8023009 -24.2162247 -0.0005540 0.8948777 0.0644564 0.4416322
1629804203.656393 2.1457064 1.8018328 -24.2173805 -0.0013204 0.8884796 0.0622283 0.4546756
1629804203.756393 2.1441894 1.8002529 -24.2138214 0.0009757 0.8767993 0.0648949 0.4764564
1629804203.956393 2.1434085 1.7993248 -24.2042694 0.0072776 0.8535042 0.0711950 0.5161481
1629804206.056514 2.1384714 1.8020552 -24.2231655 -0.0034392 0.8374840 0.0563955 0.5435331
1629804207.456625 2.1333072 1.8015119 -24.2269955 -0.0073568 0.8195143 0.0553731 0.5703298
1629804207.656625 2.1307106 1.8039896 -24.2279320 -0.0078062 0.7983906 0.0544726 0.5996200
1629804207.856625 2.1299250 1.8068119 -24.2308407 -0.0064848 0.7618140 0.0482594 0.6459631
1629804208.056625 2.1290462 1.8055173 -24.2318764 -0.0026646 0.7143357 0.0455336 0.6983152
1629804208.556672 2.1287992 1.8047814 -24.2201920 0.0089088 0.6585908 0.0504008 0.7507586
1629804209.556733 2.1193235 1.7992157 -24.1967068 0.0255294 0.5705118 0.0621179 0.8185388
1629804209.756733 2.1246274 1.7982255 -24.1958008 0.0293399 0.5497857 0.0569003 0.8328488
1629804210.056733 2.1239858 1.7984798 -24.1946335 0.0318487 0.5286665 0.0555417 0.8464116
1629804210.256774 2.1161261 1.7994783 -24.1736736 0.0439275 0.4784813 0.0630452 0.8747293
1629804210.356774 2.1137316 1.8049660 -24.1596241 0.0430247 0.4723273 0.0634321 0.8780844
1629804210.556774 2.0961850 1.8201311 -24.1247826 0.0241964 0.4239393 0.0618081 0.9032551
1629804210.656774 2.0854175 1.8251382 -24.1046219 0.0141788 0.3853946 0.0583221 0.9207978
1629804210.756774 2.0768642 1.8290826 -24.0801067 0.0047599 0.3533903 0.0551075 0.9338393
1629804210.856774 2.0664070 1.8321877 -24.0555553 -0.0078194 0.3317451 0.0564773 0.9416445
1629804210.956774 2.0577033 1.8352916 -24.0328636 -0.0213947 0.3082360 0.0588818 0.9492449
1629804211.056775 2.0509779 1.8354574 -24.0092297 -0.0329939 0.2729209 0.0608610 0.9595423
1629804211.156831 2.0474894 1.8341539 -23.9848499 -0.0413818 0.2295931 0.0627418 0.9703804
1629804211.256831 2.0452275 1.8320208 -23.9589443 -0.0463980 0.1864256 0.0652221 0.9792032
1629804211.456831 2.0419908 1.8312776 -23.9016476 -0.0482681 0.0995092 0.0641115 0.9917952
1629804211.556832 2.0417340 1.8263898 -23.8704052 -0.0494498 0.0615270 0.0597475 0.9950876
1629804211.656832 2.0383658 1.8242576 -23.8374138 -0.0475520 0.0346936 0.0562053 0.9966826
1629804211.756832 2.0344083 1.8172777 -23.8005447 -0.0462993 0.0236799 0.0539447 0.9971889
1629804212.156891 2.0153968 1.8128450 -23.6449451 -0.0472545 0.0560530 0.0540683 0.9958422
1629804212.356891 2.0057282 1.7987123 -23.5689087 -0.0587050 0.0666744 0.0525539 0.9946589
1629804212.456891 1.9996476 1.7949420 -23.5269508 -0.0582832 0.0504601 0.0543319 0.9955425
1629804212.656891 1.9856805 1.7943623 -23.4469490 -0.0547624 0.0169553 0.0618429 0.9964381
1629804212.756891 1.9803847 1.7940555 -23.4071693 -0.0546249 0.0095868 0.0634313 0.9964440
1629804212.956891 1.9730831 1.7816952 -23.3295059 -0.0664214 0.0174669 0.0594668 0.9958649
1629804213.156947 1.9726349 1.7810444 -23.2448025 -0.0618585 0.0281513 0.0525953 0.9963005
1629804213.356947 1.9752100 1.7756424 -23.1644840 -0.0593691 0.0479317 0.0477993 0.9959383
1629804213.556947 1.9803219 1.7673166 -23.0861664 -0.0574396 0.0282798 0.0491735 0.9967361
1629804213.956948 1.9734082 1.7503761 -22.9314060 -0.0535482 0.0252941 0.0581704 0.9965485
1629804214.157012 1.9699585 1.7489182 -22.8550682 -0.0512411 0.0350560 0.0577701 0.9963976
1629804214.357012 1.9728619 1.7482606 -22.7884865 -0.0544985 0.0308791 0.0488527 0.9968399
1629804214.657012 1.9764212 1.7375040 -22.6974392 -0.0661508 -0.0210289 0.0397434 0.9967960
1629804214.857013 1.9690114 1.7323854 -22.6445465 -0.0690314 -0.0441936 0.0402753 0.9958210
1629804215.057013 1.9572856 1.7261149 -22.5915413 -0.0716640 -0.0179732 0.0362429 0.9966081
1629804215.457068 1.9482210 1.7151616 -22.4834900 -0.0483186 -0.0184565 0.0112879 0.9985977
1629804215.657068 1.9473374 1.7038857 -22.4318352 -0.0313200 -0.0404609 0.0048449 0.9986784
1629804215.857068 1.9491502 1.7006882 -22.3892193 -0.0219857 -0.0716836 -0.0011426 0.9971845
1629804216.057069 1.9517791 1.6982082 -22.3600960 -0.0250517 -0.0654878 -0.0053360 0.9975246
1629804216.357121 1.9472115 1.6963863 -22.3326054 -0.0322249 -0.0645609 -0.0150276 0.9972801
1629804216.557121 1.9335319 1.6946234 -22.3048077 -0.0265718 -0.0748021 -0.0112256 0.9967811
1629804216.857121 1.8945793 1.6922092 -22.2448387 -0.0194102 -0.0750688 0.0041944 0.9969806
1629804217.157175 1.8681363 1.6882446 -22.1902905 -0.0299662 -0.0649172 0.0067982 0.9974174
1629804217.357176 1.8557230 1.6838006 -22.1409283 -0.0353155 -0.0762517 0.0053436 0.9964487
1629804217.757176 1.8241140 1.6793869 -22.0094337 -0.0426224 -0.1044484 0.0171331 0.9934688
1629804217.957176 1.8030781 1.6700252 -21.9391499 -0.0455562 -0.1084036 0.0215867 0.9928280
1629804218.257225 1.7710789 1.6640906 -21.8210526 -0.0473811 -0.0639493 0.0214315 0.9965973
1629804218.457225 1.7530042 1.6598917 -21.7484055 -0.0486143 -0.0677887 0.0153111 0.9963970
1629804218.657225 1.7349094 1.6512557 -21.6720619 -0.0515726 -0.0871562 0.0115973 0.9947912
1629804218.857225 1.7112260 1.6486300 -21.5981045 -0.0544314 -0.1023400 0.0177164 0.9931011
1629804219.057225 1.6828766 1.6388339 -21.5235310 -0.0516034 -0.1163873 0.0193758 0.9916732
1629804219.257265 1.6582799 1.6345215 -21.4414215 -0.0439081 -0.0847288 0.0173933 0.9952842
1629804219.457265 1.6410601 1.6324494 -21.3606567 -0.0326617 -0.0534098 0.0144373 0.9979339
1629804219.657265 1.6309253 1.6213603 -21.2835217 -0.0285248 -0.0682356 0.0082226 0.9972275
1629804219.857265 1.6216922 1.6198287 -21.2084923 -0.0336783 -0.0607277 0.0115964 0.9975187
1629804220.157336 1.5908234 1.6090734 -21.1061268 -0.0491281 -0.0699625 0.0266860 0.9959817
1629804220.357336 1.5680308 1.6029823 -21.0301514 -0.0570789 -0.0446996 0.0321038 0.9968517
1629804220.557336 1.5443056 1.6013097 -20.9545898 -0.0542689 -0.0632778 0.0323613 0.9959937
1629804220.757336 1.5237163 1.5894830 -20.8782063 -0.0509424 -0.1061443 0.0279257 0.9926522
1629804220.957336 1.4986181 1.5897197 -20.8040543 -0.0483106 -0.1400327 0.0286155 0.9885535
1629804221.157388 1.4671158 1.5827827 -20.7364960 -0.0515689 -0.1725029 0.0299515 0.9832021
1629804221.357389 1.4351354 1.5757385 -20.6641541 -0.0611746 -0.1380163 0.0293879 0.9881020
1629804221.557389 1.4102719 1.5761011 -20.5912037 -0.0648270 -0.1183022 0.0258353 0.9905224
1629804221.757389 1.3877497 1.5653925 -20.5216045 -0.0677806 -0.1398074 0.0199927 0.9876538
1629804222.057389 1.3452926 1.5638529 -20.4229755 -0.0702773 -0.1859740 0.0249315 0.9797210
1629804222.257453 1.3108031 1.5539486 -20.3577633 -0.0699112 -0.2062331 0.0255194 0.9756685
1629804222.457453 1.2755247 1.5501715 -20.2821236 -0.0685538 -0.1460633 0.0255509 0.9865663
1629804222.657454 1.2472204 1.5504932 -20.2097931 -0.0671439 -0.1142237 0.0314313 0.9906850
1629804222.857454 1.2246209 1.5393964 -20.1420212 -0.0796264 -0.1248713 0.0346862 0.9883642
1629804223.057454 1.2057664 1.5355521 -20.0730267 -0.0876185 -0.1226842 0.0347080 0.9879610
1629804223.257500 1.1827816 1.5322659 -20.0065308 -0.0870573 -0.1307444 0.0358150 0.9869368
1629804223.457500 1.1575135 1.5222235 -19.9348736 -0.0844065 -0.1151311 0.0290319 0.9893318
1629804223.657500 1.1336590 1.5232921 -19.8596001 -0.0708508 -0.1081678 0.0191190 0.9914204
1629804223.857500 1.1116854 1.5153530 -19.7896061 -0.0584872 -0.1323092 0.0080948 0.9894483
1629804224.057500 1.0897435 1.5086495 -19.7196159 -0.0572474 -0.1553614 0.0015293 0.9861963
1629804224.257557 1.0642493 1.5064951 -19.6558380 -0.0644501 -0.1648635 0.0035494 0.9842020
1629804224.457557 1.0348151 1.4940075 -19.5928631 -0.0770388 -0.1765109 0.0000209 0.9812792
1629804224.657558 1.0061975 1.4877445 -19.5167408 -0.0822103 -0.1144924 0.0004326 0.9900166
1629804224.857558 0.9885947 1.4836873 -19.4394188 -0.0828360 -0.0930411 0.0068839 0.9921865
1629804225.157612 0.9945371 1.4695625 -19.3173294 -0.0919868 -0.0892224 0.0083206 0.9917200
1629804225.457613 1.0076364 1.4610059 -19.1930447 -0.0997534 -0.0309739 0.0308959 0.9940500
1629804225.657613 1.0287006 1.4509567 -19.1070118 -0.1013979 0.0490382 0.0450142 0.9926165
1629804225.857613 1.0572838 1.4446553 -19.0195122 -0.0870999 0.0837025 0.0571736 0.9910291
1629804226.257670 1.1419368 1.4313500 -18.8604832 -0.0702328 0.0800977 0.0509930 0.9930012
1629804226.457670 1.1754514 1.4238465 -18.7840767 -0.0537964 0.0530448 0.0467389 0.9960460
1629804226.657671 1.2128383 1.4157097 -18.7049294 -0.0435437 0.0921042 0.0414779 0.9939318
1629804226.857671 1.2429233 1.4107724 -18.6389256 -0.0435825 0.0878261 0.0364291 0.9945150
1629804227.057671 1.2737842 1.4016213 -18.5784435 -0.0471920 0.0261524 0.0222213 0.9982961
1629804227.257722 1.2978485 1.3969650 -18.5184479 -0.0536923 -0.0001330 0.0130485 0.9984723
1629804227.457722 1.3032162 1.3897247 -18.4647961 -0.0581770 -0.0392875 0.0137617 0.9974380
1629804227.657722 1.3004363 1.3780743 -18.4169846 -0.0648900 -0.0404343 0.0245305 0.9967711
1629804227.857722 1.3020769 1.3683990 -18.3731518 -0.0690429 -0.0800051 0.0305784 0.9939302
1629804228.057722 1.3144103 1.3590957 -18.3300800 -0.0693391 -0.1300463 0.0214006 0.9888489
1629804228.257778 1.3308733 1.3518614 -18.2882347 -0.0626855 -0.1693429 0.0028336 0.9835576
1629804228.457778 1.3399062 1.3450967 -18.2524261 -0.0444777 -0.1794142 -0.0165828 0.9826277
1629804228.657778 1.3426312 1.3368403 -18.2261848 -0.0239388 -0.1638128 -0.0228950 0.9859352
1629804229.657830 1.3636278 1.3351988 -18.1830444 0.0095500 -0.1795084 -0.0471238 0.9825807
1629804229.857830 1.3720120 1.3349255 -18.1887913 0.0035512 -0.1675806 -0.0537939 0.9843832
1629804241.158501 1.3488675 1.3363597 -18.1892719 0.0066671 -0.1962578 -0.0342900 0.9799299
1629804245.958730 1.3480865 1.3356038 -18.1851406 0.0104495 -0.1931455 -0.0345763 0.9805050
1629804246.858781 1.3472981 1.3358016 -18.1850185 0.0108547 -0.1940102 -0.0340512 0.9803483
1629804272.660210 1.3263994 1.3365762 -18.1882820 0.0118896 -0.2027796 -0.0154498 0.9790303
1629804273.360261 1.3284684 1.3355266 -18.1888943 0.0115255 -0.2053574 -0.0178918 0.9784556
1629804279.160606 1.3207980 1.3354955 -18.1803837 0.0198858 -0.2092873 -0.0122138 0.9775757
1629804279.560606 1.3109794 1.3344593 -18.1718540 0.0283042 -0.1921319 -0.0042840 0.9809515
1629804279.960607 1.3008639 1.3308252 -18.1408710 0.0573318 -0.2011301 -0.0022747 0.9778827
1629804280.160650 1.2913682 1.3320085 -18.1172314 0.0742870 -0.2565033 -0.0019526 0.9636824
1629804280.360650 1.2655391 1.3426342 -18.0863457 0.0632242 -0.2607886 0.0109928 0.9632607
1629804280.660650 1.2131000 1.3524915 -18.0269737 -0.0029727 -0.2013631 0.0241672 0.9792140
1629804280.860651 1.1765971 1.3624841 -17.9768600 -0.0389046 -0.1831183 0.0310527 0.9818298
1629804281.060651 1.1392912 1.3567082 -17.9188995 -0.0582182 -0.2019418 0.0374092 0.9769497
1629804281.260708 1.0994878 1.3527797 -17.8462448 -0.0671430 -0.1875731 0.0448836 0.9789248
1629804281.460708 1.0549111 1.3431624 -17.7709980 -0.0707432 -0.2221920 0.0517075 0.9710574
1629804281.760709 0.9943305 1.3340011 -17.6357117 -0.0809147 -0.1401817 0.0584537 0.9850813
1629804282.060709 0.9529693 1.3199164 -17.5035133 -0.0856654 -0.1355193 0.0599053 0.9852448
1629804282.360763 0.9185499 1.3126978 -17.3675880 -0.0806723 -0.1344854 0.0563801 0.9860157
1629804282.560763 0.8899466 1.2979990 -17.2726212 -0.0798998 -0.1108119 0.0545649 0.9891205
1629804282.760764 0.8706291 1.2990609 -17.1805630 -0.0789711 -0.0457377 0.0535892 0.9943841
1629804283.060764 0.8462921 1.2816398 -17.0548286 -0.0790024 -0.0994876 0.0483010 0.9907209
1629804283.260824 0.8278236 1.2772154 -16.9771061 -0.0861628 -0.1066036 0.0567347 0.9889352
1629804283.560825 0.7957442 1.2635831 -16.8601913 -0.0893586 -0.1051429 0.0658468 0.9882430
1629804283.860825 0.7852937 1.2618312 -16.7530823 -0.0870884 -0.0713517 0.0530935 0.9922225
1629804284.060825 0.7957277 1.2457532 -16.6919079 -0.0824436 -0.1240707 0.0312363 0.9883490
1629804284.360875 0.7945426 1.2329682 -16.6113262 -0.0686051 -0.1403297 0.0075210 0.9876965
1629804284.560875 0.7834747 1.2230198 -16.5696564 -0.0533668 -0.1218001 0.0090310 0.9910778
1629804284.960876 0.7793924 1.2088485 -16.5054188 -0.0029981 -0.1350239 -0.0087130 0.9907995
1629804285.560925 0.7861539 1.1981306 -16.4696026 0.0250058 -0.1748448 -0.0207261 0.9840602
1629804286.260982 0.7795857 1.1969703 -16.4540920 0.0395632 -0.1557662 -0.0161201 0.9868697
1629804286.960983 0.7766404 1.1982423 -16.4700527 0.0254541 -0.1379166 -0.0105210 0.9900608
1629804287.961035 0.7982471 1.1989529 -16.4691143 0.0243563 -0.1918873 -0.0330558 0.9805577
1629804288.361088 0.8061448 1.1979488 -16.4680214 0.0235919 -0.2253115 -0.0421723 0.9730877
1629804291.361265 0.8039446 1.1978148 -16.4694328 0.0219473 -0.2209876 -0.0397832 0.9742177
