\relax 
\providecommand\hyper@newdestlabel[2]{}
\providecommand\HyperFirstAtBeginDocument{\AtBeginDocument}
\HyperFirstAtBeginDocument{\ifx\hyper@anchor\@undefined
\global\let\oldcontentsline\contentsline
\gdef\contentsline#1#2#3#4{\oldcontentsline{#1}{#2}{#3}}
\global\let\oldnewlabel\newlabel
\gdef\newlabel#1#2{\newlabelxx{#1}#2}
\gdef\newlabelxx#1#2#3#4#5#6{\oldnewlabel{#1}{{#2}{#3}}}
\AtEndDocument{\ifx\hyper@anchor\@undefined
\let\contentsline\oldcontentsline
\let\newlabel\oldnewlabel
\fi}
\fi}
\global\let\hyper@last\relax 
\gdef\HyperFirstAtBeginDocument#1{#1}
\providecommand\HyField@AuxAddToFields[1]{}
\providecommand\HyField@AuxAddToCoFields[2]{}
\babel@aux{english}{}
\@writefile{toc}{\contentsline {section}{\numberline {1}Calibration}{1}{section.1}}
\@writefile{toc}{\contentsline {subsection}{\numberline {1.1}Maker and model of the phone/camera used}{1}{subsection.1.1}}
\newlabel{subsec:camera}{{1.1}{1}{Maker and model of the phone/camera used}{subsection.1.1}{}}
\@writefile{lot}{\contentsline {table}{\numberline {1}{\ignorespaces Camera used\relax }}{1}{table.caption.1}}
\providecommand*\caption@xref[2]{\@setref\relax\@undefined{#1}}
\newlabel{table:mobile_phone}{{1}{1}{Camera used\relax }{table.caption.1}{}}
\@writefile{lot}{\contentsline {table}{\numberline {2}{\ignorespaces Phone camera specifications\relax }}{1}{table.caption.2}}
\newlabel{table:phone_camera_specs}{{2}{1}{Phone camera specifications\relax }{table.caption.2}{}}
\@writefile{toc}{\contentsline {subsection}{\numberline {1.2}Pattern size}{2}{subsection.1.2}}
\newlabel{subsec:pattern_size}{{1.2}{2}{Pattern size}{subsection.1.2}{}}
\newlabel{eqn:pattern_height}{{1}{2}{Pattern size}{equation.1.1}{}}
\@writefile{lot}{\contentsline {table}{\numberline {3}{\ignorespaces Screen specifications\relax }}{2}{table.caption.3}}
\newlabel{table:screen_specifications}{{3}{2}{Screen specifications\relax }{table.caption.3}{}}
\@writefile{lot}{\contentsline {table}{\numberline {4}{\ignorespaces Screen derived parameters\relax }}{2}{table.4}}
\newlabel{table:screen_derived_parameters}{{4}{2}{Screen derived parameters\relax }{table.4}{}}
\newlabel{eqn:screen_diagonal}{{2}{2}{Pattern size}{equation.1.2}{}}
\newlabel{eqn:screen_aspect_ratio}{{3}{2}{Pattern size}{equation.1.3}{}}
\newlabel{eqn:screen_height}{{4}{2}{Pattern size}{equation.1.4}{}}
\@writefile{lof}{\contentsline {figure}{\numberline {1}{\ignorespaces Pattern height measurement in the screen\relax }}{2}{figure.caption.4}}
\newlabel{figure:pattern_height_px}{{1}{2}{Pattern height measurement in the screen\relax }{figure.caption.4}{}}
\@writefile{lot}{\contentsline {table}{\numberline {5}{\ignorespaces Calibration pattern measurements\relax }}{2}{table.5}}
\newlabel{table:pattern_measurement}{{5}{2}{Calibration pattern measurements\relax }{table.5}{}}
\@writefile{toc}{\contentsline {subsection}{\numberline {1.3}Picture information}{2}{subsection.1.3}}
\@writefile{lot}{\contentsline {table}{\numberline {6}{\ignorespaces Picture information\relax }}{3}{table.caption.5}}
\newlabel{table:picture_information}{{6}{3}{Picture information\relax }{table.caption.5}{}}
\@writefile{toc}{\contentsline {subsection}{\numberline {1.4}Calibration images}{3}{subsection.1.4}}
\newlabel{subsec:calibration_images}{{1.4}{3}{Calibration images}{subsection.1.4}{}}
\@writefile{lof}{\contentsline {figure}{\numberline {2}{\ignorespaces Miniatures of the calibration photos\relax }}{3}{figure.caption.6}}
\newlabel{figure:calibration_miniatures}{{2}{3}{Miniatures of the calibration photos\relax }{figure.caption.6}{}}
\@writefile{toc}{\contentsline {subsection}{\numberline {1.5}Calibrator app}{3}{subsection.1.5}}
\newlabel{subsec:calibrator_app}{{1.5}{3}{Calibrator app}{subsection.1.5}{}}
\@writefile{lof}{\contentsline {figure}{\numberline {3}{\ignorespaces \emph  {Matlab}'s \emph  {Calibrator App}\relax }}{4}{figure.caption.7}}
\newlabel{figure:calibrator_app}{{3}{4}{\emph {Matlab}'s \emph {Calibrator App}\relax }{figure.caption.7}{}}
\@writefile{toc}{\contentsline {subsection}{\numberline {1.6}Final camera calibration parameters}{4}{subsection.1.6}}
\newlabel{subsec:calibration_parameters}{{1.6}{4}{Final camera calibration parameters}{subsection.1.6}{}}
\newlabel{eqn:intrinsic_camera_parameters}{{5}{4}{Final camera calibration parameters}{equation.1.5}{}}
\@writefile{lof}{\contentsline {figure}{\numberline {4}{\ignorespaces Calibration camera positions\relax }}{5}{figure.caption.8}}
\newlabel{figure:calibrator_app_camera_positions}{{4}{5}{Calibration camera positions\relax }{figure.caption.8}{}}
\@writefile{lof}{\contentsline {figure}{\numberline {5}{\ignorespaces Distance measurement diagram\relax }}{6}{figure.caption.9}}
\newlabel{figure:equation_derivation}{{5}{6}{Distance measurement diagram\relax }{figure.caption.9}{}}
\newlabel{figure:equation_derivation_3D}{{\caption@xref {figure:equation_derivation_3D}{ on input line 322}}{6}{Distance measurement diagram\relax }{figure.caption.9}{}}
\newlabel{sub@figure:equation_derivation_3D}{{0}{6}{Distance measurement diagram\relax }{figure.caption.9}{}}
\newlabel{figure:equation_derivation_2D}{{\caption@xref {figure:equation_derivation_2D}{ on input line 327}}{6}{Distance measurement diagram\relax }{figure.caption.9}{}}
\newlabel{sub@figure:equation_derivation_2D}{{1}{6}{Distance measurement diagram\relax }{figure.caption.9}{}}
\@writefile{toc}{\contentsline {section}{\numberline {2}Distance measurement}{6}{section.2}}
\newlabel{sec:distance_measurement}{{2}{6}{Distance measurement}{section.2}{}}
\@writefile{toc}{\contentsline {subsection}{\numberline {2.1}Equation used for distance measurement}{6}{subsection.2.1}}
\newlabel{subsec:distance_measurement_equation}{{2.1}{6}{Equation used for distance measurement}{subsection.2.1}{}}
\newlabel{eqn:assumption_parallel}{{6}{6}{Equation used for distance measurement}{equation.2.6}{}}
\newlabel{eqn:assumption_centered_e}{{7}{6}{Equation used for distance measurement}{equation.2.7}{}}
\newlabel{eqn:assumption_centered_f}{{8}{6}{Equation used for distance measurement}{equation.2.8}{}}
\newlabel{eqn:assumption_centered_c}{{9}{6}{Equation used for distance measurement}{equation.2.9}{}}
\newlabel{eqn:implicit_z_gamma}{{10}{6}{Equation used for distance measurement}{equation.2.10}{}}
\newlabel{eqn:implicit_z_alpha}{{11}{6}{Equation used for distance measurement}{equation.2.11}{}}
\newlabel{eqn:implicit_z}{{12}{6}{Equation used for distance measurement}{equation.2.12}{}}
\newlabel{eqn:explicit_gamma}{{13}{7}{Equation used for distance measurement}{equation.2.13}{}}
\newlabel{eqn:explicit_alpha}{{14}{7}{Equation used for distance measurement}{equation.2.14}{}}
\newlabel{eqn:explicit_z}{{15}{7}{Equation used for distance measurement}{equation.2.15}{}}
\newlabel{eqn:distance}{{16}{7}{Equation used for distance measurement}{equation.2.16}{}}
\@writefile{toc}{\contentsline {subsubsection}{\numberline {2.1.1}Distance uncertainty propagation}{7}{subsubsection.2.1.1}}
\newlabel{subsubsec:distance_error_propagation}{{2.1.1}{7}{Distance uncertainty propagation}{subsubsection.2.1.1}{}}
\newlabel{eqn:differential}{{18}{7}{Distance uncertainty propagation}{equation.2.18}{}}
\newlabel{eqn:error_propagation}{{19}{7}{Distance uncertainty propagation}{equation.2.19}{}}
\newlabel{eqn:distance_error}{{20}{7}{Distance uncertainty propagation}{equation.2.20}{}}
\@writefile{toc}{\contentsline {subsection}{\numberline {2.2}Pictures of the target pattern}{7}{subsection.2.2}}
\newlabel{subsec:target_pattern}{{2.2}{7}{Pictures of the target pattern}{subsection.2.2}{}}
\@writefile{lof}{\contentsline {figure}{\numberline {6}{\ignorespaces Miniatures of the target images from 50cm\relax }}{8}{figure.caption.10}}
\newlabel{figure:target_miniatures_50}{{6}{8}{Miniatures of the target images from \distance cm\relax }{figure.caption.10}{}}
\@writefile{lof}{\contentsline {figure}{\numberline {7}{\ignorespaces Miniatures of the target images from 100cm\relax }}{8}{figure.caption.11}}
\newlabel{figure:target_miniatures_100}{{7}{8}{Miniatures of the target images from \distance cm\relax }{figure.caption.11}{}}
\@writefile{lof}{\contentsline {figure}{\numberline {8}{\ignorespaces Miniatures of the target images from 150cm\relax }}{8}{figure.caption.12}}
\newlabel{figure:target_miniatures_150}{{8}{8}{Miniatures of the target images from \distance cm\relax }{figure.caption.12}{}}
\@writefile{lot}{\contentsline {table}{\numberline {7}{\ignorespaces Measurements of the target pattern in the images taken at different distances\relax }}{8}{table.caption.13}}
\newlabel{table:target_pattern_measurements}{{7}{8}{Measurements of the target pattern in the images taken at different distances\relax }{table.caption.13}{}}
\@writefile{toc}{\contentsline {subsection}{\numberline {2.3}Measured target pattern size}{9}{subsection.2.3}}
\newlabel{subsec:target_pattern_size}{{2.3}{9}{Measured target pattern size}{subsection.2.3}{}}
\@writefile{lot}{\contentsline {table}{\numberline {8}{\ignorespaces Target pattern measurement\relax }}{9}{table.8}}
\newlabel{table:target_pattern_size}{{8}{9}{Target pattern measurement\relax }{table.8}{}}
\@writefile{toc}{\contentsline {subsection}{\numberline {2.4}Results}{9}{subsection.2.4}}
\newlabel{subsec:results}{{2.4}{9}{Results}{subsection.2.4}{}}
\newlabel{eqn:assumption_scaling}{{21}{9}{Results}{equation.2.21}{}}
\@writefile{lot}{\contentsline {table}{\numberline {9}{\ignorespaces Focal length, assuming negligible scaling factor effect\relax }}{9}{table.9}}
\newlabel{table:focal_length}{{9}{9}{Focal length, assuming negligible scaling factor effect\relax }{table.9}{}}
\@writefile{lot}{\contentsline {table}{\numberline {10}{\ignorespaces Results of the distance calculus\relax }}{9}{table.10}}
\newlabel{table:results}{{10}{9}{Results of the distance calculus\relax }{table.10}{}}
\@writefile{toc}{\contentsline {subsubsection}{\numberline {2.4.1}Target size measurement uncertainty impact}{10}{subsubsection.2.4.1}}
\newlabel{eqn:target_size_error_impact}{{22}{10}{Target size measurement uncertainty impact}{equation.2.22}{}}
\newlabel{eqn:target_size_error_impact_numeric}{{23}{10}{Target size measurement uncertainty impact}{equation.2.23}{}}
\@writefile{lot}{\contentsline {table}{\numberline {11}{\ignorespaces Target size $d$ uncertainty impact on distance $Z$\relax }}{10}{table.11}}
\newlabel{table:target_size_error_impact}{{11}{10}{Target size $d$ uncertainty impact on distance $Z$\relax }{table.11}{}}
