<?xml version="1.0" encoding="utf-8" standalone="no"?>
<!DOCTYPE svg PUBLIC "-//W3C//DTD SVG 1.1//EN"
  "http://www.w3.org/Graphics/SVG/1.1/DTD/svg11.dtd">
<svg height="274.853533pt" version="1.1" viewBox="0 0 365.075699 274.853533" width="365.075699pt" xmlns="http://www.w3.org/2000/svg" xmlns:xlink="http://www.w3.org/1999/xlink">
 <metadata>
  <rdf:RDF xmlns:cc="http://creativecommons.org/ns#" xmlns:dc="http://purl.org/dc/elements/1.1/" xmlns:rdf="http://www.w3.org/1999/02/22-rdf-syntax-ns#">
   <cc:Work>
    <dc:type rdf:resource="http://purl.org/dc/dcmitype/StillImage"/>
    <dc:date>2021-11-25T11:31:26.304164</dc:date>
    <dc:format>image/svg+xml</dc:format>
    <dc:creator>
     <cc:Agent>
      <dc:title>Matplotlib v3.4.3, https://matplotlib.org/</dc:title>
     </cc:Agent>
    </dc:creator>
   </cc:Work>
  </rdf:RDF>
 </metadata>
 <defs>
  <style type="text/css">*{stroke-linecap:butt;stroke-linejoin:round;}</style>
 </defs>
 <g id="figure_1">
  <g id="patch_1">
   <path d="M 0 274.853533 
L 365.075699 274.853533 
L 365.075699 0 
L 0 0 
z
" style="fill:none;"/>
  </g>
  <g id="axes_1">
   <g id="patch_2">
    <path d="M 49.748426 238.94218 
L 201.930244 238.94218 
L 201.930244 21.50218 
L 49.748426 21.50218 
z
" style="fill:#ffffff;"/>
   </g>
   <g id="matplotlib.axis_1">
    <g id="xtick_1">
     <g id="line2d_1">
      <defs>
       <path d="M 0 0 
L 0 3.5 
" id="mb8952d5bf2" style="stroke:#000000;stroke-width:0.8;"/>
      </defs>
      <g>
       <use style="stroke:#000000;stroke-width:0.8;" x="56.665782" xlink:href="#mb8952d5bf2" y="238.94218"/>
      </g>
     </g>
     <g id="text_1">
      <!-- $\mathdefault{12}$ -->
      <g transform="translate(51.684446 252.860678)scale(0.1 -0.1)">
       <defs>
        <path d="M 1702 4058 
C 1702 4192 1696 4192 1606 4192 
C 1357 3916 979 3827 621 3827 
C 602 3827 570 3827 563 3808 
C 557 3795 557 3782 557 3648 
C 755 3648 1088 3686 1344 3839 
L 1344 461 
C 1344 236 1331 160 781 160 
L 589 160 
L 589 0 
C 896 0 1216 0 1523 0 
C 1830 0 2150 0 2458 0 
L 2458 160 
L 2266 160 
C 1715 160 1702 230 1702 458 
L 1702 4058 
z
" id="CMR17-31" transform="scale(0.015625)"/>
        <path d="M 2669 989 
L 2554 989 
C 2490 536 2438 459 2413 420 
C 2381 369 1920 369 1830 369 
L 602 369 
C 832 619 1280 1072 1824 1597 
C 2214 1967 2669 2402 2669 3035 
C 2669 3790 2067 4224 1395 4224 
C 691 4224 262 3604 262 3030 
C 262 2780 448 2748 525 2748 
C 589 2748 781 2787 781 3010 
C 781 3207 614 3264 525 3264 
C 486 3264 448 3258 422 3245 
C 544 3790 915 4058 1306 4058 
C 1862 4058 2227 3617 2227 3035 
C 2227 2479 1901 2000 1536 1584 
L 262 146 
L 262 0 
L 2515 0 
L 2669 989 
z
" id="CMR17-32" transform="scale(0.015625)"/>
       </defs>
       <use transform="scale(0.996264)" xlink:href="#CMR17-31"/>
       <use transform="translate(45.690477 0)scale(0.996264)" xlink:href="#CMR17-32"/>
      </g>
     </g>
    </g>
    <g id="xtick_2">
     <g id="line2d_2">
      <g>
       <use style="stroke:#000000;stroke-width:0.8;" x="102.781484" xlink:href="#mb8952d5bf2" y="238.94218"/>
      </g>
     </g>
     <g id="text_2">
      <!-- $\mathdefault{14}$ -->
      <g transform="translate(97.800149 252.860678)scale(0.1 -0.1)">
       <defs>
        <path d="M 2150 4122 
C 2150 4256 2144 4256 2029 4256 
L 128 1254 
L 128 1088 
L 1779 1088 
L 1779 457 
C 1779 224 1766 160 1318 160 
L 1197 160 
L 1197 0 
C 1402 0 1747 0 1965 0 
C 2182 0 2528 0 2733 0 
L 2733 160 
L 2611 160 
C 2163 160 2150 224 2150 457 
L 2150 1088 
L 2803 1088 
L 2803 1254 
L 2150 1254 
L 2150 4122 
z
M 1798 3703 
L 1798 1254 
L 256 1254 
L 1798 3703 
z
" id="CMR17-34" transform="scale(0.015625)"/>
       </defs>
       <use transform="scale(0.996264)" xlink:href="#CMR17-31"/>
       <use transform="translate(45.690477 0)scale(0.996264)" xlink:href="#CMR17-34"/>
      </g>
     </g>
    </g>
    <g id="xtick_3">
     <g id="line2d_3">
      <g>
       <use style="stroke:#000000;stroke-width:0.8;" x="148.897187" xlink:href="#mb8952d5bf2" y="238.94218"/>
      </g>
     </g>
     <g id="text_3">
      <!-- $\mathdefault{16}$ -->
      <g transform="translate(143.915851 252.860678)scale(0.1 -0.1)">
       <defs>
        <path d="M 678 2176 
C 678 3690 1395 4032 1811 4032 
C 1946 4032 2272 4009 2400 3776 
C 2298 3776 2106 3776 2106 3553 
C 2106 3381 2246 3323 2336 3323 
C 2394 3323 2566 3348 2566 3560 
C 2566 3954 2246 4179 1805 4179 
C 1043 4179 243 3390 243 1984 
C 243 253 966 -128 1478 -128 
C 2099 -128 2688 427 2688 1283 
C 2688 2081 2170 2662 1517 2662 
C 1126 2662 838 2407 678 1960 
L 678 2176 
z
M 1478 25 
C 691 25 691 1200 691 1436 
C 691 1896 909 2560 1504 2560 
C 1613 2560 1926 2560 2138 2120 
C 2253 1870 2253 1609 2253 1289 
C 2253 944 2253 690 2118 434 
C 1978 171 1773 25 1478 25 
z
" id="CMR17-36" transform="scale(0.015625)"/>
       </defs>
       <use transform="scale(0.996264)" xlink:href="#CMR17-31"/>
       <use transform="translate(45.690477 0)scale(0.996264)" xlink:href="#CMR17-36"/>
      </g>
     </g>
    </g>
    <g id="xtick_4">
     <g id="line2d_4">
      <g>
       <use style="stroke:#000000;stroke-width:0.8;" x="195.012889" xlink:href="#mb8952d5bf2" y="238.94218"/>
      </g>
     </g>
     <g id="text_4">
      <!-- $\mathdefault{18}$ -->
      <g transform="translate(190.031554 252.860678)scale(0.1 -0.1)">
       <defs>
        <path d="M 1741 2264 
C 2144 2467 2554 2773 2554 3263 
C 2554 3841 1990 4179 1472 4179 
C 890 4179 378 3759 378 3180 
C 378 3021 416 2747 666 2505 
C 730 2442 998 2251 1171 2130 
C 883 1983 211 1634 211 934 
C 211 279 838 -128 1459 -128 
C 2144 -128 2720 362 2720 1010 
C 2720 1590 2330 1857 2074 2029 
L 1741 2264 
z
M 902 2822 
C 851 2854 595 3051 595 3351 
C 595 3739 998 4032 1459 4032 
C 1965 4032 2336 3676 2336 3262 
C 2336 2669 1670 2331 1638 2331 
C 1632 2331 1626 2331 1574 2370 
L 902 2822 
z
M 2080 1519 
C 2176 1449 2483 1240 2483 851 
C 2483 381 2010 25 1472 25 
C 890 25 448 438 448 940 
C 448 1443 838 1862 1280 2060 
L 2080 1519 
z
" id="CMR17-38" transform="scale(0.015625)"/>
       </defs>
       <use transform="scale(0.996264)" xlink:href="#CMR17-31"/>
       <use transform="translate(45.690477 0)scale(0.996264)" xlink:href="#CMR17-38"/>
      </g>
     </g>
    </g>
    <g id="text_5">
     <!-- $r_{21}$ -->
     <g transform="translate(119.620735 265.716355)scale(0.1 -0.1)">
      <defs>
       <path d="M 2490 2612 
C 2291 2574 2189 2433 2189 2293 
C 2189 2139 2310 2088 2400 2088 
C 2579 2088 2726 2242 2726 2433 
C 2726 2638 2528 2816 2208 2816 
C 1952 2816 1658 2701 1389 2312 
C 1344 2650 1088 2816 832 2816 
C 582 2816 454 2625 378 2484 
C 269 2254 173 1871 173 1839 
C 173 1814 198 1782 243 1782 
C 294 1782 301 1788 339 1935 
C 435 2318 557 2689 813 2689 
C 966 2689 1011 2580 1011 2395 
C 1011 2254 947 2005 902 1807 
L 723 1118 
C 698 996 627 709 595 594 
C 550 428 480 128 480 96 
C 480 6 550 -64 646 -64 
C 717 -64 838 -19 877 109 
C 896 160 1133 1124 1171 1271 
C 1203 1411 1242 1546 1274 1686 
C 1299 1775 1325 1878 1344 1961 
C 1363 2018 1536 2331 1696 2472 
C 1773 2542 1939 2689 2202 2689 
C 2304 2689 2406 2670 2490 2612 
z
" id="CMMI12-72" transform="scale(0.015625)"/>
      </defs>
      <use transform="scale(0.996264)" xlink:href="#CMMI12-72"/>
      <use transform="translate(43.960894 -14.943915)scale(0.697382)" xlink:href="#CMR17-32"/>
      <use transform="translate(75.944076 -14.943915)scale(0.697382)" xlink:href="#CMR17-31"/>
     </g>
    </g>
   </g>
   <g id="matplotlib.axis_2">
    <g id="ytick_1">
     <g id="line2d_5">
      <defs>
       <path d="M 0 0 
L -3.5 0 
" id="mf4a58939e3" style="stroke:#000000;stroke-width:0.8;"/>
      </defs>
      <g>
       <use style="stroke:#000000;stroke-width:0.8;" x="49.748426" xlink:href="#mf4a58939e3" y="200.41423"/>
      </g>
     </g>
     <g id="text_6">
      <!-- $\mathdefault{0.532}$ -->
      <g transform="translate(20.055677 203.873479)scale(0.1 -0.1)">
       <defs>
        <path d="M 2688 2025 
C 2688 2416 2682 3080 2413 3591 
C 2176 4039 1798 4198 1466 4198 
C 1158 4198 768 4058 525 3597 
C 269 3118 243 2524 243 2025 
C 243 1661 250 1106 448 619 
C 723 -39 1216 -128 1466 -128 
C 1760 -128 2208 -7 2470 600 
C 2662 1042 2688 1559 2688 2025 
z
M 1466 -26 
C 1056 -26 813 325 723 812 
C 653 1188 653 1738 653 2096 
C 653 2588 653 2997 736 3387 
C 858 3929 1216 4096 1466 4096 
C 1728 4096 2067 3923 2189 3400 
C 2272 3036 2278 2607 2278 2096 
C 2278 1680 2278 1169 2202 792 
C 2067 95 1690 -26 1466 -26 
z
" id="CMR17-30" transform="scale(0.015625)"/>
        <path d="M 1178 307 
C 1178 492 1024 619 870 619 
C 685 619 557 466 557 313 
C 557 128 710 0 864 0 
C 1050 0 1178 153 1178 307 
z
" id="CMMI12-3a" transform="scale(0.015625)"/>
        <path d="M 730 3692 
C 794 3666 1056 3584 1325 3584 
C 1920 3584 2246 3911 2432 4100 
C 2432 4157 2432 4192 2394 4192 
C 2387 4192 2374 4192 2323 4163 
C 2099 4058 1837 3973 1517 3973 
C 1325 3973 1037 3999 723 4139 
C 653 4171 640 4171 634 4171 
C 602 4171 595 4164 595 4037 
L 595 2203 
C 595 2089 595 2057 659 2057 
C 691 2057 704 2070 736 2114 
C 941 2401 1222 2522 1542 2522 
C 1766 2522 2246 2382 2246 1289 
C 2246 1085 2246 715 2054 421 
C 1894 159 1645 25 1370 25 
C 947 25 518 320 403 814 
C 429 807 480 795 506 795 
C 589 795 749 840 749 1038 
C 749 1210 627 1280 506 1280 
C 358 1280 262 1190 262 1011 
C 262 454 704 -128 1382 -128 
C 2042 -128 2669 440 2669 1264 
C 2669 2030 2170 2624 1549 2624 
C 1222 2624 947 2503 730 2274 
L 730 3692 
z
" id="CMR17-35" transform="scale(0.015625)"/>
        <path d="M 1414 2157 
C 1984 2157 2234 1662 2234 1090 
C 2234 320 1824 25 1453 25 
C 1114 25 563 194 390 693 
C 422 680 454 680 486 680 
C 640 680 755 782 755 948 
C 755 1133 614 1216 486 1216 
C 378 1216 211 1165 211 926 
C 211 335 787 -128 1466 -128 
C 2176 -128 2720 430 2720 1085 
C 2720 1707 2208 2157 1600 2227 
C 2086 2328 2554 2756 2554 3329 
C 2554 3820 2048 4179 1472 4179 
C 890 4179 378 3829 378 3329 
C 378 3110 544 3072 627 3072 
C 762 3072 877 3155 877 3321 
C 877 3486 762 3569 627 3569 
C 602 3569 570 3569 544 3557 
C 730 3959 1235 4032 1459 4032 
C 1683 4032 2106 3925 2106 3320 
C 2106 3143 2080 2828 1862 2550 
C 1670 2304 1453 2304 1242 2284 
C 1210 2284 1062 2269 1037 2269 
C 992 2263 966 2257 966 2208 
C 966 2163 973 2157 1101 2157 
L 1414 2157 
z
" id="CMR17-33" transform="scale(0.015625)"/>
       </defs>
       <use transform="scale(0.996264)" xlink:href="#CMR17-30"/>
       <use transform="translate(45.690477 0)scale(0.996264)" xlink:href="#CMMI12-3a"/>
       <use transform="translate(72.787654 0)scale(0.996264)" xlink:href="#CMR17-35"/>
       <use transform="translate(118.478131 0)scale(0.996264)" xlink:href="#CMR17-33"/>
       <use transform="translate(164.168608 0)scale(0.996264)" xlink:href="#CMR17-32"/>
      </g>
     </g>
    </g>
    <g id="ytick_2">
     <g id="line2d_6">
      <g>
       <use style="stroke:#000000;stroke-width:0.8;" x="49.748426" xlink:href="#mf4a58939e3" y="153.550119"/>
      </g>
     </g>
     <g id="text_7">
      <!-- $\mathdefault{0.534}$ -->
      <g transform="translate(20.055677 157.009368)scale(0.1 -0.1)">
       <use transform="scale(0.996264)" xlink:href="#CMR17-30"/>
       <use transform="translate(45.690477 0)scale(0.996264)" xlink:href="#CMMI12-3a"/>
       <use transform="translate(72.787654 0)scale(0.996264)" xlink:href="#CMR17-35"/>
       <use transform="translate(118.478131 0)scale(0.996264)" xlink:href="#CMR17-33"/>
       <use transform="translate(164.168608 0)scale(0.996264)" xlink:href="#CMR17-34"/>
      </g>
     </g>
    </g>
    <g id="ytick_3">
     <g id="line2d_7">
      <g>
       <use style="stroke:#000000;stroke-width:0.8;" x="49.748426" xlink:href="#mf4a58939e3" y="106.686008"/>
      </g>
     </g>
     <g id="text_8">
      <!-- $\mathdefault{0.536}$ -->
      <g transform="translate(20.055677 110.145257)scale(0.1 -0.1)">
       <use transform="scale(0.996264)" xlink:href="#CMR17-30"/>
       <use transform="translate(45.690477 0)scale(0.996264)" xlink:href="#CMMI12-3a"/>
       <use transform="translate(72.787654 0)scale(0.996264)" xlink:href="#CMR17-35"/>
       <use transform="translate(118.478131 0)scale(0.996264)" xlink:href="#CMR17-33"/>
       <use transform="translate(164.168608 0)scale(0.996264)" xlink:href="#CMR17-36"/>
      </g>
     </g>
    </g>
    <g id="ytick_4">
     <g id="line2d_8">
      <g>
       <use style="stroke:#000000;stroke-width:0.8;" x="49.748426" xlink:href="#mf4a58939e3" y="59.821896"/>
      </g>
     </g>
     <g id="text_9">
      <!-- $\mathdefault{0.538}$ -->
      <g transform="translate(20.055677 63.281145)scale(0.1 -0.1)">
       <use transform="scale(0.996264)" xlink:href="#CMR17-30"/>
       <use transform="translate(45.690477 0)scale(0.996264)" xlink:href="#CMMI12-3a"/>
       <use transform="translate(72.787654 0)scale(0.996264)" xlink:href="#CMR17-35"/>
       <use transform="translate(118.478131 0)scale(0.996264)" xlink:href="#CMR17-33"/>
       <use transform="translate(164.168608 0)scale(0.996264)" xlink:href="#CMR17-38"/>
      </g>
     </g>
    </g>
    <g id="text_10">
     <!-- $\Delta \overline{V}$ -->
     <g transform="translate(14.118498 138.386023)rotate(-90)scale(0.1 -0.1)">
      <defs>
       <path d="M 2598 4403 
C 2547 4512 2522 4512 2470 4512 
C 2394 4512 2387 4499 2342 4409 
L 269 109 
C 262 96 237 38 237 32 
C 237 6 243 0 358 0 
L 4576 0 
C 4691 0 4698 6 4698 32 
C 4698 38 4672 96 4666 109 
L 2598 4403 
z
M 2310 4038 
L 4083 358 
L 531 358 
L 2310 4038 
z
" id="CMR17-1" transform="scale(0.015625)"/>
       <path d="M 3962 3640 
C 4179 3984 4378 4136 4704 4162 
C 4768 4168 4819 4168 4819 4282 
C 4819 4308 4806 4346 4749 4346 
C 4634 4346 4358 4346 4243 4346 
C 4058 4346 3866 4346 3686 4346 
C 3635 4346 3571 4346 3571 4226 
C 3571 4168 3629 4162 3654 4162 
C 3891 4143 3917 4029 3917 3952 
C 3917 3857 3827 3710 3821 3704 
L 1811 540 
L 1363 3969 
C 1363 4160 1696 4160 1766 4160 
C 1862 4160 1920 4160 1920 4282 
C 1920 4346 1850 4346 1830 4346 
C 1722 4346 1594 4346 1485 4346 
L 1126 4346 
C 659 4346 467 4346 461 4346 
C 422 4346 346 4346 346 4230 
C 346 4160 390 4160 493 4160 
C 819 4160 838 4102 858 3944 
L 1370 24 
C 1389 -109 1389 -128 1478 -128 
C 1555 -128 1587 -109 1651 -8 
L 3962 3640 
z
" id="CMMI12-56" transform="scale(0.015625)"/>
      </defs>
      <use transform="scale(0.996264)" xlink:href="#CMR17-1"/>
      <use transform="translate(76.91959 0)scale(0.996264)" xlink:href="#CMMI12-56"/>
      <path d="M 76.91959 80.032884 
L 155.466911 80.032884 
L 155.466911 84.017834 
L 76.91959 84.017834 
L 76.91959 80.032884 
z
"/>
     </g>
    </g>
   </g>
   <g id="line2d_9">
    <path clip-path="url(#pf19ad4eeaf)" d="M 56.665782 149.335344 
L 60.547264 144.022364 
L 64.428746 139.109991 
L 68.310227 134.577972 
L 72.191709 130.407228 
L 76.073191 126.57977 
L 79.954673 123.078634 
L 83.836155 119.887805 
L 87.717637 116.99216 
L 91.599119 114.377408 
L 95.480601 112.030037 
L 99.362083 109.937265 
L 103.243565 108.086992 
L 107.402296 106.360651 
L 111.561027 104.886217 
L 115.719757 103.651102 
L 119.878488 102.643412 
L 124.314467 101.806559 
L 128.750447 101.202795 
L 133.186426 100.819968 
L 137.899654 100.642484 
L 142.612882 100.688525 
L 147.603359 100.967366 
L 152.593836 101.469525 
L 157.861562 102.227744 
L 163.129287 103.206449 
L 168.674261 104.460354 
L 174.496484 106.008373 
L 180.595956 107.86768 
L 186.972676 110.053613 
L 193.626645 112.579602 
L 195.012889 113.135626 
L 195.012889 113.135626 
" style="fill:none;stroke:#1f77b4;stroke-linecap:square;"/>
   </g>
   <g id="line2d_10">
    <path clip-path="url(#pf19ad4eeaf)" d="M 56.665782 31.385816 
L 61.933507 43.677316 
L 67.201233 55.430059 
L 72.746207 67.249787 
L 78.291181 78.533429 
L 83.836155 89.309107 
L 89.38113 99.603067 
L 94.926104 109.439833 
L 100.471078 118.842346 
L 106.293301 128.27111 
L 112.115524 137.268063 
L 117.937747 145.854981 
L 123.75997 154.052258 
L 129.582193 161.879011 
L 135.681665 169.700591 
L 141.781136 177.154544 
L 147.880608 184.25901 
L 153.98008 191.031005 
L 160.3568 197.772677 
L 166.73352 204.185582 
L 173.110241 210.285815 
L 179.486961 216.088493 
L 186.14093 221.841582 
L 192.794899 227.301327 
L 195.012889 229.058543 
L 195.012889 229.058543 
" style="fill:none;stroke:#ff7f0e;stroke-linecap:square;"/>
   </g>
   <g id="line2d_11">
    <path clip-path="url(#pf19ad4eeaf)" d="M 125.839335 238.94218 
L 125.839335 21.50218 
" style="fill:none;stroke:#000000;stroke-dasharray:5.55,2.4;stroke-dashoffset:0;stroke-width:1.5;"/>
   </g>
   <g id="patch_3">
    <path d="M 49.748426 238.94218 
L 49.748426 21.50218 
" style="fill:none;stroke:#000000;stroke-linecap:square;stroke-linejoin:miter;stroke-width:0.8;"/>
   </g>
   <g id="patch_4">
    <path d="M 201.930244 238.94218 
L 201.930244 21.50218 
" style="fill:none;stroke:#000000;stroke-linecap:square;stroke-linejoin:miter;stroke-width:0.8;"/>
   </g>
   <g id="patch_5">
    <path d="M 49.748426 238.94218 
L 201.930244 238.94218 
" style="fill:none;stroke:#000000;stroke-linecap:square;stroke-linejoin:miter;stroke-width:0.8;"/>
   </g>
   <g id="patch_6">
    <path d="M 49.748426 21.50218 
L 201.930244 21.50218 
" style="fill:none;stroke:#000000;stroke-linecap:square;stroke-linejoin:miter;stroke-width:0.8;"/>
   </g>
   <g id="legend_1">
    <g id="patch_7">
     <path d="M 110.920386 57.376536 
L 194.930244 57.376536 
Q 196.930244 57.376536 196.930244 55.376536 
L 196.930244 28.50218 
Q 196.930244 26.50218 194.930244 26.50218 
L 110.920386 26.50218 
Q 108.920386 26.50218 108.920386 28.50218 
L 108.920386 55.376536 
Q 108.920386 57.376536 110.920386 57.376536 
z
" style="fill:#ffffff;opacity:0.8;stroke:#cccccc;stroke-linejoin:miter;"/>
    </g>
    <g id="line2d_12">
     <path d="M 112.920386 34.00218 
L 132.920386 34.00218 
" style="fill:none;stroke:#1f77b4;stroke-linecap:square;"/>
    </g>
    <g id="line2d_13"/>
    <g id="text_11">
     <!-- $r_{m1}=1.00$ -->
     <g transform="translate(140.920386 37.50218)scale(0.1 -0.1)">
      <defs>
       <path d="M 1318 1871 
C 1331 1910 1491 2229 1728 2433 
C 1894 2586 2112 2689 2362 2689 
C 2618 2689 2707 2497 2707 2242 
C 2707 2203 2707 2076 2630 1775 
L 2470 1118 
C 2419 926 2298 453 2285 383 
C 2259 287 2221 121 2221 96 
C 2221 6 2291 -64 2387 -64 
C 2579 -64 2611 83 2669 313 
L 3053 1839 
C 3066 1890 3398 2689 4102 2689 
C 4358 2689 4448 2497 4448 2242 
C 4448 1884 4198 1188 4058 805 
C 4000 651 3968 568 3968 453 
C 3968 166 4166 -64 4474 -64 
C 5069 -64 5293 875 5293 913 
C 5293 945 5267 971 5229 971 
C 5171 971 5165 952 5133 843 
C 4986 332 4749 64 4493 64 
C 4429 64 4326 64 4326 269 
C 4326 436 4403 640 4429 710 
C 4544 1018 4832 1773 4832 2145 
C 4832 2528 4608 2816 4122 2816 
C 3693 2816 3347 2574 3091 2197 
C 3072 2542 2861 2816 2381 2816 
C 1811 2816 1510 2415 1395 2255 
C 1376 2618 1114 2816 832 2816 
C 646 2816 499 2727 378 2484 
C 262 2254 173 1865 173 1839 
C 173 1814 198 1782 243 1782 
C 294 1782 301 1788 339 1935 
C 435 2312 557 2689 813 2689 
C 960 2689 1011 2586 1011 2395 
C 1011 2254 947 2005 902 1807 
L 723 1118 
C 698 996 627 709 595 594 
C 550 428 480 128 480 96 
C 480 6 550 -64 646 -64 
C 723 -64 813 -26 864 70 
C 877 102 934 326 966 453 
L 1107 1028 
L 1318 1871 
z
" id="CMMI12-6d" transform="scale(0.015625)"/>
       <path d="M 4115 2017 
C 4211 2017 4307 2017 4307 2125 
C 4307 2240 4198 2240 4090 2240 
L 512 2240 
C 403 2240 294 2240 294 2125 
C 294 2017 390 2017 486 2017 
L 4115 2017 
z
M 4090 896 
C 4198 896 4307 896 4307 1011 
C 4307 1119 4211 1119 4115 1119 
L 486 1119 
C 390 1119 294 1119 294 1011 
C 294 896 403 896 512 896 
L 4090 896 
z
" id="CMR17-3d" transform="scale(0.015625)"/>
      </defs>
      <use transform="scale(0.996264)" xlink:href="#CMMI12-72"/>
      <use transform="translate(43.960894 -14.943915)scale(0.697382)" xlink:href="#CMMI12-6d"/>
      <use transform="translate(103.689685 -14.943915)scale(0.697382)" xlink:href="#CMR17-31"/>
      <use transform="translate(163.845008 0)scale(0.996264)" xlink:href="#CMR17-3d"/>
      <use transform="translate(263.233805 0)scale(0.996264)" xlink:href="#CMR17-31"/>
      <use transform="translate(308.924282 0)scale(0.996264)" xlink:href="#CMMI12-3a"/>
      <use transform="translate(336.021459 0)scale(0.996264)" xlink:href="#CMR17-30"/>
      <use transform="translate(381.711937 0)scale(0.996264)" xlink:href="#CMR17-30"/>
     </g>
    </g>
    <g id="line2d_14">
     <path d="M 112.920386 47.939358 
L 132.920386 47.939358 
" style="fill:none;stroke:#ff7f0e;stroke-linecap:square;"/>
    </g>
    <g id="line2d_15"/>
    <g id="text_12">
     <!-- $r_{m1}=30.00$ -->
     <g transform="translate(140.920386 51.439358)scale(0.1 -0.1)">
      <use transform="scale(0.996264)" xlink:href="#CMMI12-72"/>
      <use transform="translate(43.960894 -14.943915)scale(0.697382)" xlink:href="#CMMI12-6d"/>
      <use transform="translate(103.689685 -14.943915)scale(0.697382)" xlink:href="#CMR17-31"/>
      <use transform="translate(163.845008 0)scale(0.996264)" xlink:href="#CMR17-3d"/>
      <use transform="translate(263.233805 0)scale(0.996264)" xlink:href="#CMR17-33"/>
      <use transform="translate(308.924282 0)scale(0.996264)" xlink:href="#CMR17-30"/>
      <use transform="translate(354.614759 0)scale(0.996264)" xlink:href="#CMMI12-3a"/>
      <use transform="translate(381.711937 0)scale(0.996264)" xlink:href="#CMR17-30"/>
      <use transform="translate(427.402414 0)scale(0.996264)" xlink:href="#CMR17-30"/>
     </g>
    </g>
   </g>
  </g>
  <g id="axes_2">
   <g id="patch_8">
    <path d="M 357.875699 70.920362 
C 357.875699 64.430825 356.597402 58.004392 354.113964 52.008842 
C 351.630526 46.013293 347.990244 40.565225 343.401449 35.97643 
C 338.812654 31.387635 333.364586 27.747353 327.369037 25.263915 
C 321.373487 22.780477 314.947053 21.50218 308.457517 21.50218 
C 301.967981 21.50218 295.541547 22.780477 289.545998 25.263915 
C 283.550448 27.747353 278.102381 31.387635 273.513586 35.97643 
C 268.924791 40.565225 265.284508 46.013293 262.80107 52.008842 
C 260.317632 58.004392 259.039335 64.430825 259.039335 70.920362 
C 259.039335 77.409898 260.317632 83.836331 262.80107 89.831881 
C 265.284508 95.827431 268.924791 101.275498 273.513586 105.864293 
C 278.102381 110.453088 283.550448 114.09337 289.545998 116.576808 
C 295.541547 119.060246 301.967981 120.338543 308.457517 120.338543 
C 314.947053 120.338543 321.373487 119.060246 327.369037 116.576808 
C 333.364586 114.09337 338.812654 110.453088 343.401449 105.864293 
C 347.990244 101.275498 351.630526 95.827431 354.113964 89.831881 
C 356.597402 83.836331 357.875699 77.409898 357.875699 70.920362 
M 308.457517 70.920362 
C 308.457517 70.920362 308.457517 70.920362 308.457517 70.920362 
C 308.457517 70.920362 308.457517 70.920362 308.457517 70.920362 
C 308.457517 70.920362 308.457517 70.920362 308.457517 70.920362 
C 308.457517 70.920362 308.457517 70.920362 308.457517 70.920362 
C 308.457517 70.920362 308.457517 70.920362 308.457517 70.920362 
C 308.457517 70.920362 308.457517 70.920362 308.457517 70.920362 
C 308.457517 70.920362 308.457517 70.920362 308.457517 70.920362 
C 308.457517 70.920362 308.457517 70.920362 308.457517 70.920362 
C 308.457517 70.920362 308.457517 70.920362 308.457517 70.920362 
C 308.457517 70.920362 308.457517 70.920362 308.457517 70.920362 
C 308.457517 70.920362 308.457517 70.920362 308.457517 70.920362 
C 308.457517 70.920362 308.457517 70.920362 308.457517 70.920362 
C 308.457517 70.920362 308.457517 70.920362 308.457517 70.920362 
C 308.457517 70.920362 308.457517 70.920362 308.457517 70.920362 
C 308.457517 70.920362 308.457517 70.920362 308.457517 70.920362 
C 308.457517 70.920362 308.457517 70.920362 308.457517 70.920362 
M 357.875699 70.920362 
z
" style="fill:#ffffff;"/>
   </g>
   <g id="matplotlib.axis_3">
    <g id="xtick_5">
     <g id="line2d_16">
      <path clip-path="url(#pb1c1b3d1db)" d="M 308.457517 70.920362 
L 357.875699 70.920362 
" style="fill:none;stroke:#b0b0b0;stroke-linecap:square;stroke-width:0.8;"/>
     </g>
    </g>
    <g id="xtick_6">
     <g id="line2d_17">
      <path clip-path="url(#pb1c1b3d1db)" d="M 308.457517 70.920362 
L 343.401449 35.97643 
" style="fill:none;stroke:#b0b0b0;stroke-linecap:square;stroke-width:0.8;"/>
     </g>
    </g>
    <g id="xtick_7">
     <g id="line2d_18">
      <path clip-path="url(#pb1c1b3d1db)" d="M 308.457517 70.920362 
L 308.457517 21.50218 
" style="fill:none;stroke:#b0b0b0;stroke-linecap:square;stroke-width:0.8;"/>
     </g>
    </g>
    <g id="xtick_8">
     <g id="line2d_19">
      <path clip-path="url(#pb1c1b3d1db)" d="M 308.457517 70.920362 
L 273.513586 35.97643 
" style="fill:none;stroke:#b0b0b0;stroke-linecap:square;stroke-width:0.8;"/>
     </g>
    </g>
    <g id="xtick_9">
     <g id="line2d_20">
      <path clip-path="url(#pb1c1b3d1db)" d="M 308.457517 70.920362 
L 259.039335 70.920362 
" style="fill:none;stroke:#b0b0b0;stroke-linecap:square;stroke-width:0.8;"/>
     </g>
    </g>
    <g id="xtick_10">
     <g id="line2d_21">
      <path clip-path="url(#pb1c1b3d1db)" d="M 308.457517 70.920362 
L 273.513586 105.864293 
" style="fill:none;stroke:#b0b0b0;stroke-linecap:square;stroke-width:0.8;"/>
     </g>
    </g>
    <g id="xtick_11">
     <g id="line2d_22">
      <path clip-path="url(#pb1c1b3d1db)" d="M 308.457517 70.920362 
L 308.457517 120.338543 
" style="fill:none;stroke:#b0b0b0;stroke-linecap:square;stroke-width:0.8;"/>
     </g>
    </g>
    <g id="xtick_12">
     <g id="line2d_23">
      <path clip-path="url(#pb1c1b3d1db)" d="M 308.457517 70.920362 
L 343.401449 105.864293 
" style="fill:none;stroke:#b0b0b0;stroke-linecap:square;stroke-width:0.8;"/>
     </g>
    </g>
   </g>
   <g id="matplotlib.axis_4">
    <g id="ytick_5">
     <g id="line2d_24">
      <path clip-path="url(#pb1c1b3d1db)" d="M 330.905022 70.920362 
C 330.905022 67.972582 330.324374 65.053466 329.196307 62.330073 
C 328.068241 59.60668 326.414695 57.131974 324.3303 55.047579 
C 322.245905 52.963184 319.771198 51.309638 317.047805 50.181571 
C 314.324412 49.053505 311.405296 48.472857 308.457517 48.472857 
C 305.509738 48.472857 302.590622 49.053505 299.867229 50.181571 
C 297.143836 51.309638 294.669129 52.963184 292.584734 55.047579 
C 290.500339 57.131974 288.846793 59.60668 287.718727 62.330073 
C 286.590661 65.053466 286.010012 67.972582 286.010012 70.920362 
C 286.010012 73.868141 286.590661 76.787257 287.718727 79.51065 
C 288.846793 82.234043 290.500339 84.70875 292.584734 86.793144 
C 294.669129 88.877539 297.143836 90.531086 299.867229 91.659152 
C 302.590622 92.787218 305.509738 93.367866 308.457517 93.367866 
C 311.405296 93.367866 314.324412 92.787218 317.047805 91.659152 
C 319.771198 90.531086 322.245905 88.877539 324.3303 86.793144 
C 326.414695 84.70875 328.068241 82.234043 329.196307 79.51065 
C 330.324374 76.787257 330.905022 73.868141 330.905022 70.920362 
" style="fill:none;stroke:#b0b0b0;stroke-linecap:square;stroke-width:0.8;"/>
     </g>
     <g id="text_13">
      <!-- $\mathdefault{1}$ -->
      <g transform="translate(329.196307 60.392895)scale(0.1 -0.1)">
       <use transform="scale(0.996264)" xlink:href="#CMR17-31"/>
      </g>
     </g>
    </g>
    <g id="ytick_6">
     <g id="line2d_25">
      <path clip-path="url(#pb1c1b3d1db)" d="M 353.352527 70.920362 
C 353.352527 65.024803 352.19123 59.186571 349.935098 53.739785 
C 347.678965 48.292999 344.371872 43.343585 340.203083 39.174796 
C 336.034293 35.006006 331.084879 31.698914 325.638093 29.442781 
C 320.191308 27.186649 314.353076 26.025352 308.457517 26.025352 
C 302.561958 26.025352 296.723727 27.186649 291.276941 29.442781 
C 285.830155 31.698914 280.880741 35.006006 276.711951 39.174796 
C 272.543162 43.343585 269.236069 48.292999 266.979937 53.739785 
C 264.723804 59.186571 263.562507 65.024803 263.562507 70.920362 
C 263.562507 76.81592 264.723804 82.654152 266.979937 88.100938 
C 269.236069 93.547724 272.543162 98.497138 276.711951 102.665927 
C 280.880741 106.834717 285.830155 110.141809 291.276941 112.397942 
C 296.723727 114.654075 302.561958 115.815371 308.457517 115.815371 
C 314.353076 115.815371 320.191308 114.654075 325.638093 112.397942 
C 331.084879 110.141809 336.034293 106.834717 340.203083 102.665927 
C 344.371872 98.497138 347.678965 93.547724 349.935098 88.100938 
C 352.19123 82.654152 353.352527 76.81592 353.352527 70.920362 
" style="fill:none;stroke:#b0b0b0;stroke-linecap:square;stroke-width:0.8;"/>
     </g>
     <g id="text_14">
      <!-- $\mathdefault{2}$ -->
      <g transform="translate(349.935098 51.802607)scale(0.1 -0.1)">
       <use transform="scale(0.996264)" xlink:href="#CMR17-32"/>
      </g>
     </g>
    </g>
    <g id="text_15">
     <!-- $r[m]$ -->
     <g transform="translate(252.548675 80.447174)rotate(-90)scale(0.1 -0.1)">
      <defs>
       <path d="M 1504 -1600 
L 1504 -1377 
L 902 -1377 
L 902 4544 
L 1504 4544 
L 1504 4767 
L 678 4767 
L 678 -1600 
L 1504 -1600 
z
" id="CMR17-5b" transform="scale(0.015625)"/>
       <path d="M 915 4767 
L 90 4767 
L 90 4544 
L 691 4544 
L 691 -1377 
L 90 -1377 
L 90 -1600 
L 915 -1600 
L 915 4767 
z
" id="CMR17-5d" transform="scale(0.015625)"/>
      </defs>
      <use transform="scale(0.996264)" xlink:href="#CMMI12-72"/>
      <use transform="translate(46.670612 0)scale(0.996264)" xlink:href="#CMR17-5b"/>
      <use transform="translate(71.541671 0)scale(0.996264)" xlink:href="#CMMI12-6d"/>
      <use transform="translate(156.868895 0)scale(0.996264)" xlink:href="#CMR17-5d"/>
     </g>
    </g>
    <g id="text_16">
     <!-- $\times\mathdefault{10^{8}}\mathdefault{}$ -->
     <g transform="translate(259.039335 18.50218)scale(0.1 -0.1)">
      <defs>
       <path d="M 2490 1785 
L 1210 3059 
C 1133 3136 1120 3148 1069 3148 
C 1005 3148 941 3091 941 3020 
C 941 2976 954 2963 1024 2892 
L 2304 1606 
L 1024 320 
C 954 249 941 236 941 192 
C 941 121 1005 64 1069 64 
C 1120 64 1133 76 1210 153 
L 2483 1427 
L 3808 102 
C 3821 96 3866 64 3904 64 
C 3981 64 4032 121 4032 192 
C 4032 204 4032 230 4013 262 
C 4006 275 2989 1280 2669 1606 
L 3840 2777 
C 3872 2816 3968 2899 4000 2937 
C 4006 2950 4032 2976 4032 3020 
C 4032 3091 3981 3148 3904 3148 
C 3853 3148 3827 3123 3757 3052 
L 2490 1785 
z
" id="CMSY10-2" transform="scale(0.015625)"/>
      </defs>
      <use transform="scale(0.996264)" xlink:href="#CMSY10-2"/>
      <use transform="translate(77.487468 0)scale(0.996264)" xlink:href="#CMR17-31"/>
      <use transform="translate(123.177945 0)scale(0.996264)" xlink:href="#CMR17-30"/>
      <use transform="translate(168.868422 36.153639)scale(0.697382)" xlink:href="#CMR17-38"/>
     </g>
    </g>
   </g>
   <g id="line2d_26">
    <path clip-path="url(#pb1c1b3d1db)" d="M 310.028842 70.920362 
L 310.025679 70.820702 
L 310.016201 70.721444 
L 310.000447 70.622986 
L 309.978479 70.525726 
L 309.950388 70.430056 
L 309.916285 70.336359 
L 309.876308 70.245014 
L 309.830619 70.156388 
L 309.7794 70.070839 
L 309.722859 69.98871 
L 309.661222 69.910333 
L 309.594739 69.836023 
L 309.523676 69.766079 
L 309.44832 69.700783 
L 309.368975 69.640398 
L 309.28596 69.585167 
L 309.199609 69.535312 
L 309.110269 69.491034 
L 309.018301 69.452511 
L 308.924076 69.4199 
L 308.827971 69.393329 
L 308.730375 69.372908 
L 308.63168 69.358718 
L 308.532284 69.350816 
L 308.432587 69.349234 
L 308.33299 69.353978 
L 308.233894 69.36503 
L 308.135699 69.382345 
L 308.0388 69.405852 
L 307.943587 69.435458 
L 307.850443 69.471043 
L 307.759744 69.512464 
L 307.671854 69.559554 
L 307.587128 69.612124 
L 307.505907 69.669961 
L 307.428518 69.732833 
L 307.355272 69.800487 
L 307.286464 69.872651 
L 307.222372 69.949033 
L 307.163253 70.029326 
L 307.109346 70.113207 
L 307.060867 70.200339 
L 307.018013 70.290369 
L 306.980954 70.382937 
L 306.949841 70.477668 
L 306.9248 70.574182 
L 306.905929 70.67209 
L 306.893307 70.770998 
L 306.886983 70.870507 
L 306.886983 70.970217 
L 306.893307 71.069726 
L 306.905929 71.168633 
L 306.9248 71.266541 
L 306.949841 71.363055 
L 306.980954 71.457787 
L 307.018013 71.550354 
L 307.060867 71.640385 
L 307.109346 71.727516 
L 307.163253 71.811397 
L 307.222372 71.891691 
L 307.286464 71.968073 
L 307.355272 72.040236 
L 307.428518 72.10789 
L 307.505907 72.170762 
L 307.587128 72.2286 
L 307.671854 72.281169 
L 307.759744 72.328259 
L 307.850443 72.36968 
L 307.943587 72.405265 
L 308.0388 72.434871 
L 308.135699 72.458379 
L 308.233894 72.475693 
L 308.33299 72.486745 
L 308.432587 72.491489 
L 308.532284 72.489907 
L 308.63168 72.482005 
L 308.730375 72.467815 
L 308.827971 72.447394 
L 308.924076 72.420824 
L 309.018301 72.388212 
L 309.110269 72.349689 
L 309.199609 72.305412 
L 309.28596 72.255557 
L 309.368975 72.200325 
L 309.44832 72.13994 
L 309.523676 72.074644 
L 309.594739 72.0047 
L 309.661222 71.93039 
L 309.722859 71.852013 
L 309.7794 71.769884 
L 309.830619 71.684335 
L 309.876308 71.595709 
L 309.916285 71.504364 
L 309.950388 71.410668 
L 309.978479 71.314997 
L 310.000447 71.217737 
L 310.016201 71.11928 
L 310.025679 71.020021 
L 310.028842 70.920362 
" style="fill:none;stroke:#000000;stroke-linecap:square;stroke-width:1.5;"/>
   </g>
   <g id="line2d_27">
    <path clip-path="url(#pb1c1b3d1db)" d="M 310.028842 70.920362 
L 310.028434 70.870495 
L 310.027206 70.820605 
L 310.025158 70.77067 
L 310.022285 70.720667 
L 310.018582 70.670574 
L 310.014042 70.620366 
L 310.008655 70.570022 
L 310.002412 70.519517 
L 309.9953 70.468828 
L 309.987305 70.417931 
L 309.978412 70.366801 
L 309.968602 70.315414 
L 309.957857 70.263745 
L 309.946154 70.211768 
L 309.933469 70.159456 
L 309.919777 70.106782 
L 309.905049 70.05372 
L 309.889254 70.00024 
L 309.872358 69.946315 
L 309.854325 69.891913 
L 309.835117 69.837005 
L 309.814689 69.781559 
L 309.792997 69.725542 
L 309.769992 69.66892 
L 309.745619 69.611658 
L 309.719822 69.553721 
L 309.692539 69.49507 
L 309.663705 69.435667 
L 309.633247 69.375471 
L 309.601089 69.31444 
L 309.567148 69.25253 
L 309.531336 69.189696 
L 309.493556 69.12589 
L 309.453705 69.061062 
L 309.411673 68.99516 
L 309.367339 68.92813 
L 309.320573 68.859915 
L 309.271237 68.790455 
L 309.219178 68.719688 
L 309.164233 68.647548 
L 309.106226 68.573967 
L 309.044964 68.498872 
L 308.98024 68.422188 
L 308.911828 68.343835 
L 308.839483 68.263729 
L 308.762938 68.181782 
L 308.681903 68.097901 
L 308.59606 68.011989 
L 308.505064 67.923943 
L 308.408537 67.833656 
L 308.306066 67.741012 
L 308.197197 67.645893 
L 308.081432 67.548172 
L 307.958226 67.447718 
L 307.826977 67.344392 
L 307.687022 67.238048 
L 307.537629 67.128533 
L 307.37799 67.015688 
L 307.20721 66.899348 
L 307.024295 66.779339 
L 306.828143 66.655483 
L 306.617527 66.527598 
L 306.391079 66.395493 
L 306.147274 66.258981 
L 305.884405 66.117869 
L 305.600562 65.97197 
L 305.293602 65.821103 
L 304.961119 65.665098 
L 304.600405 65.503805 
L 304.208411 65.337102 
L 303.781701 65.164905 
L 303.316393 64.987188 
L 302.808108 64.804 
L 302.251896 64.615489 
L 301.64217 64.421941 
L 300.972623 64.223819 
L 300.236154 64.021819 
L 299.424783 63.816941 
L 298.529587 63.610582 
L 297.540647 63.404646 
L 296.447037 63.201695 
L 295.236872 63.00512 
L 293.897471 62.81937 
L 292.415665 62.650212 
L 290.778353 62.505043 
L 288.973399 62.393229 
L 286.990997 62.326464 
L 284.825668 62.319072 
L 282.479016 62.388199 
L 279.963351 62.55372 
L 277.306084 62.837681 
L 274.55454 63.263037 
L 271.780306 63.851409 
L 269.081652 64.619778 
L 266.582002 65.576243 
L 264.422427 66.71552 
L 262.747098 68.015379 
L 261.682951 69.435554 
L 261.317757 70.920362 
" style="fill:none;stroke:#1f77b4;stroke-linecap:square;stroke-width:1.5;"/>
   </g>
   <g id="line2d_28">
    <path clip-path="url(#pb1c1b3d1db)" d="M 261.317757 70.920362 
L 261.353347 72.415632 
L 261.459975 73.907143 
L 261.637212 75.391159 
L 261.88435 76.863991 
L 262.200405 78.322023 
L 262.58413 79.761732 
L 263.034023 81.17971 
L 263.548346 82.572682 
L 264.125135 83.937524 
L 264.762221 85.271281 
L 265.457249 86.571179 
L 266.207696 87.834638 
L 267.010895 89.05928 
L 267.864051 90.242936 
L 268.764268 91.383654 
L 269.708569 92.479697 
L 270.693914 93.529551 
L 271.717223 94.531915 
L 272.775397 95.485705 
L 273.865334 96.390047 
L 274.983946 97.244269 
L 276.12818 98.047897 
L 277.295027 98.800643 
L 278.481539 99.502399 
L 279.684842 100.153222 
L 280.902143 100.753329 
L 282.130741 101.303081 
L 283.368036 101.802971 
L 284.611534 102.253618 
L 285.85885 102.655748 
L 287.107717 103.01019 
L 288.355982 103.317859 
L 289.601613 103.579745 
L 290.842697 103.796909 
L 292.07744 103.970465 
L 293.304164 104.101576 
L 294.521311 104.191442 
L 295.727433 104.241293 
L 296.921193 104.252381 
L 298.101362 104.225975 
L 299.266816 104.163349 
L 300.416525 104.065781 
L 301.54956 103.934545 
L 302.665079 103.770908 
L 303.762327 103.576125 
L 304.84063 103.351433 
L 305.899391 103.098052 
L 306.938085 102.817177 
L 307.956254 102.509979 
L 308.953506 102.177604 
L 309.929504 101.821166 
L 310.883968 101.441752 
L 311.816667 101.040415 
L 312.727419 100.618178 
L 313.616081 100.176031 
L 314.482553 99.71493 
L 315.326768 99.235799 
L 316.148693 98.739527 
L 316.948323 98.226974 
L 317.725681 97.698962 
L 318.480812 97.156286 
L 319.213784 96.599705 
L 319.924682 96.029951 
L 320.613608 95.447722 
L 321.280678 94.853689 
L 321.92602 94.248493 
L 322.549773 93.632747 
L 323.152084 93.007039 
L 323.733109 92.371928 
L 324.293006 91.727951 
L 324.831939 91.075617 
L 325.350078 90.415416 
L 325.847589 89.747812 
L 326.324642 89.073251 
L 326.781408 88.392157 
L 327.218055 87.704934 
L 327.634748 87.011969 
L 328.031651 86.31363 
L 328.408924 85.610271 
L 328.766722 84.902227 
L 329.105199 84.189821 
L 329.424498 83.47336 
L 329.724761 82.753138 
L 330.006122 82.02944 
L 330.268709 81.302535 
L 330.512643 80.572683 
L 330.738038 79.840137 
L 330.945 79.105136 
L 331.133628 78.367915 
L 331.304012 77.628698 
L 331.456237 76.887705 
L 331.590375 76.145148 
L 331.706494 75.401235 
L 331.80465 74.656167 
L 331.884892 73.910144 
L 331.947262 73.16336 
L 331.991789 72.416009 
L 332.018496 71.668279 
L 332.027397 70.920362 
" style="fill:none;stroke:#ff7f0e;stroke-linecap:square;stroke-width:1.5;"/>
   </g>
   <g id="line2d_29">
    <path clip-path="url(#pb1c1b3d1db)" d="M 332.027397 70.920362 
L 331.979943 69.425467 
L 331.837773 67.936593 
L 331.601459 66.459733 
L 331.271952 65.000834 
L 330.850579 63.565771 
L 330.339038 62.160322 
L 329.739387 60.790147 
L 329.054042 59.460763 
L 328.285762 58.177522 
L 327.43764 56.945593 
L 326.513093 55.769935 
L 325.515842 54.655282 
L 324.449903 53.606123 
L 323.319568 52.626683 
L 322.129389 51.720904 
L 320.884158 50.892435 
L 319.58889 50.144612 
L 318.248799 49.480445 
L 316.869283 48.902609 
L 315.455895 48.41343 
L 314.014327 48.01488 
L 312.550384 47.708561 
L 311.06996 47.495708 
L 309.579017 47.377178 
L 308.083558 47.353448 
L 306.589605 47.424614 
L 305.103173 47.590389 
L 303.630249 47.850105 
L 302.176761 48.202718 
L 300.748564 48.646806 
L 299.351409 49.180582 
L 297.99092 49.801896 
L 296.672577 50.508247 
L 295.401688 51.29679 
L 294.183369 52.164351 
L 293.022528 53.107435 
L 291.923838 54.122246 
L 290.891723 55.204696 
L 289.93034 56.350428 
L 289.043559 57.554829 
L 288.234951 58.813047 
L 287.507772 60.120017 
L 286.864951 61.470477 
L 286.309075 62.858988 
L 285.842383 64.279959 
L 285.466754 65.727669 
L 285.183701 67.196288 
L 284.994363 68.679902 
L 284.899503 70.172538 
L 284.899503 71.668185 
L 284.994363 73.160821 
L 285.183701 74.644436 
L 285.466754 76.113054 
L 285.842383 77.560764 
L 286.309075 78.981735 
L 286.864951 80.370246 
L 287.507772 81.720706 
L 288.234951 83.027676 
L 289.043559 84.285895 
L 289.93034 85.490295 
L 290.891723 86.636027 
L 291.923838 87.718478 
L 293.022528 88.733288 
L 294.183369 89.676373 
L 295.401688 90.543933 
L 296.672577 91.332477 
L 297.99092 92.038827 
L 299.351409 92.660142 
L 300.748564 93.193918 
L 302.176761 93.638006 
L 303.630249 93.990618 
L 305.103173 94.250334 
L 306.589605 94.416109 
L 308.083558 94.487275 
L 309.579017 94.463545 
L 311.06996 94.345015 
L 312.550384 94.132162 
L 314.014327 93.825844 
L 315.455895 93.427293 
L 316.869283 92.938115 
L 318.248799 92.360279 
L 319.58889 91.696112 
L 320.884158 90.948288 
L 322.129389 90.119819 
L 323.319568 89.214041 
L 324.449903 88.2346 
L 325.515842 87.185441 
L 326.513093 86.070788 
L 327.43764 84.89513 
L 328.285762 83.663201 
L 329.054042 82.37996 
L 329.739387 81.050576 
L 330.339038 79.680401 
L 330.850579 78.274953 
L 331.271952 76.83989 
L 331.601459 75.380991 
L 331.837773 73.904131 
L 331.979943 72.415256 
L 332.027397 70.920362 
" style="fill:none;stroke:#000000;stroke-dasharray:5.55,2.4;stroke-dashoffset:0;stroke-width:1.5;"/>
   </g>
   <g id="patch_9">
    <path d="M 357.875699 70.920362 
C 357.875699 64.430825 356.597402 58.004392 354.113964 52.008842 
C 351.630526 46.013293 347.990244 40.565225 343.401449 35.97643 
C 338.812654 31.387635 333.364586 27.747353 327.369037 25.263915 
C 321.373487 22.780477 314.947053 21.50218 308.457517 21.50218 
C 301.967981 21.50218 295.541547 22.780477 289.545998 25.263915 
C 283.550448 27.747353 278.102381 31.387635 273.513586 35.97643 
C 268.924791 40.565225 265.284508 46.013293 262.80107 52.008842 
C 260.317632 58.004392 259.039335 64.430825 259.039335 70.920362 
C 259.039335 77.409898 260.317632 83.836331 262.80107 89.831881 
C 265.284508 95.827431 268.924791 101.275498 273.513586 105.864293 
C 278.102381 110.453088 283.550448 114.09337 289.545998 116.576808 
C 295.541547 119.060246 301.967981 120.338543 308.457517 120.338543 
C 314.947053 120.338543 321.373487 119.060246 327.369037 116.576808 
C 333.364586 114.09337 338.812654 110.453088 343.401449 105.864293 
C 347.990244 101.275498 351.630526 95.827431 354.113964 89.831881 
C 356.597402 83.836331 357.875699 77.409898 357.875699 70.920362 
" style="fill:none;stroke:#000000;stroke-linecap:square;stroke-linejoin:miter;stroke-width:0.8;"/>
   </g>
   <g id="text_17">
    <!-- $r_{m1}=$30.0 -->
    <g transform="translate(283.090386 15.50218)scale(0.12 -0.12)">
     <defs>
      <path d="M 1005 2025 
L 1440 2025 
C 2042 2025 2214 1507 2214 1146 
C 2214 653 1933 267 1472 267 
C 1114 267 608 444 320 912 
C 275 691 275 678 250 526 
C 550 88 1037 -128 1485 -128 
C 2214 -128 2752 473 2752 1138 
C 2752 1638 2400 2057 1920 2215 
C 2304 2424 2586 2816 2586 3273 
C 2586 3805 2093 4229 1491 4229 
C 941 4229 512 3892 333 3530 
C 378 3468 493 3284 550 3189 
C 691 3562 1056 3840 1485 3840 
C 1843 3840 2080 3607 2080 3271 
C 2080 2923 1856 2543 1478 2455 
C 1453 2455 1056 2417 1005 2411 
L 1005 2025 
z
" id="CMSS17-33" transform="scale(0.015625)"/>
      <path d="M 2758 2044 
C 2758 2405 2752 3077 2490 3596 
C 2227 4096 1805 4229 1504 4229 
C 1069 4229 698 3975 506 3570 
C 301 3146 243 2709 243 2044 
C 243 1589 262 1031 493 543 
C 755 5 1197 -128 1498 -128 
C 1894 -128 2278 81 2496 518 
C 2720 974 2758 1474 2758 2044 
z
M 1498 261 
C 1011 261 864 811 819 995 
C 742 1310 730 1614 730 2114 
C 730 2506 730 2948 851 3297 
C 998 3701 1254 3840 1498 3840 
C 1971 3840 2125 3372 2176 3208 
C 2272 2873 2272 2481 2272 2114 
C 2272 1526 2272 261 1498 261 
z
" id="CMSS17-30" transform="scale(0.015625)"/>
      <path d="M 1088 510 
L 576 510 
L 576 0 
L 1088 0 
L 1088 510 
z
" id="CMSS17-2e" transform="scale(0.015625)"/>
     </defs>
     <use transform="scale(0.996264)" xlink:href="#CMMI12-72"/>
     <use transform="translate(43.960894 -14.943915)scale(0.697382)" xlink:href="#CMMI12-6d"/>
     <use transform="translate(103.689685 -14.943915)scale(0.697382)" xlink:href="#CMR17-31"/>
     <use transform="translate(163.845008 0)scale(0.996264)" xlink:href="#CMR17-3d"/>
     <use transform="translate(235.559797 0)scale(0.996264)" xlink:href="#CMSS17-33"/>
     <use transform="translate(282.40342 0)scale(0.996264)" xlink:href="#CMSS17-30"/>
     <use transform="translate(329.247044 0)scale(0.996264)" xlink:href="#CMSS17-2e"/>
     <use transform="translate(355.271248 0)scale(0.996264)" xlink:href="#CMSS17-30"/>
    </g>
   </g>
   <g id="legend_2">
    <g id="patch_10">
     <path d="M 313.894364 115.338543 
L 350.875699 115.338543 
Q 352.875699 115.338543 352.875699 113.338543 
L 352.875699 58.58983 
Q 352.875699 56.58983 350.875699 56.58983 
L 313.894364 56.58983 
Q 311.894364 56.58983 311.894364 58.58983 
L 311.894364 113.338543 
Q 311.894364 115.338543 313.894364 115.338543 
z
" style="fill:#ffffff;opacity:0.8;stroke:#cccccc;stroke-linejoin:miter;"/>
    </g>
    <g id="line2d_30">
     <path d="M 315.894364 64.08983 
L 335.894364 64.08983 
" style="fill:none;stroke:#000000;stroke-linecap:square;stroke-width:1.5;"/>
    </g>
    <g id="line2d_31"/>
    <g id="text_18">
     <!-- 0 -->
     <g transform="translate(343.894364 67.58983)scale(0.1 -0.1)">
      <use transform="scale(0.996264)" xlink:href="#CMSS17-30"/>
     </g>
    </g>
    <g id="line2d_32">
     <path d="M 315.894364 78.027008 
L 335.894364 78.027008 
" style="fill:none;stroke:#1f77b4;stroke-linecap:square;stroke-width:1.5;"/>
    </g>
    <g id="line2d_33"/>
    <g id="text_19">
     <!-- 1 -->
     <g transform="translate(343.894364 81.527008)scale(0.1 -0.1)">
      <defs>
       <path d="M 1818 4288 
L 1696 4288 
C 1350 3940 947 3890 538 3890 
L 538 3520 
C 723 3520 1024 3520 1325 3667 
L 1325 369 
L 570 369 
L 570 0 
L 2573 0 
L 2573 369 
L 1818 369 
L 1818 4288 
z
" id="CMSS17-31" transform="scale(0.015625)"/>
      </defs>
      <use transform="scale(0.996264)" xlink:href="#CMSS17-31"/>
     </g>
    </g>
    <g id="line2d_34">
     <path d="M 315.894364 91.964187 
L 335.894364 91.964187 
" style="fill:none;stroke:#ff7f0e;stroke-linecap:square;stroke-width:1.5;"/>
    </g>
    <g id="line2d_35"/>
    <g id="text_20">
     <!-- 2 -->
     <g transform="translate(343.894364 95.464187)scale(0.1 -0.1)">
      <defs>
       <path d="M 1651 1357 
C 1830 1541 2099 1764 2285 1987 
C 2464 2204 2701 2511 2701 2957 
C 2701 3657 2227 4288 1421 4288 
C 787 4288 422 3893 250 3274 
L 499 2929 
C 640 3510 838 3880 1338 3880 
C 1888 3880 2195 3433 2195 2942 
C 2195 2355 1747 1901 1408 1563 
C 1030 1187 659 804 301 408 
L 301 0 
L 2701 0 
L 2701 433 
L 1613 433 
C 1536 433 1459 433 1382 433 
L 742 433 
L 742 439 
L 1651 1357 
z
" id="CMSS17-32" transform="scale(0.015625)"/>
      </defs>
      <use transform="scale(0.996264)" xlink:href="#CMSS17-32"/>
     </g>
    </g>
    <g id="line2d_36">
     <path d="M 315.894364 105.901365 
L 335.894364 105.901365 
" style="fill:none;stroke:#000000;stroke-dasharray:5.55,2.4;stroke-dashoffset:0;stroke-width:1.5;"/>
    </g>
    <g id="line2d_37"/>
    <g id="text_21">
     <!-- 3 -->
     <g transform="translate(343.894364 109.401365)scale(0.1 -0.1)">
      <use transform="scale(0.996264)" xlink:href="#CMSS17-33"/>
     </g>
    </g>
   </g>
  </g>
  <g id="axes_3">
   <g id="patch_11">
    <path d="M 357.875699 189.523998 
C 357.875699 183.034462 356.597402 176.608028 354.113964 170.612479 
C 351.630526 164.616929 347.990244 159.168862 343.401449 154.580067 
C 338.812654 149.991271 333.364586 146.350989 327.369037 143.867551 
C 321.373487 141.384113 314.947053 140.105816 308.457517 140.105816 
C 301.967981 140.105816 295.541547 141.384113 289.545998 143.867551 
C 283.550448 146.350989 278.102381 149.991271 273.513586 154.580067 
C 268.924791 159.168862 265.284508 164.616929 262.80107 170.612479 
C 260.317632 176.608028 259.039335 183.034462 259.039335 189.523998 
C 259.039335 196.013534 260.317632 202.439968 262.80107 208.435517 
C 265.284508 214.431067 268.924791 219.879134 273.513586 224.467929 
C 278.102381 229.056725 283.550448 232.697007 289.545998 235.180445 
C 295.541547 237.663883 301.967981 238.94218 308.457517 238.94218 
C 314.947053 238.94218 321.373487 237.663883 327.369037 235.180445 
C 333.364586 232.697007 338.812654 229.056725 343.401449 224.467929 
C 347.990244 219.879134 351.630526 214.431067 354.113964 208.435517 
C 356.597402 202.439968 357.875699 196.013534 357.875699 189.523998 
M 308.457517 189.523998 
C 308.457517 189.523998 308.457517 189.523998 308.457517 189.523998 
C 308.457517 189.523998 308.457517 189.523998 308.457517 189.523998 
C 308.457517 189.523998 308.457517 189.523998 308.457517 189.523998 
C 308.457517 189.523998 308.457517 189.523998 308.457517 189.523998 
C 308.457517 189.523998 308.457517 189.523998 308.457517 189.523998 
C 308.457517 189.523998 308.457517 189.523998 308.457517 189.523998 
C 308.457517 189.523998 308.457517 189.523998 308.457517 189.523998 
C 308.457517 189.523998 308.457517 189.523998 308.457517 189.523998 
C 308.457517 189.523998 308.457517 189.523998 308.457517 189.523998 
C 308.457517 189.523998 308.457517 189.523998 308.457517 189.523998 
C 308.457517 189.523998 308.457517 189.523998 308.457517 189.523998 
C 308.457517 189.523998 308.457517 189.523998 308.457517 189.523998 
C 308.457517 189.523998 308.457517 189.523998 308.457517 189.523998 
C 308.457517 189.523998 308.457517 189.523998 308.457517 189.523998 
C 308.457517 189.523998 308.457517 189.523998 308.457517 189.523998 
C 308.457517 189.523998 308.457517 189.523998 308.457517 189.523998 
M 357.875699 189.523998 
z
" style="fill:#ffffff;"/>
   </g>
   <g id="matplotlib.axis_5">
    <g id="xtick_13">
     <g id="line2d_38">
      <path clip-path="url(#p0ac319a7ed)" d="M 308.457517 189.523998 
L 357.875699 189.523998 
" style="fill:none;stroke:#b0b0b0;stroke-linecap:square;stroke-width:0.8;"/>
     </g>
    </g>
    <g id="xtick_14">
     <g id="line2d_39">
      <path clip-path="url(#p0ac319a7ed)" d="M 308.457517 189.523998 
L 343.401449 154.580067 
" style="fill:none;stroke:#b0b0b0;stroke-linecap:square;stroke-width:0.8;"/>
     </g>
    </g>
    <g id="xtick_15">
     <g id="line2d_40">
      <path clip-path="url(#p0ac319a7ed)" d="M 308.457517 189.523998 
L 308.457517 140.105816 
" style="fill:none;stroke:#b0b0b0;stroke-linecap:square;stroke-width:0.8;"/>
     </g>
    </g>
    <g id="xtick_16">
     <g id="line2d_41">
      <path clip-path="url(#p0ac319a7ed)" d="M 308.457517 189.523998 
L 273.513586 154.580067 
" style="fill:none;stroke:#b0b0b0;stroke-linecap:square;stroke-width:0.8;"/>
     </g>
    </g>
    <g id="xtick_17">
     <g id="line2d_42">
      <path clip-path="url(#p0ac319a7ed)" d="M 308.457517 189.523998 
L 259.039335 189.523998 
" style="fill:none;stroke:#b0b0b0;stroke-linecap:square;stroke-width:0.8;"/>
     </g>
    </g>
    <g id="xtick_18">
     <g id="line2d_43">
      <path clip-path="url(#p0ac319a7ed)" d="M 308.457517 189.523998 
L 273.513586 224.467929 
" style="fill:none;stroke:#b0b0b0;stroke-linecap:square;stroke-width:0.8;"/>
     </g>
    </g>
    <g id="xtick_19">
     <g id="line2d_44">
      <path clip-path="url(#p0ac319a7ed)" d="M 308.457517 189.523998 
L 308.457517 238.94218 
" style="fill:none;stroke:#b0b0b0;stroke-linecap:square;stroke-width:0.8;"/>
     </g>
    </g>
    <g id="xtick_20">
     <g id="line2d_45">
      <path clip-path="url(#p0ac319a7ed)" d="M 308.457517 189.523998 
L 343.401449 224.467929 
" style="fill:none;stroke:#b0b0b0;stroke-linecap:square;stroke-width:0.8;"/>
     </g>
    </g>
   </g>
   <g id="matplotlib.axis_6">
    <g id="ytick_7">
     <g id="line2d_46">
      <path clip-path="url(#p0ac319a7ed)" d="M 330.905022 189.523998 
C 330.905022 186.576219 330.324374 183.657103 329.196307 180.93371 
C 328.068241 178.210317 326.414695 175.73561 324.3303 173.651215 
C 322.245905 171.56682 319.771198 169.913274 317.047805 168.785208 
C 314.324412 167.657141 311.405296 167.076493 308.457517 167.076493 
C 305.509738 167.076493 302.590622 167.657141 299.867229 168.785208 
C 297.143836 169.913274 294.669129 171.56682 292.584734 173.651215 
C 290.500339 175.73561 288.846793 178.210317 287.718727 180.93371 
C 286.590661 183.657103 286.010012 186.576219 286.010012 189.523998 
C 286.010012 192.471777 286.590661 195.390893 287.718727 198.114286 
C 288.846793 200.837679 290.500339 203.312386 292.584734 205.396781 
C 294.669129 207.481176 297.143836 209.134722 299.867229 210.262788 
C 302.590622 211.390855 305.509738 211.971503 308.457517 211.971503 
C 311.405296 211.971503 314.324412 211.390855 317.047805 210.262788 
C 319.771198 209.134722 322.245905 207.481176 324.3303 205.396781 
C 326.414695 203.312386 328.068241 200.837679 329.196307 198.114286 
C 330.324374 195.390893 330.905022 192.471777 330.905022 189.523998 
" style="fill:none;stroke:#b0b0b0;stroke-linecap:square;stroke-width:0.8;"/>
     </g>
     <g id="text_22">
      <!-- $\mathdefault{1}$ -->
      <g transform="translate(329.196307 178.996531)scale(0.1 -0.1)">
       <use transform="scale(0.996264)" xlink:href="#CMR17-31"/>
      </g>
     </g>
    </g>
    <g id="ytick_8">
     <g id="line2d_47">
      <path clip-path="url(#p0ac319a7ed)" d="M 353.352527 189.523998 
C 353.352527 183.628439 352.19123 177.790208 349.935098 172.343422 
C 347.678965 166.896636 344.371872 161.947222 340.203083 157.778432 
C 336.034293 153.609643 331.084879 150.30255 325.638093 148.046418 
C 320.191308 145.790285 314.353076 144.628988 308.457517 144.628988 
C 302.561958 144.628988 296.723727 145.790285 291.276941 148.046418 
C 285.830155 150.30255 280.880741 153.609643 276.711951 157.778432 
C 272.543162 161.947222 269.236069 166.896636 266.979937 172.343422 
C 264.723804 177.790208 263.562507 183.628439 263.562507 189.523998 
C 263.562507 195.419557 264.723804 201.257788 266.979937 206.704574 
C 269.236069 212.15136 272.543162 217.100774 276.711951 221.269564 
C 280.880741 225.438353 285.830155 228.745446 291.276941 231.001578 
C 296.723727 233.257711 302.561958 234.419008 308.457517 234.419008 
C 314.353076 234.419008 320.191308 233.257711 325.638093 231.001578 
C 331.084879 228.745446 336.034293 225.438353 340.203083 221.269564 
C 344.371872 217.100774 347.678965 212.15136 349.935098 206.704574 
C 352.19123 201.257788 353.352527 195.419557 353.352527 189.523998 
" style="fill:none;stroke:#b0b0b0;stroke-linecap:square;stroke-width:0.8;"/>
     </g>
     <g id="text_23">
      <!-- $\mathdefault{2}$ -->
      <g transform="translate(349.935098 170.406243)scale(0.1 -0.1)">
       <use transform="scale(0.996264)" xlink:href="#CMR17-32"/>
      </g>
     </g>
    </g>
    <g id="text_24">
     <!-- $r[m]$ -->
     <g transform="translate(252.548675 199.050811)rotate(-90)scale(0.1 -0.1)">
      <use transform="scale(0.996264)" xlink:href="#CMMI12-72"/>
      <use transform="translate(46.670612 0)scale(0.996264)" xlink:href="#CMR17-5b"/>
      <use transform="translate(71.541671 0)scale(0.996264)" xlink:href="#CMMI12-6d"/>
      <use transform="translate(156.868895 0)scale(0.996264)" xlink:href="#CMR17-5d"/>
     </g>
    </g>
    <g id="text_25">
     <!-- $\times\mathdefault{10^{8}}\mathdefault{}$ -->
     <g transform="translate(259.039335 137.105816)scale(0.1 -0.1)">
      <use transform="scale(0.996264)" xlink:href="#CMSY10-2"/>
      <use transform="translate(77.487468 0)scale(0.996264)" xlink:href="#CMR17-31"/>
      <use transform="translate(123.177945 0)scale(0.996264)" xlink:href="#CMR17-30"/>
      <use transform="translate(168.868422 36.153639)scale(0.697382)" xlink:href="#CMR17-38"/>
     </g>
    </g>
   </g>
   <g id="line2d_48">
    <path clip-path="url(#p0ac319a7ed)" d="M 310.028842 189.523998 
L 310.025679 189.424338 
L 310.016201 189.32508 
L 310.000447 189.226623 
L 309.978479 189.129363 
L 309.950388 189.033692 
L 309.916285 188.939995 
L 309.876308 188.84865 
L 309.830619 188.760025 
L 309.7794 188.674475 
L 309.722859 188.592347 
L 309.661222 188.51397 
L 309.594739 188.439659 
L 309.523676 188.369715 
L 309.44832 188.304419 
L 309.368975 188.244034 
L 309.28596 188.188803 
L 309.199609 188.138948 
L 309.110269 188.09467 
L 309.018301 188.056148 
L 308.924076 188.023536 
L 308.827971 187.996966 
L 308.730375 187.976545 
L 308.63168 187.962354 
L 308.532284 187.954452 
L 308.432587 187.95287 
L 308.33299 187.957615 
L 308.233894 187.968666 
L 308.135699 187.985981 
L 308.0388 188.009488 
L 307.943587 188.039094 
L 307.850443 188.074679 
L 307.759744 188.1161 
L 307.671854 188.16319 
L 307.587128 188.21576 
L 307.505907 188.273597 
L 307.428518 188.33647 
L 307.355272 188.404124 
L 307.286464 188.476287 
L 307.222372 188.552669 
L 307.163253 188.632962 
L 307.109346 188.716844 
L 307.060867 188.803975 
L 307.018013 188.894006 
L 306.980954 188.986573 
L 306.949841 189.081304 
L 306.9248 189.177818 
L 306.905929 189.275726 
L 306.893307 189.374634 
L 306.886983 189.474143 
L 306.886983 189.573853 
L 306.893307 189.673362 
L 306.905929 189.77227 
L 306.9248 189.870178 
L 306.949841 189.966692 
L 306.980954 190.061423 
L 307.018013 190.15399 
L 307.060867 190.244021 
L 307.109346 190.331152 
L 307.163253 190.415034 
L 307.222372 190.495327 
L 307.286464 190.571709 
L 307.355272 190.643872 
L 307.428518 190.711526 
L 307.505907 190.774399 
L 307.587128 190.832236 
L 307.671854 190.884806 
L 307.759744 190.931896 
L 307.850443 190.973317 
L 307.943587 191.008902 
L 308.0388 191.038508 
L 308.135699 191.062015 
L 308.233894 191.07933 
L 308.33299 191.090381 
L 308.432587 191.095126 
L 308.532284 191.093544 
L 308.63168 191.085642 
L 308.730375 191.071451 
L 308.827971 191.05103 
L 308.924076 191.02446 
L 309.018301 190.991848 
L 309.110269 190.953326 
L 309.199609 190.909048 
L 309.28596 190.859193 
L 309.368975 190.803962 
L 309.44832 190.743577 
L 309.523676 190.678281 
L 309.594739 190.608337 
L 309.661222 190.534026 
L 309.722859 190.455649 
L 309.7794 190.373521 
L 309.830619 190.287971 
L 309.876308 190.199346 
L 309.916285 190.108001 
L 309.950388 190.014304 
L 309.978479 189.918633 
L 310.000447 189.821373 
L 310.016201 189.722916 
L 310.025679 189.623658 
L 310.028842 189.523998 
" style="fill:none;stroke:#000000;stroke-linecap:square;stroke-width:1.5;"/>
   </g>
   <g id="line2d_49">
    <path clip-path="url(#p0ac319a7ed)" d="M 310.028842 189.523998 
L 310.02842 189.474131 
L 310.027154 189.424245 
L 310.02504 189.374318 
L 310.022075 189.32433 
L 310.018254 189.274262 
L 310.013569 189.224094 
L 310.008013 189.173803 
L 310.001574 189.123371 
L 309.994242 189.072775 
L 309.986002 189.021995 
L 309.976839 188.97101 
L 309.966736 188.919798 
L 309.955673 188.868337 
L 309.943631 188.816605 
L 309.930585 188.764579 
L 309.91651 188.712236 
L 309.901379 188.659553 
L 309.885162 188.606506 
L 309.867827 188.55307 
L 309.849339 188.499221 
L 309.82966 188.444933 
L 309.808749 188.39018 
L 309.786562 188.334935 
L 309.763054 188.279171 
L 309.738173 188.22286 
L 309.711865 188.165972 
L 309.684071 188.108479 
L 309.654731 188.050349 
L 309.623775 187.991552 
L 309.591134 187.932056 
L 309.556729 187.871826 
L 309.520479 187.81083 
L 309.482294 187.749031 
L 309.44208 187.686395 
L 309.399735 187.622884 
L 309.355149 187.558459 
L 309.308204 187.493081 
L 309.258775 187.42671 
L 309.206725 187.359305 
L 309.151908 187.290822 
L 309.094167 187.221219 
L 309.033334 187.15045 
L 308.969225 187.078469 
L 308.901644 187.00523 
L 308.830379 186.930685 
L 308.755202 186.854786 
L 308.675865 186.777483 
L 308.592101 186.698728 
L 308.503622 186.61847 
L 308.410114 186.536661 
L 308.311239 186.453252 
L 308.206631 186.368194 
L 308.09589 186.281442 
L 307.978585 186.192951 
L 307.854247 186.102681 
L 307.722365 186.010593 
L 307.582386 185.916658 
L 307.433706 185.820849 
L 307.27567 185.723151 
L 307.107562 185.623558 
L 306.928605 185.522077 
L 306.737951 185.418732 
L 306.534677 185.313566 
L 306.31778 185.206647 
L 306.086164 185.098072 
L 305.838642 184.987972 
L 305.573919 184.876524 
L 305.290594 184.763952 
L 304.987148 184.650546 
L 304.66194 184.536668 
L 304.313204 184.422768 
L 303.939044 184.309403 
L 303.53744 184.197252 
L 303.10625 184.087144 
L 302.643227 183.980083 
L 302.146035 183.877277 
L 301.612291 183.780172 
L 301.039609 183.690491 
L 300.42567 183.610274 
L 299.768321 183.541924 
L 299.065698 183.488243 
L 298.316399 183.452479 
L 297.519689 183.438354 
L 296.675765 183.450082 
L 295.786073 183.492364 
L 294.853679 183.570343 
L 293.883677 183.689512 
L 292.883621 183.855563 
L 291.863945 184.074143 
L 290.838298 184.350528 
L 289.82374 184.689201 
L 288.840683 185.093341 
L 287.912502 185.564271 
L 287.064722 186.100909 
L 286.323753 186.699305 
L 285.715216 187.352372 
L 285.261992 188.049879 
L 284.982235 188.778801 
L 284.887637 189.523998 
" style="fill:none;stroke:#1f77b4;stroke-linecap:square;stroke-width:1.5;"/>
   </g>
   <g id="line2d_50">
    <path clip-path="url(#p0ac319a7ed)" d="M 332.027397 189.523998 
L 331.979943 188.029104 
L 331.837773 186.540229 
L 331.601459 185.063369 
L 331.271952 183.60447 
L 330.850579 182.169407 
L 330.339038 180.763959 
L 329.739387 179.393783 
L 329.054042 178.064399 
L 328.285762 176.781159 
L 327.43764 175.549229 
L 326.513093 174.373571 
L 325.515842 173.258918 
L 324.449903 172.20976 
L 323.319568 171.230319 
L 322.129389 170.324541 
L 320.884158 169.496072 
L 319.58889 168.748248 
L 318.248799 168.084081 
L 316.869283 167.506245 
L 315.455895 167.017067 
L 314.014327 166.618516 
L 312.550384 166.312197 
L 311.06996 166.099345 
L 309.579017 165.980815 
L 308.083558 165.957085 
L 306.589605 166.028251 
L 305.103173 166.194025 
L 303.630249 166.453742 
L 302.176761 166.806354 
L 300.748564 167.250442 
L 299.351409 167.784218 
L 297.99092 168.405532 
L 296.672577 169.111883 
L 295.401688 169.900426 
L 294.183369 170.767987 
L 293.022528 171.711071 
L 291.923838 172.725882 
L 290.891723 173.808333 
L 289.93034 174.954065 
L 289.043559 176.158465 
L 288.234951 177.416683 
L 287.507772 178.723654 
L 286.864951 180.074113 
L 286.309075 181.462624 
L 285.842383 182.883595 
L 285.466754 184.331305 
L 285.183701 185.799924 
L 284.994363 187.283538 
L 284.899503 188.776174 
L 284.899503 190.271822 
L 284.994363 191.764458 
L 285.183701 193.248072 
L 285.466754 194.716691 
L 285.842383 196.164401 
L 286.309075 197.585372 
L 286.864951 198.973883 
L 287.507772 200.324342 
L 288.234951 201.631312 
L 289.043559 202.889531 
L 289.93034 204.093931 
L 290.891723 205.239663 
L 291.923838 206.322114 
L 293.022528 207.336925 
L 294.183369 208.280009 
L 295.401688 209.14757 
L 296.672577 209.936113 
L 297.99092 210.642464 
L 299.351409 211.263778 
L 300.748564 211.797554 
L 302.176761 212.241642 
L 303.630249 212.594254 
L 305.103173 212.853971 
L 306.589605 213.019745 
L 308.083558 213.090911 
L 309.579017 213.067181 
L 311.06996 212.948651 
L 312.550384 212.735799 
L 314.014327 212.42948 
L 315.455895 212.030929 
L 316.869283 211.541751 
L 318.248799 210.963915 
L 319.58889 210.299748 
L 320.884158 209.551924 
L 322.129389 208.723455 
L 323.319568 207.817677 
L 324.449903 206.838236 
L 325.515842 205.789078 
L 326.513093 204.674425 
L 327.43764 203.498767 
L 328.285762 202.266837 
L 329.054042 200.983597 
L 329.739387 199.654213 
L 330.339038 198.284037 
L 330.850579 196.878589 
L 331.271952 195.443526 
L 331.601459 193.984627 
L 331.837773 192.507767 
L 331.979943 191.018892 
L 332.027397 189.523998 
" style="fill:none;stroke:#000000;stroke-dasharray:5.55,2.4;stroke-dashoffset:0;stroke-width:1.5;"/>
   </g>
   <g id="patch_12">
    <path d="M 357.875699 189.523998 
C 357.875699 183.034462 356.597402 176.608028 354.113964 170.612479 
C 351.630526 164.616929 347.990244 159.168862 343.401449 154.580067 
C 338.812654 149.991271 333.364586 146.350989 327.369037 143.867551 
C 321.373487 141.384113 314.947053 140.105816 308.457517 140.105816 
C 301.967981 140.105816 295.541547 141.384113 289.545998 143.867551 
C 283.550448 146.350989 278.102381 149.991271 273.513586 154.580067 
C 268.924791 159.168862 265.284508 164.616929 262.80107 170.612479 
C 260.317632 176.608028 259.039335 183.034462 259.039335 189.523998 
C 259.039335 196.013534 260.317632 202.439968 262.80107 208.435517 
C 265.284508 214.431067 268.924791 219.879134 273.513586 224.467929 
C 278.102381 229.056725 283.550448 232.697007 289.545998 235.180445 
C 295.541547 237.663883 301.967981 238.94218 308.457517 238.94218 
C 314.947053 238.94218 321.373487 237.663883 327.369037 235.180445 
C 333.364586 232.697007 338.812654 229.056725 343.401449 224.467929 
C 347.990244 219.879134 351.630526 214.431067 354.113964 208.435517 
C 356.597402 202.439968 357.875699 196.013534 357.875699 189.523998 
" style="fill:none;stroke:#000000;stroke-linecap:square;stroke-linejoin:miter;stroke-width:0.8;"/>
   </g>
   <g id="text_26">
    <!-- $r_{m1}=$1 -->
    <g transform="translate(290.569207 134.105816)scale(0.12 -0.12)">
     <use transform="scale(0.996264)" xlink:href="#CMMI12-72"/>
     <use transform="translate(43.960894 -14.943915)scale(0.697382)" xlink:href="#CMMI12-6d"/>
     <use transform="translate(103.689685 -14.943915)scale(0.697382)" xlink:href="#CMR17-31"/>
     <use transform="translate(163.845008 0)scale(0.996264)" xlink:href="#CMR17-3d"/>
     <use transform="translate(235.559797 0)scale(0.996264)" xlink:href="#CMSS17-31"/>
    </g>
   </g>
   <g id="legend_3">
    <g id="patch_13">
     <path d="M 313.894364 233.94218 
L 350.875699 233.94218 
Q 352.875699 233.94218 352.875699 231.94218 
L 352.875699 191.130645 
Q 352.875699 189.130645 350.875699 189.130645 
L 313.894364 189.130645 
Q 311.894364 189.130645 311.894364 191.130645 
L 311.894364 231.94218 
Q 311.894364 233.94218 313.894364 233.94218 
z
" style="fill:#ffffff;opacity:0.8;stroke:#cccccc;stroke-linejoin:miter;"/>
    </g>
    <g id="line2d_51">
     <path d="M 315.894364 196.630645 
L 335.894364 196.630645 
" style="fill:none;stroke:#000000;stroke-linecap:square;stroke-width:1.5;"/>
    </g>
    <g id="line2d_52"/>
    <g id="text_27">
     <!-- 0 -->
     <g transform="translate(343.894364 200.130645)scale(0.1 -0.1)">
      <use transform="scale(0.996264)" xlink:href="#CMSS17-30"/>
     </g>
    </g>
    <g id="line2d_53">
     <path d="M 315.894364 210.567823 
L 335.894364 210.567823 
" style="fill:none;stroke:#1f77b4;stroke-linecap:square;stroke-width:1.5;"/>
    </g>
    <g id="line2d_54"/>
    <g id="text_28">
     <!-- 1 -->
     <g transform="translate(343.894364 214.067823)scale(0.1 -0.1)">
      <use transform="scale(0.996264)" xlink:href="#CMSS17-31"/>
     </g>
    </g>
    <g id="line2d_55">
     <path d="M 315.894364 224.505001 
L 335.894364 224.505001 
" style="fill:none;stroke:#000000;stroke-dasharray:5.55,2.4;stroke-dashoffset:0;stroke-width:1.5;"/>
    </g>
    <g id="line2d_56"/>
    <g id="text_29">
     <!-- 2 -->
     <g transform="translate(343.894364 228.005001)scale(0.1 -0.1)">
      <use transform="scale(0.996264)" xlink:href="#CMSS17-32"/>
     </g>
    </g>
   </g>
  </g>
 </g>
 <defs>
  <clipPath id="pf19ad4eeaf">
   <rect height="217.44" width="152.181818" x="49.748426" y="21.50218"/>
  </clipPath>
  <clipPath id="pb1c1b3d1db">
   <path d="M 357.875699 70.920362 
C 357.875699 64.430825 356.597402 58.004392 354.113964 52.008842 
C 351.630526 46.013293 347.990244 40.565225 343.401449 35.97643 
C 338.812654 31.387635 333.364586 27.747353 327.369037 25.263915 
C 321.373487 22.780477 314.947053 21.50218 308.457517 21.50218 
C 301.967981 21.50218 295.541547 22.780477 289.545998 25.263915 
C 283.550448 27.747353 278.102381 31.387635 273.513586 35.97643 
C 268.924791 40.565225 265.284508 46.013293 262.80107 52.008842 
C 260.317632 58.004392 259.039335 64.430825 259.039335 70.920362 
C 259.039335 77.409898 260.317632 83.836331 262.80107 89.831881 
C 265.284508 95.827431 268.924791 101.275498 273.513586 105.864293 
C 278.102381 110.453088 283.550448 114.09337 289.545998 116.576808 
C 295.541547 119.060246 301.967981 120.338543 308.457517 120.338543 
C 314.947053 120.338543 321.373487 119.060246 327.369037 116.576808 
C 333.364586 114.09337 338.812654 110.453088 343.401449 105.864293 
C 347.990244 101.275498 351.630526 95.827431 354.113964 89.831881 
C 356.597402 83.836331 357.875699 77.409898 357.875699 70.920362 
M 308.457517 70.920362 
C 308.457517 70.920362 308.457517 70.920362 308.457517 70.920362 
C 308.457517 70.920362 308.457517 70.920362 308.457517 70.920362 
C 308.457517 70.920362 308.457517 70.920362 308.457517 70.920362 
C 308.457517 70.920362 308.457517 70.920362 308.457517 70.920362 
C 308.457517 70.920362 308.457517 70.920362 308.457517 70.920362 
C 308.457517 70.920362 308.457517 70.920362 308.457517 70.920362 
C 308.457517 70.920362 308.457517 70.920362 308.457517 70.920362 
C 308.457517 70.920362 308.457517 70.920362 308.457517 70.920362 
C 308.457517 70.920362 308.457517 70.920362 308.457517 70.920362 
C 308.457517 70.920362 308.457517 70.920362 308.457517 70.920362 
C 308.457517 70.920362 308.457517 70.920362 308.457517 70.920362 
C 308.457517 70.920362 308.457517 70.920362 308.457517 70.920362 
C 308.457517 70.920362 308.457517 70.920362 308.457517 70.920362 
C 308.457517 70.920362 308.457517 70.920362 308.457517 70.920362 
C 308.457517 70.920362 308.457517 70.920362 308.457517 70.920362 
C 308.457517 70.920362 308.457517 70.920362 308.457517 70.920362 
M 357.875699 70.920362 
z
"/>
  </clipPath>
  <clipPath id="p0ac319a7ed">
   <path d="M 357.875699 189.523998 
C 357.875699 183.034462 356.597402 176.608028 354.113964 170.612479 
C 351.630526 164.616929 347.990244 159.168862 343.401449 154.580067 
C 338.812654 149.991271 333.364586 146.350989 327.369037 143.867551 
C 321.373487 141.384113 314.947053 140.105816 308.457517 140.105816 
C 301.967981 140.105816 295.541547 141.384113 289.545998 143.867551 
C 283.550448 146.350989 278.102381 149.991271 273.513586 154.580067 
C 268.924791 159.168862 265.284508 164.616929 262.80107 170.612479 
C 260.317632 176.608028 259.039335 183.034462 259.039335 189.523998 
C 259.039335 196.013534 260.317632 202.439968 262.80107 208.435517 
C 265.284508 214.431067 268.924791 219.879134 273.513586 224.467929 
C 278.102381 229.056725 283.550448 232.697007 289.545998 235.180445 
C 295.541547 237.663883 301.967981 238.94218 308.457517 238.94218 
C 314.947053 238.94218 321.373487 237.663883 327.369037 235.180445 
C 333.364586 232.697007 338.812654 229.056725 343.401449 224.467929 
C 347.990244 219.879134 351.630526 214.431067 354.113964 208.435517 
C 356.597402 202.439968 357.875699 196.013534 357.875699 189.523998 
M 308.457517 189.523998 
C 308.457517 189.523998 308.457517 189.523998 308.457517 189.523998 
C 308.457517 189.523998 308.457517 189.523998 308.457517 189.523998 
C 308.457517 189.523998 308.457517 189.523998 308.457517 189.523998 
C 308.457517 189.523998 308.457517 189.523998 308.457517 189.523998 
C 308.457517 189.523998 308.457517 189.523998 308.457517 189.523998 
C 308.457517 189.523998 308.457517 189.523998 308.457517 189.523998 
C 308.457517 189.523998 308.457517 189.523998 308.457517 189.523998 
C 308.457517 189.523998 308.457517 189.523998 308.457517 189.523998 
C 308.457517 189.523998 308.457517 189.523998 308.457517 189.523998 
C 308.457517 189.523998 308.457517 189.523998 308.457517 189.523998 
C 308.457517 189.523998 308.457517 189.523998 308.457517 189.523998 
C 308.457517 189.523998 308.457517 189.523998 308.457517 189.523998 
C 308.457517 189.523998 308.457517 189.523998 308.457517 189.523998 
C 308.457517 189.523998 308.457517 189.523998 308.457517 189.523998 
C 308.457517 189.523998 308.457517 189.523998 308.457517 189.523998 
C 308.457517 189.523998 308.457517 189.523998 308.457517 189.523998 
M 357.875699 189.523998 
z
"/>
  </clipPath>
 </defs>
</svg>
