case_id,author,ner
25332,PRESIDING JUSTICE McDADE,"[('JUSTICE', 'ORGANIZATION'), ('Michael', 'PERSON'), ('Kenneth', 'PERSON'), ('Stateville', 'FACILITY'), ('Code', 'ORGANIZATION'), ('Civil', 'PERSON'), ('Stateville', 'FACILITY'), ('Illinois', 'ORGANIZATION'), ('Stateville', 'FACILITY'), ('Act', 'ORGANIZATION'), ('Department', 'ORGANIZATION'), ('Corrections', 'GPE'), ('DOC', 'ORGANIZATION'), ('Dismiss', 'PERSON'), ('DOC', 'ORGANIZATION'), ('Follow', 'PERSON'), ('DOC', 'ORGANIZATION'), ('DOC', 'ORGANIZATION'), ('Act', 'ORGANIZATION'), ('DOC', 'ORGANIZATION'), ('Act', 'ORGANIZATION'), ('DOC', 'ORGANIZATION'), ('Weiss', 'GPE'), ('Waterhouse', 'ORGANIZATION'), ('Krilich', 'PERSON'), ('American', 'ORGANIZATION'), ('Trust', 'PERSON'), ('Chicago', 'GPE'), ('Caruth', 'PERSON'), ('Quinley', 'PERSON'), ('Southern', 'PERSON'), ('Central', 'ORGANIZATION'), ('District', 'PERSON'), ('Board', 'PERSON'), ('Act', 'ORGANIZATION'), ('Act', 'ORGANIZATION'), ('DOC', 'ORGANIZATION'), ('DOC', 'ORGANIZATION'), ('Adm', 'ORGANIZATION'), ('Department', 'ORGANIZATION'), ('Corrections', 'ORGANIZATION'), ('Illinois', 'ORGANIZATION'), ('Unified', 'PERSON'), ('Corrections', 'GPE'), ('DOC', 'ORGANIZATION'), ('Code', 'ORGANIZATION'), ('Code', 'ORGANIZATION'), ('DOC', 'ORGANIZATION'), ('Pub', 'PERSON'), ('Code', 'ORGANIZATION'), ('DOC', 'ORGANIZATION'), ('Due', 'PERSON'), ('DOC', 'ORGANIZATION'), ('Thompson', 'PERSON'), ('Lane', 'PERSON'), ('DOC', 'ORGANIZATION'), ('Will', 'PERSON'), ('LYTTON', 'ORGANIZATION')]"
25333,JUSTICE MAAG,"[('JUSTICE', 'ORGANIZATION'), ('Amanda', 'PERSON'), ('Brittany', 'GPE'), ('Tommy', 'PERSON'), ('Tommy', 'PERSON'), ('Harrah', 'PERSON'), ('Casino', 'PERSON'), ('Maryland', 'ORGANIZATION'), ('Missouri', 'PERSON'), ('Amanda', 'PERSON'), ('Brittany', 'GPE'), ('Supreme', 'ORGANIZATION'), ('Illinois', 'ORGANIZATION'), ('Johnson', 'PERSON'), ('Farm', 'PERSON'), ('Dempsey', 'PERSON'), ('Gaidar', 'PERSON'), ('Tippecanoe', 'PERSON'), ('International', 'ORGANIZATION'), ('Martin', 'PERSON'), ('Casualty', 'PERSON'), ('Worldtronics', 'ORGANIZATION'), ('Inc.', 'PERSON'), ('Illinois', 'GPE'), ('Illinois', 'ORGANIZATION'), ('United', 'ORGANIZATION'), ('Flint', 'PERSON'), ('Inc.', 'PERSON'), ('Nueva', 'PERSON'), ('S.A.', 'ORGANIZATION'), ('Illinois', 'ORGANIZATION'), ('Washington', 'GPE'), ('U.S.', 'GPE'), ('Milliken', 'PERSON'), ('Meyer', 'PERSON'), ('U.S.', 'GPE'), ('Metal', 'ORGANIZATION'), ('Superior', 'ORGANIZATION'), ('California', 'GPE'), ('U.S.', 'GPE'), ('Burger', 'PERSON'), ('U.S.', 'GPE'), ('Burger', 'PERSON'), ('U.S.', 'GPE'), ('Burger', 'PERSON'), ('U.S.', 'GPE'), ('Illinois', 'ORGANIZATION'), ('Burger', 'PERSON'), ('U.S.', 'GPE'), ('Illinois', 'GPE'), ('Illinois', 'GPE'), ('Illinois', 'GPE'), ('Illinois', 'GPE'), ('Alton', 'GPE'), ('Illinois', 'GPE'), ('Hence', 'PERSON'), ('Illinois', 'GPE'), ('Illinois', 'ORGANIZATION'), ('Colombia', 'GPE'), ('S.A.', 'ORGANIZATION'), ('U.S.', 'GPE'), ('Helicopteros', 'PERSON'), ('Colombia', 'GPE'), ('S.A.', 'ORGANIZATION'), ('U.S.', 'GPE'), ('Illinois', 'PERSON'), ('Illinois', 'PERSON'), ('Illinois', 'PERSON'), ('Quaker', 'PERSON'), ('Chelsea', 'PERSON'), ('Illinois', 'GPE'), ('Illinois', 'GPE'), ('Illinois', 'ORGANIZATION'), ('Illinois', 'GPE'), ('Illinois', 'GPE'), ('Missouri', 'GPE'), ('Illinois', 'ORGANIZATION'), ('Illinois', 'ORGANIZATION'), ('Due', 'PERSON'), ('Illinois', 'GPE'), ('Illinois', 'GPE'), ('Illinois', 'GPE'), ('Ellwood', 'PERSON'), ('Illinois', 'GPE'), ('Illinois', 'GPE'), ('Alton', 'GPE'), ('Illinois', 'GPE'), ('Illinois', 'GPE'), ('Illinois', 'GPE'), ('Illinois', 'ORGANIZATION'), ('Illinois', 'PERSON'), ('Illinois', 'ORGANIZATION'), ('Alderson', 'PERSON'), ('Illinois', 'ORGANIZATION'), ('GOLDENHERSH', 'ORGANIZATION')]"
25334,PRESIDING JUSTICE HOPKINS,"[('JUSTICE', 'ORGANIZATION'), ('Alisha', 'PERSON'), ('William', 'PERSON'), ('Matthew', 'ORGANIZATION'), ('Alisha', 'PERSON'), ('Alisha', 'PERSON'), ('Matthew', 'PERSON'), ('Robert', 'PERSON'), ('Alisha', 'PERSON'), ('Alisha', 'PERSON'), ('Matthew', 'PERSON'), ('Alisha', 'PERSON'), ('Alisha', 'PERSON'), ('Matthew', 'PERSON'), ('Matthew', 'PERSON'), ('Matthew', 'PERSON'), ('Asplundh', 'ORGANIZATION'), ('Matthew', 'PERSON'), ('Robert', 'PERSON'), ('Alisha', 'PERSON'), ('As-plundh', 'ORGANIZATION'), ('Alisha', 'PERSON'), ('Asplundh', 'ORGANIZATION'), ('Freightliner', 'PERSON'), ('GMC', 'ORGANIZATION'), ('Alisha', 'PERSON'), ('Matthew', 'PERSON'), ('Matthew', 'PERSON'), ('Matthew', 'PERSON'), ('Alisha', 'PERSON'), ('Matthew', 'PERSON'), ('Matthew', 'PERSON'), ('Matthew', 'PERSON'), ('Matthew', 'PERSON'), ('Robert', 'PERSON'), ('Matthew', 'PERSON'), ('Robert', 'PERSON'), ('Old', 'PERSON'), ('GMC', 'ORGANIZATION'), ('National', 'ORGANIZATION'), ('Robert', 'PERSON'), ('Matthew', 'PERSON'), ('Alisha', 'PERSON'), ('Robert', 'PERSON'), ('Matthew', 'PERSON'), ('Matthew', 'GPE'), ('Robert', 'PERSON'), ('Robert', 'PERSON'), ('Matthew', 'PERSON'), ('Robert', 'PERSON'), ('Robert', 'PERSON'), ('Matthew', 'PERSON'), ('Robert', 'PERSON'), ('Matthew', 'PERSON'), ('Alisha', 'PERSON'), ('Yukon', 'ORGANIZATION'), ('Robert', 'PERSON'), ('Matthew', 'GPE'), ('Robert', 'PERSON'), ('Matthew', 'PERSON'), ('Alisha', 'PERSON'), ('Alisha', 'PERSON'), ('Matthew', 'PERSON'), ('Alisha', 'PERSON'), ('Alisha', 'PERSON'), ('Alisha', 'GPE'), ('Matthew', 'PERSON'), ('Alisha', 'PERSON'), ('Alisha', 'PERSON'), ('Alisha', 'PERSON'), ('Matthew', 'PERSON'), ('Yukon', 'ORGANIZATION'), ('Matthew', 'PERSON'), ('Yukon', 'ORGANIZATION'), ('Alisha', 'PERSON'), ('Marital', 'ORGANIZATION'), ('Matthew', 'PERSON'), ('Matthew', 'PERSON'), ('Schmidt', 'GPE'), ('Schmidt', 'GPE'), ('Illinois', 'ORGANIZATION'), ('Dissolution', 'ORGANIZATION'), ('Marriage', 'PERSON'), ('Schmidt', 'GPE'), ('Steele', 'GPE'), ('Alisha', 'PERSON'), ('Matthew', 'PERSON'), ('Matthew', 'PERSON'), ('Chicago', 'ORGANIZATION'), ('Dolins', 'PERSON'), ('Matthew', 'PERSON'), ('Alisha', 'PERSON'), ('Matthew', 'PERSON'), ('Matthew', 'PERSON'), ('Matthew', 'PERSON'), ('Alisha', 'GPE'), ('Steele', 'GPE'), ('Alisha', 'GPE'), ('Matthew', 'PERSON'), ('Head', 'PERSON'), ('Alisha', 'PERSON'), ('Alisha', 'PERSON'), ('Alisha', 'PERSON'), ('CropsAlisha', 'ORGANIZATION'), ('Alisha', 'PERSON'), ('Alisha', 'GPE'), ('Heinze', 'GPE'), ('Mohr', 'GPE'), ('Farm', 'PERSON'), ('Mohr', 'GPE'), ('Mohr', 'GPE'), ('Matthew', 'PERSON'), ('Matthew', 'GPE'), ('Matthew', 'PERSON'), ('Alisha', 'PERSON'), ('Matthew', 'GPE'), ('Alisha', 'PERSON'), ('Further', 'PERSON'), ('Alisha', 'PERSON'), ('Matthew', 'PERSON'), ('Matthew', 'PERSON'), ('Alisha', 'PERSON'), ('Matthew', 'PERSON'), ('Supreme', 'ORGANIZATION'), ('Matthew', 'GPE'), ('Smith', 'GPE'), ('RobertAlisha', 'ORGANIZATION'), ('Matthew', 'PERSON'), ('Robert', 'PERSON'), ('Robert', 'PERSON'), ('Supreme', 'ORGANIZATION'), ('Shelbyville', 'ORGANIZATION'), ('Sunbeam', 'ORGANIZATION'), ('Matthew', 'PERSON'), ('Robert', 'PERSON'), ('Matthew', 'PERSON'), ('Robert', 'PERSON'), ('Matthew', 'PERSON'), ('Robert', 'PERSON'), ('Matthew', 'GPE'), ('Alisha', 'PERSON'), ('Matthew', 'PERSON'), ('SupportAlisha', 'ORGANIZATION'), ('Matthew', 'PERSON'), ('Matthew', 'PERSON'), ('Matthew', 'PERSON'), ('Partney', 'GPE'), ('Act', 'ORGANIZATION'), ('Nelson', 'GPE'), ('Sweet', 'GPE'), ('Alisha', 'PERSON'), ('Matthew', 'PERSON'), ('Alisha', 'PERSON'), ('Matthew', 'PERSON'), ('Asplundh', 'ORGANIZATION'), ('Sweet', 'GPE'), ('Sweet', 'GPE'), ('Sweet', 'GPE'), ('Sweet', 'GPE'), ('Matthew', 'PERSON'), ('Matthew', 'PERSON'), ('Alisha', 'PERSON'), ('Matthew', 'PERSON'), ('Alisha', 'PERSON'), ('Heil', 'GPE'), ('Alisha', 'PERSON'), ('Robert', 'PERSON'), ('Matthew', 'PERSON'), ('Yukon', 'ORGANIZATION'), ('Las', 'PERSON'), ('Matthew', 'PERSON'), ('Alisha', 'PERSON'), ('Yukon', 'ORGANIZATION'), ('Matthew', 'PERSON'), ('Matthew', 'GPE'), ('Heil', 'GPE'), ('Heil', 'GPE'), ('Heil', 'GPE'), ('Matthew', 'PERSON'), ('Robert', 'PERSON'), ('Las', 'PERSON'), ('Robert', 'PERSON'), ('Alisha', 'PERSON'), ('Harmon', 'GPE'), ('FeesAlisha', 'ORGANIZATION'), ('Matthew', 'PERSON'), ('Alisha', 'PERSON'), ('Act', 'ORGANIZATION'), ('Hillebrand', 'GPE'), ('Uphoff', 'GPE'), ('Marriage', 'PERSON'), ('Roth', 'PERSON'), ('Roth', 'PERSON'), ('Green', 'GPE'), ('Alisha', 'PERSON'), ('Matthew', 'PERSON'), ('Matthew', 'PERSON'), ('Alisha', 'PERSON'), ('Alisha', 'PERSON'), ('Alisha', 'PERSON'), ('Jackson', 'PERSON'), ('KUEHN', 'ORGANIZATION')]"
25335,JUSTICE MAAG,"[('JUSTICE', 'ORGANIZATION'), ('Michael', 'PERSON'), ('Diane', 'PERSON'), ('Midwest', 'GPE'), ('Inc.', 'GPE'), ('MWT', 'ORGANIZATION'), ('Lawrence', 'GPE'), ('Hal', 'PERSON'), ('MWT', 'ORGANIZATION'), ('Hicks', 'PERSON'), ('Business', 'ORGANIZATION'), ('Lawrence', 'GPE'), ('MWT', 'ORGANIZATION'), ('Hicks', 'PERSON'), ('Illinois', 'PERSON'), ('Witters', 'GPE'), ('Hicks', 'PERSON'), ('Hicks', 'PERSON'), ('Hicks', 'PERSON'), ('MWT', 'ORGANIZATION'), ('Hicks', 'PERSON'), ('Hicks', 'PERSON'), ('MWT', 'ORGANIZATION'), ('MWT', 'ORGANIZATION'), ('Hicks', 'PERSON'), ('MWT', 'ORGANIZATION'), ('Hicks', 'PERSON'), ('MWT', 'ORGANIZATION'), ('MWT', 'ORGANIZATION'), ('MWT', 'ORGANIZATION'), ('Hicks', 'PERSON'), ('MWT', 'ORGANIZATION'), ('Hicks', 'PERSON'), ('MWT', 'ORGANIZATION'), ('MWT', 'ORGANIZATION'), ('Hicks', 'PERSON'), ('Hicks', 'PERSON'), ('Hicks', 'PERSON'), ('MWT', 'ORGANIZATION'), ('MWT', 'ORGANIZATION'), ('Hicks', 'PERSON'), ('MWT', 'ORGANIZATION'), ('MWT', 'ORGANIZATION'), ('Don', 'PERSON'), ('Hicks', 'PERSON'), ('MWT', 'ORGANIZATION'), ('Don', 'PERSON'), ('Hicks', 'PERSON'), ('Hicks', 'PERSON'), ('Hicks', 'PERSON'), ('Hicks', 'PERSON'), ('Payne', 'PERSON'), ('Cygnar', 'PERSON'), ('Payne', 'PERSON'), ('Lind', 'PERSON'), ('Spannuth', 'GPE'), ('Feinberg', 'ORGANIZATION'), ('Dunteman', 'PERSON'), ('MWT', 'ORGANIZATION'), ('McGovern', 'ORGANIZATION'), ('Generally', 'PERSON'), ('Hicks', 'GPE'), ('Hicks', 'PERSON'), ('Hicks', 'PERSON'), ('Hicks', 'PERSON'), ('Hicks', 'GPE'), ('Hicks', 'PERSON'), ('MWT', 'ORGANIZATION'), ('Hicks', 'PERSON'), ('Hicks', 'GPE'), ('Hicks', 'PERSON'), ('Hicks', 'PERSON'), ('Hicks', 'PERSON'), ('Taxy', 'PERSON'), ('Chicago', 'ORGANIZATION'), ('Hunt', 'GPE'), ('MWT', 'ORGANIZATION'), ('Gidwitz', 'PERSON'), ('Lanzit', 'PERSON'), ('Hicks', 'PERSON'), ('Hicks', 'PERSON'), ('Code', 'ORGANIZATION'), ('Civil', 'PERSON'), ('Hicks', 'PERSON'), ('Hicks', 'PERSON'), ('Hicks', 'PERSON'), ('Hicks', 'PERSON'), ('Hicks', 'PERSON'), ('Hicks', 'PERSON'), ('Hicks', 'PERSON'), ('Hicks', 'PERSON'), ('Hicks', 'PERSON'), ('Court', 'PERSON'), ('Code', 'ORGANIZATION'), ('Civil', 'PERSON'), ('Bond', 'PERSON'), ('Act', 'ORGANIZATION'), ('Hicks', 'GPE'), ('Don', 'PERSON'), ('Hicks', 'PERSON'), ('Hicks', 'PERSON'), ('Hicks', 'PERSON'), ('Illinois', 'PERSON'), ('Greer', 'GPE'), ('Illinois', 'PERSON'), ('Greer', 'PERSON'), ('Hicks', 'PERSON'), ('Hicks', 'PERSON'), ('MWT', 'ORGANIZATION'), ('WELCH', 'ORGANIZATION'), ('Hicks', 'PERSON'), ('Hicks', 'PERSON'), ('Hicks', 'PERSON'), ('Hicks', 'PERSON'), ('MWT', 'ORGANIZATION'), ('Hicks', 'PERSON')]"
25336,PRESIDING JUSTICE THEIS,"[('JUSTICE', 'ORGANIZATION'), ('Blockbuster', 'PERSON'), ('United', 'GPE'), ('United', 'GPE'), ('Blockbuster', 'ORGANIZATION'), ('United', 'GPE'), ('Blockbuster', 'PERSON'), ('Blockbuster', 'PERSON'), ('Scott', 'GPE'), ('No', 'GPE'), ('Jefferson', 'PERSON'), ('Texas', 'GPE'), ('Scott', 'PERSON'), ('Scott', 'ORGANIZATION'), ('Texas', 'ORGANIZATION'), ('Scott', 'ORGANIZATION'), ('Blockbuster', 'PERSON'), ('Blockbuster', 'PERSON'), ('Federal', 'ORGANIZATION'), ('American', 'ORGANIZATION'), ('Plaintiffs', 'PERSON'), ('Plaintiffs', 'PERSON'), ('Blockbuster', 'ORGANIZATION'), ('Scott', 'PERSON'), ('Scott', 'ORGANIZATION'), ('Blockbuster', 'PERSON'), ('Illinois', 'ORGANIZATION'), ('Civil', 'PERSON'), ('Code', 'GPE'), ('Blockbuster', 'PERSON'), ('Federal', 'ORGANIZATION'), ('Uniform', 'ORGANIZATION'), ('Blockbuster', 'ORGANIZATION'), ('Plaintiffs', 'PERSON'), ('Blockbuster', 'PERSON'), ('Plaintiffs', 'PERSON'), ('Blockbuster', 'PERSON'), ('Partial', 'ORGANIZATION'), ('Compel', 'ORGANIZATION'), ('Blockbuster', 'PERSON'), ('Supreme', 'ORGANIZATION'), ('Blockbuster', 'PERSON'), ('Supreme', 'ORGANIZATION'), ('Blockbuster', 'PERSON'), ('Dunn', 'PERSON'), ('Patton', 'PERSON'), ('Supreme', 'ORGANIZATION'), ('Notaro', 'PERSON'), ('Nor-Evan', 'ORGANIZATION'), ('Federal', 'ORGANIZATION'), ('Comdisco', 'ORGANIZATION'), ('Bradstreet', 'ORGANIZATION'), ('Lehr', 'GPE'), ('Twardowski', 'PERSON'), ('Federal', 'ORGANIZATION'), ('Boomer', 'PERSON'), ('SBC', 'ORGANIZATION'), ('Sandvik', 'PERSON'), ('Advent', 'ORGANIZATION'), ('Blockbuster', 'ORGANIZATION'), ('Comdisco', 'ORGANIZATION'), ('Lundy', 'PERSON'), ('Farmers', 'ORGANIZATION'), ('Illinois', 'GPE'), ('Uniform', 'ORGANIZATION'), ('Emphasis', 'ORGANIZATION'), ('Act', 'ORGANIZATION'), ('Comdisco', 'ORGANIZATION'), ('Phillips', 'PERSON'), ('Shutts', 'PERSON'), ('U.S.', 'GPE'), ('Comdisco', 'ORGANIZATION'), ('Comdisco', 'ORGANIZATION'), ('Uniform', 'ORGANIZATION'), ('Act', 'ORGANIZATION'), ('Comdisco', 'ORGANIZATION'), ('Uniform', 'ORGANIZATION'), ('GREIMAN', 'ORGANIZATION'), ('JJ', 'ORGANIZATION'), ('Blockbuster', 'ORGANIZATION'), ('Inc', 'PERSON')]"
25337,JUSTICE LYTTON,"[('JUSTICE', 'ORGANIZATION'), ('Plaintiffs', 'PERSON'), ('Illinois', 'PERSON'), ('Illinois', 'ORGANIZATION'), ('Illinois', 'PERSON'), ('Illinois', 'PERSON'), ('Snowmobile', 'ORGANIZATION'), ('Safety', 'PERSON'), ('Illinois', 'PERSON'), ('Illinois', 'PERSON'), ('Illinois', 'PERSON'), ('Illinois', 'PERSON'), ('Illinois', 'PERSON'), ('Illinois', 'PERSON'), ('Illinois', 'PERSON'), ('Supreme', 'ORGANIZATION'), ('Birkett', 'PERSON'), ('Chicago', 'GPE'), ('Illinois', 'PERSON'), ('Act', 'ORGANIZATION'), ('Act', 'ORGANIZATION'), ('Judgment', 'ORGANIZATION'), ('Sale', 'ORGANIZATION'), ('Delinquent', 'ORGANIZATION'), ('Tax', 'ORGANIZATION'), ('Board', 'PERSON'), ('Education', 'ORGANIZATION'), ('Rockford', 'ORGANIZATION'), ('Illinois', 'PERSON'), ('Tax', 'PERSON'), ('Property', 'ORGANIZATION'), ('Black', 'PERSON'), ('Law', 'PERSON'), ('Black', 'PERSON'), ('Law', 'PERSON'), ('Illinois', 'PERSON'), ('Illinois', 'PERSON'), ('Act', 'ORGANIZATION'), ('Ostergren', 'PERSON'), ('Power', 'PERSON'), ('Illinois', 'PERSON'), ('La', 'PERSON'), ('SLATER', 'ORGANIZATION')]"
25338,JUSTICE GREIMAN,"[('JUSTICE', 'ORGANIZATION'), ('Jesse', 'PERSON'), ('State', 'ORGANIZATION'), ('Petitioner', 'PERSON'), ('State', 'ORGANIZATION'), ('Illinois', 'ORGANIZATION'), ('United', 'GPE'), ('Illinois', 'ORGANIZATION'), ('People', 'PERSON'), ('State', 'ORGANIZATION'), ('Coleman', 'PERSON'), ('Ponyi', 'PERSON'), ('Coleman', 'PERSON'), ('State', 'ORGANIZATION'), ('Coleman', 'PERSON'), ('Illinois', 'ORGANIZATION'), ('Illinois', 'ORGANIZATION'), ('Petitioner', 'PERSON'), ('State', 'ORGANIZATION'), ('State', 'ORGANIZATION'), ('State', 'ORGANIZATION'), ('Menard', 'ORGANIZATION'), ('Stateville', 'FACILITY'), ('Pontiac', 'ORGANIZATION'), ('State', 'ORGANIZATION'), ('State', 'ORGANIZATION'), ('State', 'ORGANIZATION'), ('State', 'ORGANIZATION'), ('State', 'ORGANIZATION'), ('State', 'ORGANIZATION'), ('State', 'ORGANIZATION'), ('Scullark', 'GPE'), ('State', 'ORGANIZATION'), ('State', 'ORGANIZATION'), ('State', 'ORGANIZATION'), ('State', 'ORGANIZATION'), ('State', 'ORGANIZATION'), ('Illinois', 'ORGANIZATION'), ('People', 'PERSON'), ('Illinois', 'ORGANIZATION'), ('State', 'ORGANIZATION'), ('Illinois', 'ORGANIZATION'), ('Supreme', 'ORGANIZATION'), ('People', 'GPE'), ('Hendrix', 'PERSON'), ('Furthermore', 'GPE'), ('Hendrix', 'ORGANIZATION'), ('Hendrix', 'PERSON'), ('Howell', 'ORGANIZATION'), ('Act', 'ORGANIZATION'), ('State', 'ORGANIZATION'), ('People', 'GPE'), ('Farnsley', 'PERSON'), ('People', 'GPE'), ('Cartee', 'PERSON'), ('People', 'GPE'), ('Farnsley', 'GPE'), ('Cartee', 'PERSON'), ('Cartee', 'PERSON'), ('State', 'ORGANIZATION'), ('State', 'ORGANIZATION'), ('McCarthy', 'ORGANIZATION'), ('Midwest', 'ORGANIZATION'), ('Trust', 'PERSON'), ('Lakewood', 'GPE'), ('Illinois', 'PERSON'), ('Sons', 'PERSON'), ('Inc.', 'GPE'), ('State', 'ORGANIZATION'), ('State', 'ORGANIZATION'), ('State', 'ORGANIZATION'), ('State', 'ORGANIZATION'), ('State', 'ORGANIZATION'), ('State', 'ORGANIZATION'), ('State', 'ORGANIZATION'), ('State', 'ORGANIZATION'), ('State', 'ORGANIZATION'), ('State', 'ORGANIZATION'), ('Barrow', 'PERSON'), ('People', 'PERSON'), ('Scullark', 'ORGANIZATION'), ('Scullark', 'GPE'), ('Scullark', 'PERSON'), ('Scullark', 'GPE'), ('Scullark', 'ORGANIZATION'), ('Scullark', 'PERSON'), ('State', 'ORGANIZATION'), ('Scullark', 'PERSON'), ('Scullark', 'GPE'), ('Scullark', 'GPE'), ('State', 'ORGANIZATION'), ('Scullark', 'GPE'), ('Scullark', 'GPE'), ('Scullark', 'GPE'), ('Scullark', 'ORGANIZATION'), ('Petitioner', 'PERSON'), ('State', 'ORGANIZATION'), ('Illinois', 'ORGANIZATION'), ('Corrections', 'GPE'), ('Scullark', 'ORGANIZATION'), ('Mitchell', 'ORGANIZATION'), ('Van', 'PERSON'), ('Mitchell', 'GPE'), ('Mitchell', 'GPE'), ('Justice', 'ORGANIZATION'), ('People', 'GPE'), ('McClain', 'PERSON'), ('Mitchell', 'ORGANIZATION'), ('Mitchell', 'PERSON'), ('People', 'GPE'), ('Van', 'PERSON'), ('Van', 'PERSON'), ('KARNEZIS', 'ORGANIZATION')]"
25339,PRESIDING JUSTICE McBRIDE,"[('JUSTICE', 'ORGANIZATION'), ('Plaintiff', 'PERSON'), ('Chicago', 'ORGANIZATION'), ('CTA', 'ORGANIZATION'), ('CTA', 'ORGANIZATION'), ('Nichols', 'PERSON'), ('Committee', 'ORGANIZATION'), ('Plan', 'ORGANIZATION'), ('Committee', 'ORGANIZATION'), ('Nichols', 'PERSON'), ('Nichols', 'PERSON'), ('Committee', 'ORGANIZATION'), ('Plan', 'ORGANIZATION'), ('Nichols', 'PERSON'), ('CTA', 'ORGANIZATION'), ('Nichols', 'PERSON'), ('CTA', 'ORGANIZATION'), ('Beverly', 'ORGANIZATION'), ('Credit', 'ORGANIZATION'), ('Nichols', 'PERSON'), ('Nichols', 'PERSON'), ('Nichols', 'PERSON'), ('Plan', 'ORGANIZATION'), ('Nichols', 'PERSON'), ('Committee', 'ORGANIZATION'), ('Committee', 'ORGANIZATION'), ('Participant', 'ORGANIZATION'), ('Nichols', 'PERSON'), ('Committee', 'ORGANIZATION'), ('Nichols', 'PERSON'), ('CTA', 'ORGANIZATION'), ('Employees', 'PERSON'), ('Internal', 'ORGANIZATION'), ('Plan', 'ORGANIZATION'), ('CTA', 'ORGANIZATION'), ('Deferred', 'ORGANIZATION'), ('Participant', 'ORGANIZATION'), ('Participant', 'ORGANIZATION'), ('Committee', 'ORGANIZATION'), ('Participant', 'ORGANIZATION'), ('Participant', 'ORGANIZATION'), ('Code', 'GPE'), ('Participant', 'ORGANIZATION'), ('Participant', 'ORGANIZATION'), ('Payment', 'PERSON'), ('Participant', 'ORGANIZATION'), ('Plan', 'ORGANIZATION'), ('Committee', 'ORGANIZATION'), ('Committee', 'ORGANIZATION'), ('Participant', 'ORGANIZATION'), ('Administrative', 'ORGANIZATION'), ('Belvidere', 'GPE'), ('Illinois', 'PERSON'), ('Illinois', 'ORGANIZATION'), ('Belvidere', 'GPE'), ('Nichols', 'PERSON'), ('Nichols', 'PERSON'), ('Nichols', 'PERSON'), ('Beverly', 'ORGANIZATION'), ('Credit', 'ORGANIZATION'), ('Plan', 'ORGANIZATION'), ('Plan', 'ORGANIZATION'), ('Plan', 'ORGANIZATION'), ('Schmitt', 'PERSON'), ('Copeland', 'ORGANIZATION'), ('Plan', 'ORGANIZATION'), ('Committee', 'ORGANIZATION'), ('Jerome', 'PERSON'), ('National', 'ORGANIZATION'), ('See', 'PERSON'), ('Gatto', 'PERSON'), ('Richard', 'PERSON'), ('Hackett', 'PERSON'), ('Xerox', 'PERSON'), ('Income', 'PERSON'), ('Committee', 'ORGANIZATION'), ('Plan', 'ORGANIZATION'), ('Committee', 'ORGANIZATION'), ('Plan', 'ORGANIZATION'), ('Committee', 'ORGANIZATION'), ('Nichols', 'PERSON'), ('Committee', 'ORGANIZATION'), ('Committee', 'ORGANIZATION'), ('Nichols', 'PERSON'), ('Nichols', 'PERSON'), ('Nichols', 'PERSON'), ('Nichols', 'PERSON'), ('Nichols', 'PERSON'), ('Nichols', 'PERSON'), ('Nichols', 'ORGANIZATION'), ('Nichols', 'PERSON'), ('CTA', 'ORGANIZATION'), ('Plan', 'ORGANIZATION'), ('Nichols', 'PERSON'), ('Committee', 'ORGANIZATION'), ('Committee', 'ORGANIZATION'), ('Nichols', 'PERSON'), ('Nichols', 'PERSON'), ('Nichols', 'PERSON'), ('Nichols', 'PERSON'), ('Nichols', 'PERSON'), ('Nichols', 'PERSON'), ('Nichols', 'PERSON'), ('Nichols', 'PERSON'), ('Plan', 'ORGANIZATION'), ('CTA', 'ORGANIZATION'), ('Nichols', 'PERSON'), ('Federal', 'ORGANIZATION'), ('Leach', 'PERSON'), ('Plan', 'PERSON'), ('Plan', 'ORGANIZATION'), ('Participant', 'ORGANIZATION'), ('Nichols', 'PERSON'), ('Federal', 'ORGANIZATION'), ('Nichols', 'PERSON'), ('Plan', 'ORGANIZATION'), ('Nichols', 'PERSON'), ('New', 'GPE'), ('Schmitt', 'PERSON'), ('Copeland', 'ORGANIZATION'), ('Schmitt', 'PERSON'), ('Schmitt', 'PERSON'), ('Internal', 'ORGANIZATION'), ('New', 'GPE'), ('Schmitt', 'PERSON'), ('New', 'GPE'), ('Schmitt', 'PERSON'), ('IRS', 'ORGANIZATION'), ('Schmitt', 'PERSON'), ('Schmitt', 'PERSON'), ('Schmitt', 'PERSON'), ('Schmitt', 'PERSON'), ('Nichols', 'PERSON'), ('Beverly', 'ORGANIZATION'), ('Credit', 'ORGANIZATION'), ('Committee', 'ORGANIZATION'), ('Nichols', 'PERSON'), ('CTA', 'ORGANIZATION'), ('BURKE', 'ORGANIZATION')]"
25340,PRESIDING JUSTICE McDADE,"[('JUSTICE', 'ORGANIZATION'), ('Turner', 'ORGANIZATION'), ('Defendant', 'PERSON'), ('Sharon', 'PERSON'), ('David', 'PERSON'), ('Plaintiff', 'PERSON'), ('Moline', 'GPE'), ('Illinois', 'GPE'), ('Moline', 'PERSON'), ('Dance', 'PERSON'), ('Academy', 'GPE'), ('Pirkl', 'PERSON'), ('Academy', 'ORGANIZATION'), ('Van', 'PERSON'), ('Academy', 'PERSON'), ('Pirkl', 'PERSON'), ('Academy', 'GPE'), ('Pirkl', 'PERSON'), ('Academy', 'ORGANIZATION'), ('Academy', 'ORGANIZATION'), ('parties.In', 'ORGANIZATION'), ('Lisa', 'PERSON'), ('Allen', 'PERSON'), ('Academy', 'ORGANIZATION'), ('Academy', 'ORGANIZATION'), ('Plaintiff', 'PERSON'), ('Pirkl', 'PERSON'), ('Van', 'PERSON'), ('Van', 'PERSON'), ('Academy', 'PERSON'), ('Pirkl', 'PERSON'), ('Pirkl', 'PERSON'), ('Van', 'PERSON'), ('Acker', 'PERSON'), ('Donald', 'PERSON'), ('Brace', 'PERSON'), ('Turner', 'PERSON'), ('Brace', 'PERSON'), ('Turner', 'ORGANIZATION'), ('Turner', 'GPE'), ('Bruce', 'PERSON'), ('Turner', 'ORGANIZATION'), ('True', 'PERSON'), ('Ronald', 'PERSON'), ('Supreme', 'ORGANIZATION'), ('Van', 'PERSON'), ('Defendant', 'PERSON'), ('Van', 'PERSON'), ('William', 'PERSON'), ('Don', 'PERSON'), ('Turner', 'ORGANIZATION'), ('Plaintiff', 'PERSON'), ('Don', 'PERSON'), ('Don', 'PERSON'), ('Mark', 'PERSON'), ('Vandewiele', 'PERSON'), ('Vandewiele', 'PERSON'), ('Van', 'PERSON'), ('Vandewiele', 'PERSON'), ('Admission', 'ORGANIZATION'), ('Van', 'PERSON'), ('Summary', 'PERSON'), ('Illinois', 'PERSON'), ('Code', 'ORGANIZATION'), ('Civil', 'PERSON'), ('Logan', 'PERSON'), ('Farms', 'PERSON'), ('Logan', 'PERSON'), ('Loyola', 'PERSON'), ('Outboard', 'PERSON'), ('Liberty', 'PERSON'), ('Estate', 'ORGANIZATION'), ('Albergo', 'PERSON'), ('Colonial', 'PERSON'), ('American', 'ORGANIZATION'), ('Lines', 'PERSON'), ('Johnson', 'PERSON'), ('Western', 'GPE'), ('States', 'PERSON'), ('Louis', 'PERSON'), ('Associates', 'PERSON'), ('Plaintiff', 'PERSON'), ('Carothers', 'ORGANIZATION'), ('Academy', 'ORGANIZATION'), ('Plaintiff', 'PERSON'), ('SanctionsNext', 'ORGANIZATION'), ('Van', 'PERSON'), ('Van', 'PERSON'), ('Van', 'PERSON'), ('VandeWiele', 'ORGANIZATION'), ('VandeWiele', 'ORGANIZATION'), ('Toland', 'PERSON'), ('Toland', 'GPE'), ('Vandewiele', 'PERSON'), ('Yassin', 'PERSON'), ('Certified', 'PERSON'), ('Illinois', 'GPE'), ('Estate', 'ORGANIZATION'), ('Smith', 'GPE'), ('Associates', 'PERSON'), ('Tim', 'PERSON'), ('Rein', 'PERSON'), ('David', 'PERSON'), ('Elledge', 'PERSON'), ('Smith', 'PERSON'), ('Smith', 'PERSON'), ('Supreme', 'ORGANIZATION'), ('Committee', 'ORGANIZATION'), ('Supreme', 'ORGANIZATION'), ('Smith', 'ORGANIZATION'), ('Smith', 'GPE'), ('Smith', 'PERSON'), ('Smith', 'PERSON'), ('Smith', 'GPE'), ('Supreme', 'ORGANIZATION'), ('Emphasis', 'ORGANIZATION'), ('Van', 'PERSON'), ('Plaintiff', 'PERSON'), ('Van', 'PERSON'), ('Van', 'PERSON'), ('Deem', 'PERSON'), ('Van', 'PERSON'), ('Van', 'PERSON'), ('Supreme', 'ORGANIZATION'), ('Supreme', 'ORGANIZATION'), ('Deboe', 'PERSON'), ('Flick', 'PERSON'), ('Supreme', 'ORGANIZATION'), ('Absence', 'ORGANIZATION'), ('Denial', 'GPE'), ('Sims', 'PERSON'), ('Alton', 'GPE'), ('Mr.', 'PERSON'), ('Turner', 'ORGANIZATION'), ('SCHMIDT', 'ORGANIZATION')]"
25341,JUSTICE SMITH,"[('JUSTICE', 'ORGANIZATION'), ('Ronnie', 'PERSON'), ('Defendant', 'PERSON'), ('Supreme', 'ORGANIZATION'), ('Supreme', 'ORGANIZATION'), ('Chicago', 'GPE'), ('Supreme', 'ORGANIZATION'), ('State', 'ORGANIZATION'), ('Lloyd', 'PERSON'), ('Defendant', 'PERSON'), ('State', 'ORGANIZATION'), ('Court', 'PERSON'), ('Defendant', 'ORGANIZATION'), ('Wilk', 'PERSON'), ('Wilk', 'PERSON'), ('Foster', 'PERSON'), ('Foster', 'PERSON'), ('472-73.Supreme', 'ORGANIZATION'), ('Foster', 'GPE'), ('Foster', 'PERSON'), ('Munoz', 'PERSON'), ('Foster', 'PERSON'), ('Jamison', 'PERSON'), ('Jamison', 'PERSON'), ('Jamison', 'PERSON'), ('State', 'ORGANIZATION'), ('People', 'GPE'), ('Defendant', 'ORGANIZATION'), ('Castillo', 'PERSON'), ('State', 'ORGANIZATION'), ('Massa', 'PERSON'), ('Castillo', 'PERSON'), ('Castillo', 'PERSON'), ('See', 'PERSON'), ('Foster', 'PERSON'), ('Defendant', 'PERSON'), ('State', 'ORGANIZATION'), ('JJ', 'ORGANIZATION')]"
