{
  "auditorDeployments": [
    {
      "name": "auditor",
      "image": "derivadex/ddx-auditor:3.0.0",
      "auditorConfig": {
        "logLevel": "verbose",
        "stagingEnv": "beta"
      },
      "isKube": false
    }
  ],
  "mmDeployments": [
    {
      "auditorName": "auditor",
      "image": "derivadex/ddx-mm:3.0.0",
      "mmCount": 1,
      "mmConfig": {
        "symbol": "ETHPERP",
        "depositMinimum": 1000,
        "depositAmount": 100000,
        "levelsToQuote": 10,
        "logLevel": "info",
        "priceOffset": 0.001,
        "quantityPerLevel": 10,
        "refPXDeviationToReplaceOrders": 0.0001,
        "sleepRate": 5,
        "tradingStrategy": "MAKER"
      },
      "ethereumConfigs": [
        {
          "address": "<bot-address>",
          "privateKey": "<bot-private-key>",
          "mnemonic": "<bot-mnemonic>",
          "rpcUrl": "<your-rpc-url>"
        }
      ]
    }
  ],
  "mtDeployments": [
    {
      "auditorName": "auditor",
      "image": "derivadex/ddx-mt:3.0.0",
      "mtCount": 1,
      "mtConfig": {
        "depositMinimum": 1,
        "depositAmount": 1000,
        "logLevel": "info",
        "longLikelihood": 0.1,
        "quantity": 2,
        "sleepRate": 5
      },
      "ethereumConfigs": [
        {
          "address": "<bot-address>",
          "privateKey": "<bot-private-key>",
          "mnemonic": "<bot-mnemonic>",
          "rpcUrl": "<your-rpc-url>"
        }
      ]
    }
  ]
}
