<?xml version="1.0" standalone="no"?>
<!DOCTYPE svg PUBLIC "-//W3C//DTD SVG 1.1//EN" "http://www.w3.org/Graphics/SVG/1.1/DTD/svg11.dtd">
<svg xmlns="http://www.w3.org/2000/svg">
<metadata>Copyright (C) 2018 by original authors @ fontello.com</metadata>
<defs>
<font id="fontello" horiz-adv-x="1000" >
<font-face font-family="fontello" font-weight="400" font-stretch="normal" units-per-em="1000" ascent="850" descent="-150" />
<missing-glyph horiz-adv-x="1000" />
<glyph glyph-name="attention" unicode="&#xe800;" d="M571 83v106q0 8-5 13t-12 5h-108q-7 0-12-5t-5-13v-106q0-8 5-13t12-6h108q7 0 12 6t5 13z m-1 208l10 257q0 6-5 10-7 6-14 6h-122q-6 0-14-6-5-4-5-12l9-255q0-5 6-9t13-3h103q8 0 14 3t5 9z m-7 522l428-786q20-35-1-70-9-17-26-26t-35-10h-858q-18 0-35 10t-26 26q-21 35-1 70l429 786q9 17 26 27t36 10 36-10 27-27z" horiz-adv-x="1000" />

<glyph glyph-name="wrench" unicode="&#xe801;" d="M214 29q0 14-10 25t-25 10-25-10-11-25 11-25 25-11 25 11 10 25z m360 234l-381-381q-21-20-50-20-29 0-51 20l-59 61q-21 20-21 50 0 29 21 51l380 380q22-55 64-97t97-64z m354 243q0-22-13-59-27-75-92-122t-144-46q-104 0-177 73t-73 177 73 176 177 74q32 0 67-10t60-26q9-6 9-15t-9-16l-163-94v-125l108-60q2 2 44 27t75 45 40 20q8 0 13-5t5-14z" horiz-adv-x="928.6" />

<glyph glyph-name="mail" unicode="&#xe802;" d="M30 586q-32 18-28 40 2 14 26 14l846 0q38 0 20-32-8-14-24-22-14-6-192-102t-182-98q-16-10-46-10-28 0-46 10-4 2-182 98t-192 102z m850-100q20 10 20-10l0-368q0-16-17-32t-33-16l-800 0q-16 0-33 16t-17 32l0 368q0 20 20 10l384-200q18-10 46-10t46 10z" horiz-adv-x="900" />

<glyph glyph-name="attention-1" unicode="&#xe803;" d="M957-24q10-16 0-34-10-16-30-16l-892 0q-18 0-28 16-13 18-2 34l446 782q8 18 30 18t30-18z m-420 50l0 100-110 0 0-100 110 0z m0 174l0 300-110 0 0-300 110 0z" horiz-adv-x="962" />

<glyph glyph-name="flow-split" unicode="&#xe804;" d="M678 142q65 0 110-46t46-111-46-110-110-46q-50 0-91 29t-57 76l-165 0q-107 0-184 76t-77 184l0 374q-45 16-75 57t-29 90q0 65 46 111t110 46 111-46 46-111q0-50-30-90t-74-57l0-9q0-65 45-111t111-45l165 0q16 45 57 74t91 30q65 0 110-46t46-111-46-110-110-46q-50 0-91 29t-57 75l-165 0q-84 0-156 54l0-158q0-65 45-111t111-45l165 0q16 45 57 74t91 30z m0 261q-22 0-37-16t-16-37 16-37 37-15 36 15 15 37-15 37-36 16z m-522 364q-21 0-37-15t-15-37 15-37 37-15 37 15 16 37-16 37-37 15z m522-833q21 0 36 15t15 36-15 37-36 16-37-16-16-37 16-36 37-15z" horiz-adv-x="834" />

<glyph glyph-name="wrench-1" unicode="&#xe805;" d="M900 640q11-37 11-66 0-93-65-158t-158-65q-51 0-96 22l-447-448q-21-22-53-22-30 0-52 22t-22 53 22 53l447 447q-23 45-23 96 0 92 66 157t158 66q31 0 63-10l-138-139 0-149 147 0z" horiz-adv-x="928" />

<glyph glyph-name="signal" unicode="&#xe806;" d="M424 644c-31 0-58 26-58 58s27 57 58 57c32 0 57-26 57-57s-25-58-57-58z m327-744c9-24-2-50-26-59-5-2-10-2-16-2-18 0-35 10-41 29l-14 35-460 0-14-35c-6-19-24-29-41-29-6 0-11 0-16 2-24 9-35 35-27 59l278 714 42 29 17 0 41-29z m-178 212l-44 111-71-71 77-77z m-149 382l-70-181 140 0z m87-226l-170 0 85-84z m-191-41l-44-112 42-40 77 77z m-109-279l170 0-122 121z m215 17l78 78-78 77-77-77z m45-17l165 0-46 119z m165 582l-37 37c26 25 40 61 40 95 0 30-13 63-36 88l35 35c32-36 55-81 55-128 0-44-18-89-57-127z m134-72l-39 39c44 42 67 100 65 161 2 60-21 119-65 162l38 37c56-55 84-129 85-203-1-69-25-140-84-196z m-551 331l36-37c-26-25-40-62-40-94s13-65 36-89l-35-35c-33 34-55 81-55 128 0 43 18 88 58 127z m-135 73l39-40c-44-43-67-100-67-162 0-60 23-117 67-161l-38-39c-56 57-84 130-85 204 1 69 25 140 84 198z" horiz-adv-x="854" />

<glyph glyph-name="gplus" unicode="&#xe807;" d="M0 32q0 87 89 155t215 68l54 0q-42 40-42 86 0 29 16 58-10-1-29-1-104 0-170 65t-66 160q0 91 82 159t187 68l310 0-69-50-98 0q47-18 74-68t26-111q0-93-88-162-37-29-48-46t-11-42q0-19 27-48t54-49q61-43 85-88t23-113q0-90-82-157t-222-66q-133 0-225 50t-92 132z m112 33q0-69 59-118t145-48q119 0 173 44t53 117q0 19-4 32-3 11-7 21t-12 19-14 16-19 16-21 15-25 18-26 17q-39 12-77 12-90 1-157-47t-68-114z m66 559q11-79 61-136t109-58q59-2 94 52t25 133-59 134-110 57-95-51-25-131z m555-24l0 50 200 0 0 200 50 0 0-200 201 0 0-50-201 0 0-201-50 0 0 201-200 0z" horiz-adv-x="1184" />

<glyph glyph-name="users" unicode="&#xf064;" d="M0 49q20 7 60 22t69 26 50 22q37 19 57 56t21 76q0 27-31 64-19 21-33 60-45 18-45 76 0 43 14 61-5 39-9 82-5 55 26 108t84 84 110 32q43 0 85-19t73-50 48-72 14-83q-4-55-8-82 14-19 14-61 0-58-45-76-15-41-32-60-32-37-32-64 0-39 20-76t58-56q29-15 92-38t113-43 66-38q18-17 28-47t10-51l1-21h-878v168z m705 299q0 34 12 50-5 32-7 67-4 45 21 89t69 72 90 27 89-27 69-72 22-89q-2-35-8-67 12-16 12-50 0-48-36-62-12-33-27-50-9-10-13-16t-9-16-4-20q0-32 17-62t47-46q17-9 42-19t60-22 50-19v-135h-254q0 4 0 11t-3 26-7 36-15 38-23 33q-23 25-53 44t-79 37q27 34 27 78 0 10-5 20t-8 16-12 16q-14 15-27 49-37 16-37 63z" horiz-adv-x="1201.2" />

<glyph glyph-name="suitcase" unicode="&#xf0f2;" d="M357 636h286v71h-286v-71z m-196 0v-715h-36q-51 0-88 37t-37 88v465q0 51 37 88t88 37h36z m625 0v-715h-572v715h72v89q0 22 15 38t38 16h322q22 0 38-16t15-38v-89h72z m214-125v-465q0-51-37-88t-88-37h-36v715h36q51 0 88-37t37-88z" horiz-adv-x="1000" />

<glyph glyph-name="coffee" unicode="&#xf0f4;" d="M929 493q0 45-32 76t-76 31h-35v-214h35q45 0 76 31t32 76z m-929-429h1000q0-59-42-101t-101-42h-714q-59 0-101 42t-42 101z m1036 429q0-89-63-152t-152-62h-35v-18q0-52-37-88t-88-37h-393q-51 0-88 37t-37 88v410q0 15 11 26t25 10h642q89 0 152-63t63-151z" horiz-adv-x="1071.4" />

<glyph glyph-name="folder-open-empty" unicode="&#xf115;" d="M994 331q0 19-30 19h-607q-22 0-48-12t-39-29l-164-203q-11-13-11-22 0-20 30-20h607q23 0 48 13t40 29l164 203q10 12 10 22z m-637 90h429v90q0 22-16 38t-38 15h-321q-23 0-38 16t-16 38v36q0 22-15 38t-38 15h-179q-22 0-38-15t-16-38v-476l143 175q25 30 65 49t78 19z m708-90q0-35-25-67l-165-203q-24-30-65-49t-78-19h-607q-51 0-88 37t-37 88v536q0 51 37 88t88 37h179q51 0 88-37t37-88v-18h303q52 0 88-37t37-88v-90h107q30 0 56-13t37-40q8-17 8-37z" horiz-adv-x="1071.4" />

<glyph glyph-name="rocket" unicode="&#xf135;" d="M804 600q0 22-16 38t-38 16-38-16-16-38 16-38 38-16 38 16 16 38z m125 161q0-139-43-240t-141-202q-45-44-109-98l-11-211q-1-9-9-15l-214-125q-4-2-9-2-7 0-13 5l-36 36q-7 7-4 17l47 155-156 156-154-47q-2-1-6-1-7 0-12 5l-36 36q-10 11-3 22l125 214q6 8 15 9l211 11q54 64 98 109 105 104 200 144t241 40q7 0 13-6t6-12z" horiz-adv-x="928.6" />

<glyph glyph-name="sliders" unicode="&#xf1de;" d="M196 64v-71h-196v71h196z m197 72q14 0 25-11t11-25v-143q0-14-11-25t-25-11h-143q-14 0-25 11t-11 25v143q0 15 11 25t25 11h143z m89 214v-71h-482v71h482z m-357 286v-72h-125v72h125z m732-572v-71h-411v71h411z m-536 643q15 0 26-10t10-26v-142q0-15-10-25t-26-11h-142q-15 0-25 11t-11 25v142q0 15 11 26t25 10h142z m358-286q14 0 25-10t10-25v-143q0-15-10-25t-25-11h-143q-15 0-25 11t-11 25v143q0 14 11 25t25 10h143z m178-71v-71h-125v71h125z m0 286v-72h-482v72h482z" horiz-adv-x="857.1" />

<glyph glyph-name="slideshare" unicode="&#xf1e7;" d="M487 437q0-46-35-79t-85-34-85 34-36 79q0 47 36 80t85 33 85-33 35-80z m280 0q0-46-35-79t-85-34q-50 0-85 34t-36 79q0 47 36 80t85 33q50 0 85-33t35-80z m126-100v372q0 48-18 69t-62 20h-620q-47 0-63-19t-17-70v-376q24-13 50-22t45-16 45-10 40-6 39-2 32-1 32 2 25 1q38 0 53-15 3-4 5-5 15-14 34-29 4 51 66 49 3 0 21-1t24-1 25-1 30 1 30 2 34 5 35 7 37 11 38 15 40 20z m91 2q-68-83-208-140 47-159-13-260-36-63-102-82-58-18-101 8-48 28-46 92l-1 182v0q-4 1-13 3t-13 3l-1-188q2-64-46-92-44-26-102-8-66 20-102 83-58 101-12 259-140 57-208 140-14 21-2 36t33-1q3-1 7-4t6-4v387q0 40 26 69t64 28h701q37 0 64-28t26-69v-387l12 8q21 15 33 1t-2-36z" horiz-adv-x="1000" />

<glyph glyph-name="simplybuilt" unicode="&#xf215;" d="M482 274q0 63-45 107t-107 44-106-44-44-107 44-106 106-45 107 45 45 106z m481 1q0 62-44 106t-106 44-107-44-45-106q0-63 45-107t107-45 106 45 44 107z m180 451v-752q0-25-18-42t-42-18h-1023q-25 0-42 18t-18 42v752q0 25 18 42t42 18h241q24 0 42-18t18-42v-90h421v90q0 25 18 42t42 18h241q25 0 42-18t18-42z" horiz-adv-x="1142.9" />

<glyph glyph-name="instagram-filled" unicode="&#xf31f;" d="M604 339c0 54-45 98-99 98-54 0-98-44-98-98 0-54 44-98 98-98 54 0 99 44 99 98z m146 510h-500c-137 0-249-111-249-248v-69h367c39 27 86 43 137 43 51 0 99-16 137-43h358v69c0 137-112 248-250 248z m101-236c0-15-12-28-28-28h-85c-16 0-28 13-28 28v85c0 16 12 28 28 28h85c16 0 28-12 28-28v-85z m-109-274c0-130-106-236-237-236-131 0-237 106-237 236 0 36 8 70 23 101h-290v-341c0-137 112-248 249-248h500c138 0 250 111 250 248v341h-280c14-31 22-65 22-101z" horiz-adv-x="1000" />
</font>
</defs>
</svg>