{
	"info": {
		"_postman_id": "f3f950e2-ab53-4952-80f3-599a6d6c458d",
		"name": "ESTRUCTURA",
		"schema": "https://schema.getpostman.com/json/collection/v2.0.0/collection.json"
	},
	"item": [
		{
			"name": "TAD PILA",
			"item": [
				{
					"name": "VACIA",
					"request": {
						"method": "POST",
						"header": [],
						"body": {
							"mode": "raw",
							"raw": "{\r\n   \r\n}",
							"options": {
								"raw": {
									"language": "json"
								}
							}
						},
						"url": "http://localhost:5005/pila/vacia"
					},
					"response": []
				},
				{
					"name": "CIMA",
					"request": {
						"method": "POST",
						"header": [],
						"body": {
							"mode": "raw",
							"raw": "{\r\n  \r\n}",
							"options": {
								"raw": {
									"language": "json"
								}
							}
						},
						"url": "http://localhost:5005/pila/cima"
					},
					"response": []
				},
				{
					"name": "APILAR",
					"request": {
						"method": "POST",
						"header": [],
						"body": {
							"mode": "raw",
							"raw": "{\r\n    \"dato\":  \"ojo\"\r\n}",
							"options": {
								"raw": {
									"language": "json"
								}
							}
						},
						"url": "http://localhost:5005/pila/apilar"
					},
					"response": []
				},
				{
					"name": "DESAPILAR",
					"request": {
						"method": "POST",
						"header": [],
						"body": {
							"mode": "raw",
							"raw": "{\r\n\r\n}",
							"options": {
								"raw": {
									"language": "json"
								}
							}
						},
						"url": "http://localhost:5005/pila/desapilar"
					},
					"response": []
				}
			]
		},
		{
			"name": "TAD COLA",
			"item": [
				{
					"name": "VACIA",
					"request": {
						"method": "POST",
						"header": [],
						"body": {
							"mode": "raw",
							"raw": "{\r\n   \r\n}",
							"options": {
								"raw": {
									"language": "json"
								}
							}
						},
						"url": "http://localhost:5005/cola/vacia"
					},
					"response": []
				},
				{
					"name": "FRONTAL",
					"request": {
						"method": "POST",
						"header": [],
						"body": {
							"mode": "raw",
							"raw": "{\r\n  \r\n}",
							"options": {
								"raw": {
									"language": "json"
								}
							}
						},
						"url": "http://localhost:5005/cola/frontal"
					},
					"response": []
				},
				{
					"name": "ENCOLAR",
					"request": {
						"method": "POST",
						"header": [],
						"body": {
							"mode": "raw",
							"raw": "{\r\n    \"dato\":  \"cabeza 6\"\r\n}",
							"options": {
								"raw": {
									"language": "json"
								}
							}
						},
						"url": "http://localhost:5005/cola/encolar"
					},
					"response": []
				},
				{
					"name": "DESENCOLAR",
					"request": {
						"method": "POST",
						"header": [],
						"body": {
							"mode": "raw",
							"raw": "{\r\n\r\n}",
							"options": {
								"raw": {
									"language": "json"
								}
							}
						},
						"url": "http://localhost:5005/cola/desencolar"
					},
					"response": []
				}
			]
		},
		{
			"name": "TAD LISTA",
			"item": [
				{
					"name": "AGREAGAR AL INICIO",
					"request": {
						"method": "POST",
						"header": [],
						"body": {
							"mode": "raw",
							"raw": "{\r\n   \"dato\":\"REGUE\"\r\n}",
							"options": {
								"raw": {
									"language": "json"
								}
							}
						},
						"url": "http://localhost:5005/lista/agregar_al_inicio"
					},
					"response": []
				},
				{
					"name": "AGREAGAR AL FINAL",
					"request": {
						"method": "POST",
						"header": [],
						"body": {
							"mode": "raw",
							"raw": "{\r\n   \"dato\":\"REGUE\"\r\n}",
							"options": {
								"raw": {
									"language": "json"
								}
							}
						},
						"url": "http://localhost:5005/lista/agregar_al_final"
					},
					"response": []
				},
				{
					"name": "MOSTRAR LISTA",
					"request": {
						"method": "POST",
						"header": [],
						"body": {
							"mode": "raw",
							"raw": "{\r\n   \"dato\":\"uno\"\r\n}",
							"options": {
								"raw": {
									"language": "json"
								}
							}
						},
						"url": "http://localhost:5005/lista/mostrar_lista"
					},
					"response": []
				}
			]
		}
	]
}