teamLetter,time,mentorFullname,mentorAvailability,mentorEmail,studentEmails
G,Thu/Fri 9-5 except 10-11a,Callie Smith,Thu/Fri 9-5 except 10-11a,mentorb@cs.unc.edu,"groupGstudent0@cs.unc.edu,groupGstudent1@cs.unc.edu,groupGstudent2@cs.unc.edu,groupGstudent3@cs.unc.edu"
F,Fri  at 2:30p,Ollie Smith,Fri @2:30p,mentorb@cs.unc.edu,"groupFstudent0@cs.unc.edu,groupFstudent1@cs.unc.edu,groupFstudent2@cs.unc.edu"
L,Mon-Thu 5:15-6:30p; Fri 3:15-4p,Mike Smith,Mon-Thu 5:15-6:30p; Fri 3:15-4p,mentorb@cs.unc.edu,"groupLstudent0@cs.unc.edu,groupLstudent1@cs.unc.edu,groupLstudent2@cs.unc.edu"
V,Mon-Fri 5-7p,Lisa Smith,Mon-Fri 5-7p,mentorb@cs.unc.edu,"groupVstudent0@cs.unc.edu,groupVstudent1@cs.unc.edu,groupVstudent2@cs.unc.edu"
W,"Mon-Fri 8a-6p EXCEPT Mon/Wed 12:30-1p, Wed 3:30-4p, or Fri 9:30-10a",Philip Smith,"Mon-Fri 8a-6p EXCEPT Mon/Wed 12:30-1p, Wed 3:30-4p, or Fri 9:30-10a",mentorb@cs.unc.edu,"groupWstudent0@cs.unc.edu,groupWstudent1@cs.unc.edu,groupWstudent2@cs.unc.edu"
U,Mon/Wed 9-5 except 11a-12p; Thu 9-11a or  at 2p; Fri 10:30a-12p,Danny Smith,Mon/Wed 9-5 except 11a-12p; Thu 9-11a or @2p; Fri 10:30a-12p,mentorb@cs.unc.edu,"groupUstudent0@cs.unc.edu,groupUstudent1@cs.unc.edu,groupUstudent2@cs.unc.edu"
D,Fri  at 3p,Adam Smith,Fri @3p,mentora@cs.unc.edu,"groupDstudent0@cs.unc.edu,groupDstudent1@cs.unc.edu,groupDstudent2@cs.unc.edu"
K,Mon/Tue 11a-2p or  at 4p; Wed 11a-5p; Thu/Fri 12-2p or  at 4p,Ed Smith,Mon/Tue 11a-2p or @4p; Wed 11a-5p; Thu/Fri 12-2p or @4p,mentorb@cs.unc.edu,"groupKstudent0@cs.unc.edu,groupKstudent1@cs.unc.edu,groupKstudent2@cs.unc.edu"
N,Mon-Fri 12-5p,Greg Smith,Mon-Fri 12-5p,mentorb@cs.unc.edu,"groupNstudent0@cs.unc.edu,groupNstudent1@cs.unc.edu,groupNstudent2@cs.unc.edu"
A,Mon-Fri  at 1p or  at 5p,Nicholas Smith,Mon-Fri @1p or @5p,mentorb@cs.unc.edu,"groupAstudent0@cs.unc.edu,groupAstudent1@cs.unc.edu,groupAstudent2@cs.unc.edu"
X,Tue/Wed/Thu  at 2p  at 3p or  at 4p,Fran Smith,Tue/Wed/Thu @2p @3p or @4p,mentorb@cs.unc.edu,"groupXstudent0@cs.unc.edu,groupXstudent1@cs.unc.edu,groupXstudent2@cs.unc.edu"
S,Mon-Thu  at 8p,Howard Smith,Mon-Thu @8p,mentorb@cs.unc.edu,"groupSstudent0@cs.unc.edu,groupSstudent1@cs.unc.edu,groupSstudent2@cs.unc.edu"
O,Tue-Thu  at 10a,Jim Smith,Tue-Thu @10a,mentorb@cs.unc.edu,"groupOstudent0@cs.unc.edu,groupOstudent1@cs.unc.edu,groupOstudent2@cs.unc.edu"
C,Tue-Thu 4-6p,Kam Smith,Tue-Thu 4-6p,mentorb@cs.unc.edu,"groupCstudent0@cs.unc.edu,groupCstudent1@cs.unc.edu,groupCstudent2@cs.unc.edu"
H,Tue  at 10a,Benjamin Smith,Tue @10a,mentorb@cs.unc.edu,"groupHstudent0@cs.unc.edu,groupHstudent1@cs.unc.edu,groupHstudent2@cs.unc.edu"
