127.0.0.1 - - [02/Apr/2020:19:19:06 +0800] "GET / HTTP/1.1" 404 709
127.0.0.1 - - [02/Apr/2020:19:19:43 +0800] "GET /CalculatorWS/services/Calculator?wsdl HTTP/1.1" 200 11019
127.0.0.1 - - [02/Apr/2020:19:19:43 +0800] "GET /CalculatorWS/services/Calculator?wsdl HTTP/1.1" 200 11019
0:0:0:0:0:0:0:1 - - [02/Apr/2020:19:20:20 +0800] "GET / HTTP/1.1" 404 709
0:0:0:0:0:0:0:1 - - [02/Apr/2020:19:20:33 +0800] "GET /CalculatorWS HTTP/1.1" 302 -
0:0:0:0:0:0:0:1 - - [02/Apr/2020:19:20:35 +0800] "GET /CalculatorWS/ HTTP/1.1" 200 3478
0:0:0:0:0:0:0:1 - - [02/Apr/2020:19:20:36 +0800] "GET /CalculatorWS/axis2-web/images/asf-logo.gif HTTP/1.1" 200 5866
0:0:0:0:0:0:0:1 - - [02/Apr/2020:19:20:36 +0800] "GET /CalculatorWS/axis2-web/images/axis_l.jpg HTTP/1.1" 200 12340
0:0:0:0:0:0:0:1 - - [02/Apr/2020:19:20:36 +0800] "GET /CalculatorWS/axis2-web/css/axis-style.css HTTP/1.1" 200 1587
0:0:0:0:0:0:0:1 - - [02/Apr/2020:19:21:01 +0800] "GET /CalculatorWS/services/Calculator?wsdl HTTP/1.1" 200 11019
