{
  "plotly": {
    "background_color": "white",
    "gauge": {
      "title_color": "dimgray",
      "bar_color": "dimgray",
      "background_color": "lightgray",
      "border_color": "white",
      "value_color": "darkgray"
    }
  },
  "disconnected": {
    "show_notification": false,
    "background_color": "black"
  }
}
