{
    "PresetList": [
        {
            "AlignAVStart": false,
            "AudioCopyMask": [
                "copy:mp2",
                "copy:mp3",
                "copy:aac",
                "copy:ac3",
                "copy:dts",
                "copy:dtshd",
                "copy:eac3",
                "copy:flac",
                "copy:truehd"
            ],
            "AudioEncoderFallback": "av_aac",
            "AudioLanguageList": [
                "any"
            ],
            "AudioList": [
                {
                    "AudioBitrate": 640,
                    "AudioCompressionLevel": -1.0,
                    "AudioDitherMethod": "auto",
                    "AudioEncoder": "copy",
                    "AudioMixdown": "5point1",
                    "AudioNormalizeMixLevel": false,
                    "AudioSamplerate": "auto",
                    "AudioTrackDRCSlider": 0.0,
                    "AudioTrackGainSlider": 0.0,
                    "AudioTrackQuality": 3.0,
                    "AudioTrackQualityEnable": false
                }
            ],
            "AudioSecondaryEncoderMode": false,
            "AudioTrackSelectionBehavior": "all",
            "ChapterMarkers": true,
            "ChildrenArray": [],
            "Default": false,
            "FileFormat": "av_mkv",
            "Folder": false,
            "FolderOpen": false,
            "InlineParameterSets": false,
            "MetadataPassthrough": true,
            "Mp4HttpOptimize": false,
            "Mp4iPodCompatible": false,
            "PictureAllowUpscaling": false,
            "PictureAutoCrop": true,
            "PictureBottomCrop": 2,
            "PictureChromaSmoothCustom": "",
            "PictureChromaSmoothPreset": "off",
            "PictureChromaSmoothTune": "none",
            "PictureColorspaceCustom": "",
            "PictureColorspacePreset": "off",
            "PictureCombDetectCustom": "",
            "PictureCombDetectPreset": "off",
            "PictureDARWidth": 3840,
            "PictureDeblockCustom": "strength=strong:thresh=20:blocksize=8",
            "PictureDeblockPreset": "off",
            "PictureDeblockTune": "medium",
            "PictureDeinterlaceCustom": "",
            "PictureDeinterlaceFilter": "off",
            "PictureDeinterlacePreset": "",
            "PictureDenoiseCustom": "",
            "PictureDenoiseFilter": "off",
            "PictureDenoisePreset": "",
            "PictureDenoiseTune": "none",
            "PictureDetelecine": "off",
            "PictureDetelecineCustom": "",
            "PictureForceHeight": 0,
            "PictureForceWidth": 0,
            "PictureHeight": 0,
            "PictureItuPAR": false,
            "PictureKeepRatio": true,
            "PictureLeftCrop": 0,
            "PictureLooseCrop": false,
            "PictureModulus": 2,
            "PicturePAR": "auto",
            "PicturePARHeight": 1,
            "PicturePARWidth": 1,
            "PicturePadBottom": 0,
            "PicturePadColor": "black",
            "PicturePadLeft": 0,
            "PicturePadMode": "none",
            "PicturePadRight": 0,
            "PicturePadTop": 0,
            "PictureRightCrop": 0,
            "PictureRotate": "angle=0:hflip=0",
            "PictureSharpenCustom": "",
            "PictureSharpenFilter": "off",
            "PictureSharpenPreset": "",
            "PictureSharpenTune": "",
            "PictureTopCrop": 2,
            "PictureUseMaximumSize": true,
            "PictureWidth": 0,
            "PresetDescription": "",
            "PresetDisabled": false,
            "PresetName": "Default Preset",
            "SubtitleAddCC": false,
            "SubtitleAddForeignAudioSearch": false,
            "SubtitleAddForeignAudioSubtitle": false,
            "SubtitleBurnBDSub": false,
            "SubtitleBurnBehavior": "none",
            "SubtitleBurnDVDSub": false,
            "SubtitleLanguageList": [
                "eng"
            ],
            "SubtitleTrackSelectionBehavior": "all",
            "Type": 1,
            "UsesPictureFilters": true,
            "VideoAvgBitrate": 6000,
            "VideoColorMatrixCodeOverride": 0,
            "VideoEncoder": "x265_10bit",
            "VideoFramerate": "auto",
            "VideoFramerateMode": "cfr",
            "VideoGrayScale": false,
            "VideoLevel": "auto",
            "VideoOptionExtra": "",
            "VideoPreset": "veryfast",
            "VideoProfile": "auto",
            "VideoQSVDecode": false,
            "VideoQualitySlider": 20.0,
            "VideoQualityType": 2,
            "VideoScaler": "swscale",
            "VideoTune": "",
            "VideoTurboTwoPass": true,
            "VideoTwoPass": true,
            "x264Option": "",
            "x264UseAdvancedOptions": false
        }
    ],
    "VersionMajor": 47,
    "VersionMicro": 0,
    "VersionMinor": 0
}