﻿DateSampled,River,Treatment,Species,ID,StandardLengthmm,Snails,UKNInvert,Ephemeroptera,Trichoptera,Detritus,Diptera,Swage,Trash,FilamentousAlgae,Mosquitoes,InvertsEggs,Chironomidae,Coleoptera,FIshScales,Seeds,Plastic,Fish,Scales,Crickets_Nymph,Rocks,Odonata,FishBones,WaterBugs,Obs
20/03/2023,Maracas,HighUrb,Andinoacara_pulcher,1,85.22,1,0,0,0,0,0,0,0,0,0,0,0,0,0,0,0,0,0,0,0,0,0,0,
20/03/2023,Maracas,HighUrb,Andinoacara_pulcher,2,35.41,1,0,1,0,1,0,0,0,0,0,0,0,0,0,0,0,0,1,0,0,0,0,0,
20/03/2023,Maracas,HighUrb,Andinoacara_pulcher,3,32.41,0,0,1,0,1,0,0,0,0,0,0,0,0,0,0,0,0,0,0,0,0,0,0,
20/03/2023,Maracas,HighUrb,Astyanax_bimaculatus,4,37.95,0,0,1,0,1,0,0,0,1,0,0,1,0,0,0,0,0,0,0,0,0,0,0,
20/03/2023,Maracas,HighUrb,Astyanax_bimaculatus,5,40.81,0,0,1,0,0,0,0,0,0,0,0,1,0,0,1,0,0,0,0,0,0,0,0,
20/03/2023,Maracas,HighUrb,Astyanax_bimaculatus,6,48.42,0,0,0,0,0,0,0,1,1,0,0,1,0,0,1,1,0,0,0,0,0,0,0,
20/03/2023,Maracas,HighUrb,Astyanax_bimaculatus,7,50.49,0,0,0,0,0,0,0,0,1,0,0,0,0,0,0,0,0,0,0,0,0,0,0,
20/03/2023,Maracas,HighUrb,Astyanax_bimaculatus,8,,0,0,1,0,1,0,0,0,0,0,0,1,0,0,0,0,0,0,1,0,1,0,0,
20/03/2023,Maracas,HighUrb,Poecilia_reticulata,9,21.29,0,0,0,0,1,0,0,0,0,0,0,0,0,0,0,0,0,0,0,0,0,0,0,
20/03/2023,Maracas,HighUrb,Poecilia_reticulata,10,15.21,0,0,0,0,1,0,0,1,0,0,0,0,0,0,0,0,0,0,0,0,0,0,0,
20/03/2023,Maracas,HighUrb,Poecilia_reticulata,11,17.15,0,0,0,0,1,0,0,0,1,0,0,0,0,0,0,0,0,0,0,0,0,0,0,
20/03/2023,Maracas,HighUrb,Poecilia_reticulata,12,15.75,0,0,0,0,1,0,0,1,1,0,0,0,0,0,0,0,0,0,0,0,0,0,0,
20/03/2023,Maracas,HighUrb,Poecilia_reticulata,13,23.26,0,0,1,0,0,0,0,0,0,0,0,1,0,0,0,0,0,0,0,0,0,0,0,
20/03/2023,Maracas,HighUrb,Poecilia_reticulata,14,19.07,0,0,0,0,1,0,0,0,0,0,0,0,0,0,0,0,0,0,0,0,0,0,0,
20/03/2023,Maracas,HighUrb,Poecilia_reticulata,15,19.81,0,0,0,0,1,0,0,0,0,0,0,0,0,0,0,0,0,0,0,0,0,0,0,
20/03/2023,Maracas,HighUrb,Poecilia_reticulata,16,13.6,0,0,0,0,1,0,0,0,1,0,0,0,0,0,0,0,0,0,0,0,0,0,0,
20/03/2023,Maracas,HighUrb,Poecilia_reticulata,17,14.57,0,0,0,0,1,0,0,1,0,0,0,0,0,0,0,0,0,0,0,0,0,0,0,
20/03/2023,Maracas,HighUrb,Poecilia_reticulata,19,14.47,0,0,0,0,1,0,0,1,1,0,0,0,0,0,0,0,0,0,0,0,0,0,0,
20/03/2023,Maracas,HighUrb,Poecilia_reticulata,20,12.48,0,0,0,0,1,0,0,0,0,0,0,0,0,0,0,0,0,0,0,0,0,0,0,
20/03/2023,Maracas,HighUrb,Poecilia_reticulata,21,13.76,0,0,0,0,1,0,0,0,0,0,0,0,0,0,0,0,0,0,0,0,0,0,0,
20/03/2023,Maracas,HighUrb,Ancistrus_maracasae,22,32.54,0,0,0,0,0,0,0,0,1,0,0,0,0,0,0,0,0,0,0,0,0,0,0,
20/03/2023,Maracas,HighUrb,Hypostomus_robinii,23,66.91,0,0,0,0,0,0,0,0,1,0,0,0,0,0,0,0,0,0,0,0,0,0,0,
21/03/2023,Maracas,LowUrb,Poecilia_reticulata,1,16.88,0,0,0,0,1,0,0,0,1,0,0,0,0,0,0,1,0,0,0,0,0,0,0,
21/03/2023,Maracas,LowUrb,Poecilia_reticulata,2,15.41,0,0,0,0,1,0,0,0,0,0,0,0,0,0,0,0,0,0,0,0,0,0,0,
21/03/2023,Maracas,LowUrb,Poecilia_reticulata,3,15.97,0,0,0,0,1,0,0,0,0,0,0,0,0,0,0,0,0,0,0,0,0,0,0,
21/03/2023,Maracas,LowUrb,Poecilia_reticulata,4,15.04,0,0,0,0,1,0,0,0,0,0,0,0,0,0,0,0,0,0,0,0,0,0,0,Detritus with redish color (like with a lot of iron).
21/03/2023,Maracas,LowUrb,Poecilia_reticulata,6,18.58,0,0,0,0,1,0,0,0,0,0,0,0,0,0,0,0,0,0,0,0,0,0,0,
21/03/2023,Maracas,LowUrb,Andinoacara_pulcher,7,42.96,0,0,1,0,1,0,0,0,1,0,0,1,0,0,0,0,0,1,0,1,0,0,0,
21/03/2023,Maracas,LowUrb,Crenicichla_frenata,8,36.38,0,0,1,1,0,0,0,0,0,0,0,0,0,0,0,0,0,0,0,0,0,0,1,
21/03/2023,Maracas,LowUrb,Ancistrus_maracasae,9,56.78,0,0,0,0,0,0,0,0,1,0,0,0,0,0,0,0,0,0,0,0,0,0,0,
21/03/2023,Maracas,LowUrb,Hemibrycon_taeniurus,10,47.57,0,0,0,0,0,0,0,0,0,0,0,0,0,0,0,0,0,0,0,0,0,0,0,
21/03/2023,Maracas,LowUrb,Hemibrycon_taeniurus,11,51.9,0,0,0,0,0,0,0,0,0,0,0,0,0,0,0,0,0,0,0,0,0,0,0,
21/03/2023,Maracas,LowUrb,Hemibrycon_taeniurus,12,53.99,0,0,0,0,0,0,0,0,0,0,0,0,0,0,0,0,0,0,0,0,0,0,0,
21/03/2023,Maracas,LowUrb,Hemibrycon_taeniurus,13,55.28,0,0,0,0,0,0,0,0,0,0,0,0,0,0,0,0,0,0,0,0,0,0,0,
21/03/2023,Maracas,LowUrb,Hemibrycon_taeniurus,14,53.74,0,0,0,0,0,0,0,0,0,0,0,0,0,0,0,0,0,0,0,0,0,0,0,
21/03/2023,Maracas,LowUrb,Astyanax_bimaculatus,20,91.85,0,0,1,0,0,0,0,0,1,0,0,0,0,0,0,0,0,1,0,0,0,0,0,
21/03/2023,Maracas,LowUrb,Astyanax_bimaculatus,21,96.66,0,0,0,0,0,0,0,0,1,0,0,0,0,0,0,0,0,0,0,0,0,0,0,
21/03/2023,Maracas,LowUrb,Astyanax_bimaculatus,22,79.39,0,0,0,0,0,0,0,0,1,0,0,0,0,0,0,0,0,0,0,0,0,0,0,
21/03/2023,Maracas,LowUrb,Astyanax_bimaculatus,23,68.72,0,0,0,0,0,0,0,0,1,0,0,0,0,0,0,1,0,0,0,0,0,0,0,
21/03/2023,Maracas,LowUrb,Astyanax_bimaculatus,24,82.02,0,0,0,0,0,0,0,0,1,0,0,0,0,0,0,0,0,0,0,0,0,0,0,
21/03/2023,Maracas,LowUrb,Andinoacara_pulcher,25,35.17,0,0,0,0,1,0,1,0,1,0,0,0,0,0,0,0,0,0,0,1,0,0,0,
16/03/2023,Tacarigua,HighUrb,Andinoacara_pulcher,1,93.48,1,1,0,0,1,0,1,0,0,0,0,0,0,0,0,0,0,0,0,0,0,0,0,
16/03/2023,Tacarigua,HighUrb,Andinoacara_pulcher,2,93,1,0,1,1,1,0,0,0,1,0,0,1,0,0,1,1,0,0,0,0,0,0,0,Ephemeroptera were Baetidae.
16/03/2023,Tacarigua,HighUrb,Astyanax_bimaculatus,1,73.37,0,0,1,0,0,0,0,0,1,0,0,0,0,0,1,0,0,0,0,0,0,0,0,Ephemeroptera were Baetidae.
16/03/2023,Tacarigua,HighUrb,Astyanax_bimaculatus,2,59.47,0,0,0,0,1,0,0,0,1,0,0,0,0,0,0,0,0,0,0,0,0,0,0,
16/03/2023,Tacarigua,HighUrb,Astyanax_bimaculatus,3,65.6,0,0,1,0,0,0,0,0,1,0,0,1,0,0,0,0,0,0,0,0,0,0,0,
16/03/2023,Tacarigua,HighUrb,Astyanax_bimaculatus,4,64.86,1,0,1,0,0,0,0,0,0,0,0,0,0,0,0,0,0,0,0,0,0,0,0,Leptohyphes sp. and Baetodes sp were the Ephemeroptera
16/03/2023,Tacarigua,HighUrb,Astyanax_bimaculatus,5,65.17,0,0,1,0,0,1,0,0,0,0,0,0,0,0,0,0,0,0,0,0,0,0,0,
16/03/2023,Tacarigua,HighUrb,Oreochromis_niloticus,1,83.39,0,0,0,0,1,0,0,0,1,0,0,0,0,0,0,0,0,0,0,0,0,0,0,
16/03/2023,Tacarigua,HighUrb,Oreochromis_niloticus,2,75.74,0,0,0,0,0,0,0,0,1,0,0,0,0,1,0,0,0,0,0,0,0,0,0,
16/03/2023,Tacarigua,HighUrb,Oreochromis_niloticus,3,62.23,0,0,0,0,0,0,1,0,1,0,0,0,0,0,0,0,0,0,0,0,0,0,0,
16/03/2023,Tacarigua,HighUrb,Oreochromis_niloticus,4,33.4,0,0,1,0,1,0,0,0,1,0,0,1,0,1,0,0,0,0,0,0,0,0,0,
16/03/2023,Tacarigua,HighUrb,Oreochromis_niloticus,5,30.96,0,0,1,0,1,0,0,0,1,0,0,1,0,0,0,0,0,0,0,0,0,0,0,
16/03/2023,Tacarigua,HighUrb,Oreochromis_niloticus,6,19.55,0,0,0,0,1,0,0,0,1,1,0,1,0,0,0,0,0,0,0,0,0,0,0,There might be diatoms inside all Tilapias and the other fishes.
16/03/2023,Tacarigua,HighUrb,Corydora_aeneus,1,32.45,0,0,1,1,1,0,0,0,0,0,0,1,0,0,0,0,0,0,0,0,0,0,0,
16/03/2023,Tacarigua,HighUrb,Corydora_aeneus,2,25.51,0,0,1,0,1,0,0,0,0,0,1,1,0,1,0,0,0,0,0,0,0,0,0,Both individuals had lots of fat. no filamentous algae. and looked really good in terms of collecting inverts.
16/03/2023,Tacarigua,HighUrb,Poecilia_reticulata,1,18.75,0,0,1,0,1,0,0,0,0,0,0,1,0,0,0,0,0,0,0,0,0,0,0,
16/03/2023,Tacarigua,HighUrb,Poecilia_reticulata,2,34.14,0,0,0,0,1,0,0,1,1,0,0,1,0,0,0,0,0,0,0,0,0,0,0,
16/03/2023,Tacarigua,HighUrb,Poecilia_reticulata,3,25.14,1,0,0,0,1,0,0,0,1,0,0,0,0,0,0,0,0,0,0,0,0,0,0,
16/03/2023,Tacarigua,HighUrb,Poecilia_reticulata,4,27.24,1,0,0,0,1,0,0,0,0,0,0,0,0,0,0,0,0,0,0,0,0,0,0,
16/03/2023,Tacarigua,HighUrb,Poecilia_reticulata,5,26.38,0,0,0,0,0,0,0,0,1,0,0,1,0,0,0,0,0,0,0,0,0,0,0,
16/03/2023,Tacarigua,HighUrb,Poecilia_reticulata,6,23.33,0,0,1,0,0,0,0,0,1,0,0,0,0,0,0,0,0,0,0,0,0,0,0,
16/03/2023,Tacarigua,HighUrb,Poecilia_reticulata,7,23.82,0,0,0,0,1,0,0,0,1,0,0,1,0,0,0,0,0,0,0,0,0,0,0,
16/03/2023,Tacarigua,HighUrb,Poecilia_reticulata,8,29.08,0,0,0,0,1,0,1,0,1,0,0,1,0,0,0,0,0,0,0,0,0,0,0,
16/03/2023,Tacarigua,HighUrb,Poecilia_reticulata,9,20.3,0,0,0,0,1,0,0,0,1,0,0,1,0,0,0,0,0,0,0,0,0,0,0,
16/03/2023,Tacarigua,HighUrb,Poecilia_reticulata,10,20.99,0,0,0,0,1,0,0,0,1,0,0,1,0,0,0,0,0,0,0,0,0,0,0,
16/03/2023,Tacarigua,HighUrb,Poecilia_reticulata,11,17.63,0,0,0,0,1,0,0,0,0,0,0,1,0,0,0,0,0,0,0,0,0,0,0,
21/03/2023,Tacarigua,LowUrb,Crenicichla_frenata,1,94.87,0,0,1,1,0,0,0,0,0,0,0,0,1,0,0,0,0,0,0,0,0,0,0,
21/03/2023,Tacarigua,LowUrb,Crenicichla_frenata,2,60.03,0,0,1,1,0,0,0,1,1,0,0,0,0,0,0,0,0,0,0,0,0,0,0,
21/03/2023,Tacarigua,LowUrb,Crenicichla_frenata,3,68.9,0,0,1,0,0,0,0,0,0,0,0,0,1,0,0,0,0,0,0,0,0,0,0,
21/03/2023,Tacarigua,LowUrb,Crenicichla_frenata,4,63.37,0,0,0,0,0,0,1,1,1,0,0,0,0,0,0,0,0,0,0,0,0,0,0,
21/03/2023,Tacarigua,LowUrb,Crenicichla_frenata,5,45.74,0,0,0,0,0,0,1,1,1,0,0,0,0,0,0,0,0,0,0,0,0,0,0,
22/03/2023,Tacarigua,LowUrb,Crenicichla_frenata,6,43.48,0,0,0,0,0,0,1,1,1,0,0,0,0,0,0,0,0,0,0,0,0,0,0,
22/03/2023,Tacarigua,LowUrb,Andinoacara_pulcher,7,75.37,0,0,0,0,1,0,0,0,1,0,0,0,0,0,0,0,0,0,0,0,0,0,0,
22/03/2023,Tacarigua,LowUrb,Andinoacara_pulcher,8,79.75,0,0,0,0,0,0,0,0,1,0,0,0,0,0,0,0,0,0,0,0,0,0,0,
22/03/2023,Tacarigua,LowUrb,Andinoacara_pulcher,9,43.8,0,0,1,1,0,0,0,0,1,0,0,1,0,0,0,0,0,1,0,0,0,0,0,
22/03/2023,Tacarigua,LowUrb,Andinoacara_pulcher,10,40.45,0,0,0,0,1,0,0,0,0,0,0,1,0,0,0,0,0,1,0,1,0,0,0,
22/03/2023,Tacarigua,LowUrb,Andinoacara_pulcher,11,41.54,0,0,0,0,0,0,0,0,1,0,0,1,0,0,0,0,0,0,0,0,0,1,0,
22/03/2023,Tacarigua,LowUrb,Andinoacara_pulcher,12,38,0,0,0,0,0,0,0,0,1,0,0,1,0,0,0,0,0,0,0,0,0,0,0,
22/03/2023,Tacarigua,LowUrb,Andinoacara_pulcher,13,29.15,0,0,1,0,0,1,0,0,1,0,0,1,0,0,0,0,0,0,0,0,0,0,0,
22/03/2023,Tacarigua,LowUrb,Andinoacara_pulcher,14,31.15,0,0,0,0,0,0,0,0,1,0,0,1,0,0,0,0,0,0,0,0,0,0,0,
22/03/2023,Tacarigua,LowUrb,Hoplias_malabaricus,15,64.75,0,0,0,0,0,0,0,0,0,0,0,0,0,0,0,0,1,0,0,0,0,0,0,P. reticulata and A. pulcher found in the gut.
22/03/2023,Tacarigua,LowUrb,Hoplias_malabaricus,16,58.54,0,0,1,0,0,0,0,0,0,0,0,0,0,0,0,0,1,0,0,0,0,0,0,P. reticulata found in the gut.
22/03/2023,Tacarigua,LowUrb,Poecilia_reticulata,17,28.05,0,0,0,0,0,0,0,1,1,0,0,0,0,0,0,0,0,0,0,0,0,0,0,
22/03/2023,Tacarigua,LowUrb,Poecilia_reticulata,18,30.05,0,0,0,0,0,0,0,0,1,0,0,0,0,0,0,0,0,0,0,0,0,0,0,
22/03/2023,Tacarigua,LowUrb,Poecilia_reticulata,19,21.1,0,0,0,0,0,0,0,0,1,0,0,0,0,0,0,0,0,0,0,0,0,0,0,
22/03/2023,Tacarigua,LowUrb,Poecilia_reticulata,20,15.88,0,0,0,0,0,0,0,0,1,0,0,0,0,0,0,0,0,0,0,0,0,0,0,
22/03/2023,Tacarigua,LowUrb,Poecilia_reticulata,21,14.48,0,0,0,0,0,0,0,0,1,0,0,0,0,0,0,0,0,0,0,0,0,0,0,
15/03/2023,Tunapuna,HighUrb,Rhamdia_quelen,1,88.84,1,0,0,0,1,0,0,0,0,0,0,1,0,0,0,0,1,0,0,1,0,0,0,
15/03/2023,Tunapuna,HighUrb,Astyanax_bimaculatus,1,74.32,0,0,0,0,0,0,1,0,0,0,0,0,0,0,0,0,0,0,0,0,0,0,0,
15/03/2023,Tunapuna,HighUrb,Astyanax_bimaculatus,2,66.15,0,0,0,0,1,0,1,0,0,0,0,1,0,0,0,0,0,0,0,0,0,0,0,
15/03/2023,Tunapuna,HighUrb,Astyanax_bimaculatus,3,62.39,0,0,0,0,1,0,1,0,0,0,0,1,1,0,0,0,0,0,0,0,0,0,0,
15/03/2023,Tunapuna,HighUrb,Astyanax_bimaculatus,4,59.35,0,0,0,0,1,0,1,0,0,0,0,0,0,0,0,0,0,0,0,0,0,0,0,
15/03/2023,Tunapuna,HighUrb,Poecilia_sphenops,1,53.86,0,0,0,0,1,0,0,0,0,0,0,0,0,0,0,0,0,0,0,0,0,0,0,
15/03/2023,Tunapuna,HighUrb,Poecilia_sphenops,2,58.9,0,0,0,0,1,0,0,0,0,0,0,0,0,0,0,0,0,0,0,0,0,0,0,
15/03/2023,Tunapuna,HighUrb,Poecilia_sphenops,3,48.53,0,0,0,0,1,0,1,0,1,0,0,0,0,0,0,0,0,0,0,0,0,0,0,
15/03/2023,Tunapuna,HighUrb,Poecilia_sphenops,4,52.84,0,0,0,0,0,0,1,0,0,1,0,0,0,0,0,0,0,0,0,0,0,0,0,
15/03/2023,Tunapuna,HighUrb,Poecilia_sphenops,5,44.53,0,0,0,0,0,0,1,0,1,0,0,0,0,0,0,0,0,0,0,0,0,0,0,
15/03/2023,Tunapuna,HighUrb,Poecilia_sphenops,6,40.88,0,0,0,0,1,0,1,0,1,0,0,0,0,0,0,0,0,0,0,0,0,0,0,
15/03/2023,Tunapuna,HighUrb,Poecilia_sphenops,7,37.56,0,0,0,0,1,0,1,0,0,0,0,0,0,0,0,1,0,0,0,0,0,0,0,
15/03/2023,Tunapuna,HighUrb,Poecilia_sphenops,8,34.41,0,0,0,0,1,0,0,0,0,0,0,0,0,0,0,0,0,0,0,0,0,0,0,
15/03/2023,Tunapuna,HighUrb,Poecilia_sphenops,9,35.42,0,0,0,0,1,0,1,0,0,0,0,0,0,0,0,0,0,0,0,0,0,0,0,
15/03/2023,Tunapuna,HighUrb,Poecilia_sphenops,10,66.97,0,0,0,0,1,0,0,0,0,0,0,0,0,0,0,0,0,0,0,0,0,0,0,
15/03/2023,Tunapuna,HighUrb,Poecilia_reticulata,1,28.67,0,0,0,0,1,0,0,0,0,0,0,0,0,0,0,0,0,0,0,0,0,0,0,
15/03/2023,Tunapuna,HighUrb,Poecilia_reticulata,2,30.68,0,0,0,0,1,0,0,0,0,0,0,0,0,0,0,0,0,0,0,0,0,0,0,
15/03/2023,Tunapuna,HighUrb,Poecilia_reticulata,3,28.72,0,0,0,0,1,0,0,0,0,0,0,0,0,0,0,0,0,0,0,0,0,0,0,
15/03/2023,Tunapuna,HighUrb,Poecilia_reticulata,4,27.3,0,0,0,0,1,0,0,0,0,0,0,0,0,0,0,0,0,0,0,0,0,0,0,
15/03/2023,Tunapuna,HighUrb,Poecilia_reticulata,5,22.7,0,0,0,0,1,0,0,0,0,0,0,0,0,0,0,0,0,0,0,0,0,0,0,
,,,,,,0,0,0,0,0,0,0,0,0,0,0,0,0,0,0,0,0,0,0,0,0,0,0,