﻿River,Treatment,SiteID,Time,EvaluatedBy,Temperature_C,DO,pH,Conductivity,Pressure,Salinity
Maracas,LowUrb,Site15,9:27,AM & JRA,25.8,90.9,7.59,518,756.2,0.2
Maracas,HighUrb,Site4,9:53,AM & JRA,28.6,100.8,7.71,548,759.6,0.2
Tacarigua,LowUrb,Site22,13:18,AM & JRA,26.6,95.6,7.41,222,751.8,0.1
Tacarigua,HighUrb,Site7,11:03,AM & JRA,27.5,120.9,7.93,457,759.1,0.2
Tunapuna,LowUrb,Site11,12:34,AM & JRA,27.7,51.1,7.43,601,758.2,0.3
Tunapuna,HighUrb,Site9,13:20,AM & JRA,31.4,50.5,7.44,588,760.4,0.3