﻿Date,River,SiteID,Treatment,TypeOfAlgae,ugChl-a/cm2,Trial,TypeOfSediment,PercentOfSedimentInRiver,ugChl-a/cm2,Obs
4/1/23,Maracas,Site15,LowUrb,Cyan,0.01,1,Gravel,0.45,0.144,
4/1/23,Maracas,Site15,LowUrb,Cyan,0.21,2,Gravel,,,
4/1/23,Maracas,Site15,LowUrb,Cyan,0.06,3,Gravel,,,
4/1/23,Maracas,Site15,LowUrb,Cyan,0.03,4,Gravel,,,
4/1/23,Maracas,Site15,LowUrb,Cyan,0.01,5,Gravel,,,
4/1/23,Maracas,Site15,LowUrb,Cyan,4.22,1,Rock,0.4,2.788,
4/1/23,Maracas,Site15,LowUrb,Cyan,0.47,2,Rock,,,
4/1/23,Maracas,Site15,LowUrb,Cyan,1.19,3,Rock,,,
4/1/23,Maracas,Site15,LowUrb,Cyan,1.02,4,Rock,,,
4/1/23,Maracas,Site15,LowUrb,Cyan,0.07,5,Rock,,,
4/1/23,Maracas,Site15,LowUrb,Cyan,0.04,1,Sand,0.15,0.0255,
4/1/23,Maracas,Site15,LowUrb,Cyan,0.03,2,Sand,,,
4/1/23,Maracas,Site15,LowUrb,Cyan,0.03,3,Sand,,,
4/1/23,Maracas,Site15,LowUrb,Cyan,0.05,4,Sand,,,
4/1/23,Maracas,Site15,LowUrb,Cyan,0.02,5,Sand,,,
4/1/23,Maracas,Site15,LowUrb,Diatoms,0.08,1,Gravel,0.45,0.4545,
4/1/23,Maracas,Site15,LowUrb,Diatoms,0.6,2,Gravel,,,
4/1/23,Maracas,Site15,LowUrb,Diatoms,0.19,3,Gravel,,,
4/1/23,Maracas,Site15,LowUrb,Diatoms,0.04,4,Gravel,,,
4/1/23,Maracas,Site15,LowUrb,Diatoms,0.1,5,Gravel,,,
4/1/23,Maracas,Site15,LowUrb,Diatoms,3.54,1,Rock,0.4,3.648,
4/1/23,Maracas,Site15,LowUrb,Diatoms,1.57,2,Rock,,,
4/1/23,Maracas,Site15,LowUrb,Diatoms,2.01,3,Rock,,,
4/1/23,Maracas,Site15,LowUrb,Diatoms,1.5,4,Rock,,,
4/1/23,Maracas,Site15,LowUrb,Diatoms,0.5,5,Rock,,,
4/1/23,Maracas,Site15,LowUrb,Diatoms,0.32,1,Sand,0.15,0.153,
4/1/23,Maracas,Site15,LowUrb,Diatoms,0.01,2,Sand,,,
4/1/23,Maracas,Site15,LowUrb,Diatoms,0.3,3,Sand,,,
4/1/23,Maracas,Site15,LowUrb,Diatoms,0.23,4,Sand,,,
4/1/23,Maracas,Site15,LowUrb,Diatoms,0.16,5,Sand,,,
4/1/23,Maracas,Site15,LowUrb,Green,0,1,Gravel,0.45,0,
4/1/23,Maracas,Site15,LowUrb,Green,0,2,Gravel,,,
4/1/23,Maracas,Site15,LowUrb,Green,0,3,Gravel,,,
4/1/23,Maracas,Site15,LowUrb,Green,0,4,Gravel,,,
4/1/23,Maracas,Site15,LowUrb,Green,0,5,Gravel,,,
4/1/23,Maracas,Site15,LowUrb,Green,0,1,Rock,0.4,0,
4/1/23,Maracas,Site15,LowUrb,Green,0,2,Rock,,,
4/1/23,Maracas,Site15,LowUrb,Green,0,3,Rock,,,
4/1/23,Maracas,Site15,LowUrb,Green,0,4,Rock,,,
4/1/23,Maracas,Site15,LowUrb,Green,0,5,Rock,,,
4/1/23,Maracas,Site15,LowUrb,Green,0.01,1,Sand,0.15,0.0015,
4/1/23,Maracas,Site15,LowUrb,Green,0,2,Sand,,,
4/1/23,Maracas,Site15,LowUrb,Green,0,3,Sand,,,
4/1/23,Maracas,Site15,LowUrb,Green,0,4,Sand,,,
4/1/23,Maracas,Site15,LowUrb,Green,0,5,Sand,,,
4/1/23,Maracas,Site4,HighUrb,Cyan,2.49,1,Rock,0.15,3.114,
4/1/23,Maracas,Site4,HighUrb,Cyan,6.14,2,Rock,,,
4/1/23,Maracas,Site4,HighUrb,Cyan,3.32,3,Rock,,,
4/1/23,Maracas,Site4,HighUrb,Cyan,1.9,4,Rock,,,
4/1/23,Maracas,Site4,HighUrb,Cyan,6.91,5,Rock,,,
4/1/23,Maracas,Site4,HighUrb,Cyan,0.59,1,Gravel,0.35,3.787,
4/1/23,Maracas,Site4,HighUrb,Cyan,1.33,2,Gravel,,,
4/1/23,Maracas,Site4,HighUrb,Cyan,2.17,3,Gravel,,,
4/1/23,Maracas,Site4,HighUrb,Cyan,3.41,4,Gravel,,,
4/1/23,Maracas,Site4,HighUrb,Cyan,3.32,5,Gravel,,,
4/1/23,Maracas,Site4,HighUrb,Cyan,0.08,1,Sand,0.05,0.0675,
4/1/23,Maracas,Site4,HighUrb,Cyan,0.13,2,Sand,,,
4/1/23,Maracas,Site4,HighUrb,Cyan,0.07,3,Sand,,,
4/1/23,Maracas,Site4,HighUrb,Cyan,0.6,4,Sand,,,
4/1/23,Maracas,Site4,HighUrb,Cyan,0.47,5,Sand,,,
4/1/23,Maracas,Site4,HighUrb,Cyan,4.59,1,Wall,0.45,12.537,
4/1/23,Maracas,Site4,HighUrb,Cyan,6.38,2,Wall,,,
4/1/23,Maracas,Site4,HighUrb,Cyan,5.66,3,Wall,,,
4/1/23,Maracas,Site4,HighUrb,Cyan,6.11,4,Wall,,,
4/1/23,Maracas,Site4,HighUrb,Cyan,5.12,5,Wall,,,
4/1/23,Maracas,Site4,HighUrb,Diatoms,0.85,1,Rock,0.15,1.017,
4/1/23,Maracas,Site4,HighUrb,Diatoms,0.39,2,Rock,,,
4/1/23,Maracas,Site4,HighUrb,Diatoms,1.24,3,Rock,,,
4/1/23,Maracas,Site4,HighUrb,Diatoms,2.6,4,Rock,,,
4/1/23,Maracas,Site4,HighUrb,Diatoms,1.7,5,Rock,,,
4/1/23,Maracas,Site4,HighUrb,Diatoms,0.39,1,Gravel,0.35,3.269,
4/1/23,Maracas,Site4,HighUrb,Diatoms,1.21,2,Gravel,,,
4/1/23,Maracas,Site4,HighUrb,Diatoms,2.18,3,Gravel,,,
4/1/23,Maracas,Site4,HighUrb,Diatoms,2.58,4,Gravel,,,
4/1/23,Maracas,Site4,HighUrb,Diatoms,2.98,5,Gravel,,,
4/1/23,Maracas,Site4,HighUrb,Diatoms,0.17,1,Sand,0.05,0.0505,
4/1/23,Maracas,Site4,HighUrb,Diatoms,0.43,2,Sand,,,
4/1/23,Maracas,Site4,HighUrb,Diatoms,0.21,3,Sand,,,
4/1/23,Maracas,Site4,HighUrb,Diatoms,0.11,4,Sand,,,
4/1/23,Maracas,Site4,HighUrb,Diatoms,0.09,5,Sand,,,
4/1/23,Maracas,Site4,HighUrb,Diatoms,3.58,1,Wall,0.45,10.08,
4/1/23,Maracas,Site4,HighUrb,Diatoms,5.18,2,Wall,,,
4/1/23,Maracas,Site4,HighUrb,Diatoms,5.01,3,Wall,,,
4/1/23,Maracas,Site4,HighUrb,Diatoms,4.94,4,Wall,,,
4/1/23,Maracas,Site4,HighUrb,Diatoms,3.69,5,Wall,,,
4/1/23,Maracas,Site4,HighUrb,Green,0,1,Rock,0.15,0,
4/1/23,Maracas,Site4,HighUrb,Green,0,2,Rock,,,
4/1/23,Maracas,Site4,HighUrb,Green,0,3,Rock,,,
4/1/23,Maracas,Site4,HighUrb,Green,0,4,Rock,,,
4/1/23,Maracas,Site4,HighUrb,Green,0,5,Rock,,,
4/1/23,Maracas,Site4,HighUrb,Green,1.69,1,Gravel,0.35,0.5915,
4/1/23,Maracas,Site4,HighUrb,Green,0,2,Gravel,,,
4/1/23,Maracas,Site4,HighUrb,Green,0,3,Gravel,,,
4/1/23,Maracas,Site4,HighUrb,Green,0,4,Gravel,,,
4/1/23,Maracas,Site4,HighUrb,Green,0,5,Gravel,,,
4/1/23,Maracas,Site4,HighUrb,Green,0,1,Sand,0.05,0,
4/1/23,Maracas,Site4,HighUrb,Green,0,2,Sand,,,
4/1/23,Maracas,Site4,HighUrb,Green,0,3,Sand,,,
4/1/23,Maracas,Site4,HighUrb,Green,0,4,Sand,,,
4/1/23,Maracas,Site4,HighUrb,Green,0,5,Sand,,,
4/1/23,Maracas,Site4,HighUrb,Green,0,1,Wall,0.45,0,
4/1/23,Maracas,Site4,HighUrb,Green,0,2,Wall,,,
4/1/23,Maracas,Site4,HighUrb,Green,0,3,Wall,,,
4/1/23,Maracas,Site4,HighUrb,Green,0,4,Wall,,,
4/1/23,Maracas,Site4,HighUrb,Green,0,5,Wall,,,
4/5/23,Tacarigua,Site22,LowUrb,Cyan,2.37,1,Rock,0.15,2.0565,
4/5/23,Tacarigua,Site22,LowUrb,Cyan,0.88,2,Rock,,,
4/5/23,Tacarigua,Site22,LowUrb,Cyan,8.14,3,Rock,,,
4/5/23,Tacarigua,Site22,LowUrb,Cyan,0.91,4,Rock,,,
4/5/23,Tacarigua,Site22,LowUrb,Cyan,1.41,5,Rock,,,
4/5/23,Tacarigua,Site22,LowUrb,Cyan,0.95,1,Gravel,0.35,1.015,
4/5/23,Tacarigua,Site22,LowUrb,Cyan,0.86,2,Gravel,,,
4/5/23,Tacarigua,Site22,LowUrb,Cyan,0.15,3,Gravel,,,
4/5/23,Tacarigua,Site22,LowUrb,Cyan,0.62,4,Gravel,,,
4/5/23,Tacarigua,Site22,LowUrb,Cyan,0.32,5,Gravel,,,
4/5/23,Tacarigua,Site22,LowUrb,Cyan,1.4,1,Sand,0.5,2.315,
4/5/23,Tacarigua,Site22,LowUrb,Cyan,0.44,2,Sand,,,
4/5/23,Tacarigua,Site22,LowUrb,Cyan,0.54,3,Sand,,,
4/5/23,Tacarigua,Site22,LowUrb,Cyan,1.94,4,Sand,,,
4/5/23,Tacarigua,Site22,LowUrb,Cyan,0.31,5,Sand,,,
4/5/23,Tacarigua,Site22,LowUrb,Diatoms,0.73,1,Rock,0.15,0.432,
4/5/23,Tacarigua,Site22,LowUrb,Diatoms,0.9,2,Rock,,,
4/5/23,Tacarigua,Site22,LowUrb,Diatoms,0.08,3,Rock,,,
4/5/23,Tacarigua,Site22,LowUrb,Diatoms,0.61,4,Rock,,,
4/5/23,Tacarigua,Site22,LowUrb,Diatoms,0.56,5,Rock,,,
4/5/23,Tacarigua,Site22,LowUrb,Diatoms,1.35,1,Gravel,0.35,0.98,
4/5/23,Tacarigua,Site22,LowUrb,Diatoms,0.61,2,Gravel,,,
4/5/23,Tacarigua,Site22,LowUrb,Diatoms,0.34,3,Gravel,,,
4/5/23,Tacarigua,Site22,LowUrb,Diatoms,0.31,4,Gravel,,,
4/5/23,Tacarigua,Site22,LowUrb,Diatoms,0.19,5,Gravel,,,
4/5/23,Tacarigua,Site22,LowUrb,Diatoms,1,1,Sand,0.5,1.62,
4/5/23,Tacarigua,Site22,LowUrb,Diatoms,0.36,2,Sand,,,
4/5/23,Tacarigua,Site22,LowUrb,Diatoms,0.45,3,Sand,,,
4/5/23,Tacarigua,Site22,LowUrb,Diatoms,0.84,4,Sand,,,
4/5/23,Tacarigua,Site22,LowUrb,Diatoms,0.59,5,Sand,,,
4/5/23,Tacarigua,Site22,LowUrb,Green,0,1,Rock,0.15,0,
4/5/23,Tacarigua,Site22,LowUrb,Green,0,2,Rock,,,
4/5/23,Tacarigua,Site22,LowUrb,Green,0,3,Rock,,,
4/5/23,Tacarigua,Site22,LowUrb,Green,0,4,Rock,,,
4/5/23,Tacarigua,Site22,LowUrb,Green,0,5,Rock,,,
4/5/23,Tacarigua,Site22,LowUrb,Green,0,1,Gravel,0.35,0,
4/5/23,Tacarigua,Site22,LowUrb,Green,0,2,Gravel,,,
4/5/23,Tacarigua,Site22,LowUrb,Green,0,3,Gravel,,,
4/5/23,Tacarigua,Site22,LowUrb,Green,0,4,Gravel,,,
4/5/23,Tacarigua,Site22,LowUrb,Green,0,5,Gravel,,,
4/5/23,Tacarigua,Site22,LowUrb,Green,0,1,Sand,0.5,0,
4/5/23,Tacarigua,Site22,LowUrb,Green,0,2,Sand,,,
4/5/23,Tacarigua,Site22,LowUrb,Green,0,3,Sand,,,
4/5/23,Tacarigua,Site22,LowUrb,Green,0,4,Sand,,,
4/5/23,Tacarigua,Site22,LowUrb,Green,0,5,Sand,,,
4/6/23,Tacarigua,Site7,HighUrb,Cyan,0.12,1,Sand,0.25,0.2125,
4/6/23,Tacarigua,Site7,HighUrb,Cyan,0.12,2,Sand,,,
4/6/23,Tacarigua,Site7,HighUrb,Cyan,0.21,3,Sand,,,
4/6/23,Tacarigua,Site7,HighUrb,Cyan,0.05,4,Sand,,,
4/6/23,Tacarigua,Site7,HighUrb,Cyan,0.35,5,Sand,,,
4/6/23,Tacarigua,Site7,HighUrb,Diatoms,0.17,1,Sand,0.25,0.305,
4/6/23,Tacarigua,Site7,HighUrb,Diatoms,0.16,2,Sand,,,
4/6/23,Tacarigua,Site7,HighUrb,Diatoms,0.19,3,Sand,,,
4/6/23,Tacarigua,Site7,HighUrb,Diatoms,0.07,4,Sand,,,
4/6/23,Tacarigua,Site7,HighUrb,Diatoms,0.63,5,Sand,,,
4/6/23,Tacarigua,Site7,HighUrb,Green,0,1,Sand,0.25,0.005,
4/6/23,Tacarigua,Site7,HighUrb,Green,0.02,2,Sand,,,
4/6/23,Tacarigua,Site7,HighUrb,Green,0,3,Sand,,,
4/6/23,Tacarigua,Site7,HighUrb,Green,0,4,Sand,,,
4/6/23,Tacarigua,Site7,HighUrb,Green,0,5,Sand,,,
4/6/23,Tacarigua,Site7,HighUrb,Cyan,2.24,1,Rock,0.1,0.894,
4/6/23,Tacarigua,Site7,HighUrb,Cyan,0.76,2,Rock,,,
4/6/23,Tacarigua,Site7,HighUrb,Cyan,3.5,3,Rock,,,
4/6/23,Tacarigua,Site7,HighUrb,Cyan,1.83,4,Rock,,,
4/6/23,Tacarigua,Site7,HighUrb,Cyan,0.61,5,Rock,,,
4/6/23,Tacarigua,Site7,HighUrb,Diatoms,1.51,1,Rock,0.1,0.64,
4/6/23,Tacarigua,Site7,HighUrb,Diatoms,0.38,2,Rock,,,
4/6/23,Tacarigua,Site7,HighUrb,Diatoms,1.51,3,Rock,,,
4/6/23,Tacarigua,Site7,HighUrb,Diatoms,2.68,4,Rock,,,
4/6/23,Tacarigua,Site7,HighUrb,Diatoms,0.32,5,Rock,,,
4/6/23,Tacarigua,Site7,HighUrb,Green,0,1,Rock,0.1,0,
4/6/23,Tacarigua,Site7,HighUrb,Green,0,2,Rock,,,
4/6/23,Tacarigua,Site7,HighUrb,Green,0,3,Rock,,,
4/6/23,Tacarigua,Site7,HighUrb,Green,0,4,Rock,,,
4/6/23,Tacarigua,Site7,HighUrb,Green,0,5,Rock,,,
4/6/23,Tacarigua,Site7,HighUrb,Cyan,1.13,1,Gravel,0.65,2.912,
4/6/23,Tacarigua,Site7,HighUrb,Cyan,1.21,2,Gravel,,,
4/6/23,Tacarigua,Site7,HighUrb,Cyan,0.27,3,Gravel,,,
4/6/23,Tacarigua,Site7,HighUrb,Cyan,1.15,4,Gravel,,,
4/6/23,Tacarigua,Site7,HighUrb,Cyan,0.72,5,Gravel,,,
4/6/23,Tacarigua,Site7,HighUrb,Diatoms,1.59,1,Gravel,0.65,3.575,
4/6/23,Tacarigua,Site7,HighUrb,Diatoms,1.27,2,Gravel,,,
4/6/23,Tacarigua,Site7,HighUrb,Diatoms,0.44,3,Gravel,,,
4/6/23,Tacarigua,Site7,HighUrb,Diatoms,1.35,4,Gravel,,,
4/6/23,Tacarigua,Site7,HighUrb,Diatoms,0.85,5,Gravel,,,
4/6/23,Tacarigua,Site7,HighUrb,Green,0,1,Gravel,0.65,0,
4/6/23,Tacarigua,Site7,HighUrb,Green,0,2,Gravel,,,
4/6/23,Tacarigua,Site7,HighUrb,Green,0,3,Gravel,,,
4/6/23,Tacarigua,Site7,HighUrb,Green,0,4,Gravel,,,
4/6/23,Tacarigua,Site7,HighUrb,Green,0,5,Gravel,,,
4/8/23,Tunapuna,Site11,LowUrb,Cyan,7.75,1,Rock,0.2,3.196,
4/8/23,Tunapuna,Site11,LowUrb,Cyan,0.89,2,Rock,,,
4/8/23,Tunapuna,Site11,LowUrb,Cyan,1.31,3,Rock,,,
4/8/23,Tunapuna,Site11,LowUrb,Cyan,3.72,4,Rock,,,
4/8/23,Tunapuna,Site11,LowUrb,Cyan,2.31,5,Rock,,,
4/8/23,Tunapuna,Site11,LowUrb,Cyan,0.03,1,Gravel,0.7,2.702,
4/8/23,Tunapuna,Site11,LowUrb,Cyan,1.36,2,Gravel,,,
4/8/23,Tunapuna,Site11,LowUrb,Cyan,1.25,3,Gravel,,,
4/8/23,Tunapuna,Site11,LowUrb,Cyan,0.87,4,Gravel,,,
4/8/23,Tunapuna,Site11,LowUrb,Cyan,0.35,5,Gravel,,,
4/8/23,Tunapuna,Site11,LowUrb,Cyan,0.06,1,Sand,0.1,0.39,
4/8/23,Tunapuna,Site11,LowUrb,Cyan,0.01,2,Sand,,,
4/8/23,Tunapuna,Site11,LowUrb,Cyan,3.72,3,Sand,,,
4/8/23,Tunapuna,Site11,LowUrb,Cyan,0.08,4,Sand,,,
4/8/23,Tunapuna,Site11,LowUrb,Cyan,0.03,5,Sand,,,
4/8/23,Tunapuna,Site11,LowUrb,Diatoms,5.18,1,Rock,0.2,2.812,
4/8/23,Tunapuna,Site11,LowUrb,Diatoms,1.6,2,Rock,,,
4/8/23,Tunapuna,Site11,LowUrb,Diatoms,1.02,3,Rock,,,
4/8/23,Tunapuna,Site11,LowUrb,Diatoms,3.7,4,Rock,,,
4/8/23,Tunapuna,Site11,LowUrb,Diatoms,2.56,5,Rock,,,
4/8/23,Tunapuna,Site11,LowUrb,Diatoms,0.17,1,Gravel,0.7,5.236,
4/8/23,Tunapuna,Site11,LowUrb,Diatoms,1.66,2,Gravel,,,
4/8/23,Tunapuna,Site11,LowUrb,Diatoms,1.75,3,Gravel,,,
4/8/23,Tunapuna,Site11,LowUrb,Diatoms,2.02,4,Gravel,,,
4/8/23,Tunapuna,Site11,LowUrb,Diatoms,1.88,5,Gravel,,,
4/8/23,Tunapuna,Site11,LowUrb,Diatoms,1.16,1,Sand,0.1,0.529,
4/8/23,Tunapuna,Site11,LowUrb,Diatoms,0.02,2,Sand,,,
4/8/23,Tunapuna,Site11,LowUrb,Diatoms,3.7,3,Sand,,,
4/8/23,Tunapuna,Site11,LowUrb,Diatoms,0.28,4,Sand,,,
4/8/23,Tunapuna,Site11,LowUrb,Diatoms,0.13,5,Sand,,,
4/8/23,Tunapuna,Site11,LowUrb,Green,0,1,Rock,0.2,0,
4/8/23,Tunapuna,Site11,LowUrb,Green,0,2,Rock,,,
4/8/23,Tunapuna,Site11,LowUrb,Green,0,3,Rock,,,
4/8/23,Tunapuna,Site11,LowUrb,Green,0,4,Rock,,,
4/8/23,Tunapuna,Site11,LowUrb,Green,0,5,Rock,,,
4/8/23,Tunapuna,Site11,LowUrb,Green,0,1,Gravel,0.7,0,
4/8/23,Tunapuna,Site11,LowUrb,Green,0,2,Gravel,,,
4/8/23,Tunapuna,Site11,LowUrb,Green,0,3,Gravel,,,
4/8/23,Tunapuna,Site11,LowUrb,Green,0,4,Gravel,,,
4/8/23,Tunapuna,Site11,LowUrb,Green,0,5,Gravel,,,
4/8/23,Tunapuna,Site11,LowUrb,Green,0,1,Sand,0.1,0,
4/8/23,Tunapuna,Site11,LowUrb,Green,0,2,Sand,,,
4/8/23,Tunapuna,Site11,LowUrb,Green,0,3,Sand,,,
4/8/23,Tunapuna,Site11,LowUrb,Green,0,4,Sand,,,
4/8/23,Tunapuna,Site11,LowUrb,Green,0,5,Sand,,,
4/10/23,Tunapuna,Site9,HighUrb,Cyan,60.1,1,Rock,0.25,22.7,
4/10/23,Tunapuna,Site9,HighUrb,Cyan,9.98,2,Rock,,,
4/10/23,Tunapuna,Site9,HighUrb,Cyan,4.56,3,Rock,,,
4/10/23,Tunapuna,Site9,HighUrb,Cyan,9.65,4,Rock,,,
4/10/23,Tunapuna,Site9,HighUrb,Cyan,6.51,5,Rock,,,
4/10/23,Tunapuna,Site9,HighUrb,Cyan,0.28,1,Gravel,0.75,8.4375,
4/10/23,Tunapuna,Site9,HighUrb,Cyan,2.76,2,Gravel,,,
4/10/23,Tunapuna,Site9,HighUrb,Cyan,4.73,3,Gravel,,,
4/10/23,Tunapuna,Site9,HighUrb,Cyan,2.68,4,Gravel,,,
4/10/23,Tunapuna,Site9,HighUrb,Cyan,0.8,5,Gravel,,,
4/10/23,Tunapuna,Site9,HighUrb,Diatoms,7.03,1,Rock,0.25,6.5775,
4/10/23,Tunapuna,Site9,HighUrb,Diatoms,3.72,2,Rock,,,
4/10/23,Tunapuna,Site9,HighUrb,Diatoms,5.61,3,Rock,,,
4/10/23,Tunapuna,Site9,HighUrb,Diatoms,2.7,4,Rock,,,
4/10/23,Tunapuna,Site9,HighUrb,Diatoms,7.25,5,Rock,,,
4/10/23,Tunapuna,Site9,HighUrb,Diatoms,2.69,1,Gravel,0.75,18.6525,
4/10/23,Tunapuna,Site9,HighUrb,Diatoms,5.27,2,Gravel,,,
4/10/23,Tunapuna,Site9,HighUrb,Diatoms,5.98,3,Gravel,,,
4/10/23,Tunapuna,Site9,HighUrb,Diatoms,8.69,4,Gravel,,,
4/10/23,Tunapuna,Site9,HighUrb,Diatoms,2.24,5,Gravel,,,
4/10/23,Tunapuna,Site9,HighUrb,Green,0,1,Rock,0.25,0,
4/10/23,Tunapuna,Site9,HighUrb,Green,0,2,Rock,,,
4/10/23,Tunapuna,Site9,HighUrb,Green,0,3,Rock,,,
4/10/23,Tunapuna,Site9,HighUrb,Green,0,4,Rock,,,
4/10/23,Tunapuna,Site9,HighUrb,Green,0,5,Rock,,,
4/10/23,Tunapuna,Site9,HighUrb,Green,0,1,Gravel,0.75,0,
4/10/23,Tunapuna,Site9,HighUrb,Green,0,2,Gravel,,,
4/10/23,Tunapuna,Site9,HighUrb,Green,0,3,Gravel,,,
4/10/23,Tunapuna,Site9,HighUrb,Green,0,4,Gravel,,,
4/10/23,Tunapuna,Site9,HighUrb,Green,0,5,Gravel,,,