﻿Date,River,Treatment,SiteID,DistanceFromUpstream,Upstream,Downstream,Left bank,Right bank,Average,% of Canopy Cover,%Canopy Cover,Date and Initials
3/21/23,Maracas,LowUrb,Site15,30,17,14,17,14,15.5,91.17647059,0.911764706,AM & JRA
3/21/23,Maracas,LowUrb,Site15,25,16,16,17,14,15.75,92.64705882,0.926470588,AM & JRA
3/21/23,Maracas,LowUrb,Site15,20,12,17,15,10,13.5,79.41176471,0.794117647,AM & JRA
3/21/23,Maracas,LowUrb,Site15,15,14,15,10,10,12.25,72.05882353,0.720588235,AM & JRA
3/21/23,Maracas,LowUrb,Site15,10,2,17,10,8,9.25,54.41176471,0.544117647,AM & JRA
3/21/23,Maracas,LowUrb,Site15,5,3,3,15,0,5.25,30.88235294,0.308823529,AM & JRA
3/21/23,Maracas,LowUrb,Site15,0,1,4,11,0,4,23.52941176,0.235294118,AM & JRA
3/20/23,Maracas,HighUrb,Site4,30,0,17,8,10,8.75,51.47058824,0.514705882,AM & JRA
3/20/23,Maracas,HighUrb,Site4,25,0,0,0,3,0.75,4.411764706,0.044117647,AM & JRA
3/20/23,Maracas,HighUrb,Site4,20,0,4,0,6,2.5,14.70588235,0.147058824,AM & JRA
3/20/23,Maracas,HighUrb,Site4,15,1,0,0,5,1.5,8.823529412,0.088235294,AM & JRA
3/20/23,Maracas,HighUrb,Site4,10,1,0,0,4,1.25,7.352941176,0.073529412,AM & JRA
3/20/23,Maracas,HighUrb,Site4,5,1,1,0,9,2.75,16.17647059,0.161764706,AM & JRA
3/20/23,Maracas,HighUrb,Site4,0,8,1,0,9,4.5,26.47058824,0.264705882,AM & JRA
3/22/23,Tacarigua,LowUrb,Site22,30,16,15,8,17,14,82.35294118,0.823529412,AM & JRA
3/22/23,Tacarigua,LowUrb,Site22,25,17,17,17,14,16.25,95.58823529,0.955882353,AM & JRA
3/22/23,Tacarigua,LowUrb,Site22,20,15,16,7,17,13.75,80.88235294,0.808823529,AM & JRA
3/22/23,Tacarigua,LowUrb,Site22,15,16,14,5,17,13,76.47058824,0.764705882,AM & JRA
3/22/23,Tacarigua,LowUrb,Site22,10,7,9,2,17,8.75,51.47058824,0.514705882,AM & JRA
3/22/23,Tacarigua,LowUrb,Site22,5,7,12,1,17,9.25,54.41176471,0.544117647,AM & JRA
3/22/23,Tacarigua,LowUrb,Site22,0,6,9,2,17,8.5,50,0.5,AM & JRA
4/13/23,Tacarigua,HighUrb,Site7,30,9,16,17,6,12,70.58823529,0.705882353,AM & JRA
4/13/23,Tacarigua,HighUrb,Site7,25,5,17,17,8,11.75,69.11764706,0.691176471,AM & JRA
4/13/23,Tacarigua,HighUrb,Site7,20,0,12,8,0,5,29.41176471,0.294117647,AM & JRA
4/13/23,Tacarigua,HighUrb,Site7,15,1,3,5,0,2.25,13.23529412,0.132352941,AM & JRA
4/13/23,Tacarigua,HighUrb,Site7,10,0,2,7,0,2.25,13.23529412,0.132352941,AM & JRA
4/13/23,Tacarigua,HighUrb,Site7,5,0,2,8,0,2.5,14.70588235,0.147058824,AM & JRA
4/13/23,Tacarigua,HighUrb,Site7,0,0,0,1,0,0.25,1.470588235,0.014705882,AM & JRA
4/8/23,Tunapuna,LowUrb,Site11,30,15,15,17,17,16,94.11764706,0.941176471,AM & JRA
4/8/23,Tunapuna,LowUrb,Site11,25,17,11,17,9,13.5,79.41176471,0.794117647,AM & JRA
4/8/23,Tunapuna,LowUrb,Site11,20,11,17,14,17,14.75,86.76470588,0.867647059,AM & JRA
4/8/23,Tunapuna,LowUrb,Site11,15,6,9,11,0,6.5,38.23529412,0.382352941,AM & JRA
4/8/23,Tunapuna,LowUrb,Site11,10,9,13,15,2,9.75,57.35294118,0.573529412,AM & JRA
4/8/23,Tunapuna,LowUrb,Site11,5,10,8,14,0,8,47.05882353,0.470588235,AM & JRA
4/8/23,Tunapuna,LowUrb,Site11,0,2,13,7,0,5.5,32.35294118,0.323529412,AM & JRA
4/10/23,Tunapuna,HighUrb,Site9,30,0,0,0,1,0.25,1.470588235,0.014705882,AM & JRA
4/10/23,Tunapuna,HighUrb,Site9,25,0,0,0,0,0,0,0,AM & JRA
4/10/23,Tunapuna,HighUrb,Site9,20,0,0,0,0,0,0,0,AM & JRA
4/10/23,Tunapuna,HighUrb,Site9,15,0,0,0,0,0,0,0,AM & JRA
4/10/23,Tunapuna,HighUrb,Site9,10,0,0,1,0,0.25,1.470588235,0.014705882,AM & JRA
4/10/23,Tunapuna,HighUrb,Site9,5,0,0,0,0,0,0,0,AM & JRA
4/10/23,Tunapuna,HighUrb,Site9,0,0,0,0,0,0,0,0,AM & JRA