\relax 
\@writefile{toc}{\contentsline {section}{\numberline {1}Distancia Eucl\IeC {\'\i }dea}{2}}
\@writefile{lot}{\contentsline {table}{\numberline {1}{\ignorespaces Distancia eucl\IeC {\'\i }dea}}{2}}
\@writefile{lof}{\contentsline {figure}{\numberline {1}{\ignorespaces Gr\IeC {\'a}fico de barras para distancia eucl\IeC {\'\i }dea}}{3}}
\newlabel{fig:barraDM}{{1}{3}}
\@writefile{toc}{\contentsline {section}{\numberline {2}MAD}{4}}
\@writefile{lot}{\contentsline {table}{\numberline {2}{\ignorespaces Distancia media absoluta}}{4}}
\@writefile{lof}{\contentsline {figure}{\numberline {2}{\ignorespaces Gr\IeC {\'a}fico de barras para Distancia absoluta media}}{5}}
\newlabel{fig:barraDaM}{{2}{5}}
\@writefile{toc}{\contentsline {section}{\numberline {3}Distancia de Manhattan}{6}}
\@writefile{lot}{\contentsline {table}{\numberline {3}{\ignorespaces Distancia de Manhattan}}{6}}
\@writefile{lof}{\contentsline {figure}{\numberline {3}{\ignorespaces Gr\IeC {\'a}fico de barras para Distancia de Manhattan}}{7}}
\newlabel{fig:barraDM}{{3}{7}}
