\relax 
\@writefile{toc}{\contentsline {section}{\numberline {1}Distancia Eucl\IeC {\'\i }dea}{2}}
\@writefile{toc}{\contentsline {subsection}{\numberline {1.1}M\IeC {\'e}trica Distancia Eucl\IeC {\'\i }dea para MFCC 1}{3}}
\@writefile{lot}{\contentsline {table}{\numberline {1}{\ignorespaces Distancia euclidiana para MFCC:1}}{3}}
\@writefile{lof}{\contentsline {figure}{\numberline {1}{\ignorespaces Distancia eucl\IeC {\'\i }dea: MFCC 1}}{4}}
\newlabel{fig:1}{{1}{4}}
\@writefile{toc}{\contentsline {subsection}{\numberline {1.2}M\IeC {\'e}trica Distancia Eucl\IeC {\'\i }dea para MFCC 2}{5}}
\@writefile{lot}{\contentsline {table}{\numberline {2}{\ignorespaces Distancia euclidiana para MFCC:2}}{5}}
\@writefile{lof}{\contentsline {figure}{\numberline {2}{\ignorespaces Distancia eucl\IeC {\'\i }dea: MFCC 2}}{6}}
\newlabel{fig:2}{{2}{6}}
\@writefile{toc}{\contentsline {subsection}{\numberline {1.3}M\IeC {\'e}trica Distancia Eucl\IeC {\'\i }dea para MFCC 3}{7}}
\@writefile{lot}{\contentsline {table}{\numberline {3}{\ignorespaces Distancia euclidiana para MFCC:3}}{7}}
\@writefile{lof}{\contentsline {figure}{\numberline {3}{\ignorespaces Distancia eucl\IeC {\'\i }dea: MFCC 3}}{8}}
\newlabel{fig:3}{{3}{8}}
\@writefile{toc}{\contentsline {subsection}{\numberline {1.4}M\IeC {\'e}trica Distancia Eucl\IeC {\'\i }dea para MFCC 4}{9}}
\@writefile{lot}{\contentsline {table}{\numberline {4}{\ignorespaces Distancia euclidiana para MFCC:4}}{9}}
\@writefile{lof}{\contentsline {figure}{\numberline {4}{\ignorespaces Distancia eucl\IeC {\'\i }dea: MFCC 4}}{10}}
\newlabel{fig:4}{{4}{10}}
\@writefile{toc}{\contentsline {subsection}{\numberline {1.5}M\IeC {\'e}trica Distancia Eucl\IeC {\'\i }dea para MFCC 5}{11}}
\@writefile{lot}{\contentsline {table}{\numberline {5}{\ignorespaces Distancia euclidiana para MFCC:5}}{11}}
\@writefile{lof}{\contentsline {figure}{\numberline {5}{\ignorespaces Distancia eucl\IeC {\'\i }dea: MFCC 5}}{12}}
\newlabel{fig:5}{{5}{12}}
\@writefile{toc}{\contentsline {subsection}{\numberline {1.6}M\IeC {\'e}trica Distancia Eucl\IeC {\'\i }dea para MFCC 6}{13}}
\@writefile{lot}{\contentsline {table}{\numberline {6}{\ignorespaces Distancia euclidiana para MFCC:6}}{13}}
\@writefile{lof}{\contentsline {figure}{\numberline {6}{\ignorespaces Distancia eucl\IeC {\'\i }dea: MFCC 6}}{14}}
\newlabel{fig:6}{{6}{14}}
\@writefile{toc}{\contentsline {subsection}{\numberline {1.7}M\IeC {\'e}trica Distancia Eucl\IeC {\'\i }dea para MFCC 7}{15}}
\@writefile{lot}{\contentsline {table}{\numberline {7}{\ignorespaces Distancia euclidiana para MFCC:7}}{15}}
\@writefile{lof}{\contentsline {figure}{\numberline {7}{\ignorespaces Distancia eucl\IeC {\'\i }dea: MFCC 7}}{16}}
\newlabel{fig:7}{{7}{16}}
\@writefile{toc}{\contentsline {subsection}{\numberline {1.8}M\IeC {\'e}trica Distancia Eucl\IeC {\'\i }dea para MFCC 8}{17}}
\@writefile{lot}{\contentsline {table}{\numberline {8}{\ignorespaces Distancia euclidiana para MFCC:8}}{17}}
\@writefile{lof}{\contentsline {figure}{\numberline {8}{\ignorespaces Distancia eucl\IeC {\'\i }dea: MFCC 8}}{18}}
\newlabel{fig:8}{{8}{18}}
\@writefile{toc}{\contentsline {subsection}{\numberline {1.9}M\IeC {\'e}trica Distancia Eucl\IeC {\'\i }dea para MFCC 9}{19}}
\@writefile{lot}{\contentsline {table}{\numberline {9}{\ignorespaces Distancia euclidiana para MFCC:9}}{19}}
\@writefile{lof}{\contentsline {figure}{\numberline {9}{\ignorespaces Distancia eucl\IeC {\'\i }dea: MFCC 9}}{20}}
\newlabel{fig:9}{{9}{20}}
\@writefile{toc}{\contentsline {subsection}{\numberline {1.10}M\IeC {\'e}trica Distancia Eucl\IeC {\'\i }dea para MFCC 10}{21}}
\@writefile{lot}{\contentsline {table}{\numberline {10}{\ignorespaces Distancia euclidiana para MFCC:10}}{21}}
\@writefile{lof}{\contentsline {figure}{\numberline {10}{\ignorespaces Distancia eucl\IeC {\'\i }dea: MFCC 10}}{22}}
\newlabel{fig:10}{{10}{22}}
\@writefile{toc}{\contentsline {section}{\numberline {2}MAD}{23}}
\@writefile{toc}{\contentsline {subsection}{\numberline {2.1}MAD para MFCC 1}{24}}
\@writefile{lot}{\contentsline {table}{\numberline {11}{\ignorespaces Distancia media absoluta para MFCC:1}}{24}}
\@writefile{toc}{\contentsline {subsection}{\numberline {2.2}MAD para MFCC 2}{25}}
\@writefile{lot}{\contentsline {table}{\numberline {12}{\ignorespaces Distancia media absoluta para MFCC:2}}{25}}
\@writefile{toc}{\contentsline {subsection}{\numberline {2.3}MAD para MFCC 3}{26}}
\@writefile{lot}{\contentsline {table}{\numberline {13}{\ignorespaces Distancia media absoluta para MFCC:3}}{26}}
\@writefile{toc}{\contentsline {subsection}{\numberline {2.4}MAD para MFCC 4}{27}}
\@writefile{lot}{\contentsline {table}{\numberline {14}{\ignorespaces Distancia media absoluta para MFCC:4}}{27}}
\@writefile{toc}{\contentsline {subsection}{\numberline {2.5}MAD para MFCC 5}{28}}
\@writefile{lot}{\contentsline {table}{\numberline {15}{\ignorespaces Distancia media absoluta para MFCC:5}}{28}}
\@writefile{toc}{\contentsline {subsection}{\numberline {2.6}MAD para MFCC 6}{29}}
\@writefile{lot}{\contentsline {table}{\numberline {16}{\ignorespaces Distancia media absoluta para MFCC:6}}{29}}
\@writefile{toc}{\contentsline {subsection}{\numberline {2.7}MAD para MFCC 7}{30}}
\@writefile{lot}{\contentsline {table}{\numberline {17}{\ignorespaces Distancia media absoluta para MFCC:7}}{30}}
\@writefile{toc}{\contentsline {subsection}{\numberline {2.8}MAD para MFCC 8}{31}}
\@writefile{lot}{\contentsline {table}{\numberline {18}{\ignorespaces Distancia media absoluta para MFCC:8}}{31}}
\@writefile{toc}{\contentsline {subsection}{\numberline {2.9}MAD para MFCC 9}{32}}
\@writefile{lot}{\contentsline {table}{\numberline {19}{\ignorespaces Distancia media absoluta para MFCC:9}}{32}}
\@writefile{toc}{\contentsline {subsection}{\numberline {2.10}MAD para MFCC 10}{33}}
\@writefile{lot}{\contentsline {table}{\numberline {20}{\ignorespaces Distancia media absoluta para MFCC:10}}{33}}
\@writefile{toc}{\contentsline {section}{\numberline {3}Distancia de Manhattan}{34}}
\@writefile{toc}{\contentsline {subsection}{\numberline {3.1}Distance Manhattan MFCC 1}{35}}
\@writefile{lot}{\contentsline {table}{\numberline {21}{\ignorespaces Distance Manhattan para MFCC:1}}{35}}
\@writefile{toc}{\contentsline {subsection}{\numberline {3.2}Distance Manhattan MFCC 2}{36}}
\@writefile{lot}{\contentsline {table}{\numberline {22}{\ignorespaces Distance Manhattan para MFCC:2}}{36}}
\@writefile{toc}{\contentsline {subsection}{\numberline {3.3}Distance Manhattan MFCC 3}{37}}
\@writefile{lot}{\contentsline {table}{\numberline {23}{\ignorespaces Distance Manhattan para MFCC:3}}{37}}
\@writefile{toc}{\contentsline {subsection}{\numberline {3.4}Distance Manhattan MFCC 4}{38}}
\@writefile{lot}{\contentsline {table}{\numberline {24}{\ignorespaces Distance Manhattan para MFCC:4}}{38}}
\@writefile{toc}{\contentsline {subsection}{\numberline {3.5}Distance Manhattan MFCC 5}{39}}
\@writefile{lot}{\contentsline {table}{\numberline {25}{\ignorespaces Distance Manhattan para MFCC:5}}{39}}
\@writefile{toc}{\contentsline {subsection}{\numberline {3.6}Distance Manhattan MFCC 6}{40}}
\@writefile{lot}{\contentsline {table}{\numberline {26}{\ignorespaces Distance Manhattan para MFCC:6}}{40}}
\@writefile{toc}{\contentsline {subsection}{\numberline {3.7}Distance Manhattan MFCC 7}{41}}
\@writefile{lot}{\contentsline {table}{\numberline {27}{\ignorespaces Distance Manhattan para MFCC:7}}{41}}
\@writefile{toc}{\contentsline {subsection}{\numberline {3.8}Distance Manhattan MFCC 8}{42}}
\@writefile{lot}{\contentsline {table}{\numberline {28}{\ignorespaces Distance Manhattan para MFCC:8}}{42}}
\@writefile{toc}{\contentsline {subsection}{\numberline {3.9}Distance Manhattan MFCC 9}{43}}
\@writefile{lot}{\contentsline {table}{\numberline {29}{\ignorespaces Distance Manhattan para MFCC:9}}{43}}
\@writefile{toc}{\contentsline {subsection}{\numberline {3.10}Distance Manhattan MFCC 10}{44}}
\@writefile{lot}{\contentsline {table}{\numberline {30}{\ignorespaces Distance Manhattan para MFCC:10}}{44}}
