e5-126V4.1aD20
e4-126V4.1bD20
e4-126V4.1aD20_a
e23-126V3.1cD15
e3-126V3.1D20
e1-126V2.1abD20
e2-126V2.1bD20
e14-015V4.1aD20
e4-015V4.1bD20
e5-015V4.2bD20
e6-015V4.2bD15
e7-015V23.1bD19
e7-015V23.1bcD19
e2-015V23.1D20
e3-015V3.1abD20
e3-015V3.1bD20
e1-015V2.1aD20
e1-015V2.1aD20_a
e8-015V1.1D15
e1-018V1.1aD20
e1-018V1.1aD20_a
e2-018V1.2bD20
e2-018V1.2bD20_a
e9-018V7.2bD20
e9-018V7.2bD20_a
e8-018V7.2aD20
e7-018V6.2bD20
e7-018V6.2bD20_a
e6-018V6.1aD20
e6-018V6.1aD20_a
e4-018V5.2bD20
e4-018V5.2bD20_a
e5-018V5.3bD20
e3-018V5.1aD20
e9-67V12.1b1D20
e9-67V12.1beD20
e11-067V11.1acD20
e12-067V11.2c1D15
e13-067V11.2c2D15
e10-067V14.1D20
e4-137V21.1D20
e3-137V4.2520
e4-139V4.1D15
e4-139V4.1D15_a
e7-139V7.1D20
e6-139V6.1D15
e2-139V2.1D20
e2-139V2.1D20_a
e1-139V1.1D15
e1-188V1.1abD20
e5-188V1.1cD20
e4-188V4.1bD20
e4-188V4.1abD20
e3-188V3.1abD20
e6-188V3.1cD20
e2-188V2.1abD20
e2-188V2.1bD20
e6-189V5.1aD20
e5-189V5.1D20
e5-189V5.1D20_a
e1-189V1.1D20
e1-189V1.1D20_a
e2-189V1.1cD15
e3-227V4.1abD20
e3-227V4.1bD20
e9-227V12.1D20
e9-227V12.1D20_a
e1-227V2.1abD20
e1-227V2.1bD20
e2-227V3.1D5
e5-227V7.1abD20
e5-227V7.1bD20
e1-228V1.1b2D20
e1-228V1.1b2D20_a
e3-228V1.2cD10
e2-228V1.2cD10
e4-228V2.1acD20
e5-228V3.1aD20
e6-228V3.1bD20
e6-228V3.1bD20_a
e10-228V6.1aD20
e11-228V7.1D20
e11-228V7.1D20_a
e4-232V7.1aD10
e6-232V8.1aD20
e7-232V8.1bD20
e7-232V8.1bD20_a
e2-232V6.1D20
e2-232V6.1D20_a
e3-233V6.1bD15
e3-233V6.1bD20
e3-233V6.1bD20_a
e6-233V8.1bD20
e6-233V8.1bD20_a
e6-233V8.1aD20_a
e4-036V4.1aD20
e4-036V4.1abD20
e4-036V4.2bD20
e4-036V4.2bD20_a
e6-036V6.1aD15
e6-036V6.1aD15_a
e2-036V15.1abD20
e3-036V15.1cD20
e3-036V15.2cD20
e3-036V15.2cD20_a
e1-036V13.1abD20
e1-036V13.1bD20
e1-036V13.1bD20_a
e6-036V18.1aD20
e6-036V18.1aD20_a
e2-036V2.2abD20
e2-036V2.1bD20
e2-036V2.1bD20_a
e3-036V2.2cdD20_a
e1-036V1.1bD20
e1-036V1.1bD10
e4-036V16.1bD20
e4-036V16.1bD20_a
e4-036V16.2bD20
e5-036V16.2cdD15
