^E:\SUMO\GIT\GETDETECTORS\STDAFX.CPP
E:\SUMO\GIT\GETDETECTORS\DEBUG\GETDETECTORS.PCH
E:\SUMO\GIT\GETDETECTORS\DEBUG\VC120.PDB
E:\SUMO\GIT\GETDETECTORS\DEBUG\VC120.IDB
E:\SUMO\GIT\GETDETECTORS\DEBUG\STDAFX.OBJ
^E:\SUMO\GIT\GETDETECTORS\GETDETECTORS.CPP
E:\SUMO\GIT\GETDETECTORS\DEBUG\VC120.PDB
E:\SUMO\GIT\GETDETECTORS\DEBUG\VC120.IDB
E:\SUMO\GIT\GETDETECTORS\DEBUG\GETDETECTORS.OBJ
