Detector;Time;qPKW;qLKW;vPKW;vLKW
e5-126V4.1aD20;10;1;0;10.000;0
e4-126V4.1bD20;10;1;0;10.000;0
e4-126V4.1aD20_a;10;1;0;10.000;0
e23-126V3.1cD15;10;1;0;10.000;0
e3-126V3.1D20;10;1;0;10.000;0
e1-126V2.1abD20;10;1;0;10.000;0
e2-126V2.1bD20;10;1;0;10.000;0
e14-015V4.1aD20;10;66;0;10.000;0
e4-015V4.1bD20;10;50;0;10.000;0
e5-015V4.2bD20;10;44;0;10.000;0
e6-015V4.2bD15;10;17;0;10.000;0
e7-015V23.1bD19;10;1;0;10.000;0
e7-015V23.1bcD19;10;1;0;10.000;0
e2-015V23.1D20;10;49;0;10.000;0
e3-015V3.1abD20;10;93;0;10.000;0
e3-015V3.1bD20;10;93;0;10.000;0
e1-015V2.1aD20;10;36;0;10.000;0
e1-015V2.1aD20_a;10;36;0;10.000;0
e8-015V1.1D15;10;1;0;10.000;0
e1-018V1.1aD20;10;54;0;10.000;0
e1-018V1.1aD20_a;10;54;0;10.000;0
e2-018V1.2bD20;10;58;0;10.000;0
e2-018V1.2bD20_a;10;58;0;10.000;0
e9-018V7.2bD20;10;131;0;10.000;0
e9-018V7.2bD20_a;10;131;0;10.000;0
e8-018V7.2aD20;10;1;0;10.000;0
e7-018V6.2bD20;10;73;0;10.000;0
e7-018V6.2bD20_a;10;73;0;10.000;0
e6-018V6.1aD20;10;103;0;10.000;0
e6-018V6.1aD20_a;10;103;0;10.000;0
e4-018V5.2bD20;10;69;0;10.000;0
e4-018V5.2bD20_a;10;69;0;10.000;0
e5-018V5.3bD20;10;35;0;10.000;0
e3-018V5.1aD20;10;1;0;10.000;0
e9-67V12.1b1D20;10;1;0;10.000;0
e9-67V12.1beD20;10;1;0;10.000;0
e11-067V11.1acD20;10;1;0;10.000;0
e12-067V11.2c1D15;10;1;0;10.000;0
e13-067V11.2c2D15;10;1;0;10.000;0
e10-067V14.1D20;10;1;0;10.000;0
e4-137V21.1D20;10;1;0;10.000;0
e3-137V4.2520;10;1;0;10.000;0
e4-139V4.1D15;10;61;0;10.000;0
e4-139V4.1D15_a;10;61;0;10.000;0
e7-139V7.1D20;10;21;0;10.000;0
e6-139V6.1D15;10;9;0;10.000;0
e2-139V2.1D20;10;127;0;10.000;0
e2-139V2.1D20_a;10;127;0;10.000;0
e1-139V1.1D15;10;18;0;10.000;0
e1-188V1.1abD20;10;23;0;10.000;0
e5-188V1.1cD20;10;10;0;10.000;0
e4-188V4.1bD20;10;21;0;10.000;0
e4-188V4.1abD20;10;21;0;10.000;0
e3-188V3.1abD20;10;68;0;10.000;0
e6-188V3.1cD20;10;1;0;10.000;0
e2-188V2.1abD20;10;1;0;10.000;0
e2-188V2.1bD20;10;1;0;10.000;0
e6-189V5.1aD20;10;1;0;10.000;0
e5-189V5.1D20;10;1;0;10.000;0
e5-189V5.1D20_a;10;1;0;10.000;0
e1-189V1.1D20;10;1;0;10.000;0
e1-189V1.1D20_a;10;1;0;10.000;0
e2-189V1.1cD15;10;1;0;10.000;0
e3-227V4.1abD20;10;21;0;10.000;0
e3-227V4.1bD20;10;21;0;10.000;0
e9-227V12.1D20;10;29;0;10.000;0
e9-227V12.1D20_a;10;29;0;10.000;0
e1-227V2.1abD20;10;165;0;10.000;0
e1-227V2.1bD20;10;165;0;10.000;0
e2-227V3.1D5;10;6;0;10.000;0
e5-227V7.1abD20;10;81;0;10.000;0
e5-227V7.1bD20;10;81;0;10.000;0
e1-228V1.1b2D20;10;125;0;10.000;0
e1-228V1.1b2D20_a;10;125;0;10.000;0
e3-228V1.2cD10;10;2;0;10.000;0
e2-228V1.2cD10;10;5;0;10.000;0
e4-228V2.1acD20;10;20;0;10.000;0
e5-228V3.1aD20;10;15;0;10.000;0
e6-228V3.1bD20;10;73;0;10.000;0
e6-228V3.1bD20_a;10;73;0;10.000;0
e10-228V6.1aD20;10;4;0;10.000;0
e11-228V7.1D20;10;89;0;10.000;0
e11-228V7.1D20_a;10;89;0;10.000;0
e4-232V7.1aD10;10;1;0;10.000;0
e6-232V8.1aD20;10;1;0;10.000;0
e7-232V8.1bD20;10;1;0;10.000;0
e7-232V8.1bD20_a;10;1;0;10.000;0
e2-232V6.1D20;10;1;0;10.000;0
e2-232V6.1D20_a;10;1;0;10.000;0
e3-233V6.1bD15;10;1;0;10.000;0
e3-233V6.1bD20;10;1;0;10.000;0
e3-233V6.1bD20_a;10;1;0;10.000;0
e6-233V8.1bD20;10;1;0;10.000;0
e6-233V8.1bD20_a;10;1;0;10.000;0
e6-233V8.1aD20_a;10;1;0;10.000;0
e4-036V4.1aD20;10;1;0;10.000;0
e4-036V4.1abD20;10;1;0;10.000;0
e4-036V4.2bD20;10;1;0;10.000;0
e4-036V4.2bD20_a;10;1;0;10.000;0
e6-036V6.1aD15;10;1;0;10.000;0
e6-036V6.1aD15_a;10;1;0;10.000;0
e2-036V15.1abD20;10;1;0;10.000;0
e3-036V15.1cD20;10;1;0;10.000;0
e3-036V15.2cD20;10;1;0;10.000;0
e3-036V15.2cD20_a;10;1;0;10.000;0
e1-036V13.1abD20;10;1;0;10.000;0
e1-036V13.1bD20;10;1;0;10.000;0
e1-036V13.1bD20_a;10;1;0;10.000;0
e6-036V18.1aD20;10;1;0;10.000;0
e6-036V18.1aD20_a;10;1;0;10.000;0
e2-036V2.2abD20;10;1;0;10.000;0
e2-036V2.1bD20;10;1;0;10.000;0
e2-036V2.1bD20_a;10;1;0;10.000;0
e3-036V2.2cdD20_a;10;1;0;10.000;0
e1-036V1.1bD20;10;1;0;10.000;0
e1-036V1.1bD10;10;1;0;10.000;0
e4-036V16.1bD20;10;1;0;10.000;0
e4-036V16.1bD20_a;10;1;0;10.000;0
e4-036V16.2bD20;10;1;0;10.000;0
e5-036V16.2cdD15;10;1;0;10.000;0
