^E:\SUMO\GIT\GETDETECTORS\STDAFX.CPP
E:\SUMO\GIT\GETDETECTORS\RELEASE\GETDETECTORS.PCH
E:\SUMO\GIT\GETDETECTORS\RELEASE\VC120.PDB
E:\SUMO\GIT\GETDETECTORS\RELEASE\STDAFX.OBJ
^E:\SUMO\GIT\GETDETECTORS\GETDETECTORS.CPP
E:\SUMO\GIT\GETDETECTORS\RELEASE\VC120.PDB
E:\SUMO\GIT\GETDETECTORS\RELEASE\GETDETECTORS.OBJ
