2014-05-14 07:00:06:000
2014-05-14 07:05:06:000
2014-05-14 07:10:06:000
2014-05-14 07:15:06:000
2014-05-14 07:20:06:000
2014-05-14 07:25:06:000
2014-05-14 07:30:06:000
2014-05-14 07:35:06:000
2014-05-14 07:40:06:000
2014-05-14 07:45:06:000
2014-05-14 07:50:06:000
2014-05-14 07:55:06:000