Detector;Time;qPKW;qLKW;vPKW;vLKW
e5-126V4.1aD20;0;1;0;10.000;0
e4-126V4.1bD20;0;1;0;10.000;0
e4-126V4.1aD20_a;0;1;0;10.000;0
e23-126V3.1cD15;0;1;0;10.000;0
e3-126V3.1D20;0;1;0;10.000;0
e1-126V2.1abD20;0;1;0;10.000;0
e2-126V2.1bD20;0;1;0;10.000;0
e14-015V4.1aD20;0;67;0;10.000;0
e4-015V4.1bD20;0;45;0;10.000;0
e5-015V4.2bD20;0;41;0;10.000;0
e6-015V4.2bD15;0;9;0;10.000;0
e7-015V23.1bD19;0;1;0;10.000;0
e7-015V23.1bcD19;0;1;0;10.000;0
e2-015V23.1D20;0;51;0;10.000;0
e3-015V3.1abD20;0;85;0;10.000;0
e3-015V3.1bD20;0;85;0;10.000;0
e1-015V2.1aD20;0;46;0;10.000;0
e1-015V2.1aD20_a;0;46;0;10.000;0
e8-015V1.1D15;0;1;0;10.000;0
e1-018V1.1aD20;0;47;0;10.000;0
e1-018V1.1aD20_a;0;47;0;10.000;0
e2-018V1.2bD20;0;56;0;10.000;0
e2-018V1.2bD20_a;0;56;0;10.000;0
e9-018V7.2bD20;0;118;0;10.000;0
e9-018V7.2bD20_a;0;118;0;10.000;0
e8-018V7.2aD20;0;1;0;10.000;0
e7-018V6.2bD20;0;68;0;10.000;0
e7-018V6.2bD20_a;0;68;0;10.000;0
e6-018V6.1aD20;0;108;0;10.000;0
e6-018V6.1aD20_a;0;108;0;10.000;0
e4-018V5.2bD20;0;62;0;10.000;0
e4-018V5.2bD20_a;0;62;0;10.000;0
e5-018V5.3bD20;0;32;0;10.000;0
e3-018V5.1aD20;0;1;0;10.000;0
e9-67V12.1b1D20;0;1;0;10.000;0
e9-67V12.1beD20;0;1;0;10.000;0
e11-067V11.1acD20;0;1;0;10.000;0
e12-067V11.2c1D15;0;1;0;10.000;0
e13-067V11.2c2D15;0;1;0;10.000;0
e10-067V14.1D20;0;1;0;10.000;0
e4-137V21.1D20;0;1;0;10.000;0
e3-137V4.2520;0;1;0;10.000;0
e4-139V4.1D15;0;70;0;10.000;0
e4-139V4.1D15_a;0;70;0;10.000;0
e7-139V7.1D20;0;26;0;10.000;0
e6-139V6.1D15;0;5;0;10.000;0
e2-139V2.1D20;0;104;0;10.000;0
e2-139V2.1D20_a;0;104;0;10.000;0
e1-139V1.1D15;0;22;0;10.000;0
e1-188V1.1abD20;0;23;0;10.000;0
e5-188V1.1cD20;0;9;0;10.000;0
e4-188V4.1bD20;0;20;0;10.000;0
e4-188V4.1abD20;0;20;0;10.000;0
e3-188V3.1abD20;0;67;0;10.000;0
e6-188V3.1cD20;0;1;0;10.000;0
e2-188V2.1abD20;0;1;0;10.000;0
e2-188V2.1bD20;0;1;0;10.000;0
e6-189V5.1aD20;0;1;0;10.000;0
e5-189V5.1D20;0;1;0;10.000;0
e5-189V5.1D20_a;0;1;0;10.000;0
e1-189V1.1D20;0;1;0;10.000;0
e1-189V1.1D20_a;0;1;0;10.000;0
e2-189V1.1cD15;0;1;0;10.000;0
e3-227V4.1abD20;0;26;0;10.000;0
e3-227V4.1bD20;0;26;0;10.000;0
e9-227V12.1D20;0;23;0;10.000;0
e9-227V12.1D20_a;0;23;0;10.000;0
e1-227V2.1abD20;0;139;0;10.000;0
e1-227V2.1bD20;0;139;0;10.000;0
e2-227V3.1D5;0;5;0;10.000;0
e5-227V7.1abD20;0;92;0;10.000;0
e5-227V7.1bD20;0;92;0;10.000;0
e1-228V1.1b2D20;0;117;0;10.000;0
e1-228V1.1b2D20_a;0;117;0;10.000;0
e3-228V1.2cD10;0;2;0;10.000;0
e2-228V1.2cD10;0;3;0;10.000;0
e4-228V2.1acD20;0;19;0;10.000;0
e5-228V3.1aD20;0;25;0;10.000;0
e6-228V3.1bD20;0;72;0;10.000;0
e6-228V3.1bD20_a;0;72;0;10.000;0
e10-228V6.1aD20;0;8;0;10.000;0
e11-228V7.1D20;0;110;0;10.000;0
e11-228V7.1D20_a;0;110;0;10.000;0
e4-232V7.1aD10;0;1;0;10.000;0
e6-232V8.1aD20;0;1;0;10.000;0
e7-232V8.1bD20;0;1;0;10.000;0
e7-232V8.1bD20_a;0;1;0;10.000;0
e2-232V6.1D20;0;1;0;10.000;0
e2-232V6.1D20_a;0;1;0;10.000;0
e3-233V6.1bD15;0;1;0;10.000;0
e3-233V6.1bD20;0;1;0;10.000;0
e3-233V6.1bD20_a;0;1;0;10.000;0
e6-233V8.1bD20;0;1;0;10.000;0
e6-233V8.1bD20_a;0;1;0;10.000;0
e6-233V8.1aD20_a;0;1;0;10.000;0
e4-036V4.1aD20;0;1;0;10.000;0
e4-036V4.1abD20;0;1;0;10.000;0
e4-036V4.2bD20;0;1;0;10.000;0
e4-036V4.2bD20_a;0;1;0;10.000;0
e6-036V6.1aD15;0;1;0;10.000;0
e6-036V6.1aD15_a;0;1;0;10.000;0
e2-036V15.1abD20;0;1;0;10.000;0
e3-036V15.1cD20;0;1;0;10.000;0
e3-036V15.2cD20;0;1;0;10.000;0
e3-036V15.2cD20_a;0;1;0;10.000;0
e1-036V13.1abD20;0;1;0;10.000;0
e1-036V13.1bD20;0;1;0;10.000;0
e1-036V13.1bD20_a;0;1;0;10.000;0
e6-036V18.1aD20;0;1;0;10.000;0
e6-036V18.1aD20_a;0;1;0;10.000;0
e2-036V2.2abD20;0;1;0;10.000;0
e2-036V2.1bD20;0;1;0;10.000;0
e2-036V2.1bD20_a;0;1;0;10.000;0
e3-036V2.2cdD20_a;0;1;0;10.000;0
e1-036V1.1bD20;0;1;0;10.000;0
e1-036V1.1bD10;0;1;0;10.000;0
e4-036V16.1bD20;0;1;0;10.000;0
e4-036V16.1bD20_a;0;1;0;10.000;0
e4-036V16.2bD20;0;1;0;10.000;0
e5-036V16.2cdD15;0;1;0;10.000;0
