<?xml version="1.0" encoding="UTF-8"?>
<svg width="13px" height="13px" viewBox="0 0 13 13" version="1.1" xmlns="http://www.w3.org/2000/svg" xmlns:xlink="http://www.w3.org/1999/xlink">
    <!-- Generator: Sketch 55.2 (78181) - https://sketchapp.com -->
    <title>Solid/history</title>
    <desc>Created with Sketch.</desc>
    <defs>
        <path d="M13,6.4877199 C13.0066198,10.069017 10.0859993,12.9974822 6.5047121,13 C4.95794933,13.0010991 3.53717637,12.4619126 2.42067129,11.560796 C2.13034694,11.326481 2.10864535,10.8913734 2.37247173,10.6275463 L2.66777591,10.3322413 C2.89341483,10.1066017 3.25364032,10.0819122 3.50362801,10.2802412 C4.32621802,10.9329944 5.3672393,11.322602 6.5,11.322602 C9.1656473,11.322602 11.3225708,9.16525318 11.3225708,6.50001226 C11.3225708,3.83435199 9.16522794,1.67742252 6.5,1.67742252 C5.22059628,1.67742252 4.05859124,2.17459483 3.19579562,2.9861266 L4.52604043,4.31637508 C4.79023375,4.58056913 4.60312303,5.03226756 4.22953061,5.03226756 L0.419354475,5.03226756 C0.187739757,5.03226756 0,4.84452729 0,4.61291193 L0,0.802725305 C0,0.429131858 0.451697189,0.242020618 0.715890508,0.506188455 L2.00991358,1.80021509 C3.17684604,0.685017421 4.75841523,0 6.5,0 C10.0857372,0 12.9933577,2.90351354 13,6.4877199 Z" id="path-1"></path>
    </defs>
    <g id="Desktop" stroke="none" stroke-width="1" fill="none" fill-rule="evenodd">
        <g id="Checkout" transform="translate(-370.000000, -1145.000000)">
            <g id="Group-8" transform="translate(370.000000, 1143.000000)">
                <g id="Solid/history" transform="translate(0.000000, 2.000000)">
                    <mask id="mask-2" fill="white">
                        <use xlink:href="#path-1"></use>
                    </mask>
                    <use id="Mask" fill="#00C972" xlink:href="#path-1"></use>
                </g>
            </g>
        </g>
    </g>
</svg>