2020-02-29T00:36:05+00:00 CRITICAL Uncaught Error: Call to a member function get_id() on null in /home/myachat/public_html/wp-content/themes/porto/functions.php:1008
Stack trace:
#0 /home/myachat/public_html/wp-includes/class-wp-hook.php(288): wpb_hook_javascript('')
#1 /home/myachat/public_html/wp-includes/class-wp-hook.php(312): WP_Hook->apply_filters(NULL, Array)
#2 /home/myachat/public_html/wp-includes/plugin.php(478): WP_Hook->do_action(Array)
#3 /home/myachat/public_html/wp-includes/general-template.php(2879): do_action('wp_head')
#4 /home/myachat/public_html/wp-content/themes/porto/head.php(37): wp_head()
#5 /home/myachat/public_html/wp-includes/template.php(724): require('/home/myachat/p...')
#6 /home/myachat/public_html/wp-includes/template.php(671): load_template('/home/myachat/p...', false)
#7 /home/myachat/public_html/wp-includes/general-template.php(168): locate_template(Array, true, false)
#8 /home/myachat/public_html/wp-content/themes/porto/header.php(38): get_template_part('head')
#9 /home/myachat/public_html/wp-includes/templa in /home/myachat/public_html/wp-content/themes/porto/functions.php on line 1008

2020-02-29T17:43:16+00:00 CRITICAL syntax error, unexpected '.', expecting elseif (T_ELSEIF) or else (T_ELSE) or endif (T_ENDIF) in /home/myachat/public_html/wp-content/themes/porto/woocommerce/single-product-reviews.php on line 111

2020-02-29T17:43:30+00:00 CRITICAL syntax error, unexpected '.', expecting elseif (T_ELSEIF) or else (T_ELSE) or endif (T_ENDIF) in /home/myachat/public_html/wp-content/themes/porto/woocommerce/single-product-reviews.php on line 111

2020-02-29T17:44:33+00:00 CRITICAL Uncaught Error: Class name must be a valid object or a string in /home/myachat/public_html/wp-content/themes/porto/woocommerce/single-product-reviews.php:111
Stack trace:
#0 /home/myachat/public_html/wp-includes/comment-template.php(1508): require()
#1 /home/myachat/public_html/wp-content/themes/porto/woocommerce/single-product/tabs/tabs.php(54): comments_template('reviews', Array)
#2 /home/myachat/public_html/wp-content/plugins/woocommerce/includes/wc-core-functions.php(249): include('/home/myachat/p...')
#3 /home/myachat/public_html/wp-content/plugins/woocommerce/includes/wc-template-functions.php(1496): wc_get_template('single-product/...')
#4 /home/myachat/public_html/wp-includes/class-wp-hook.php(288): woocommerce_output_product_data_tabs('')
#5 /home/myachat/public_html/wp-includes/class-wp-hook.php(312): WP_Hook->apply_filters('', Array)
#6 /home/myachat/public_html/wp-includes/plugin.php(478): WP_Hook->do_action(Array)
#7 /home/myachat/public_html/wp-content/themes/porto/woocommerce/content-single-pro in /home/myachat/public_html/wp-content/themes/porto/woocommerce/single-product-reviews.php on line 111

2020-02-29T18:30:39+00:00 CRITICAL syntax error, unexpected 'comment_author' (T_STRING), expecting ',' or ')' in /home/myachat/public_html/wp-content/themes/porto/woocommerce/single-product/review-meta.php on line 24

