%YAML 1.1
%TAG !u! tag:unity3d.com,2011:
--- !u!1001 &969994103424730218
PrefabInstance:
  m_ObjectHideFlags: 0
  serializedVersion: 2
  m_Modification:
    m_TransformParent: {fileID: 1573374872899639739}
    m_Modifications:
    - target: {fileID: 3180914043046538433, guid: 4b956dbe7d56e2c4a82336a4d1689ea5, type: 3}
      propertyPath: m_RootOrder
      value: 0
      objectReference: {fileID: 0}
    - target: {fileID: 3180914043046538433, guid: 4b956dbe7d56e2c4a82336a4d1689ea5, type: 3}
      propertyPath: m_LocalPosition.x
      value: 0
      objectReference: {fileID: 0}
    - target: {fileID: 3180914043046538433, guid: 4b956dbe7d56e2c4a82336a4d1689ea5, type: 3}
      propertyPath: m_LocalPosition.y
      value: 0
      objectReference: {fileID: 0}
    - target: {fileID: 3180914043046538433, guid: 4b956dbe7d56e2c4a82336a4d1689ea5, type: 3}
      propertyPath: m_LocalPosition.z
      value: 0
      objectReference: {fileID: 0}
    - target: {fileID: 3180914043046538433, guid: 4b956dbe7d56e2c4a82336a4d1689ea5, type: 3}
      propertyPath: m_LocalRotation.w
      value: 1
      objectReference: {fileID: 0}
    - target: {fileID: 3180914043046538433, guid: 4b956dbe7d56e2c4a82336a4d1689ea5, type: 3}
      propertyPath: m_LocalRotation.x
      value: 0
      objectReference: {fileID: 0}
    - target: {fileID: 3180914043046538433, guid: 4b956dbe7d56e2c4a82336a4d1689ea5, type: 3}
      propertyPath: m_LocalRotation.y
      value: 0
      objectReference: {fileID: 0}
    - target: {fileID: 3180914043046538433, guid: 4b956dbe7d56e2c4a82336a4d1689ea5, type: 3}
      propertyPath: m_LocalRotation.z
      value: 0
      objectReference: {fileID: 0}
    - target: {fileID: 3180914043046538433, guid: 4b956dbe7d56e2c4a82336a4d1689ea5, type: 3}
      propertyPath: m_LocalEulerAnglesHint.x
      value: 0
      objectReference: {fileID: 0}
    - target: {fileID: 3180914043046538433, guid: 4b956dbe7d56e2c4a82336a4d1689ea5, type: 3}
      propertyPath: m_LocalEulerAnglesHint.y
      value: 0
      objectReference: {fileID: 0}
    - target: {fileID: 3180914043046538433, guid: 4b956dbe7d56e2c4a82336a4d1689ea5, type: 3}
      propertyPath: m_LocalEulerAnglesHint.z
      value: 0
      objectReference: {fileID: 0}
    - target: {fileID: 3180914043046538437, guid: 4b956dbe7d56e2c4a82336a4d1689ea5, type: 3}
      propertyPath: m_Name
      value: Model-Balloon-Blue-2
      objectReference: {fileID: 0}
    m_RemovedComponents: []
  m_SourcePrefab: {fileID: 100100000, guid: 4b956dbe7d56e2c4a82336a4d1689ea5, type: 3}
--- !u!1001 &8384299737282837311
PrefabInstance:
  m_ObjectHideFlags: 0
  serializedVersion: 2
  m_Modification:
    m_TransformParent: {fileID: 0}
    m_Modifications:
    - target: {fileID: 1236877795754284800, guid: 40b6a2ba618675b4596fb16572874567, type: 3}
      propertyPath: Spawn.Array.size
      value: 1
      objectReference: {fileID: 0}
    - target: {fileID: 1236877795754284800, guid: 40b6a2ba618675b4596fb16572874567, type: 3}
      propertyPath: Spawn.Array.data[0].Amount
      value: 2
      objectReference: {fileID: 0}
    - target: {fileID: 1236877795754284800, guid: 40b6a2ba618675b4596fb16572874567, type: 3}
      propertyPath: Spawn.Array.data[0].Prefab
      value: 
      objectReference: {fileID: 3994835028929740414, guid: dddc799d6df513443b8d6fd1015c4fa9, type: 3}
    - target: {fileID: 7029771762545042049, guid: 40b6a2ba618675b4596fb16572874567, type: 3}
      propertyPath: Id
      value: balloon-blue-2
      objectReference: {fileID: 0}
    - target: {fileID: 7029771762545042049, guid: 40b6a2ba618675b4596fb16572874567, type: 3}
      propertyPath: Name
      value: Blue Balloon 2
      objectReference: {fileID: 0}
    - target: {fileID: 7029771762545042049, guid: 40b6a2ba618675b4596fb16572874567, type: 3}
      propertyPath: Spawn.Array.size
      value: 1
      objectReference: {fileID: 0}
    - target: {fileID: 7029771762545042049, guid: 40b6a2ba618675b4596fb16572874567, type: 3}
      propertyPath: Spawn.Array.data[0].Amount
      value: 2
      objectReference: {fileID: 0}
    - target: {fileID: 7029771762545042049, guid: 40b6a2ba618675b4596fb16572874567, type: 3}
      propertyPath: Spawn.Array.data[0].Prefab
      value: 
      objectReference: {fileID: 3994835028929740414, guid: dddc799d6df513443b8d6fd1015c4fa9, type: 3}
    - target: {fileID: 7029771762545042052, guid: 40b6a2ba618675b4596fb16572874567, type: 3}
      propertyPath: m_RootOrder
      value: 0
      objectReference: {fileID: 0}
    - target: {fileID: 7029771762545042052, guid: 40b6a2ba618675b4596fb16572874567, type: 3}
      propertyPath: m_LocalPosition.x
      value: 0
      objectReference: {fileID: 0}
    - target: {fileID: 7029771762545042052, guid: 40b6a2ba618675b4596fb16572874567, type: 3}
      propertyPath: m_LocalPosition.y
      value: 0
      objectReference: {fileID: 0}
    - target: {fileID: 7029771762545042052, guid: 40b6a2ba618675b4596fb16572874567, type: 3}
      propertyPath: m_LocalPosition.z
      value: 0
      objectReference: {fileID: 0}
    - target: {fileID: 7029771762545042052, guid: 40b6a2ba618675b4596fb16572874567, type: 3}
      propertyPath: m_LocalRotation.w
      value: 1
      objectReference: {fileID: 0}
    - target: {fileID: 7029771762545042052, guid: 40b6a2ba618675b4596fb16572874567, type: 3}
      propertyPath: m_LocalRotation.x
      value: 0
      objectReference: {fileID: 0}
    - target: {fileID: 7029771762545042052, guid: 40b6a2ba618675b4596fb16572874567, type: 3}
      propertyPath: m_LocalRotation.y
      value: 0
      objectReference: {fileID: 0}
    - target: {fileID: 7029771762545042052, guid: 40b6a2ba618675b4596fb16572874567, type: 3}
      propertyPath: m_LocalRotation.z
      value: 0
      objectReference: {fileID: 0}
    - target: {fileID: 7029771762545042052, guid: 40b6a2ba618675b4596fb16572874567, type: 3}
      propertyPath: m_LocalEulerAnglesHint.x
      value: 0
      objectReference: {fileID: 0}
    - target: {fileID: 7029771762545042052, guid: 40b6a2ba618675b4596fb16572874567, type: 3}
      propertyPath: m_LocalEulerAnglesHint.y
      value: 0
      objectReference: {fileID: 0}
    - target: {fileID: 7029771762545042052, guid: 40b6a2ba618675b4596fb16572874567, type: 3}
      propertyPath: m_LocalEulerAnglesHint.z
      value: 0
      objectReference: {fileID: 0}
    - target: {fileID: 7029771762545042058, guid: 40b6a2ba618675b4596fb16572874567, type: 3}
      propertyPath: m_Name
      value: Unit-Balloon-Blue-2
      objectReference: {fileID: 0}
    - target: {fileID: 7029771762545042058, guid: 40b6a2ba618675b4596fb16572874567, type: 3}
      propertyPath: m_IsActive
      value: 1
      objectReference: {fileID: 0}
    - target: {fileID: 8537211702403525429, guid: 40b6a2ba618675b4596fb16572874567, type: 3}
      propertyPath: m_Mass
      value: 1
      objectReference: {fileID: 0}
    - target: {fileID: 8952092275872302399, guid: 40b6a2ba618675b4596fb16572874567, type: 3}
      propertyPath: m_Size.x
      value: 1.33
      objectReference: {fileID: 0}
    - target: {fileID: 8952092275872302399, guid: 40b6a2ba618675b4596fb16572874567, type: 3}
      propertyPath: m_Size.y
      value: 1.08
      objectReference: {fileID: 0}
    m_RemovedComponents: []
  m_SourcePrefab: {fileID: 100100000, guid: 40b6a2ba618675b4596fb16572874567, type: 3}
--- !u!4 &1573374872899639739 stripped
Transform:
  m_CorrespondingSourceObject: {fileID: 7029771762545042052, guid: 40b6a2ba618675b4596fb16572874567, type: 3}
  m_PrefabInstance: {fileID: 8384299737282837311}
  m_PrefabAsset: {fileID: 0}
