%YAML 1.1
%TAG !u! tag:unity3d.com,2011:
--- !u!1001 &6478330029346902023
PrefabInstance:
  m_ObjectHideFlags: 0
  serializedVersion: 2
  m_Modification:
    m_TransformParent: {fileID: 1388452937698100927}
    m_Modifications:
    - target: {fileID: 1966761783582346770, guid: c498037e47571ca4c878a0aefe998ff0, type: 3}
      propertyPath: m_Name
      value: Model-Balloon-Red-2
      objectReference: {fileID: 0}
    - target: {fileID: 1966761783582346774, guid: c498037e47571ca4c878a0aefe998ff0, type: 3}
      propertyPath: m_RootOrder
      value: 0
      objectReference: {fileID: 0}
    - target: {fileID: 1966761783582346774, guid: c498037e47571ca4c878a0aefe998ff0, type: 3}
      propertyPath: m_LocalPosition.x
      value: 0
      objectReference: {fileID: 0}
    - target: {fileID: 1966761783582346774, guid: c498037e47571ca4c878a0aefe998ff0, type: 3}
      propertyPath: m_LocalPosition.y
      value: 0
      objectReference: {fileID: 0}
    - target: {fileID: 1966761783582346774, guid: c498037e47571ca4c878a0aefe998ff0, type: 3}
      propertyPath: m_LocalPosition.z
      value: 0
      objectReference: {fileID: 0}
    - target: {fileID: 1966761783582346774, guid: c498037e47571ca4c878a0aefe998ff0, type: 3}
      propertyPath: m_LocalRotation.w
      value: 1
      objectReference: {fileID: 0}
    - target: {fileID: 1966761783582346774, guid: c498037e47571ca4c878a0aefe998ff0, type: 3}
      propertyPath: m_LocalRotation.x
      value: 0
      objectReference: {fileID: 0}
    - target: {fileID: 1966761783582346774, guid: c498037e47571ca4c878a0aefe998ff0, type: 3}
      propertyPath: m_LocalRotation.y
      value: 0
      objectReference: {fileID: 0}
    - target: {fileID: 1966761783582346774, guid: c498037e47571ca4c878a0aefe998ff0, type: 3}
      propertyPath: m_LocalRotation.z
      value: 0
      objectReference: {fileID: 0}
    - target: {fileID: 1966761783582346774, guid: c498037e47571ca4c878a0aefe998ff0, type: 3}
      propertyPath: m_LocalEulerAnglesHint.x
      value: 0
      objectReference: {fileID: 0}
    - target: {fileID: 1966761783582346774, guid: c498037e47571ca4c878a0aefe998ff0, type: 3}
      propertyPath: m_LocalEulerAnglesHint.y
      value: 0
      objectReference: {fileID: 0}
    - target: {fileID: 1966761783582346774, guid: c498037e47571ca4c878a0aefe998ff0, type: 3}
      propertyPath: m_LocalEulerAnglesHint.z
      value: 0
      objectReference: {fileID: 0}
    m_RemovedComponents: []
  m_SourcePrefab: {fileID: 100100000, guid: c498037e47571ca4c878a0aefe998ff0, type: 3}
--- !u!1001 &8271426668275852347
PrefabInstance:
  m_ObjectHideFlags: 0
  serializedVersion: 2
  m_Modification:
    m_TransformParent: {fileID: 0}
    m_Modifications:
    - target: {fileID: 1236877795754284800, guid: 40b6a2ba618675b4596fb16572874567, type: 3}
      propertyPath: Spawn.Array.size
      value: 1
      objectReference: {fileID: 0}
    - target: {fileID: 1236877795754284800, guid: 40b6a2ba618675b4596fb16572874567, type: 3}
      propertyPath: Spawn.Array.data[0].Amount
      value: 2
      objectReference: {fileID: 0}
    - target: {fileID: 1236877795754284800, guid: 40b6a2ba618675b4596fb16572874567, type: 3}
      propertyPath: Spawn.Array.data[0].Prefab
      value: 
      objectReference: {fileID: 9146245608852356002, guid: 2533b03ccfaebdf42b2e79dc3ee9be18, type: 3}
    - target: {fileID: 7029771762545042049, guid: 40b6a2ba618675b4596fb16572874567, type: 3}
      propertyPath: Id
      value: balloon-red-2
      objectReference: {fileID: 0}
    - target: {fileID: 7029771762545042049, guid: 40b6a2ba618675b4596fb16572874567, type: 3}
      propertyPath: Name
      value: Red Balloon 2
      objectReference: {fileID: 0}
    - target: {fileID: 7029771762545042049, guid: 40b6a2ba618675b4596fb16572874567, type: 3}
      propertyPath: Spawn.Array.size
      value: 1
      objectReference: {fileID: 0}
    - target: {fileID: 7029771762545042049, guid: 40b6a2ba618675b4596fb16572874567, type: 3}
      propertyPath: Spawn.Array.data[0].Amount
      value: 2
      objectReference: {fileID: 0}
    - target: {fileID: 7029771762545042049, guid: 40b6a2ba618675b4596fb16572874567, type: 3}
      propertyPath: Spawn.Array.data[0].Prefab
      value: 
      objectReference: {fileID: 9146245608852356002, guid: 2533b03ccfaebdf42b2e79dc3ee9be18, type: 3}
    - target: {fileID: 7029771762545042052, guid: 40b6a2ba618675b4596fb16572874567, type: 3}
      propertyPath: m_RootOrder
      value: 0
      objectReference: {fileID: 0}
    - target: {fileID: 7029771762545042052, guid: 40b6a2ba618675b4596fb16572874567, type: 3}
      propertyPath: m_LocalPosition.x
      value: 0
      objectReference: {fileID: 0}
    - target: {fileID: 7029771762545042052, guid: 40b6a2ba618675b4596fb16572874567, type: 3}
      propertyPath: m_LocalPosition.y
      value: 0
      objectReference: {fileID: 0}
    - target: {fileID: 7029771762545042052, guid: 40b6a2ba618675b4596fb16572874567, type: 3}
      propertyPath: m_LocalPosition.z
      value: 0
      objectReference: {fileID: 0}
    - target: {fileID: 7029771762545042052, guid: 40b6a2ba618675b4596fb16572874567, type: 3}
      propertyPath: m_LocalRotation.w
      value: 1
      objectReference: {fileID: 0}
    - target: {fileID: 7029771762545042052, guid: 40b6a2ba618675b4596fb16572874567, type: 3}
      propertyPath: m_LocalRotation.x
      value: 0
      objectReference: {fileID: 0}
    - target: {fileID: 7029771762545042052, guid: 40b6a2ba618675b4596fb16572874567, type: 3}
      propertyPath: m_LocalRotation.y
      value: 0
      objectReference: {fileID: 0}
    - target: {fileID: 7029771762545042052, guid: 40b6a2ba618675b4596fb16572874567, type: 3}
      propertyPath: m_LocalRotation.z
      value: 0
      objectReference: {fileID: 0}
    - target: {fileID: 7029771762545042052, guid: 40b6a2ba618675b4596fb16572874567, type: 3}
      propertyPath: m_LocalEulerAnglesHint.x
      value: 0
      objectReference: {fileID: 0}
    - target: {fileID: 7029771762545042052, guid: 40b6a2ba618675b4596fb16572874567, type: 3}
      propertyPath: m_LocalEulerAnglesHint.y
      value: 0
      objectReference: {fileID: 0}
    - target: {fileID: 7029771762545042052, guid: 40b6a2ba618675b4596fb16572874567, type: 3}
      propertyPath: m_LocalEulerAnglesHint.z
      value: 0
      objectReference: {fileID: 0}
    - target: {fileID: 7029771762545042058, guid: 40b6a2ba618675b4596fb16572874567, type: 3}
      propertyPath: m_Name
      value: Unit-Balloon-Red-2
      objectReference: {fileID: 0}
    - target: {fileID: 7029771762545042058, guid: 40b6a2ba618675b4596fb16572874567, type: 3}
      propertyPath: m_IsActive
      value: 1
      objectReference: {fileID: 0}
    - target: {fileID: 8952092275872302399, guid: 40b6a2ba618675b4596fb16572874567, type: 3}
      propertyPath: m_Size.x
      value: 1.33
      objectReference: {fileID: 0}
    - target: {fileID: 8952092275872302399, guid: 40b6a2ba618675b4596fb16572874567, type: 3}
      propertyPath: m_Size.y
      value: 1.08
      objectReference: {fileID: 0}
    m_RemovedComponents: []
  m_SourcePrefab: {fileID: 100100000, guid: 40b6a2ba618675b4596fb16572874567, type: 3}
--- !u!4 &1388452937698100927 stripped
Transform:
  m_CorrespondingSourceObject: {fileID: 7029771762545042052, guid: 40b6a2ba618675b4596fb16572874567, type: 3}
  m_PrefabInstance: {fileID: 8271426668275852347}
  m_PrefabAsset: {fileID: 0}
