%YAML 1.1
%TAG !u! tag:unity3d.com,2011:
--- !u!1001 &5074491107020735576
PrefabInstance:
  m_ObjectHideFlags: 0
  serializedVersion: 2
  m_Modification:
    m_TransformParent: {fileID: 0}
    m_Modifications:
    - target: {fileID: 1236877795754284800, guid: 40b6a2ba618675b4596fb16572874567, type: 3}
      propertyPath: Spawn.Array.size
      value: 1
      objectReference: {fileID: 0}
    - target: {fileID: 1236877795754284800, guid: 40b6a2ba618675b4596fb16572874567, type: 3}
      propertyPath: Spawn.Array.data[0].Amount
      value: 2
      objectReference: {fileID: 0}
    - target: {fileID: 1236877795754284800, guid: 40b6a2ba618675b4596fb16572874567, type: 3}
      propertyPath: Spawn.Array.data[0].Prefab
      value: 
      objectReference: {fileID: 1990001674413784706, guid: c6e0df68718942f4d88e573a8624eea5, type: 3}
    - target: {fileID: 7029771762545042049, guid: 40b6a2ba618675b4596fb16572874567, type: 3}
      propertyPath: Id
      value: balloon-green-2
      objectReference: {fileID: 0}
    - target: {fileID: 7029771762545042049, guid: 40b6a2ba618675b4596fb16572874567, type: 3}
      propertyPath: Name
      value: Green Balloon 2
      objectReference: {fileID: 0}
    - target: {fileID: 7029771762545042049, guid: 40b6a2ba618675b4596fb16572874567, type: 3}
      propertyPath: Spawn.Array.size
      value: 1
      objectReference: {fileID: 0}
    - target: {fileID: 7029771762545042049, guid: 40b6a2ba618675b4596fb16572874567, type: 3}
      propertyPath: Spawn.Array.data[0].Amount
      value: 2
      objectReference: {fileID: 0}
    - target: {fileID: 7029771762545042049, guid: 40b6a2ba618675b4596fb16572874567, type: 3}
      propertyPath: Spawn.Array.data[0].Prefab
      value: 
      objectReference: {fileID: 1990001674413784706, guid: c6e0df68718942f4d88e573a8624eea5, type: 3}
    - target: {fileID: 7029771762545042052, guid: 40b6a2ba618675b4596fb16572874567, type: 3}
      propertyPath: m_RootOrder
      value: 0
      objectReference: {fileID: 0}
    - target: {fileID: 7029771762545042052, guid: 40b6a2ba618675b4596fb16572874567, type: 3}
      propertyPath: m_LocalPosition.x
      value: 0
      objectReference: {fileID: 0}
    - target: {fileID: 7029771762545042052, guid: 40b6a2ba618675b4596fb16572874567, type: 3}
      propertyPath: m_LocalPosition.y
      value: 0
      objectReference: {fileID: 0}
    - target: {fileID: 7029771762545042052, guid: 40b6a2ba618675b4596fb16572874567, type: 3}
      propertyPath: m_LocalPosition.z
      value: 0
      objectReference: {fileID: 0}
    - target: {fileID: 7029771762545042052, guid: 40b6a2ba618675b4596fb16572874567, type: 3}
      propertyPath: m_LocalRotation.w
      value: 1
      objectReference: {fileID: 0}
    - target: {fileID: 7029771762545042052, guid: 40b6a2ba618675b4596fb16572874567, type: 3}
      propertyPath: m_LocalRotation.x
      value: 0
      objectReference: {fileID: 0}
    - target: {fileID: 7029771762545042052, guid: 40b6a2ba618675b4596fb16572874567, type: 3}
      propertyPath: m_LocalRotation.y
      value: 0
      objectReference: {fileID: 0}
    - target: {fileID: 7029771762545042052, guid: 40b6a2ba618675b4596fb16572874567, type: 3}
      propertyPath: m_LocalRotation.z
      value: 0
      objectReference: {fileID: 0}
    - target: {fileID: 7029771762545042052, guid: 40b6a2ba618675b4596fb16572874567, type: 3}
      propertyPath: m_LocalEulerAnglesHint.x
      value: 0
      objectReference: {fileID: 0}
    - target: {fileID: 7029771762545042052, guid: 40b6a2ba618675b4596fb16572874567, type: 3}
      propertyPath: m_LocalEulerAnglesHint.y
      value: 0
      objectReference: {fileID: 0}
    - target: {fileID: 7029771762545042052, guid: 40b6a2ba618675b4596fb16572874567, type: 3}
      propertyPath: m_LocalEulerAnglesHint.z
      value: 0
      objectReference: {fileID: 0}
    - target: {fileID: 7029771762545042058, guid: 40b6a2ba618675b4596fb16572874567, type: 3}
      propertyPath: m_Name
      value: Unit-Balloon-Green-2
      objectReference: {fileID: 0}
    - target: {fileID: 7029771762545042058, guid: 40b6a2ba618675b4596fb16572874567, type: 3}
      propertyPath: m_IsActive
      value: 1
      objectReference: {fileID: 0}
    - target: {fileID: 8952092275872302399, guid: 40b6a2ba618675b4596fb16572874567, type: 3}
      propertyPath: m_Size.x
      value: 1.33
      objectReference: {fileID: 0}
    - target: {fileID: 8952092275872302399, guid: 40b6a2ba618675b4596fb16572874567, type: 3}
      propertyPath: m_Size.y
      value: 1.08
      objectReference: {fileID: 0}
    m_RemovedComponents: []
  m_SourcePrefab: {fileID: 100100000, guid: 40b6a2ba618675b4596fb16572874567, type: 3}
--- !u!4 &2874126601724372700 stripped
Transform:
  m_CorrespondingSourceObject: {fileID: 7029771762545042052, guid: 40b6a2ba618675b4596fb16572874567, type: 3}
  m_PrefabInstance: {fileID: 5074491107020735576}
  m_PrefabAsset: {fileID: 0}
--- !u!1001 &6869881568099714338
PrefabInstance:
  m_ObjectHideFlags: 0
  serializedVersion: 2
  m_Modification:
    m_TransformParent: {fileID: 2874126601724372700}
    m_Modifications:
    - target: {fileID: 8395809717709644515, guid: 5f59363fb9694434e9c303f1e9e64059, type: 3}
      propertyPath: m_RootOrder
      value: 0
      objectReference: {fileID: 0}
    - target: {fileID: 8395809717709644515, guid: 5f59363fb9694434e9c303f1e9e64059, type: 3}
      propertyPath: m_LocalPosition.x
      value: 0
      objectReference: {fileID: 0}
    - target: {fileID: 8395809717709644515, guid: 5f59363fb9694434e9c303f1e9e64059, type: 3}
      propertyPath: m_LocalPosition.y
      value: 0
      objectReference: {fileID: 0}
    - target: {fileID: 8395809717709644515, guid: 5f59363fb9694434e9c303f1e9e64059, type: 3}
      propertyPath: m_LocalPosition.z
      value: 0
      objectReference: {fileID: 0}
    - target: {fileID: 8395809717709644515, guid: 5f59363fb9694434e9c303f1e9e64059, type: 3}
      propertyPath: m_LocalRotation.w
      value: 1
      objectReference: {fileID: 0}
    - target: {fileID: 8395809717709644515, guid: 5f59363fb9694434e9c303f1e9e64059, type: 3}
      propertyPath: m_LocalRotation.x
      value: 0
      objectReference: {fileID: 0}
    - target: {fileID: 8395809717709644515, guid: 5f59363fb9694434e9c303f1e9e64059, type: 3}
      propertyPath: m_LocalRotation.y
      value: 0
      objectReference: {fileID: 0}
    - target: {fileID: 8395809717709644515, guid: 5f59363fb9694434e9c303f1e9e64059, type: 3}
      propertyPath: m_LocalRotation.z
      value: 0
      objectReference: {fileID: 0}
    - target: {fileID: 8395809717709644515, guid: 5f59363fb9694434e9c303f1e9e64059, type: 3}
      propertyPath: m_LocalEulerAnglesHint.x
      value: 0
      objectReference: {fileID: 0}
    - target: {fileID: 8395809717709644515, guid: 5f59363fb9694434e9c303f1e9e64059, type: 3}
      propertyPath: m_LocalEulerAnglesHint.y
      value: 0
      objectReference: {fileID: 0}
    - target: {fileID: 8395809717709644515, guid: 5f59363fb9694434e9c303f1e9e64059, type: 3}
      propertyPath: m_LocalEulerAnglesHint.z
      value: 0
      objectReference: {fileID: 0}
    - target: {fileID: 8395809717709644519, guid: 5f59363fb9694434e9c303f1e9e64059, type: 3}
      propertyPath: m_Name
      value: Model-Balloon-Green-2
      objectReference: {fileID: 0}
    m_RemovedComponents: []
  m_SourcePrefab: {fileID: 100100000, guid: 5f59363fb9694434e9c303f1e9e64059, type: 3}
