﻿EU Local Number,Report Type,EV Gateway Receipt Date,Primary Source Qualification,Primary Source Country for Regulatory Purposes,Literature Reference,Patient Age Group,Patient Age Group (as per reporter),Parent Child Report,Patient Sex,Reaction List PT (Duration – Outcome - Seriousness Criteria),Suspect/interacting Drug List (Drug Char - Indication PT - Action taken - [Duration - Dose - Route]),Concomitant/Not Administered Drug List (Drug Char - Indication PT - Action taken - [Duration - Dose - Route]),ICSR Form
EU-EC-10017973575,Spontaneous,2024-09-06 00:00:00,Non Healthcare Professional,Non European Economic Area,Not available,Not Specified,Not Specified,No,Female,"COVID-19 (n/a - Unknown - ),<BR><BR>Cough (n/a - Unknown - ),<BR><BR>Head injury (n/a - Unknown - ),<BR><BR>Immune system disorder (n/a - Unknown - ),<BR><BR>Malaise (n/a - Unknown - ),<BR><BR>Respiratory tract infection (n/a - Unknown - ),<BR><BR>Syncope (n/a - Unknown - Other Medically Important Condition)","NUVAXOVID XBB.1.5 [MATRIX M, SARS-COV-2, VARIANT OMICRON XBB.1.5, SPIKE PROTEIN, RECOMBINANT, EXPRESSED IN SF9 CELLS DERIVED FROM SPODOPTERA FRUGIPERDA] (S - COVID-19 immunisation - Not applicable - [n/a - n/a - Intramuscular use])",Not reported,"<a target=""_blank"" href=""https://dap.ema.europa.eu/xmlpserver/PHV%20DAP/Reports/ICSR.xdo?_xpf=&_xt=form&SR_ID=10017973575&_xpt=1&_xf=pdf"">ICSR</a>"
EU-EC-10017919841,Spontaneous,2024-08-28 00:00:00,Non Healthcare Professional,Non European Economic Area,Not available,Not Specified,Not Specified,No,Not Specified,Adrenal haemorrhage (n/a - Unknown - Other Medically Important Condition),"[SARS-COV-2, VARIANT OMICRON XBB.1.5, SPIKE PROTEIN, RECOMBINANT, EXPRESSED IN SF9 CELLS DERIVED FROM SPODOPTERA FRUGIPERDA] (S - COVID-19 immunisation - Not applicable - [n/a - n/a - Intramuscular use])",Not reported,"<a target=""_blank"" href=""https://dap.ema.europa.eu/xmlpserver/PHV%20DAP/Reports/ICSR.xdo?_xpf=&_xt=form&SR_ID=10017919841&_xpt=1&_xf=pdf"">ICSR</a>"
EU-EC-10017922116,Spontaneous,2024-08-28 00:00:00,Non Healthcare Professional,Non European Economic Area,Not available,Not Specified,Not Specified,No,Female,"Asthenia (n/a - Not Recovered/Not Resolved - Caused/Prolonged Hospitalisation),<BR><BR>Brain neoplasm malignant (n/a - Fatal - Results in Death, Other Medically Important Condition),<BR><BR>Dehydration (n/a - Not Recovered/Not Resolved - Caused/Prolonged Hospitalisation),<BR><BR>Pain in extremity (n/a - Unknown - ),<BR><BR>Unevaluable event (n/a - Not Recovered/Not Resolved - )","NUVAXOVID XBB.1.5 [MATRIX M, SARS-COV-2, VARIANT OMICRON XBB.1.5, SPIKE PROTEIN, RECOMBINANT, EXPRESSED IN SF9 CELLS DERIVED FROM SPODOPTERA FRUGIPERDA] (S - COVID-19 immunisation - Not applicable - [1d - n/a - Intramuscular use - More in ICSR])",Not reported,"<a target=""_blank"" href=""https://dap.ema.europa.eu/xmlpserver/PHV%20DAP/Reports/ICSR.xdo?_xpf=&_xt=form&SR_ID=10017922116&_xpt=1&_xf=pdf"">ICSR</a>"
EU-EC-10017812808,Spontaneous,2024-08-07 00:00:00,Non Healthcare Professional,European Economic Area,Not available,18-64 Years,Adult,No,Female,"Pulmonary embolism (99d - Recovered/Resolved - Caused/Prolonged Hospitalisation),<BR><BR>Subclavian vein thrombosis (99d - Recovered/Resolved - Caused/Prolonged Hospitalisation)","NUVAXOVID XBB.1.5 [MATRIX M, SARS-COV-2, VARIANT OMICRON XBB.1.5, SPIKE PROTEIN, RECOMBINANT, EXPRESSED IN SF9 CELLS DERIVED FROM SPODOPTERA FRUGIPERDA] (S - COVID-19 immunisation - n/a - [n/a - .5mL - Intramuscular use])",Not reported,"<a target=""_blank"" href=""https://dap.ema.europa.eu/xmlpserver/PHV%20DAP/Reports/ICSR.xdo?_xpf=&_xt=form&SR_ID=10017812808&_xpt=1&_xf=pdf"">ICSR</a>"
EU-EC-10017774653,Spontaneous,2024-07-31 00:00:00,Non Healthcare Professional,European Economic Area,Not available,65-85 Years,Not Specified,No,Male,"Prostatic specific antigen abnormal (n/a - Not Recovered/Not Resolved - ),<BR><BR>Therapeutic response unexpected (n/a - Not Recovered/Not Resolved - )","NUVAXOVID XBB.1.5 [MATRIX M, SARS-COV-2, VARIANT OMICRON XBB.1.5, SPIKE PROTEIN, RECOMBINANT, EXPRESSED IN SF9 CELLS DERIVED FROM SPODOPTERA FRUGIPERDA] (S - COVID-19 immunisation - Not applicable - [n/a - 1{DF} - n/a])",Not reported,"<a target=""_blank"" href=""https://dap.ema.europa.eu/xmlpserver/PHV%20DAP/Reports/ICSR.xdo?_xpf=&_xt=form&SR_ID=10017774653&_xpt=1&_xf=pdf"">ICSR</a>"
EU-EC-10017727784,Spontaneous,2024-07-22 00:00:00,Non Healthcare Professional,Non European Economic Area,Not available,65-85 Years,Elderly,No,Female,"Breakthrough COVID-19 (n/a - Unknown - ),<BR><BR>Expired product administered (1d - Recovered/Resolved - ),<BR><BR>Pyrexia (n/a - Unknown - ),<BR><BR>Vaccination failure (n/a - Unknown - Other Medically Important Condition)","NUVAXOVID XBB.1.5 [MATRIX M, SARS-COV-2, VARIANT OMICRON XBB.1.5, SPIKE PROTEIN, RECOMBINANT, EXPRESSED IN SF9 CELLS DERIVED FROM SPODOPTERA FRUGIPERDA] (S - COVID-19 immunisation - Not applicable - [1d - n/a - Intramuscular use])","PAXLOVID [NIRMATRELVIR, RITONAVIR, RITONAVIR, NIRMATRELVIR] (C - Product used for unknown indication - n/a - [n/a - n/a - n/a])","<a target=""_blank"" href=""https://dap.ema.europa.eu/xmlpserver/PHV%20DAP/Reports/ICSR.xdo?_xpf=&_xt=form&SR_ID=10017727784&_xpt=1&_xf=pdf"">ICSR</a>"
EU-EC-10017682488,Spontaneous,2024-07-15 00:00:00,Healthcare Professional,European Economic Area,Not available,65-85 Years,Elderly,No,Male,"Headache (n/a - Not Recovered/Not Resolved - Other Medically Important Condition),<BR><BR>Myalgia (n/a - Not Recovered/Not Resolved - Other Medically Important Condition)","NUVAXOVID XBB.1.5 [MATRIX M, SARS-COV-2, VARIANT OMICRON XBB.1.5, SPIKE PROTEIN, RECOMBINANT, EXPRESSED IN SF9 CELLS DERIVED FROM SPODOPTERA FRUGIPERDA] (S - COVID-19 immunisation - n/a - [n/a - .5mL - Intramuscular use])",Not reported,"<a target=""_blank"" href=""https://dap.ema.europa.eu/xmlpserver/PHV%20DAP/Reports/ICSR.xdo?_xpf=&_xt=form&SR_ID=10017682488&_xpt=1&_xf=pdf"">ICSR</a>"
EU-EC-10017567798,Spontaneous,2024-06-24 00:00:00,Healthcare Professional,European Economic Area,Not available,More than 85 Years,Not Specified,No,Female,Diarrhoea (n/a - Recovering/Resolving - ),"NUVAXOVID XBB.1.5 [MATRIX M, SARS-COV-2, VARIANT OMICRON XBB.1.5, SPIKE PROTEIN, RECOMBINANT, EXPRESSED IN SF9 CELLS DERIVED FROM SPODOPTERA FRUGIPERDA] (S - n/a - Not applicable - [n/a - n/a - n/a])",Not reported,"<a target=""_blank"" href=""https://dap.ema.europa.eu/xmlpserver/PHV%20DAP/Reports/ICSR.xdo?_xpf=&_xt=form&SR_ID=10017567798&_xpt=1&_xf=pdf"">ICSR</a>"
EU-EC-10017556270,Spontaneous,2024-06-21 00:00:00,Non Healthcare Professional,European Economic Area,Not available,65-85 Years,Elderly,No,Male,"Arthralgia (n/a - Not Recovered/Not Resolved - Other Medically Important Condition),<BR><BR>Dizziness (n/a - Not Recovered/Not Resolved - Other Medically Important Condition),<BR><BR>Fatigue (n/a - Not Recovered/Not Resolved - Other Medically Important Condition),<BR><BR>Headache (n/a - Not Recovered/Not Resolved - Other Medically Important Condition),<BR><BR>Malaise (n/a - Not Recovered/Not Resolved - Other Medically Important Condition),<BR><BR>Pruritus (n/a - Not Recovered/Not Resolved - Other Medically Important Condition),<BR><BR>Rash (n/a - Not Recovered/Not Resolved - Other Medically Important Condition),<BR><BR>Somnolence (n/a - Not Recovered/Not Resolved - Other Medically Important Condition),<BR><BR>Urticaria (n/a - Not Recovered/Not Resolved - Other Medically Important Condition)","NUVAXOVID XBB.1.5 [MATRIX M, SARS-COV-2, VARIANT OMICRON XBB.1.5, SPIKE PROTEIN, RECOMBINANT, EXPRESSED IN SF9 CELLS DERIVED FROM SPODOPTERA FRUGIPERDA] (S - COVID-19 immunisation - n/a - [n/a - n/a - n/a])","[TAMSULOSIN HYDROCHLORIDE, DUTASTERIDE] (C - n/a - n/a - [n/a - n/a - Oral use])","<a target=""_blank"" href=""https://dap.ema.europa.eu/xmlpserver/PHV%20DAP/Reports/ICSR.xdo?_xpf=&_xt=form&SR_ID=10017556270&_xpt=1&_xf=pdf"">ICSR</a>"
EU-EC-10017427422,Spontaneous,2024-05-29 00:00:00,Non Healthcare Professional,European Economic Area,Not available,More than 85 Years,Elderly,No,Female,"Blood cholesterol increased (n/a - Unknown - Other Medically Important Condition),<BR><BR>C-reactive protein increased (n/a - Unknown - Caused/Prolonged Hospitalisation),<BR><BR>Cardiac arrest (n/a - Fatal - Results in Death),<BR><BR>Chronic obstructive pulmonary disease (n/a - Unknown - Caused/Prolonged Hospitalisation),<BR><BR>Dyspnoea (n/a - Unknown - Caused/Prolonged Hospitalisation),<BR><BR>Lymph node calcification (n/a - Unknown - Other Medically Important Condition),<BR><BR>Oxygen saturation decreased (n/a - Unknown - Caused/Prolonged Hospitalisation),<BR><BR>Pyrexia (n/a - Unknown - Caused/Prolonged Hospitalisation),<BR><BR>Respiratory failure (n/a - Fatal - Results in Death, Caused/Prolonged Hospitalisation)","NUVAXOVID XBB.1.5 [MATRIX M, SARS-COV-2, VARIANT OMICRON XBB.1.5, SPIKE PROTEIN, RECOMBINANT, EXPRESSED IN SF9 CELLS DERIVED FROM SPODOPTERA FRUGIPERDA] (S - COVID-19 immunisation - n/a - [n/a - .5mL - Intramuscular use])","[ATORVASTATIN CALCIUM] (C - n/a - n/a - [n/a - 20mg - Oral use]),<BR><BR>[THEOPHYLLINE ANHYDROUS] (C - Chronic obstructive pulmonary disease - n/a - [n/a - 150mg - Oral use])","<a target=""_blank"" href=""https://dap.ema.europa.eu/xmlpserver/PHV%20DAP/Reports/ICSR.xdo?_xpf=&_xt=form&SR_ID=10017427422&_xpt=1&_xf=pdf"">ICSR</a>"
EU-EC-10017425494,Spontaneous,2024-05-28 00:00:00,Non Healthcare Professional,Non European Economic Area,Not available,Not Specified,Not Specified,No,Not Specified,"Arrhythmia (n/a - Unknown - Other Medically Important Condition),<BR><BR>Chest discomfort (n/a - Unknown - ),<BR><BR>Myocarditis (n/a - Unknown - Other Medically Important Condition),<BR><BR>Tachycardia (n/a - Unknown - )","[SARS-COV-2, VARIANT OMICRON XBB.1.5, SPIKE PROTEIN, RECOMBINANT, EXPRESSED IN SF9 CELLS DERIVED FROM SPODOPTERA FRUGIPERDA] (S - COVID-19 immunisation - Not applicable - [n/a - n/a - Intramuscular use])",Not reported,"<a target=""_blank"" href=""https://dap.ema.europa.eu/xmlpserver/PHV%20DAP/Reports/ICSR.xdo?_xpf=&_xt=form&SR_ID=10017425494&_xpt=1&_xf=pdf"">ICSR</a>"
EU-EC-10017296165,Spontaneous,2024-05-06 00:00:00,Healthcare Professional,European Economic Area,Not available,More than 85 Years,Not Specified,No,Female,"COVID-19 immunisation (0d - Recovered/Resolved - ),<BR><BR>Diarrhoea (1d - Recovered/Resolved - )","NUVAXOVID XBB.1.5 [MATRIX M, SARS-COV-2, VARIANT OMICRON XBB.1.5, SPIKE PROTEIN, RECOMBINANT, EXPRESSED IN SF9 CELLS DERIVED FROM SPODOPTERA FRUGIPERDA] (S - n/a - n/a - [n/a - n/a - Intramuscular use])","ELIQUIS [APIXABAN] (C - n/a - n/a - [n/a - n/a - Oral use]),<BR><BR>[COLECALCIFEROL, CALCIUM, COLECALCIFEROL, CALCIUM CARBONATE] (C - n/a - n/a - [n/a - n/a - n/a]),<BR><BR>[FUROSEMIDE] (C - n/a - n/a - [n/a - 20mg - Oral use]),<BR><BR>[ISOSORBIDE MONONITRATE] (C - n/a - n/a - [n/a - n/a - Oral use]),<BR><BR>[LAMOTRIGINE] (C - n/a - n/a - [n/a - 100mg - n/a]),<BR><BR>[LOSARTAN, LOSARTAN POTASSIUM] (C - n/a - n/a - [n/a - 12.5mg - Oral use]),<BR><BR>[MELATONIN] (C - n/a - n/a - [n/a - n/a - Oral use]),<BR><BR>[MIRTAZAPINE] (C - n/a - n/a - [n/a - n/a - Oral use]),<BR><BR>[SIMVASTATIN] (C - n/a - n/a - [n/a - 40mg - Oral use])","<a target=""_blank"" href=""https://dap.ema.europa.eu/xmlpserver/PHV%20DAP/Reports/ICSR.xdo?_xpf=&_xt=form&SR_ID=10017296165&_xpt=1&_xf=pdf"">ICSR</a>"
EU-EC-10017266341,Spontaneous,2024-04-29 00:00:00,Non Healthcare Professional,European Economic Area,Not available,65-85 Years,Elderly,No,Male,"Cardiac failure (n/a - Not Recovered/Not Resolved - Other Medically Important Condition),<BR><BR>Dyspnoea (n/a - Not Recovered/Not Resolved - ),<BR><BR>Fatigue (n/a - Not Recovered/Not Resolved - ),<BR><BR>General physical health deterioration (n/a - Not Recovered/Not Resolved - ),<BR><BR>Respiration abnormal (n/a - Not Recovered/Not Resolved - )","NUVAXOVID XBB.1.5 [MATRIX M, SARS-COV-2, VARIANT OMICRON XBB.1.5, SPIKE PROTEIN, RECOMBINANT, EXPRESSED IN SF9 CELLS DERIVED FROM SPODOPTERA FRUGIPERDA] (S - COVID-19 immunisation - Not applicable - [1d - n/a - Intramuscular use])",Not reported,"<a target=""_blank"" href=""https://dap.ema.europa.eu/xmlpserver/PHV%20DAP/Reports/ICSR.xdo?_xpf=&_xt=form&SR_ID=10017266341&_xpt=1&_xf=pdf"">ICSR</a>"
EU-EC-10017251995,Spontaneous,2024-04-26 00:00:00,Healthcare Professional,European Economic Area,Not available,18-64 Years,Adult,No,Male,Herpes zoster (n/a - Unknown - ),"NUVAXOVID XBB.1.5 [MATRIX M, SARS-COV-2, VARIANT OMICRON XBB.1.5, SPIKE PROTEIN, RECOMBINANT, EXPRESSED IN SF9 CELLS DERIVED FROM SPODOPTERA FRUGIPERDA] (S - COVID-19 immunisation - n/a - [n/a - n/a - n/a])",Not reported,"<a target=""_blank"" href=""https://dap.ema.europa.eu/xmlpserver/PHV%20DAP/Reports/ICSR.xdo?_xpf=&_xt=form&SR_ID=10017251995&_xpt=1&_xf=pdf"">ICSR</a>"
EU-EC-10017253236,Spontaneous,2024-04-26 00:00:00,Non Healthcare Professional,European Economic Area,Not available,65-85 Years,Elderly,No,Male,"Arthralgia (7d - Recovered/Resolved - ),<BR><BR>Chills (73h - Recovered/Resolved - ),<BR><BR>Cough (n/a - Recovering/Resolving - ),<BR><BR>Fatigue (n/a - Recovering/Resolving - ),<BR><BR>Headache (73h - Recovered/Resolved - ),<BR><BR>Injection site inflammation (73h - Recovered/Resolved - ),<BR><BR>Injection site pain (73h - Recovered/Resolved - ),<BR><BR>Injection site swelling (73h - Recovered/Resolved - ),<BR><BR>Malaise (3d - Recovered/Resolved - ),<BR><BR>Myalgia (74h - Recovered/Resolved - ),<BR><BR>Pyrexia (3h - Recovered/Resolved - )","NUVAXOVID XBB.1.5 [MATRIX M, SARS-COV-2, VARIANT OMICRON XBB.1.5, SPIKE PROTEIN, RECOMBINANT, EXPRESSED IN SF9 CELLS DERIVED FROM SPODOPTERA FRUGIPERDA] (S - COVID-19 immunisation - Not applicable - [n/a - 1{DF} - n/a])",[PARACETAMOL] (C - n/a - n/a - [n/a - n/a - n/a]),"<a target=""_blank"" href=""https://dap.ema.europa.eu/xmlpserver/PHV%20DAP/Reports/ICSR.xdo?_xpf=&_xt=form&SR_ID=10017253236&_xpt=1&_xf=pdf"">ICSR</a>"
EU-EC-10017244605,Spontaneous,2024-04-25 00:00:00,Healthcare Professional,European Economic Area,Not available,More than 85 Years,Not Specified,No,Female,"Death (n/a - Fatal - Results in Death),<BR><BR>Sudden death (n/a - Fatal - Results in Death)","NUVAXOVID XBB.1.5 [MATRIX M, SARS-COV-2, VARIANT OMICRON XBB.1.5, SPIKE PROTEIN, RECOMBINANT, EXPRESSED IN SF9 CELLS DERIVED FROM SPODOPTERA FRUGIPERDA] (S - n/a - Not applicable - [n/a - n/a - n/a])","ARANESP [DARBEPOETIN ALFA] (C - n/a - n/a - [n/a - 30ug - Subcutaneous use]),<BR><BR>[ALFACALCIDOL] (C - n/a - n/a - [n/a - .25ug - Oral use]),<BR><BR>[ALLOPURINOL] (C - n/a - n/a - [n/a - 100mg - n/a]),<BR><BR>[AMLODIPINE, AMLODIPINE BESILATE, AMLODIPINE MALEATE] (C - n/a - n/a - [n/a - 2.5mg - Oral use]),<BR><BR>[BISOPROLOL FUMARATE, BISOPROLOL FUMARATE PH. EUR.] (C - n/a - n/a - [n/a - 2.5mg - Oral use]),<BR><BR>[CALCIUM, CALCIUM CARBONATE] (C - n/a - n/a - [n/a - 500mg - Oral use]),<BR><BR>[CANDESARTAN CILEXETIL] (C - n/a - n/a - [n/a - 8mg - n/a]),<BR><BR>[DIGOXIN] (C - n/a - n/a - [n/a - .13mg - Oral use]),<BR><BR>[PRAMIPEXOLE] (C - n/a - n/a - [n/a - .18mg - n/a]),<BR><BR>[WARFARIN, WARFARIN SODIUM] (C - n/a - n/a - [n/a - n/a - Oral use])","<a target=""_blank"" href=""https://dap.ema.europa.eu/xmlpserver/PHV%20DAP/Reports/ICSR.xdo?_xpf=&_xt=form&SR_ID=10017244605&_xpt=1&_xf=pdf"">ICSR</a>"
EU-EC-10017165781,Spontaneous,2024-04-12 00:00:00,Non Healthcare Professional,European Economic Area,Not available,65-85 Years,Not Specified,No,Female,"Chest pain (n/a - Recovering/Resolving - Other Medically Important Condition),<BR><BR>Pleural effusion (n/a - Recovering/Resolving - Other Medically Important Condition),<BR><BR>Pleural thickening (n/a - Recovering/Resolving - Other Medically Important Condition),<BR><BR>Pulmonary embolism (n/a - Recovering/Resolving - Other Medically Important Condition),<BR><BR>Pulmonary mass (n/a - Recovering/Resolving - Other Medically Important Condition)","NUVAXOVID XBB.1.5 [MATRIX M, SARS-COV-2, VARIANT OMICRON XBB.1.5, SPIKE PROTEIN, RECOMBINANT, EXPRESSED IN SF9 CELLS DERIVED FROM SPODOPTERA FRUGIPERDA] (S - COVID-19 immunisation - n/a - [n/a - .5mL - Intramuscular use])",Not reported,"<a target=""_blank"" href=""https://dap.ema.europa.eu/xmlpserver/PHV%20DAP/Reports/ICSR.xdo?_xpf=&_xt=form&SR_ID=10017165781&_xpt=1&_xf=pdf"">ICSR</a>"
EU-EC-10017171153,Spontaneous,2024-04-12 00:00:00,Non Healthcare Professional,European Economic Area,Not available,18-64 Years,Adult,No,Female,"Diarrhoea (n/a - Recovered/Resolved - ),<BR><BR>Exaggerated startle response (n/a - Recovered/Resolved - ),<BR><BR>Headache (n/a - Recovered/Resolved - ),<BR><BR>Hyperacusis (n/a - Recovered/Resolved - ),<BR><BR>Lymphadenopathy (n/a - Not Recovered/Not Resolved - ),<BR><BR>Nausea (n/a - Recovered/Resolved - ),<BR><BR>Neuralgia (n/a - Recovered/Resolved - ),<BR><BR>Night sweats (n/a - Not Recovered/Not Resolved - ),<BR><BR>Oral herpes (n/a - Recovering/Resolving - ),<BR><BR>Pruritus (n/a - Not Recovered/Not Resolved - ),<BR><BR>Skin disorder (n/a - Not Recovered/Not Resolved - ),<BR><BR>Somnolence (n/a - Not Recovered/Not Resolved - ),<BR><BR>Vision blurred (n/a - Recovered/Resolved - )","NUVAXOVID XBB.1.5 [MATRIX M, SARS-COV-2, VARIANT OMICRON XBB.1.5, SPIKE PROTEIN, RECOMBINANT, EXPRESSED IN SF9 CELLS DERIVED FROM SPODOPTERA FRUGIPERDA] (S - COVID-19 immunisation - n/a - [n/a - 1{DF} - n/a])",Not reported,"<a target=""_blank"" href=""https://dap.ema.europa.eu/xmlpserver/PHV%20DAP/Reports/ICSR.xdo?_xpf=&_xt=form&SR_ID=10017171153&_xpt=1&_xf=pdf"">ICSR</a>"
EU-EC-10017144780,Spontaneous,2024-04-08 00:00:00,Healthcare Professional,European Economic Area,Not available,Not Specified,Not Specified,No,Not Specified,"Haemolytic anaemia (n/a - Unknown - Caused/Prolonged Hospitalisation, Other Medically Important Condition)","NUVAXOVID XBB.1.5 [MATRIX M, SARS-COV-2, VARIANT OMICRON XBB.1.5, SPIKE PROTEIN, RECOMBINANT, EXPRESSED IN SF9 CELLS DERIVED FROM SPODOPTERA FRUGIPERDA] (S - COVID-19 immunisation - Not applicable - [n/a - n/a - Intramuscular use])",Not reported,"<a target=""_blank"" href=""https://dap.ema.europa.eu/xmlpserver/PHV%20DAP/Reports/ICSR.xdo?_xpf=&_xt=form&SR_ID=10017144780&_xpt=1&_xf=pdf"">ICSR</a>"
EU-EC-10017096022,Spontaneous,2024-03-29 00:00:00,Non Healthcare Professional,Non European Economic Area,Not available,18-64 Years,Not Specified,No,Female,"Abdominal pain (n/a - Recovered/Resolved - ),<BR><BR>Ageusia (n/a - Recovered/Resolved - ),<BR><BR>Anosmia (n/a - Recovered/Resolved - ),<BR><BR>Back pain (n/a - Recovered/Resolved - ),<BR><BR>Breakthrough COVID-19 (11d - Recovered/Resolved - ),<BR><BR>Chest pain (n/a - Recovered/Resolved - ),<BR><BR>Chills (n/a - Recovered/Resolved - ),<BR><BR>Cyst (n/a - Unknown - ),<BR><BR>Device dislocation (5d - Recovered/Resolved - ),<BR><BR>Dizziness (n/a - Recovered/Resolved - ),<BR><BR>Dry throat (n/a - Recovered/Resolved - ),<BR><BR>Dyspnoea (n/a - Recovered/Resolved - ),<BR><BR>Ear congestion (n/a - Recovered/Resolved - ),<BR><BR>Ear discomfort (n/a - Recovered/Resolved - ),<BR><BR>Ear pain (n/a - Recovered/Resolved - ),<BR><BR>Eustachian tube obstruction (n/a - Recovered/Resolved - ),<BR><BR>Fatigue (n/a - Recovered/Resolved - ),<BR><BR>Gastrooesophageal reflux disease (n/a - Recovered/Resolved - ),<BR><BR>Head discomfort (n/a - Recovered/Resolved - ),<BR><BR>Headache (n/a - Recovered/Resolved - ),<BR><BR>Hypoacusis (n/a - Recovered/Resolved - ),<BR><BR>Increased upper airway secretion (n/a - Recovered/Resolved - ),<BR><BR>Limb discomfort (n/a - Recovered/Resolved - ),<BR><BR>Malaise (n/a - Recovered/Resolved - ),<BR><BR>Muscle fatigue (n/a - Recovered/Resolved - ),<BR><BR>Myalgia (n/a - Recovered/Resolved - ),<BR><BR>Nasal congestion (n/a - Recovered/Resolved - ),<BR><BR>Oropharyngeal pain (n/a - Recovered/Resolved - ),<BR><BR>Pain (n/a - Recovered/Resolved - ),<BR><BR>Productive cough (n/a - Recovered/Resolved - ),<BR><BR>Pyrexia (2d - Recovered/Resolved - ),<BR><BR>Rhinorrhoea (n/a - Recovered/Resolved - ),<BR><BR>Sinus pain (n/a - Recovered/Resolved - ),<BR><BR>Swelling (n/a - Recovered/Resolved - ),<BR><BR>Tinnitus (n/a - Recovered/Resolved - ),<BR><BR>Unevaluable event (n/a - Recovered/Resolved - ),<BR><BR>Upper-airway cough syndrome (n/a - Recovered/Resolved - ),<BR><BR>Uterine leiomyoma (n/a - Unknown - ),<BR><BR>Vaccination failure (1d - Recovered/Resolved - Other Medically Important Condition)","NUVAXOVID XBB.1.5 [MATRIX M, SARS-COV-2, VARIANT OMICRON XBB.1.5, SPIKE PROTEIN, RECOMBINANT, EXPRESSED IN SF9 CELLS DERIVED FROM SPODOPTERA FRUGIPERDA] (S - COVID-19 immunisation - Not applicable - [n/a - n/a - Intramuscular use]),<BR><BR>[CLOFEDANOL HYDROCHLORIDE, DEXCHLORPHENIRAMINE MALEATE, PSEUDOEPHEDRINE HYDROCHLORIDE] (S - n/a - Drug withdrawn - [n/a - n/a - n/a]),<BR><BR>[LEVONORGESTREL, LEVONORGESTREL MICRONISED] (S - n/a - n/a - [n/a - n/a - n/a])","PROPRANOLOL HYDROCHLORIDE [PROPRANOLOL HYDROCHLORIDE] (C - n/a - n/a - [n/a - 10mg - Oral use - More in ICSR]),<BR><BR>[BUSPIRONE] (C - n/a - n/a - [n/a - 30mg - Oral use - More in ICSR])","<a target=""_blank"" href=""https://dap.ema.europa.eu/xmlpserver/PHV%20DAP/Reports/ICSR.xdo?_xpf=&_xt=form&SR_ID=10017096022&_xpt=1&_xf=pdf"">ICSR</a>"
EU-EC-10017011422,Spontaneous,2024-03-17 00:00:00,Healthcare Professional,European Economic Area,Not available,18-64 Years,Not Specified,No,Female,"Conjunctivitis (n/a - Unknown - Other Medically Important Condition),<BR><BR>Myalgia (n/a - Unknown - Other Medically Important Condition),<BR><BR>Pyrexia (n/a - Unknown - Other Medically Important Condition)","NUVAXOVID XBB.1.5 DISPERSION FOR INJECTION COVID-19 VACCINE (RECOMBINANT, ADJUVANTED) [MATRIX M, SARS-COV-2, VARIANT OMICRON XBB.1.5, SPIKE PROTEIN, RECOMBINANT, EXPRESSED IN SF9 CELLS DERIVED FROM SPODOPTERA FRUGIPERDA] (S - COVID-19 immunisation - n/a - [n/a - .5mL - Intramuscular use])",Not reported,"<a target=""_blank"" href=""https://dap.ema.europa.eu/xmlpserver/PHV%20DAP/Reports/ICSR.xdo?_xpf=&_xt=form&SR_ID=10017011422&_xpt=1&_xf=pdf"">ICSR</a>"
EU-EC-10017011434,Spontaneous,2024-03-17 00:00:00,Healthcare Professional,European Economic Area,Not available,18-64 Years,Not Specified,No,Male,"Lymph node pain (n/a - Unknown - Other Medically Important Condition),<BR><BR>Lymphadenopathy (n/a - Unknown - Other Medically Important Condition)","NUVAXOVID XBB.1.5 DISPERSION FOR INJECTION COVID-19 VACCINE (RECOMBINANT, ADJUVANTED) [MATRIX M, SARS-COV-2, VARIANT OMICRON XBB.1.5, SPIKE PROTEIN, RECOMBINANT, EXPRESSED IN SF9 CELLS DERIVED FROM SPODOPTERA FRUGIPERDA] (S - COVID-19 immunisation - n/a - [n/a - n/a - Intramuscular use])",Not reported,"<a target=""_blank"" href=""https://dap.ema.europa.eu/xmlpserver/PHV%20DAP/Reports/ICSR.xdo?_xpf=&_xt=form&SR_ID=10017011434&_xpt=1&_xf=pdf"">ICSR</a>"
EU-EC-10017011442,Spontaneous,2024-03-17 00:00:00,Healthcare Professional,European Economic Area,Not available,18-64 Years,Not Specified,No,Male,"Lymph node pain (n/a - Unknown - ),<BR><BR>Lymphadenopathy (n/a - Not Recovered/Not Resolved - )","NUVAXOVID XBB.1.5 DISPERSION FOR INJECTION COVID-19 VACCINE (RECOMBINANT, ADJUVANTED) [MATRIX M, SARS-COV-2, VARIANT OMICRON XBB.1.5, SPIKE PROTEIN, RECOMBINANT, EXPRESSED IN SF9 CELLS DERIVED FROM SPODOPTERA FRUGIPERDA] (S - COVID-19 immunisation - n/a - [n/a - n/a - Intramuscular use])",Not reported,"<a target=""_blank"" href=""https://dap.ema.europa.eu/xmlpserver/PHV%20DAP/Reports/ICSR.xdo?_xpf=&_xt=form&SR_ID=10017011442&_xpt=1&_xf=pdf"">ICSR</a>"
EU-EC-10017011459,Spontaneous,2024-03-17 00:00:00,Healthcare Professional,European Economic Area,Not available,18-64 Years,Not Specified,No,Female,"Blood pressure increased (n/a - Unknown - Other Medically Important Condition),<BR><BR>Headache (n/a - Unknown - Other Medically Important Condition),<BR><BR>Malaise (n/a - Unknown - Other Medically Important Condition)","NUVAXOVID XBB.1.5 DISPERSION FOR INJECTION COVID-19 VACCINE (RECOMBINANT, ADJUVANTED) [MATRIX M, SARS-COV-2, VARIANT OMICRON XBB.1.5, SPIKE PROTEIN, RECOMBINANT, EXPRESSED IN SF9 CELLS DERIVED FROM SPODOPTERA FRUGIPERDA] (S - COVID-19 immunisation - n/a - [n/a - n/a - Intramuscular use])",Not reported,"<a target=""_blank"" href=""https://dap.ema.europa.eu/xmlpserver/PHV%20DAP/Reports/ICSR.xdo?_xpf=&_xt=form&SR_ID=10017011459&_xpt=1&_xf=pdf"">ICSR</a>"
EU-EC-10017011464,Spontaneous,2024-03-17 00:00:00,Healthcare Professional,European Economic Area,Not available,18-64 Years,Not Specified,No,Female,Vaccination site pain (n/a - Recovering/Resolving - ),"NUVAXOVID XBB.1.5 DISPERSION FOR INJECTION COVID-19 VACCINE (RECOMBINANT, ADJUVANTED) [MATRIX M, SARS-COV-2, VARIANT OMICRON XBB.1.5, SPIKE PROTEIN, RECOMBINANT, EXPRESSED IN SF9 CELLS DERIVED FROM SPODOPTERA FRUGIPERDA] (S - COVID-19 immunisation - n/a - [n/a - .5mL - Intramuscular use])",[LEVOTHYROXINE SODIUM] (C - n/a - n/a - ),"<a target=""_blank"" href=""https://dap.ema.europa.eu/xmlpserver/PHV%20DAP/Reports/ICSR.xdo?_xpf=&_xt=form&SR_ID=10017011464&_xpt=1&_xf=pdf"">ICSR</a>"
EU-EC-10017011470,Spontaneous,2024-03-17 00:00:00,Healthcare Professional,European Economic Area,Not available,65-85 Years,Not Specified,No,Male,Dermatitis allergic (n/a - Unknown - Other Medically Important Condition),"NUVAXOVID XBB.1.5 DISPERSION FOR INJECTION COVID-19 VACCINE (RECOMBINANT, ADJUVANTED) [MATRIX M, SARS-COV-2, VARIANT OMICRON XBB.1.5, SPIKE PROTEIN, RECOMBINANT, EXPRESSED IN SF9 CELLS DERIVED FROM SPODOPTERA FRUGIPERDA] (S - COVID-19 immunisation - n/a - [n/a - n/a - Intramuscular use])",Not reported,"<a target=""_blank"" href=""https://dap.ema.europa.eu/xmlpserver/PHV%20DAP/Reports/ICSR.xdo?_xpf=&_xt=form&SR_ID=10017011470&_xpt=1&_xf=pdf"">ICSR</a>"
EU-EC-10017008229,Spontaneous,2024-03-15 00:00:00,Healthcare Professional,European Economic Area,Not available,65-85 Years,Not Specified,No,Female,Ischaemic stroke (n/a - Unknown - Other Medically Important Condition),"NUVAXOVID XBB.1.5 DISPERSION FOR INJECTION COVID-19 VACCINE (RECOMBINANT, ADJUVANTED) [MATRIX M, SARS-COV-2, VARIANT OMICRON XBB.1.5, SPIKE PROTEIN, RECOMBINANT, EXPRESSED IN SF9 CELLS DERIVED FROM SPODOPTERA FRUGIPERDA] (S - COVID-19 immunisation - n/a - [n/a - n/a - Intramuscular use])",Not reported,"<a target=""_blank"" href=""https://dap.ema.europa.eu/xmlpserver/PHV%20DAP/Reports/ICSR.xdo?_xpf=&_xt=form&SR_ID=10017008229&_xpt=1&_xf=pdf"">ICSR</a>"
EU-EC-10016960096,Spontaneous,2024-03-07 00:00:00,Non Healthcare Professional,Non European Economic Area,Not available,18-64 Years,Not Specified,No,Female,"Breakthrough COVID-19 (n/a - Recovering/Resolving - ),<BR><BR>Cough (n/a - Recovered/Resolved - ),<BR><BR>Nasal congestion (n/a - Recovered/Resolved - ),<BR><BR>Nasopharyngitis (n/a - Recovering/Resolving - ),<BR><BR>Vaccination failure (1d - Recovered/Resolved - Other Medically Important Condition)","NUVAXOVID XBB.1.5 [MATRIX M, SARS-COV-2, VARIANT OMICRON XBB.1.5, SPIKE PROTEIN, RECOMBINANT, EXPRESSED IN SF9 CELLS DERIVED FROM SPODOPTERA FRUGIPERDA] (S - COVID-19 immunisation - Not applicable - [n/a - n/a - Intramuscular use])",Not reported,"<a target=""_blank"" href=""https://dap.ema.europa.eu/xmlpserver/PHV%20DAP/Reports/ICSR.xdo?_xpf=&_xt=form&SR_ID=10016960096&_xpt=1&_xf=pdf"">ICSR</a>"
EU-EC-10016960103,Spontaneous,2024-03-07 00:00:00,Non Healthcare Professional,Non European Economic Area,Not available,18-64 Years,Not Specified,No,Male,"Breakthrough COVID-19 (n/a - Recovering/Resolving - ),<BR><BR>Cough (n/a - Recovered/Resolved - ),<BR><BR>Nasal congestion (n/a - Recovered/Resolved - ),<BR><BR>Nasopharyngitis (n/a - Recovering/Resolving - ),<BR><BR>Vaccination failure (1d - Recovered/Resolved - Other Medically Important Condition)","NUVAXOVID XBB.1.5 [MATRIX M, SARS-COV-2, VARIANT OMICRON XBB.1.5, SPIKE PROTEIN, RECOMBINANT, EXPRESSED IN SF9 CELLS DERIVED FROM SPODOPTERA FRUGIPERDA] (S - COVID-19 immunisation - Not applicable - [n/a - n/a - Intramuscular use])",Not reported,"<a target=""_blank"" href=""https://dap.ema.europa.eu/xmlpserver/PHV%20DAP/Reports/ICSR.xdo?_xpf=&_xt=form&SR_ID=10016960103&_xpt=1&_xf=pdf"">ICSR</a>"
EU-EC-10016938285,Spontaneous,2024-03-05 00:00:00,Non Healthcare Professional,European Economic Area,Not available,18-64 Years,Adult,No,Male,"Arthralgia (n/a - Not Recovered/Not Resolved - Other Medically Important Condition),<BR><BR>Arthritis (n/a - Not Recovered/Not Resolved - Other Medically Important Condition),<BR><BR>Balance disorder (n/a - Unknown - Other Medically Important Condition),<BR><BR>Disturbance in attention (n/a - Unknown - ),<BR><BR>Gait disturbance (n/a - Not Recovered/Not Resolved - Other Medically Important Condition),<BR><BR>Headache (n/a - Unknown - Other Medically Important Condition),<BR><BR>Myalgia (n/a - Unknown - Other Medically Important Condition),<BR><BR>Pyrexia (n/a - Unknown - Other Medically Important Condition),<BR><BR>Sick leave (9d - Unknown - Other Medically Important Condition)","NUVAXOVID XBB.1.5 [MATRIX M, SARS-COV-2, VARIANT OMICRON XBB.1.5, SPIKE PROTEIN, RECOMBINANT, EXPRESSED IN SF9 CELLS DERIVED FROM SPODOPTERA FRUGIPERDA] (S - COVID-19 immunisation - n/a - [n/a - .5mL - Intramuscular use])",Not reported,"<a target=""_blank"" href=""https://dap.ema.europa.eu/xmlpserver/PHV%20DAP/Reports/ICSR.xdo?_xpf=&_xt=form&SR_ID=10016938285&_xpt=1&_xf=pdf"">ICSR</a>"
EU-EC-10016917257,Spontaneous,2024-02-29 00:00:00,Non Healthcare Professional,Non European Economic Area,Not available,65-85 Years,Not Specified,No,Male,"Asthenia (n/a - Not Recovered/Not Resolved - Caused/Prolonged Hospitalisation),<BR><BR>Confusional state (n/a - Not Recovered/Not Resolved - Caused/Prolonged Hospitalisation),<BR><BR>Diarrhoea (n/a - Not Recovered/Not Resolved - Caused/Prolonged Hospitalisation),<BR><BR>Lethargy (n/a - Not Recovered/Not Resolved - Caused/Prolonged Hospitalisation),<BR><BR>Listless (n/a - Not Recovered/Not Resolved - Caused/Prolonged Hospitalisation),<BR><BR>Malaise (n/a - Not Recovered/Not Resolved - Caused/Prolonged Hospitalisation),<BR><BR>Memory impairment (n/a - Not Recovered/Not Resolved - Caused/Prolonged Hospitalisation),<BR><BR>Rhinorrhoea (n/a - Not Recovered/Not Resolved - Caused/Prolonged Hospitalisation)","NUVAXOVID XBB.1.5 [MATRIX M, SARS-COV-2, VARIANT OMICRON XBB.1.5, SPIKE PROTEIN, RECOMBINANT, EXPRESSED IN SF9 CELLS DERIVED FROM SPODOPTERA FRUGIPERDA] (S - COVID-19 immunisation - Not applicable - [n/a - n/a - Intramuscular use])",Not reported,"<a target=""_blank"" href=""https://dap.ema.europa.eu/xmlpserver/PHV%20DAP/Reports/ICSR.xdo?_xpf=&_xt=form&SR_ID=10016917257&_xpt=1&_xf=pdf"">ICSR</a>"
EU-EC-10016884143,Spontaneous,2024-02-24 00:00:00,Non Healthcare Professional,European Economic Area,Not available,18-64 Years,Not Specified,No,Male,"Atrial fibrillation (n/a - Recovering/Resolving - Caused/Prolonged Hospitalisation),<BR><BR>Dyspnoea (n/a - Recovering/Resolving - Caused/Prolonged Hospitalisation),<BR><BR>Pericarditis (n/a - Recovering/Resolving - Caused/Prolonged Hospitalisation),<BR><BR>Tachycardia (n/a - Recovering/Resolving - Caused/Prolonged Hospitalisation)","NUVAXOVID XBB.1.5 [MATRIX M, SARS-COV-2, VARIANT OMICRON XBB.1.5, SPIKE PROTEIN, RECOMBINANT, EXPRESSED IN SF9 CELLS DERIVED FROM SPODOPTERA FRUGIPERDA] (S - COVID-19 immunisation - Not applicable - [n/a - 1{DF} - n/a]),<BR><BR>PEGINTERFERON ALFA-2A [PEGINTERFERON ALFA-2A] (S - Essential thrombocythaemia - Drug withdrawn - [n/a - 1{DF} - n/a])",[CARBASALATE CALCIUM] (C - n/a - n/a - [n/a - 100mg - n/a]),"<a target=""_blank"" href=""https://dap.ema.europa.eu/xmlpserver/PHV%20DAP/Reports/ICSR.xdo?_xpf=&_xt=form&SR_ID=10016884143&_xpt=1&_xf=pdf"">ICSR</a>"
EU-EC-10016832207,Spontaneous,2024-02-15 00:00:00,Non Healthcare Professional,European Economic Area,Not available,18-64 Years,Not Specified,No,Male,"Asthenia (n/a - Not Recovered/Not Resolved - ),<BR><BR>Depressed mood (n/a - Not Recovered/Not Resolved - ),<BR><BR>Discouragement (n/a - Not Recovered/Not Resolved - ),<BR><BR>Dizziness (n/a - Not Recovered/Not Resolved - ),<BR><BR>Dyspnoea (n/a - Not Recovered/Not Resolved - ),<BR><BR>Feeling abnormal (n/a - Not Recovered/Not Resolved - ),<BR><BR>Insomnia (n/a - Not Recovered/Not Resolved - ),<BR><BR>Memory impairment (n/a - Not Recovered/Not Resolved - ),<BR><BR>Nervous system disorder (n/a - Not Recovered/Not Resolved - ),<BR><BR>Stress (n/a - Not Recovered/Not Resolved - ),<BR><BR>Tremor (n/a - Not Recovered/Not Resolved - )","NUVAXOVID XBB.1.5 [MATRIX M, SARS-COV-2, VARIANT OMICRON XBB.1.5, SPIKE PROTEIN, RECOMBINANT, EXPRESSED IN SF9 CELLS DERIVED FROM SPODOPTERA FRUGIPERDA] (S - COVID-19 immunisation - Not applicable - [n/a - n/a - Intramuscular use])","[ASCORBIC ACID] (C - n/a - n/a - [n/a - n/a - n/a]),<BR><BR>[OXYGEN] (C - n/a - n/a - [n/a - n/a - n/a])","<a target=""_blank"" href=""https://dap.ema.europa.eu/xmlpserver/PHV%20DAP/Reports/ICSR.xdo?_xpf=&_xt=form&SR_ID=10016832207&_xpt=1&_xf=pdf"">ICSR</a>"
EU-EC-10016796117,Spontaneous,2024-02-09 00:00:00,Non Healthcare Professional,European Economic Area,Not available,18-64 Years,Not Specified,No,Female,"Headache (n/a - Not Recovered/Not Resolved - ),<BR><BR>Vaccination site bruising (n/a - Not Recovered/Not Resolved - ),<BR><BR>Vaccination site swelling (n/a - Not Recovered/Not Resolved - )","NUVAXOVID XBB.1.5 [MATRIX M, SARS-COV-2, VARIANT OMICRON XBB.1.5, SPIKE PROTEIN, RECOMBINANT, EXPRESSED IN SF9 CELLS DERIVED FROM SPODOPTERA FRUGIPERDA] (S - n/a - n/a - [n/a - n/a - n/a])",Not reported,"<a target=""_blank"" href=""https://dap.ema.europa.eu/xmlpserver/PHV%20DAP/Reports/ICSR.xdo?_xpf=&_xt=form&SR_ID=10016796117&_xpt=1&_xf=pdf"">ICSR</a>"
EU-EC-10016739122,Spontaneous,2024-02-01 00:00:00,Healthcare Professional,European Economic Area,Not available,18-64 Years,Adult,No,Female,Rash (n/a - Recovered/Resolved - ),"NUVAXOVID XBB.1.5 [MATRIX M, SARS-COV-2, VARIANT OMICRON XBB.1.5, SPIKE PROTEIN, RECOMBINANT, EXPRESSED IN SF9 CELLS DERIVED FROM SPODOPTERA FRUGIPERDA] (S - n/a - Unknown - [n/a - .5mL - Intramuscular use])",Not reported,"<a target=""_blank"" href=""https://dap.ema.europa.eu/xmlpserver/PHV%20DAP/Reports/ICSR.xdo?_xpf=&_xt=form&SR_ID=10016739122&_xpt=1&_xf=pdf"">ICSR</a>"
EU-EC-10016728050,Spontaneous,2024-01-31 00:00:00,Non Healthcare Professional,European Economic Area,Not available,18-64 Years,Adult,No,Male,Dizziness (1d - Recovered/Resolved - Other Medically Important Condition),"NUVAXOVID XBB.1.5 [MATRIX M, SARS-COV-2, VARIANT OMICRON XBB.1.5, SPIKE PROTEIN, RECOMBINANT, EXPRESSED IN SF9 CELLS DERIVED FROM SPODOPTERA FRUGIPERDA] (S - n/a - n/a - [n/a - .5mL - n/a])",Not reported,"<a target=""_blank"" href=""https://dap.ema.europa.eu/xmlpserver/PHV%20DAP/Reports/ICSR.xdo?_xpf=&_xt=form&SR_ID=10016728050&_xpt=1&_xf=pdf"">ICSR</a>"
EU-EC-10016706859,Spontaneous,2024-01-27 00:00:00,Non Healthcare Professional,European Economic Area,Not available,65-85 Years,Not Specified,No,Male,"Chills (1d - Recovered/Resolved - ),<BR><BR>Injection site erythema (5d - Recovered/Resolved - ),<BR><BR>Injection site haematoma (5d - Recovered/Resolved - ),<BR><BR>Injection site inflammation (5d - Recovered/Resolved - ),<BR><BR>Injection site pruritus (5d - Recovered/Resolved - ),<BR><BR>Injection site swelling (5d - Recovered/Resolved - ),<BR><BR>Insomnia (1d - Recovered/Resolved - )","NUVAXOVID XBB.1.5 [MATRIX M, SARS-COV-2, VARIANT OMICRON XBB.1.5, SPIKE PROTEIN, RECOMBINANT, EXPRESSED IN SF9 CELLS DERIVED FROM SPODOPTERA FRUGIPERDA] (S - COVID-19 immunisation - Not applicable - [n/a - 1{DF} - n/a])",Not reported,"<a target=""_blank"" href=""https://dap.ema.europa.eu/xmlpserver/PHV%20DAP/Reports/ICSR.xdo?_xpf=&_xt=form&SR_ID=10016706859&_xpt=1&_xf=pdf"">ICSR</a>"
EU-EC-10016694804,Spontaneous,2024-01-25 00:00:00,Non Healthcare Professional,European Economic Area,Not available,18-64 Years,Adult,No,Not Specified,"Arthralgia (n/a - Recovering/Resolving - ),<BR><BR>Balance disorder (n/a - Recovering/Resolving - ),<BR><BR>Disturbance in attention (n/a - Recovering/Resolving - ),<BR><BR>Dizziness (n/a - Recovering/Resolving - ),<BR><BR>Fatigue (n/a - Recovering/Resolving - ),<BR><BR>Headache (n/a - Recovering/Resolving - ),<BR><BR>Pain in extremity (n/a - Recovering/Resolving - )","NUVAXOVID XBB.1.5 COVID-19 VACCINE (RECOMBINANT, ADJUVANTED) DISPERSION FOR INJECTION [MATRIX M, SARS-COV-2, VARIANT OMICRON XBB.1.5, SPIKE PROTEIN, RECOMBINANT, EXPRESSED IN SF9 CELLS DERIVED FROM SPODOPTERA FRUGIPERDA] (S - n/a - n/a - [n/a - .5mL - Intramuscular use])",Not reported,"<a target=""_blank"" href=""https://dap.ema.europa.eu/xmlpserver/PHV%20DAP/Reports/ICSR.xdo?_xpf=&_xt=form&SR_ID=10016694804&_xpt=1&_xf=pdf"">ICSR</a>"
EU-EC-10016684664,Spontaneous,2024-01-24 00:00:00,Non Healthcare Professional,European Economic Area,Not available,65-85 Years,Not Specified,No,Female,"Dizziness (n/a - Not Recovered/Not Resolved - ),<BR><BR>Fatigue (n/a - Not Recovered/Not Resolved - ),<BR><BR>Headache (n/a - Not Recovered/Not Resolved - ),<BR><BR>Myalgia (n/a - Not Recovered/Not Resolved - )","NUVAXOVID XBB.1.5 [MATRIX M, SARS-COV-2, VARIANT OMICRON XBB.1.5, SPIKE PROTEIN, RECOMBINANT, EXPRESSED IN SF9 CELLS DERIVED FROM SPODOPTERA FRUGIPERDA] (S - n/a - Not applicable - [n/a - n/a - n/a])",Not reported,"<a target=""_blank"" href=""https://dap.ema.europa.eu/xmlpserver/PHV%20DAP/Reports/ICSR.xdo?_xpf=&_xt=form&SR_ID=10016684664&_xpt=1&_xf=pdf"">ICSR</a>"
EU-EC-10016691248,Spontaneous,2024-01-24 00:00:00,Non Healthcare Professional,European Economic Area,Not available,Not Specified,Not Specified,No,Not Specified,"Ageusia (n/a - Not Recovered/Not Resolved - ),<BR><BR>Anosmia (n/a - Not Recovered/Not Resolved - )","NUVAXOVID XBB.1.5 [MATRIX M, SARS-COV-2, VARIANT OMICRON XBB.1.5, SPIKE PROTEIN, RECOMBINANT, EXPRESSED IN SF9 CELLS DERIVED FROM SPODOPTERA FRUGIPERDA] (S - COVID-19 immunisation - Not applicable - [n/a - n/a - Intramuscular use])",Not reported,"<a target=""_blank"" href=""https://dap.ema.europa.eu/xmlpserver/PHV%20DAP/Reports/ICSR.xdo?_xpf=&_xt=form&SR_ID=10016691248&_xpt=1&_xf=pdf"">ICSR</a>"
EU-EC-10016691253,Spontaneous,2024-01-24 00:00:00,Non Healthcare Professional,Non European Economic Area,Not available,Not Specified,Not Specified,No,Female,Arrhythmia (n/a - Not Recovered/Not Resolved - Other Medically Important Condition),"NUVAXOVID XBB.1.5 [MATRIX M, SARS-COV-2, VARIANT OMICRON XBB.1.5, SPIKE PROTEIN, RECOMBINANT, EXPRESSED IN SF9 CELLS DERIVED FROM SPODOPTERA FRUGIPERDA] (S - COVID-19 immunisation - Not applicable - [n/a - n/a - Intramuscular use])",Not reported,"<a target=""_blank"" href=""https://dap.ema.europa.eu/xmlpserver/PHV%20DAP/Reports/ICSR.xdo?_xpf=&_xt=form&SR_ID=10016691253&_xpt=1&_xf=pdf"">ICSR</a>"
EU-EC-10016667919,Spontaneous,2024-01-22 00:00:00,Non Healthcare Professional,European Economic Area,Not available,Not Specified,Adult,No,Female,"Headache (15h - Recovered/Resolved - ),<BR><BR>Injection site erythema (3d - Recovered/Resolved - ),<BR><BR>Injection site inflammation (3d - Recovered/Resolved - ),<BR><BR>Injection site pain (3d - Recovered/Resolved - ),<BR><BR>Injection site warmth (3d - Recovered/Resolved - ),<BR><BR>Malaise (12h - Recovered/Resolved - )","NUVAXOVID XBB.1.5 [MATRIX M, SARS-COV-2, VARIANT OMICRON XBB.1.5, SPIKE PROTEIN, RECOMBINANT, EXPRESSED IN SF9 CELLS DERIVED FROM SPODOPTERA FRUGIPERDA] (S - COVID-19 immunisation - Not applicable - [n/a - 1{DF} - n/a])",Not reported,"<a target=""_blank"" href=""https://dap.ema.europa.eu/xmlpserver/PHV%20DAP/Reports/ICSR.xdo?_xpf=&_xt=form&SR_ID=10016667919&_xpt=1&_xf=pdf"">ICSR</a>"
EU-EC-10016652452,Spontaneous,2024-01-19 00:00:00,Healthcare Professional,European Economic Area,Not available,18-64 Years,Not Specified,No,Male,"Asthenia (n/a - Unknown - Other Medically Important Condition),<BR><BR>Body temperature increased (n/a - Unknown - Other Medically Important Condition),<BR><BR>Catarrh (n/a - Unknown - Other Medically Important Condition),<BR><BR>Dysphonia (n/a - Unknown - Other Medically Important Condition),<BR><BR>Headache (n/a - Unknown - Other Medically Important Condition),<BR><BR>Malaise (n/a - Unknown - Other Medically Important Condition),<BR><BR>Oropharyngeal pain (n/a - Unknown - Other Medically Important Condition),<BR><BR>Sinus pain (n/a - Unknown - Other Medically Important Condition)","NUVAXOVID XBB.1.5 [MATRIX M, SARS-COV-2, VARIANT OMICRON XBB.1.5, SPIKE PROTEIN, RECOMBINANT, EXPRESSED IN SF9 CELLS DERIVED FROM SPODOPTERA FRUGIPERDA] (S - COVID-19 immunisation - n/a - [n/a - .5mL - n/a])",Not reported,"<a target=""_blank"" href=""https://dap.ema.europa.eu/xmlpserver/PHV%20DAP/Reports/ICSR.xdo?_xpf=&_xt=form&SR_ID=10016652452&_xpt=1&_xf=pdf"">ICSR</a>"
EU-EC-10016652724,Spontaneous,2024-01-19 00:00:00,Healthcare Professional,European Economic Area,Not available,18-64 Years,Not Specified,No,Female,"Asthenia (n/a - Unknown - Other Medically Important Condition),<BR><BR>Catarrh (n/a - Unknown - Other Medically Important Condition),<BR><BR>Dysphonia (n/a - Unknown - Other Medically Important Condition),<BR><BR>Headache (n/a - Unknown - Other Medically Important Condition),<BR><BR>Malaise (n/a - Unknown - Other Medically Important Condition),<BR><BR>Pyrexia (n/a - Unknown - Other Medically Important Condition),<BR><BR>Sinus disorder (n/a - Unknown - Other Medically Important Condition)","NUVAXOVID XBB.1.5 [MATRIX M, SARS-COV-2, VARIANT OMICRON XBB.1.5, SPIKE PROTEIN, RECOMBINANT, EXPRESSED IN SF9 CELLS DERIVED FROM SPODOPTERA FRUGIPERDA] (S - COVID-19 prophylaxis - n/a - [n/a - .5mL - n/a])",Not reported,"<a target=""_blank"" href=""https://dap.ema.europa.eu/xmlpserver/PHV%20DAP/Reports/ICSR.xdo?_xpf=&_xt=form&SR_ID=10016652724&_xpt=1&_xf=pdf"">ICSR</a>"
EU-EC-10016647955,Spontaneous,2024-01-18 00:00:00,Non Healthcare Professional,European Economic Area,Not available,18-64 Years,Adult,No,Male,Vaccination site pain (n/a - Recovered/Resolved - ),"NUVAXOVID XBB.1.5 COVID-19 VACCINE (RECOMBINANT, ADJUVANTED) [MATRIX M, SARS-COV-2, VARIANT OMICRON XBB.1.5, SPIKE PROTEIN, RECOMBINANT, EXPRESSED IN SF9 CELLS DERIVED FROM SPODOPTERA FRUGIPERDA] (S - COVID-19 immunisation - n/a - [n/a - .5mg - Intramuscular use])",[BUPROPION HYDROCHLORIDE] (C - Depression - n/a - [n/a - 150mg - Oral use]),"<a target=""_blank"" href=""https://dap.ema.europa.eu/xmlpserver/PHV%20DAP/Reports/ICSR.xdo?_xpf=&_xt=form&SR_ID=10016647955&_xpt=1&_xf=pdf"">ICSR</a>"
EU-EC-10016635112,Spontaneous,2024-01-16 00:00:00,Non Healthcare Professional,European Economic Area,Not available,18-64 Years,Not Specified,No,Female,"Abdominal pain upper (12h - Recovered/Resolved - ),<BR><BR>Back pain (12h - Recovered/Resolved - ),<BR><BR>Dyspnoea (4d - Recovered/Resolved - ),<BR><BR>Fatigue (4d - Recovered/Resolved - ),<BR><BR>Gastrointestinal pain (12h - Recovered/Resolved - ),<BR><BR>Injection site pain (45min - Recovered/Resolved - ),<BR><BR>Paraesthesia (4d - Recovered/Resolved - )","NUVAXOVID XBB.1.5 [MATRIX M, SARS-COV-2, VARIANT OMICRON XBB.1.5, SPIKE PROTEIN, RECOMBINANT, EXPRESSED IN SF9 CELLS DERIVED FROM SPODOPTERA FRUGIPERDA] (S - COVID-19 immunisation - Not applicable - [n/a - 1{DF} - n/a])","NOT AVAILABLE (C - n/a - n/a - [n/a - n/a - n/a]),<BR><BR>[DYDROGESTERONE, ESTRADIOL] (C - n/a - n/a - [n/a - n/a - n/a])","<a target=""_blank"" href=""https://dap.ema.europa.eu/xmlpserver/PHV%20DAP/Reports/ICSR.xdo?_xpf=&_xt=form&SR_ID=10016635112&_xpt=1&_xf=pdf"">ICSR</a>"
EU-EC-10016604388,Spontaneous,2024-01-10 00:00:00,Non Healthcare Professional,Non European Economic Area,Not available,Not Specified,Not Specified,No,Not Specified,"Breakthrough COVID-19 (n/a - Not Recovered/Not Resolved - ),<BR><BR>Chest discomfort (n/a - Not Recovered/Not Resolved - ),<BR><BR>Dizziness (n/a - Not Recovered/Not Resolved - ),<BR><BR>Pyrexia (n/a - Not Recovered/Not Resolved - ),<BR><BR>Vaccination failure (n/a - Recovered/Resolved - Other Medically Important Condition)","NUVAXOVID XBB.1.5 [MATRIX M, SARS-COV-2, VARIANT OMICRON XBB.1.5, SPIKE PROTEIN, RECOMBINANT, EXPRESSED IN SF9 CELLS DERIVED FROM SPODOPTERA FRUGIPERDA] (S - COVID-19 immunisation - Not applicable - [n/a - n/a - Intramuscular use])",Not reported,"<a target=""_blank"" href=""https://dap.ema.europa.eu/xmlpserver/PHV%20DAP/Reports/ICSR.xdo?_xpf=&_xt=form&SR_ID=10016604388&_xpt=1&_xf=pdf"">ICSR</a>"
EU-EC-10016597170,Spontaneous,2024-01-09 00:00:00,Non Healthcare Professional,Non European Economic Area,Not available,Not Specified,Not Specified,No,Not Specified,"Breakthrough COVID-19 (n/a - Not Recovered/Not Resolved - ),<BR><BR>Rhinorrhoea (n/a - Not Recovered/Not Resolved - ),<BR><BR>Vaccination failure (n/a - Recovered/Resolved - Other Medically Important Condition)","NUVAXOVID XBB.1.5 [MATRIX M, SARS-COV-2, VARIANT OMICRON XBB.1.5, SPIKE PROTEIN, RECOMBINANT, EXPRESSED IN SF9 CELLS DERIVED FROM SPODOPTERA FRUGIPERDA] (S - COVID-19 immunisation - Not applicable - [n/a - n/a - Intramuscular use])","PANTOPRAZOLE [PANTOPRAZOLE, PANTOPRAZOLE SODIUM SESQUIHYDRATE] (C - n/a - n/a - [n/a - n/a - n/a]),<BR><BR>[AMLODIPINE, AMLODIPINE BESILATE, AMLODIPINE MALEATE, AMLODIPINE MESILATE] (C - n/a - n/a - [n/a - n/a - n/a]),<BR><BR>[CHLORTALIDONE] (C - n/a - n/a - [n/a - n/a - n/a]),<BR><BR>[CLOBETASOL] (C - n/a - n/a - [n/a - n/a - n/a]),<BR><BR>[ERGOCALCIFEROL] (C - n/a - n/a - [n/a - n/a - n/a]),<BR><BR>[ESCITALOPRAM, ESCITALOPRAM OXALATE] (C - n/a - n/a - [n/a - n/a - n/a]),<BR><BR>[POTASSIUM CHLORIDE] (C - n/a - n/a - [n/a - n/a - n/a]),<BR><BR>[PRAVASTATIN, PRAVASTATIN SODIUM] (C - n/a - n/a - [n/a - n/a - n/a])","<a target=""_blank"" href=""https://dap.ema.europa.eu/xmlpserver/PHV%20DAP/Reports/ICSR.xdo?_xpf=&_xt=form&SR_ID=10016597170&_xpt=1&_xf=pdf"">ICSR</a>"
EU-EC-10016582697,Spontaneous,2024-01-05 00:00:00,Non Healthcare Professional,European Economic Area,Not available,18-64 Years,Not Specified,No,Male,"Bone pain (n/a - Not Recovered/Not Resolved - ),<BR><BR>Chills (n/a - Recovering/Resolving - ),<BR><BR>Fatigue (n/a - Not Recovered/Not Resolved - ),<BR><BR>Headache (n/a - Not Recovered/Not Resolved - ),<BR><BR>Myalgia (n/a - Not Recovered/Not Resolved - ),<BR><BR>Pain (n/a - Not Recovered/Not Resolved - ),<BR><BR>Vaccination site pain (2d - Recovered/Resolved - )","NUVAXOVID XBB.1.5 [MATRIX M, SARS-COV-2, VARIANT OMICRON XBB.1.5, SPIKE PROTEIN, RECOMBINANT, EXPRESSED IN SF9 CELLS DERIVED FROM SPODOPTERA FRUGIPERDA] (S - COVID-19 immunisation - Not applicable - [n/a - .5mL - Intramuscular use])",Not reported,"<a target=""_blank"" href=""https://dap.ema.europa.eu/xmlpserver/PHV%20DAP/Reports/ICSR.xdo?_xpf=&_xt=form&SR_ID=10016582697&_xpt=1&_xf=pdf"">ICSR</a>"
EU-EC-10016576309,Spontaneous,2024-01-04 00:00:00,Healthcare Professional,Non European Economic Area,Not available,Not Specified,Not Specified,No,Female,Atrial fibrillation (n/a - Unknown - Other Medically Important Condition),"NUVAXOVID XBB.1.5 [MATRIX M, SARS-COV-2, VARIANT OMICRON XBB.1.5, SPIKE PROTEIN, RECOMBINANT, EXPRESSED IN SF9 CELLS DERIVED FROM SPODOPTERA FRUGIPERDA] (S - COVID-19 immunisation - Not applicable - [n/a - n/a - Intramuscular use])",Not reported,"<a target=""_blank"" href=""https://dap.ema.europa.eu/xmlpserver/PHV%20DAP/Reports/ICSR.xdo?_xpf=&_xt=form&SR_ID=10016576309&_xpt=1&_xf=pdf"">ICSR</a>"
EU-EC-10016576317,Spontaneous,2024-01-04 00:00:00,Non Healthcare Professional,Non European Economic Area,Not available,18-64 Years,Not Specified,No,Female,"Arthralgia (n/a - Recovered/Resolved - ),<BR><BR>Musculoskeletal stiffness (n/a - Recovered/Resolved - ),<BR><BR>Pain in extremity (n/a - Recovered/Resolved - ),<BR><BR>Polyarthritis (n/a - Recovering/Resolving - Other Medically Important Condition)","NUVAXOVID XBB.1.5 [MATRIX M, SARS-COV-2, VARIANT OMICRON XBB.1.5, SPIKE PROTEIN, RECOMBINANT, EXPRESSED IN SF9 CELLS DERIVED FROM SPODOPTERA FRUGIPERDA] (S - COVID-19 immunisation - Not applicable - [n/a - n/a - Intramuscular use])",Not reported,"<a target=""_blank"" href=""https://dap.ema.europa.eu/xmlpserver/PHV%20DAP/Reports/ICSR.xdo?_xpf=&_xt=form&SR_ID=10016576317&_xpt=1&_xf=pdf"">ICSR</a>"
EU-EC-10016576318,Spontaneous,2024-01-04 00:00:00,Healthcare Professional,Non European Economic Area,Not available,65-85 Years,Not Specified,No,Male,"Atrial fibrillation (n/a - Unknown - Other Medically Important Condition),<BR><BR>Chest pain (n/a - Recovered/Resolved - ),<BR><BR>Pericarditis (n/a - Unknown - Other Medically Important Condition),<BR><BR>Pleuritic pain (n/a - Recovered/Resolved - )","NUVAXOVID XBB.1.5 [MATRIX M, SARS-COV-2, VARIANT OMICRON XBB.1.5, SPIKE PROTEIN, RECOMBINANT, EXPRESSED IN SF9 CELLS DERIVED FROM SPODOPTERA FRUGIPERDA] (S - COVID-19 immunisation - Not applicable - [n/a - n/a - Intramuscular use])","[ATORVASTATIN, ATORVASTATIN CALCIUM, ATORVASTATIN CALCIUM TRIHYDRATE] (C - n/a - n/a - [n/a - n/a - n/a]),<BR><BR>[VALSARTAN] (C - n/a - n/a - [n/a - n/a - n/a])","<a target=""_blank"" href=""https://dap.ema.europa.eu/xmlpserver/PHV%20DAP/Reports/ICSR.xdo?_xpf=&_xt=form&SR_ID=10016576318&_xpt=1&_xf=pdf"">ICSR</a>"