﻿EU Local Number,Report Type,EV Gateway Receipt Date,Primary Source Qualification,Primary Source Country for Regulatory Purposes,Literature Reference,Patient Age Group,Patient Age Group (as per reporter),Parent Child Report,Patient Sex,Reaction List PT (Duration – Outcome - Seriousness Criteria),Suspect/interacting Drug List (Drug Char - Indication PT - Action taken - [Duration - Dose - Route]),Concomitant/Not Administered Drug List (Drug Char - Indication PT - Action taken - [Duration - Dose - Route]),ICSR Form
EU-EC-10016703103,Spontaneous,2024-01-26 00:00:00,Non Healthcare Professional,Non European Economic Area,Not available,18-64 Years,Not Specified,No,Female,"Chills (n/a - Unknown - Other Medically Important Condition),<BR><BR>Headache (n/a - Recovering/Resolving - Other Medically Important Condition)","COMIRNATY ORIGINAL/OMICRON BA.1 [TOZINAMERAN, RILTOZINAMERAN] (S - COVID-19 immunisation - Not applicable - [1d - n/a - n/a])",[MYCOPHENOLATE MOFETIL] (C - Autoimmune hepatitis - n/a - [n/a - n/a - n/a]),"<a target=""_blank"" href=""https://dap.ema.europa.eu/xmlpserver/PHV%20DAP/Reports/ICSR.xdo?_xpf=&_xt=form&SR_ID=10016703103&_xpt=1&_xf=pdf"">ICSR</a>"
EU-EC-10016704011,Spontaneous,2024-01-26 00:00:00,Healthcare Professional,Non European Economic Area,Not available,18-64 Years,Not Specified,No,Female,"Anxiety (n/a - Unknown - Disabling),<BR><BR>Headache (n/a - Unknown - Disabling),<BR><BR>Palpitations (n/a - Unknown - Disabling),<BR><BR>Vertigo (8d - Recovered/Resolved - Disabling)","COMIRNATY ORIGINAL/OMICRON BA.1 [TOZINAMERAN, RILTOZINAMERAN] (S - n/a - Not applicable - [n/a - n/a - n/a]),<BR><BR>[A/HONG KONG/4801/2014 (H3N2)-LIKE STRAIN (A/HONG KONG/4801/2014, X-263B), B/BRISBANE/60/2008-LIKE STRAIN (B/BRISBANE/60/2008, WILD TYPE), A/CALIFORNIA/7/2009 (H1N1)PDM09-DERIVED STRAIN USED (NYMC X-181), A/HONG KONG/4801/2014 (H3N2)-LIKE STRAIN (A/HONG KONG/4801/2014, X-263B), B/BRISBANE/60/2008-LIKE STRAIN (B/BRISBANE/60/2008, WILD TYPE), A/MICHIGAN/45/2015 (H1N1)PDM09-LIKE STRAIN (A/SINGAPORE/GP1908/2015, IVR-180), INFLUENZA VACCINE] (S - n/a - Not applicable - [n/a - n/a - n/a])","[SERTRALINE, SERTRALINE HYDROCHLORIDE] (C - Obsessive-compulsive disorder - Dose not changed - [n/a - n/a - n/a])","<a target=""_blank"" href=""https://dap.ema.europa.eu/xmlpserver/PHV%20DAP/Reports/ICSR.xdo?_xpf=&_xt=form&SR_ID=10016704011&_xpt=1&_xf=pdf"">ICSR</a>"
EU-EC-10016704150,Spontaneous,2024-01-26 00:00:00,Non Healthcare Professional,European Economic Area,Not available,18-64 Years,Not Specified,No,Female,"Movement disorder (n/a - Not Recovered/Not Resolved - ),<BR><BR>Musculoskeletal stiffness (n/a - Not Recovered/Not Resolved - ),<BR><BR>Myalgia (n/a - Not Recovered/Not Resolved - )","COMIRNATY ORIGINAL/OMICRON BA.1 [TOZINAMERAN, RILTOZINAMERAN] (S - n/a - n/a - [n/a - n/a - n/a])",Not reported,"<a target=""_blank"" href=""https://dap.ema.europa.eu/xmlpserver/PHV%20DAP/Reports/ICSR.xdo?_xpf=&_xt=form&SR_ID=10016704150&_xpt=1&_xf=pdf"">ICSR</a>"
EU-EC-10016704368,Spontaneous,2024-01-26 00:00:00,Non Healthcare Professional,Non European Economic Area,Not available,18-64 Years,Not Specified,No,Not Specified,"Mouth ulceration (n/a - Recovering/Resolving - Other Medically Important Condition),<BR><BR>Oral mucosal exfoliation (n/a - Recovering/Resolving - Other Medically Important Condition),<BR><BR>Stomatitis (n/a - Recovering/Resolving - Other Medically Important Condition)","COMIRNATY ORIGINAL/OMICRON BA.1 [TOZINAMERAN, RILTOZINAMERAN] (S - COVID-19 immunisation - Not applicable - [1d - n/a - n/a])","[VENLAFAXINE, VENLAFAXINE HYDROCHLORIDE] (C - Depression - n/a - [n/a - n/a - n/a])","<a target=""_blank"" href=""https://dap.ema.europa.eu/xmlpserver/PHV%20DAP/Reports/ICSR.xdo?_xpf=&_xt=form&SR_ID=10016704368&_xpt=1&_xf=pdf"">ICSR</a>"
EU-EC-10016706057,Spontaneous,2024-01-26 00:00:00,Non Healthcare Professional,European Economic Area,Not available,65-85 Years,Elderly,No,Female,"Rash pruritic (n/a - Recovered/Resolved - ),<BR><BR>Ulcer (n/a - Recovered/Resolved - )","COMIRNATY ORIGINAL/OMICRON BA.1 [TOZINAMERAN, RILTOZINAMERAN] (S - COVID-19 immunisation - Not applicable - [n/a - 1{DF} - n/a])","CLOPIDOGREL KRKA [CLOPIDOGREL, CLOPIDOGREL HYDROCHLORIDE] (C - Anticoagulant therapy - n/a - [n/a - 75mg - n/a]),<BR><BR>[ATORVASTATIN, ATORVASTATIN CALCIUM] (C - Hypercholesterolaemia - n/a - [n/a - 500mg - n/a])","<a target=""_blank"" href=""https://dap.ema.europa.eu/xmlpserver/PHV%20DAP/Reports/ICSR.xdo?_xpf=&_xt=form&SR_ID=10016706057&_xpt=1&_xf=pdf"">ICSR</a>"
EU-EC-10016692142,Spontaneous,2024-01-25 00:00:00,Healthcare Professional,European Economic Area,Not available,Not Specified,Not Specified,No,Female,"Condition aggravated (n/a - Not Recovered/Not Resolved - ),<BR><BR>Neurological symptom (n/a - Not Recovered/Not Resolved - )","COMIRNATY ORIGINAL/OMICRON BA.1 [TOZINAMERAN, RILTOZINAMERAN] (S - COVID-19 immunisation - Not applicable - [n/a - n/a - n/a])",Not reported,"<a target=""_blank"" href=""https://dap.ema.europa.eu/xmlpserver/PHV%20DAP/Reports/ICSR.xdo?_xpf=&_xt=form&SR_ID=10016692142&_xpt=1&_xf=pdf"">ICSR</a>"
EU-EC-10016696775,Spontaneous,2024-01-25 00:00:00,Healthcare Professional,Non European Economic Area,Not available,65-85 Years,Not Specified,No,Female,"Cerebrovascular accident (n/a - Recovering/Resolving - Caused/Prolonged Hospitalisation, Disabling)","COMIRNATY ORIGINAL/OMICRON BA.1 [TOZINAMERAN, RILTOZINAMERAN] (S - COVID-19 immunisation - Not applicable - [1d - n/a - n/a])",Not reported,"<a target=""_blank"" href=""https://dap.ema.europa.eu/xmlpserver/PHV%20DAP/Reports/ICSR.xdo?_xpf=&_xt=form&SR_ID=10016696775&_xpt=1&_xf=pdf"">ICSR</a>"
EU-EC-10016697010,Spontaneous,2024-01-25 00:00:00,Non Healthcare Professional,Non European Economic Area,Not available,65-85 Years,Not Specified,No,Male,"Myasthenia gravis (n/a - Not Recovered/Not Resolved - Life Threatening, Disabling, Other Medically Important Condition)","COMIRNATY ORIGINAL/OMICRON BA.1 [TOZINAMERAN, RILTOZINAMERAN] (S - COVID-19 immunisation - Not applicable - [1d - n/a - n/a])",Not reported,"<a target=""_blank"" href=""https://dap.ema.europa.eu/xmlpserver/PHV%20DAP/Reports/ICSR.xdo?_xpf=&_xt=form&SR_ID=10016697010&_xpt=1&_xf=pdf"">ICSR</a>"
EU-EC-10016697067,Spontaneous,2024-01-25 00:00:00,Non Healthcare Professional,Non European Economic Area,Not available,Not Specified,Not Specified,No,Not Specified,"Skin mass (n/a - Not Recovered/Not Resolved - Disabling, Other Medically Important Condition)","COMIRNATY ORIGINAL/OMICRON BA.1 [TOZINAMERAN, RILTOZINAMERAN] (S - COVID-19 immunisation - Not applicable - [1d - n/a - n/a])","[AMLODIPINE, AMLODIPINE BESILATE, AMLODIPINE MALEATE, AMLODIPINE MESILATE] (C - Blood pH increased - n/a - [n/a - n/a - n/a]),<BR><BR>[ATORVASTATIN] (C - n/a - n/a - [n/a - n/a - n/a]),<BR><BR>[LOSARTAN, LOSARTAN POTASSIUM] (C - Blood pH increased - n/a - [n/a - n/a - n/a])","<a target=""_blank"" href=""https://dap.ema.europa.eu/xmlpserver/PHV%20DAP/Reports/ICSR.xdo?_xpf=&_xt=form&SR_ID=10016697067&_xpt=1&_xf=pdf"">ICSR</a>"
EU-EC-10016697981,Spontaneous,2024-01-25 00:00:00,Non Healthcare Professional,Non European Economic Area,Not available,Not Specified,Not Specified,No,Male,"Joint range of motion decreased (n/a - Unknown - ),<BR><BR>Mobility decreased (n/a - Not Recovered/Not Resolved - ),<BR><BR>Musculoskeletal stiffness (n/a - Not Recovered/Not Resolved - Other Medically Important Condition),<BR><BR>Myalgia (n/a - Unknown - ),<BR><BR>Vaccination site mass (n/a - Unknown - ),<BR><BR>Wrong product administered (n/a - Unknown - ),<BR><BR>Wrong technique in product usage process (n/a - Unknown - )","COMIRNATY ORIGINAL/OMICRON BA.1 [TOZINAMERAN, RILTOZINAMERAN] (S - COVID-19 immunisation - Not applicable - [1d - n/a - n/a])",COMIRNATY [TOZINAMERAN] (N - COVID-19 immunisation - Not applicable - [1d - n/a - n/a]),"<a target=""_blank"" href=""https://dap.ema.europa.eu/xmlpserver/PHV%20DAP/Reports/ICSR.xdo?_xpf=&_xt=form&SR_ID=10016697981&_xpt=1&_xf=pdf"">ICSR</a>"
EU-EC-10016682486,Spontaneous,2024-01-24 00:00:00,Healthcare Professional,European Economic Area,Not available,18-64 Years,Not Specified,No,Female,"Asthenia (20h - Recovered/Resolved - ),<BR><BR>Pyrexia (20h - Recovered/Resolved - ),<BR><BR>Somnolence (20h - Recovered/Resolved - ),<BR><BR>Vaccination site erythema (20h - Recovered/Resolved - )","COMIRNATY ORIGINAL/OMICRON BA.1 [TOZINAMERAN, RILTOZINAMERAN] (S - COVID-19 immunisation - Not applicable - [1d - n/a - Intramuscular use])","[NEBIVOLOL, NEBIVOLOL HYDROCHLORIDE] (C - Hypertension - n/a - [n/a - n/a - Oral use])","<a target=""_blank"" href=""https://dap.ema.europa.eu/xmlpserver/PHV%20DAP/Reports/ICSR.xdo?_xpf=&_xt=form&SR_ID=10016682486&_xpt=1&_xf=pdf"">ICSR</a>"
EU-EC-10016682596,Spontaneous,2024-01-24 00:00:00,Non Healthcare Professional,Non European Economic Area,Not available,65-85 Years,Not Specified,No,Male,"Arthralgia (14h - Recovered/Resolved - Other Medically Important Condition),<BR><BR>Brain fog (52d - Recovered/Resolved - Other Medically Important Condition),<BR><BR>Dysarthria (51d - Recovered/Resolved - Other Medically Important Condition),<BR><BR>Hyperhidrosis (14h - Recovered/Resolved - Other Medically Important Condition)","COMIRNATY ORIGINAL/OMICRON BA.1 [TOZINAMERAN, RILTOZINAMERAN] (S - COVID-19 immunisation - Not applicable - [1d - n/a - n/a])",Not reported,"<a target=""_blank"" href=""https://dap.ema.europa.eu/xmlpserver/PHV%20DAP/Reports/ICSR.xdo?_xpf=&_xt=form&SR_ID=10016682596&_xpt=1&_xf=pdf"">ICSR</a>"
EU-EC-10016684226,Spontaneous,2024-01-24 00:00:00,Healthcare Professional,Non European Economic Area,Not available,65-85 Years,Not Specified,No,Male,"Arrhythmia (2d - Recovered/Resolved - Other Medically Important Condition),<BR><BR>Heart rate increased (2d - Recovered/Resolved - Other Medically Important Condition),<BR><BR>Influenza (3d - Recovered/Resolved - ),<BR><BR>Muscle fatigue (3d - Recovered/Resolved - ),<BR><BR>Vaccination site erythema (3d - Recovered/Resolved - ),<BR><BR>Vaccination site pain (3d - Recovered/Resolved - ),<BR><BR>Vaccination site swelling (3d - Recovered/Resolved - )","COMIRNATY ORIGINAL/OMICRON BA.1 [TOZINAMERAN, RILTOZINAMERAN] (S - COVID-19 immunisation - Not applicable - [1d - n/a - n/a])","APIXABAN [APIXABAN] (C - n/a - n/a - [n/a - n/a - n/a]),<BR><BR>ESOMEPRAZOLE [ESOMEPRAZOLE] (C - n/a - n/a - [n/a - n/a - n/a]),<BR><BR>[ATORVASTATIN] (C - n/a - n/a - [n/a - n/a - n/a]),<BR><BR>[CYANOCOBALAMIN] (C - n/a - n/a - [n/a - n/a - n/a]),<BR><BR>[METOCLOPRAMIDE] (C - n/a - n/a - [n/a - n/a - n/a]),<BR><BR>[RAMIPRIL] (C - n/a - n/a - [n/a - n/a - n/a]),<BR><BR>[SODIUM HYDROGEN CARBONATE PHEUR, CALCIUM CARBONATE PH. EUR., SODIUM ALGINATE PH. EUR., SODIUM HYDROGEN CARBONATE, CALCIUM CARBONATE, SODIUM ALGINATE] (C - n/a - n/a - [n/a - n/a - n/a])","<a target=""_blank"" href=""https://dap.ema.europa.eu/xmlpserver/PHV%20DAP/Reports/ICSR.xdo?_xpf=&_xt=form&SR_ID=10016684226&_xpt=1&_xf=pdf"">ICSR</a>"
EU-EC-10016676408,Spontaneous,2024-01-23 00:00:00,Non Healthcare Professional,Non European Economic Area,Not available,18-64 Years,Not Specified,No,Female,"Chills (4d - Recovered/Resolved - Other Medically Important Condition),<BR><BR>Fatigue (8d - Recovered/Resolved - Other Medically Important Condition),<BR><BR>Miliaria (5d - Recovered/Resolved - Other Medically Important Condition),<BR><BR>Musculoskeletal stiffness (8d - Recovered/Resolved - Other Medically Important Condition),<BR><BR>Rash (5d - Recovered/Resolved - Other Medically Important Condition),<BR><BR>Rash erythematous (5d - Recovered/Resolved - Other Medically Important Condition),<BR><BR>Vaccination site pain (15d - Recovered/Resolved - Other Medically Important Condition)","COMIRNATY ORIGINAL/OMICRON BA.1 [TOZINAMERAN, RILTOZINAMERAN] (S - COVID-19 immunisation - Not applicable - [1d - n/a - n/a])","[CHLORPHENAMINE MALEATE] (C - Hypersensitivity - n/a - [n/a - n/a - n/a]),<BR><BR>[CODEINE PHOSPHATE BP, PARACETAMOL PH. EUR., PARACETAMOL BP, CODEINE PHOSPHATE BP, PARACETAMOL DC, PARACETAMOL PH. EUR., CODEINE PHOSPHATE PH.EUR., PARACETAMOL PH. EUR., CODEINE PHOSPHATE PH.EUR., PARACETAMOL, CODEINE PHOSPHATE, PARACETAMOL, CODEINE PHOSPHATE BP, PARACETAMOL, CODEINE PHOSPHATE HEMIHYDRATE] (C - Arthralgia - n/a - [n/a - n/a - n/a]),<BR><BR>[INFLUENZA VIRUS] (C - Immunisation - n/a - [n/a - n/a - n/a])","<a target=""_blank"" href=""https://dap.ema.europa.eu/xmlpserver/PHV%20DAP/Reports/ICSR.xdo?_xpf=&_xt=form&SR_ID=10016676408&_xpt=1&_xf=pdf"">ICSR</a>"
EU-EC-10016677744,Spontaneous,2024-01-23 00:00:00,Non Healthcare Professional,European Economic Area,Not available,18-64 Years,Adult,No,Male,Seborrhoeic dermatitis (n/a - Not Recovered/Not Resolved - Other Medically Important Condition),"COMIRNATY ORIGINAL/OMICRON BA.1 [TOZINAMERAN, RILTOZINAMERAN] (S - COVID-19 immunisation - Not applicable - [1d - 1{DF} - Intramuscular use])",Not reported,"<a target=""_blank"" href=""https://dap.ema.europa.eu/xmlpserver/PHV%20DAP/Reports/ICSR.xdo?_xpf=&_xt=form&SR_ID=10016677744&_xpt=1&_xf=pdf"">ICSR</a>"
EU-EC-10016678632,Spontaneous,2024-01-23 00:00:00,Non Healthcare Professional,Non European Economic Area,Not available,65-85 Years,Not Specified,No,Female,"Chills (24h - Recovered/Resolved - ),<BR><BR>Dyspnoea (24h - Recovered/Resolved - ),<BR><BR>Feeling cold (24h - Recovered/Resolved - ),<BR><BR>Headache (24h - Recovered/Resolved - ),<BR><BR>Hypothermia (24h - Recovered/Resolved - Other Medically Important Condition),<BR><BR>Interchange of vaccine products (n/a - Unknown - Other Medically Important Condition),<BR><BR>Nausea (24h - Recovered/Resolved - ),<BR><BR>Pain (24h - Recovered/Resolved - Other Medically Important Condition),<BR><BR>Palpitations (24h - Recovered/Resolved - ),<BR><BR>Tremor (24h - Recovered/Resolved - Other Medically Important Condition),<BR><BR>Vaccination site pain (24h - Recovered/Resolved - ),<BR><BR>Vomiting (24h - Recovered/Resolved - ),<BR><BR>Wheezing (24h - Recovered/Resolved - )","COMIRNATY ORIGINAL/OMICRON BA.1 [TOZINAMERAN, RILTOZINAMERAN] (S - COVID-19 immunisation - Not applicable - [n/a - n/a - n/a])",[ROSUVASTATIN CALCIUM] (C - n/a - n/a - [n/a - n/a - n/a]),"<a target=""_blank"" href=""https://dap.ema.europa.eu/xmlpserver/PHV%20DAP/Reports/ICSR.xdo?_xpf=&_xt=form&SR_ID=10016678632&_xpt=1&_xf=pdf"">ICSR</a>"
EU-EC-10016670739,Spontaneous,2024-01-22 00:00:00,Non Healthcare Professional,Non European Economic Area,Not available,18-64 Years,Not Specified,No,Female,Vaccination site pain (n/a - Not Recovered/Not Resolved - Other Medically Important Condition),"COMIRNATY ORIGINAL/OMICRON BA.1 [TOZINAMERAN, RILTOZINAMERAN] (S - COVID-19 immunisation - Not applicable - [1d - n/a - n/a])",Not reported,"<a target=""_blank"" href=""https://dap.ema.europa.eu/xmlpserver/PHV%20DAP/Reports/ICSR.xdo?_xpf=&_xt=form&SR_ID=10016670739&_xpt=1&_xf=pdf"">ICSR</a>"
EU-EC-10016647354,Spontaneous,2024-01-18 00:00:00,Non Healthcare Professional,Non European Economic Area,Not available,18-64 Years,Not Specified,No,Female,"Migraine (n/a - Recovered/Resolved - Other Medically Important Condition),<BR><BR>Nausea (n/a - Unknown - Other Medically Important Condition),<BR><BR>Pyrexia (n/a - Recovered/Resolved - Other Medically Important Condition),<BR><BR>Vomiting (n/a - Recovered/Resolved - Other Medically Important Condition)","COMIRNATY ORIGINAL/OMICRON BA.1 [TOZINAMERAN, RILTOZINAMERAN] (S - COVID-19 immunisation - Unknown - [1d - 1{DF} - n/a]),<BR><BR>COMIRNATY [TOZINAMERAN] (S - Product used for unknown indication - Not applicable - [n/a - 1{DF} - n/a]),<BR><BR>COVID-19 VACCINE ASTRAZENECA (CHADOX1 NCOV-19) [COVID-19 VACCINE ASTRAZENECA (CHADOX1 NCOV-19)] (S - COVID-19 prophylaxis - Unknown - [n/a - 1{DF} - Intramuscular use]),<BR><BR>SPIKEVAX [ELASOMERAN] (S - COVID-19 prophylaxis - Unknown - [n/a - 1{DF} - n/a])","IBUPROFEN [IBUPROFEN, IBUPROFEN SODIUM] (C - Sinus headache - n/a - [n/a - n/a - n/a]),<BR><BR>[ACETYLSALICYLIC ACID] (C - Pyrexia - n/a - [n/a - n/a - n/a]),<BR><BR>[ESTRADIOL, NORETHISTERONE, NORETHISTERONE ACETATE, ESTRADIOL, NORETHISTERONE ACETATE, ESTRADIOL HEMIHYDRATE] (C - Hormone replacement therapy - n/a - [n/a - n/a - n/a]),<BR><BR>[ESTRADIOL] (C - Hormone replacement therapy - n/a - [n/a - n/a - n/a])","<a target=""_blank"" href=""https://dap.ema.europa.eu/xmlpserver/PHV%20DAP/Reports/ICSR.xdo?_xpf=&_xt=form&SR_ID=10016647354&_xpt=1&_xf=pdf"">ICSR</a>"
EU-EC-10016647859,Spontaneous,2024-01-18 00:00:00,Healthcare Professional,European Economic Area,Not available,18-64 Years,Not Specified,No,Female,"Vaccination site erythema (n/a - Unknown - ),<BR><BR>Vaccination site oedema (n/a - Unknown - ),<BR><BR>Vaccination site pain (n/a - Unknown - ),<BR><BR>Vaccination site warmth (n/a - Unknown - )","COMIRNATY ORIGINAL/OMICRON BA.1 [TOZINAMERAN, RILTOZINAMERAN] (S - COVID-19 immunisation - n/a - [n/a - n/a - Intramuscular use])",Not reported,"<a target=""_blank"" href=""https://dap.ema.europa.eu/xmlpserver/PHV%20DAP/Reports/ICSR.xdo?_xpf=&_xt=form&SR_ID=10016647859&_xpt=1&_xf=pdf"">ICSR</a>"
EU-EC-10016650173,Spontaneous,2024-01-18 00:00:00,Non Healthcare Professional,Non European Economic Area,Not available,65-85 Years,Not Specified,No,Female,"Blindness (n/a - Not Recovered/Not Resolved - Other Medically Important Condition),<BR><BR>Diarrhoea (n/a - Unknown - Other Medically Important Condition),<BR><BR>Diplopia (n/a - Unknown - Other Medically Important Condition),<BR><BR>Dizziness (n/a - Unknown - Other Medically Important Condition),<BR><BR>Nausea (n/a - Unknown - Other Medically Important Condition),<BR><BR>Vision blurred (n/a - Unknown - Other Medically Important Condition)","COMIRNATY ORIGINAL/OMICRON BA.1 [TOZINAMERAN, RILTOZINAMERAN] (S - COVID-19 immunisation - Not applicable - [1d - n/a - n/a])",Not reported,"<a target=""_blank"" href=""https://dap.ema.europa.eu/xmlpserver/PHV%20DAP/Reports/ICSR.xdo?_xpf=&_xt=form&SR_ID=10016650173&_xpt=1&_xf=pdf"">ICSR</a>"
EU-EC-10016650343,Spontaneous,2024-01-18 00:00:00,Healthcare Professional,Non European Economic Area,Not available,65-85 Years,Not Specified,No,Female,"Aneurysm ruptured (n/a - Fatal - Results in Death, Other Medically Important Condition),<BR><BR>Myocardial infarction (n/a - Fatal - Results in Death, Other Medically Important Condition)","TOZINAMERAN, RILTOZINAMERAN [TOZINAMERAN, RILTOZINAMERAN] (S - COVID-19 immunisation - Not applicable - [1d - n/a - n/a])",Not reported,"<a target=""_blank"" href=""https://dap.ema.europa.eu/xmlpserver/PHV%20DAP/Reports/ICSR.xdo?_xpf=&_xt=form&SR_ID=10016650343&_xpt=1&_xf=pdf"">ICSR</a>"
EU-EC-10016642068,Spontaneous,2024-01-17 00:00:00,Non Healthcare Professional,European Economic Area,Not available,18-64 Years,Not Specified,No,Male,"Chills (2d - Recovered/Resolved - ),<BR><BR>Diarrhoea (n/a - Recovering/Resolving - ),<BR><BR>Injection site pain (2d - Recovered/Resolved - ),<BR><BR>Nausea (n/a - Recovering/Resolving - ),<BR><BR>Vomiting (n/a - Recovering/Resolving - )","COMIRNATY ORIGINAL/OMICRON BA.1 [TOZINAMERAN, RILTOZINAMERAN] (S - COVID-19 immunisation - Not applicable - [n/a - 1{DF} - n/a])",OZEMPIC SOLUTION FOR INJECTION IN PRE-FILLED PEN [SEMAGLUTIDE] (C - n/a - n/a - [n/a - n/a - n/a]),"<a target=""_blank"" href=""https://dap.ema.europa.eu/xmlpserver/PHV%20DAP/Reports/ICSR.xdo?_xpf=&_xt=form&SR_ID=10016642068&_xpt=1&_xf=pdf"">ICSR</a>"
EU-EC-10016629431,Spontaneous,2024-01-16 00:00:00,Healthcare Professional,Non European Economic Area,Not available,18-64 Years,Not Specified,No,Female,"Myocarditis (n/a - Recovering/Resolving - Caused/Prolonged Hospitalisation, Other Medically Important Condition)","COMIRNATY ORIGINAL/OMICRON BA.1 [TOZINAMERAN, RILTOZINAMERAN] (S - COVID-19 immunisation - Not applicable - [1d - .3mL - n/a])",Not reported,"<a target=""_blank"" href=""https://dap.ema.europa.eu/xmlpserver/PHV%20DAP/Reports/ICSR.xdo?_xpf=&_xt=form&SR_ID=10016629431&_xpt=1&_xf=pdf"">ICSR</a>"
EU-EC-10016629771,Spontaneous,2024-01-16 00:00:00,Non Healthcare Professional,Non European Economic Area,Not available,18-64 Years,Not Specified,No,Female,"Cerebrovascular accident (n/a - Not Recovered/Not Resolved - Life Threatening, Caused/Prolonged Hospitalisation, Disabling, Other Medically Important Condition),<BR><BR>Dizziness (n/a - Unknown - Life Threatening, Caused/Prolonged Hospitalisation, Disabling),<BR><BR>Illness (n/a - Unknown - Life Threatening, Caused/Prolonged Hospitalisation, Disabling),<BR><BR>Vertebrobasilar artery dissection (n/a - Unknown - Life Threatening, Caused/Prolonged Hospitalisation, Disabling, Other Medically Important Condition),<BR><BR>Vomiting (n/a - Unknown - Life Threatening, Caused/Prolonged Hospitalisation, Disabling)","COMIRNATY ORIGINAL/OMICRON BA.1 [TOZINAMERAN, RILTOZINAMERAN] (S - COVID-19 immunisation - Not applicable - [1d - n/a - n/a])",[INFLUENZA VIRUS] (C - Influenza immunisation - n/a - [1d - n/a - n/a]),"<a target=""_blank"" href=""https://dap.ema.europa.eu/xmlpserver/PHV%20DAP/Reports/ICSR.xdo?_xpf=&_xt=form&SR_ID=10016629771&_xpt=1&_xf=pdf"">ICSR</a>"
EU-EC-10016630703,Spontaneous,2024-01-16 00:00:00,Non Healthcare Professional,European Economic Area,Not available,18-64 Years,Adult,No,Female,"Breast pain (n/a - Unknown - ),<BR><BR>Bronchitis (n/a - Unknown - ),<BR><BR>Coronavirus infection (n/a - Unknown - ),<BR><BR>Dizziness (n/a - Unknown - ),<BR><BR>Headache (n/a - Unknown - ),<BR><BR>Lymphadenopathy (364d - Recovered/Resolved With Sequelae - ),<BR><BR>Musculoskeletal discomfort (n/a - Unknown - )","COMIRNATY ORIGINAL/OMICRON BA.1 [TOZINAMERAN, RILTOZINAMERAN] (S - COVID-19 immunisation - n/a - [n/a - n/a - n/a])",Not reported,"<a target=""_blank"" href=""https://dap.ema.europa.eu/xmlpserver/PHV%20DAP/Reports/ICSR.xdo?_xpf=&_xt=form&SR_ID=10016630703&_xpt=1&_xf=pdf"">ICSR</a>"
EU-EC-10016630790,Spontaneous,2024-01-16 00:00:00,Healthcare Professional,Non European Economic Area,Not available,18-64 Years,Not Specified,No,Female,"Angioedema (n/a - Recovering/Resolving - Other Medically Important Condition),<BR><BR>Sensory disturbance (n/a - Unknown - ),<BR><BR>Urticaria (n/a - Recovering/Resolving - )","COMIRNATY ORIGINAL/OMICRON BA.1 [TOZINAMERAN, RILTOZINAMERAN] (S - COVID-19 immunisation - Not applicable - [1d - n/a - n/a]),<BR><BR>[A/HONG KONG/4801/2014 (H3N2)-LIKE STRAIN (A/HONG KONG/4801/2014, X-263B), B/BRISBANE/60/2008-LIKE STRAIN (B/BRISBANE/60/2008, WILD TYPE), A/CALIFORNIA/7/2009 (H1N1)PDM09-DERIVED STRAIN USED (NYMC X-181), A/HONG KONG/4801/2014 (H3N2)-LIKE STRAIN (A/HONG KONG/4801/2014, X-263B), B/BRISBANE/60/2008-LIKE STRAIN (B/BRISBANE/60/2008, WILD TYPE), A/MICHIGAN/45/2015 (H1N1)PDM09-LIKE STRAIN (A/SINGAPORE/GP1908/2015, IVR-180), INFLUENZA VACCINE] (S - Influenza immunisation - Not applicable - [1d - n/a - n/a])",Not reported,"<a target=""_blank"" href=""https://dap.ema.europa.eu/xmlpserver/PHV%20DAP/Reports/ICSR.xdo?_xpf=&_xt=form&SR_ID=10016630790&_xpt=1&_xf=pdf"">ICSR</a>"
EU-EC-10016631588,Spontaneous,2024-01-16 00:00:00,Healthcare Professional,Non European Economic Area,Not available,18-64 Years,Not Specified,No,Male,Anaphylactic reaction (3515min - Recovered/Resolved - Caused/Prolonged Hospitalisation),"COMIRNATY ORIGINAL/OMICRON BA.1 [TOZINAMERAN, RILTOZINAMERAN] (S - COVID-19 immunisation - Not applicable - [n/a - n/a - n/a])",Not reported,"<a target=""_blank"" href=""https://dap.ema.europa.eu/xmlpserver/PHV%20DAP/Reports/ICSR.xdo?_xpf=&_xt=form&SR_ID=10016631588&_xpt=1&_xf=pdf"">ICSR</a>"
EU-EC-10016632722,Spontaneous,2024-01-16 00:00:00,Healthcare Professional,European Economic Area,Not available,65-85 Years,Elderly,No,Female,"Gait disturbance (n/a - Not Recovered/Not Resolved - ),<BR><BR>Vaccination site movement impairment (n/a - Not Recovered/Not Resolved - )","COMIRNATY ORIGINAL/OMICRON BA.1 [TOZINAMERAN, RILTOZINAMERAN] (S - COVID-19 immunisation - n/a - [1d - .3mL - Intramuscular use])",Not reported,"<a target=""_blank"" href=""https://dap.ema.europa.eu/xmlpserver/PHV%20DAP/Reports/ICSR.xdo?_xpf=&_xt=form&SR_ID=10016632722&_xpt=1&_xf=pdf"">ICSR</a>"
EU-EC-10016634476,Spontaneous,2024-01-16 00:00:00,Non Healthcare Professional,Non European Economic Area,Not available,18-64 Years,Not Specified,No,Female,"Adenomyosis (n/a - Not Recovered/Not Resolved - Disabling, Other Medically Important Condition),<BR><BR>Anxiety (n/a - Not Recovered/Not Resolved - Disabling, Other Medically Important Condition),<BR><BR>Asthma (n/a - Not Recovered/Not Resolved - Disabling, Other Medically Important Condition),<BR><BR>Blood alkaline phosphatase decreased (n/a - Not Recovered/Not Resolved - Disabling, Other Medically Important Condition),<BR><BR>Blood folate decreased (n/a - Not Recovered/Not Resolved - Disabling, Other Medically Important Condition),<BR><BR>Ear pain (n/a - Not Recovered/Not Resolved - Disabling, Other Medically Important Condition),<BR><BR>Electrocardiogram QT prolonged (n/a - Not Recovered/Not Resolved - Disabling, Other Medically Important Condition),<BR><BR>Eustachian tube dysfunction (n/a - Not Recovered/Not Resolved - Disabling, Other Medically Important Condition),<BR><BR>Fatigue (n/a - Not Recovered/Not Resolved - Disabling, Other Medically Important Condition),<BR><BR>Insomnia (n/a - Not Recovered/Not Resolved - Disabling, Other Medically Important Condition),<BR><BR>Musculoskeletal stiffness (n/a - Not Recovered/Not Resolved - Disabling, Other Medically Important Condition),<BR><BR>Pain (n/a - Not Recovered/Not Resolved - Disabling, Other Medically Important Condition),<BR><BR>Peripheral swelling (n/a - Not Recovered/Not Resolved - Disabling, Other Medically Important Condition),<BR><BR>Presyncope (n/a - Not Recovered/Not Resolved - Disabling, Other Medically Important Condition),<BR><BR>Productive cough (n/a - Not Recovered/Not Resolved - Disabling, Other Medically Important Condition),<BR><BR>Pyrexia (n/a - Not Recovered/Not Resolved - Disabling, Other Medically Important Condition),<BR><BR>Sputum discoloured (n/a - Not Recovered/Not Resolved - Disabling, Other Medically Important Condition),<BR><BR>Syncope (n/a - Not Recovered/Not Resolved - Disabling, Other Medically Important Condition),<BR><BR>Uterine cyst (n/a - Not Recovered/Not Resolved - Disabling, Other Medically Important Condition),<BR><BR>Vaccination site bruising (n/a - Not Recovered/Not Resolved - Disabling, Other Medically Important Condition),<BR><BR>Vaccination site swelling (n/a - Not Recovered/Not Resolved - Disabling, Other Medically Important Condition)","COMIRNATY ORIGINAL/OMICRON BA.1 [TOZINAMERAN, RILTOZINAMERAN] (S - COVID-19 immunisation - Not applicable - [1d - n/a - Intramuscular use])","[A/HONG KONG/4801/2014 (H3N2)-LIKE STRAIN (A/HONG KONG/4801/2014, X-263B), B/BRISBANE/60/2008-LIKE STRAIN (B/BRISBANE/60/2008, WILD TYPE), A/CALIFORNIA/7/2009 (H1N1)PDM09-DERIVED STRAIN USED (NYMC X-181), A/HONG KONG/4801/2014 (H3N2)-LIKE STRAIN (A/HONG KONG/4801/2014, X-263B), B/BRISBANE/60/2008-LIKE STRAIN (B/BRISBANE/60/2008, WILD TYPE), A/MICHIGAN/45/2015 (H1N1)PDM09-LIKE STRAIN (A/SINGAPORE/GP1908/2015, IVR-180), INFLUENZA VACCINE] (C - Influenza immunisation - n/a - [1d - n/a - n/a]),<BR><BR>[BECLOMETASONE DIPROPIONATE, FORMOTEROL FUMARATE, BECLOMETASONE DIPROPIONATE, FORMOTEROL FUMARATE DIHYDRATE] (C - n/a - n/a - [n/a - 2{DF} - n/a]),<BR><BR>[BECLOMETASONE] (C - Asthma - n/a - [30y - 200mg - Inhalation use]),<BR><BR>[BUDESONIDE, FORMOTEROL FUMARATE DIHYDRATE] (C - Asthma - n/a - [n/a - n/a - Inhalation use]),<BR><BR>[CHLORPHENAMINE] (C - Seasonal allergy - n/a - [n/a - 4mg - n/a]),<BR><BR>[FLUCLOXACILLIN, FLUCLOXACILLIN SODIUM, FLUCLOXACILLIN SODIUM MONOHYDRATE] (C - n/a - n/a - [n/a - 500mg - n/a]),<BR><BR>[LORATADINE] (C - n/a - n/a - [n/a - 10mg - n/a]),<BR><BR>[MIRTAZAPINE] (C - Anxiety - n/a - [n/a - 15mg - n/a]),<BR><BR>[MONTELUKAST, MONTELUKAST SODIUM] (C - n/a - n/a - [n/a - n/a - n/a]),<BR><BR>[NORETHISTERONE] (C - Abnormal uterine bleeding - n/a - [n/a - 5mg - n/a]),<BR><BR>[SALBUTAMOL, SALBUTAMOL SULFATE] (C - Asthma - n/a - [n/a - 100mg - n/a]),<BR><BR>[SERTRALINE, SERTRALINE HYDROCHLORIDE] (C - n/a - n/a - [n/a - n/a - n/a]),<BR><BR>[ZOPICLONE] (C - Anxiety - n/a - [n/a - n/a - n/a])","<a target=""_blank"" href=""https://dap.ema.europa.eu/xmlpserver/PHV%20DAP/Reports/ICSR.xdo?_xpf=&_xt=form&SR_ID=10016634476&_xpt=1&_xf=pdf"">ICSR</a>"
EU-EC-10016634690,Spontaneous,2024-01-16 00:00:00,Non Healthcare Professional,European Economic Area,Not available,18-64 Years,Not Specified,No,Female,Lymphadenopathy (0d - Not Recovered/Not Resolved - ),"COMIRNATY ORIGINAL/OMICRON BA.1 [TOZINAMERAN, RILTOZINAMERAN] (S - n/a - Not applicable - [n/a - n/a - n/a])",Not reported,"<a target=""_blank"" href=""https://dap.ema.europa.eu/xmlpserver/PHV%20DAP/Reports/ICSR.xdo?_xpf=&_xt=form&SR_ID=10016634690&_xpt=1&_xf=pdf"">ICSR</a>"
EU-EC-10016635600,Spontaneous,2024-01-16 00:00:00,Non Healthcare Professional,European Economic Area,Not available,Not Specified,Adult,No,Female,"Ageusia (n/a - Not Recovered/Not Resolved - ),<BR><BR>Anaesthesia oral (n/a - Not Recovered/Not Resolved - ),<BR><BR>Hypoaesthesia oral (n/a - Not Recovered/Not Resolved - )","COMIRNATY ORIGINAL/OMICRON BA.1 [TOZINAMERAN, RILTOZINAMERAN] (S - COVID-19 immunisation - Not applicable - [1d - n/a - n/a])",Not reported,"<a target=""_blank"" href=""https://dap.ema.europa.eu/xmlpserver/PHV%20DAP/Reports/ICSR.xdo?_xpf=&_xt=form&SR_ID=10016635600&_xpt=1&_xf=pdf"">ICSR</a>"
EU-EC-10016624375,Spontaneous,2024-01-15 00:00:00,Non Healthcare Professional,European Economic Area,Not available,18-64 Years,Not Specified,No,Male,"COVID-19 (n/a - Unknown - Other Medically Important Condition),<BR><BR>Drug ineffective (n/a - Unknown - Other Medically Important Condition)","COMIRNATY ORIGINAL/OMICRON BA.1 [TOZINAMERAN, RILTOZINAMERAN] (S - COVID-19 immunisation - Not applicable - [1d - n/a - n/a]),<BR><BR>COMIRNATY [TOZINAMERAN] (S - COVID-19 immunisation - Not applicable - [1d - n/a - n/a - More in ICSR])",Not reported,"<a target=""_blank"" href=""https://dap.ema.europa.eu/xmlpserver/PHV%20DAP/Reports/ICSR.xdo?_xpf=&_xt=form&SR_ID=10016624375&_xpt=1&_xf=pdf"">ICSR</a>"
EU-EC-10016624390,Spontaneous,2024-01-15 00:00:00,Non Healthcare Professional,Non European Economic Area,Not available,18-64 Years,Not Specified,No,Female,"Asthenia (n/a - Not Recovered/Not Resolved - Caused/Prolonged Hospitalisation),<BR><BR>Chest pain (n/a - Not Recovered/Not Resolved - Caused/Prolonged Hospitalisation),<BR><BR>Dyspnoea (n/a - Not Recovered/Not Resolved - Caused/Prolonged Hospitalisation),<BR><BR>Fatigue (n/a - Unknown - Caused/Prolonged Hospitalisation),<BR><BR>Neck pain (n/a - Not Recovered/Not Resolved - Caused/Prolonged Hospitalisation),<BR><BR>Pain in extremity (n/a - Not Recovered/Not Resolved - Caused/Prolonged Hospitalisation),<BR><BR>Palpitations (n/a - Unknown - Caused/Prolonged Hospitalisation),<BR><BR>Pericarditis (n/a - Unknown - Caused/Prolonged Hospitalisation),<BR><BR>Pyrexia (n/a - Unknown - Caused/Prolonged Hospitalisation),<BR><BR>Tachycardia (n/a - Unknown - Caused/Prolonged Hospitalisation)","COMIRNATY ORIGINAL/OMICRON BA.1 [TOZINAMERAN, RILTOZINAMERAN] (S - COVID-19 immunisation - Not applicable - [n/a - n/a - n/a])",METHOTREXATE [METHOTREXATE] (C - Arthritis - n/a - [n/a - n/a - n/a]),"<a target=""_blank"" href=""https://dap.ema.europa.eu/xmlpserver/PHV%20DAP/Reports/ICSR.xdo?_xpf=&_xt=form&SR_ID=10016624390&_xpt=1&_xf=pdf"">ICSR</a>"
EU-EC-10016626418,Spontaneous,2024-01-15 00:00:00,Healthcare Professional,Non European Economic Area,Not available,More than 85 Years,Not Specified,No,Male,Fall (n/a - Unknown - Caused/Prolonged Hospitalisation),"COMIRNATY ORIGINAL/OMICRON BA.1 [TOZINAMERAN, RILTOZINAMERAN] (S - COVID-19 immunisation - Not applicable - [1d - n/a - Intramuscular use])","GOREISAN [ALISMA PLANTAGO-AQUATICA SUBSP. ORIENTALE TUBER;ATRACTYLODES LANCEA RHIZOME;CINNAMOMUM CASSIA BARK;POLYPORUS UMBELLATUS SCLEROTIUM;PORIA COCOS SCLEROTIUM] [ALISMA PLANTAGO-AQUATICA SUBSP. ORIENTALE TUBER, ATRACTYLODES LANCEA RHIZOME, CINNAMOMUM CASSIA BARK, POLYPORUS UMBELLATUS SCLEROTIUM, PORIA COCOS SCLEROTIUM] (C - Oedema - n/a - [n/a - n/a - Oral use]),<BR><BR>[CARBAZOCHROME] (C - Haematuria - n/a - [n/a - n/a - Oral use]),<BR><BR>[DILTIAZEM HYDROCHLORIDE] (C - Hypertension - n/a - [n/a - n/a - n/a]),<BR><BR>[TRANEXAMIC ACID] (C - Haematuria - n/a - [n/a - n/a - Oral use])","<a target=""_blank"" href=""https://dap.ema.europa.eu/xmlpserver/PHV%20DAP/Reports/ICSR.xdo?_xpf=&_xt=form&SR_ID=10016626418&_xpt=1&_xf=pdf"">ICSR</a>"
EU-EC-10016627020,Spontaneous,2024-01-15 00:00:00,Non Healthcare Professional,European Economic Area,Not available,65-85 Years,Not Specified,No,Female,"Headache (n/a - Not Recovered/Not Resolved - ),<BR><BR>Muscle spasms (n/a - Not Recovered/Not Resolved - ),<BR><BR>Muscular weakness (n/a - Not Recovered/Not Resolved - ),<BR><BR>Myalgia (n/a - Not Recovered/Not Resolved - ),<BR><BR>Pyrexia (2d - Recovered/Resolved - )","COMIRNATY ORIGINAL/OMICRON BA.1 [TOZINAMERAN, RILTOZINAMERAN] (S - n/a - n/a - [n/a - n/a - n/a])",Not reported,"<a target=""_blank"" href=""https://dap.ema.europa.eu/xmlpserver/PHV%20DAP/Reports/ICSR.xdo?_xpf=&_xt=form&SR_ID=10016627020&_xpt=1&_xf=pdf"">ICSR</a>"
EU-EC-10016613013,Spontaneous,2024-01-12 00:00:00,Non Healthcare Professional,Non European Economic Area,Not available,18-64 Years,Not Specified,No,Female,"Axillary pain (n/a - Recovered/Resolved With Sequelae - Other Medically Important Condition),<BR><BR>COVID-19 (n/a - Unknown - Other Medically Important Condition),<BR><BR>Contusion (n/a - Unknown - Other Medically Important Condition)","COMIRNATY ORIGINAL/OMICRON BA.1 [TOZINAMERAN, RILTOZINAMERAN] (S - COVID-19 immunisation - Not applicable - [1d - n/a - n/a])",Not reported,"<a target=""_blank"" href=""https://dap.ema.europa.eu/xmlpserver/PHV%20DAP/Reports/ICSR.xdo?_xpf=&_xt=form&SR_ID=10016613013&_xpt=1&_xf=pdf"">ICSR</a>"
EU-EC-10016614503,Spontaneous,2024-01-12 00:00:00,Non Healthcare Professional,European Economic Area,Not available,65-85 Years,Not Specified,No,Female,Herpes zoster (n/a - Not Recovered/Not Resolved - ),"COMIRNATY ORIGINAL/OMICRON BA.1 [TOZINAMERAN, RILTOZINAMERAN] (S - n/a - n/a - [n/a - n/a - n/a])",Not reported,"<a target=""_blank"" href=""https://dap.ema.europa.eu/xmlpserver/PHV%20DAP/Reports/ICSR.xdo?_xpf=&_xt=form&SR_ID=10016614503&_xpt=1&_xf=pdf"">ICSR</a>"
EU-EC-10016614728,Spontaneous,2024-01-12 00:00:00,Non Healthcare Professional,Non European Economic Area,Not available,Not Specified,Not Specified,No,Female,"Headache (n/a - Unknown - ),<BR><BR>Influenza like illness (n/a - Unknown - ),<BR><BR>Insomnia (n/a - Unknown - ),<BR><BR>Maternal exposure during pregnancy (n/a - Unknown - ),<BR><BR>Myalgia (n/a - Unknown - ),<BR><BR>Nausea (n/a - Unknown - ),<BR><BR>Pain in extremity (n/a - Unknown - ),<BR><BR>Peripheral swelling (n/a - Recovering/Resolving - Other Medically Important Condition),<BR><BR>Pyrexia (n/a - Unknown - )","COMIRNATY ORIGINAL/OMICRON BA.1 [TOZINAMERAN, RILTOZINAMERAN] (S - COVID-19 immunisation - Not applicable - [1d - n/a - n/a])",Not reported,"<a target=""_blank"" href=""https://dap.ema.europa.eu/xmlpserver/PHV%20DAP/Reports/ICSR.xdo?_xpf=&_xt=form&SR_ID=10016614728&_xpt=1&_xf=pdf"">ICSR</a>"
EU-EC-10016606768,Spontaneous,2024-01-11 00:00:00,Non Healthcare Professional,European Economic Area,Not available,18-64 Years,Not Specified,No,Female,Intermenstrual bleeding (n/a - Not Recovered/Not Resolved - ),"COMIRNATY ORIGINAL/OMICRON BA.1 [TOZINAMERAN, RILTOZINAMERAN] (S - n/a - n/a - [n/a - n/a - n/a])",Not reported,"<a target=""_blank"" href=""https://dap.ema.europa.eu/xmlpserver/PHV%20DAP/Reports/ICSR.xdo?_xpf=&_xt=form&SR_ID=10016606768&_xpt=1&_xf=pdf"">ICSR</a>"
EU-EC-10016607505,Spontaneous,2024-01-11 00:00:00,Non Healthcare Professional,European Economic Area,Not available,65-85 Years,Not Specified,No,Female,"Pyrexia (2d - Recovered/Resolved - ),<BR><BR>Rash erythematous (6d - Recovered/Resolved - )","COMIRNATY ORIGINAL/OMICRON BA.1 [TOZINAMERAN, RILTOZINAMERAN] (S - n/a - n/a - [n/a - n/a - n/a])",Not reported,"<a target=""_blank"" href=""https://dap.ema.europa.eu/xmlpserver/PHV%20DAP/Reports/ICSR.xdo?_xpf=&_xt=form&SR_ID=10016607505&_xpt=1&_xf=pdf"">ICSR</a>"
EU-EC-10016607693,Spontaneous,2024-01-11 00:00:00,Non Healthcare Professional,Non European Economic Area,Not available,18-64 Years,Not Specified,No,Male,"Cerebrovascular accident (n/a - Recovered/Resolved With Sequelae - Caused/Prolonged Hospitalisation, Other Medically Important Condition),<BR><BR>Visual impairment (n/a - Unknown - Caused/Prolonged Hospitalisation, Other Medically Important Condition)","COMIRNATY ORIGINAL/OMICRON BA.1 [TOZINAMERAN, RILTOZINAMERAN] (S - COVID-19 immunisation - Not applicable - [1d - n/a - n/a])","[A/HONG KONG/4801/2014 (H3N2)-LIKE STRAIN (A/HONG KONG/4801/2014, X-263B), B/BRISBANE/60/2008-LIKE STRAIN (B/BRISBANE/60/2008, WILD TYPE), A/CALIFORNIA/7/2009 (H1N1)PDM09-DERIVED STRAIN USED (NYMC X-181), A/HONG KONG/4801/2014 (H3N2)-LIKE STRAIN (A/HONG KONG/4801/2014, X-263B), B/BRISBANE/60/2008-LIKE STRAIN (B/BRISBANE/60/2008, WILD TYPE), A/MICHIGAN/45/2015 (H1N1)PDM09-LIKE STRAIN (A/SINGAPORE/GP1908/2015, IVR-180), INFLUENZA VACCINE] (C - Immunisation - n/a - [n/a - n/a - n/a])","<a target=""_blank"" href=""https://dap.ema.europa.eu/xmlpserver/PHV%20DAP/Reports/ICSR.xdo?_xpf=&_xt=form&SR_ID=10016607693&_xpt=1&_xf=pdf"">ICSR</a>"
EU-EC-10016608369,Spontaneous,2024-01-11 00:00:00,Non Healthcare Professional,European Economic Area,Not available,18-64 Years,Adult,No,Female,"Arthralgia (n/a - Not Recovered/Not Resolved - ),<BR><BR>Asthma (n/a - Not Recovered/Not Resolved - ),<BR><BR>Body temperature increased (n/a - Not Recovered/Not Resolved - ),<BR><BR>Fatigue (n/a - Recovering/Resolving - ),<BR><BR>Headache (n/a - Not Recovered/Not Resolved - ),<BR><BR>Malaise (n/a - Not Recovered/Not Resolved - ),<BR><BR>Myalgia (n/a - Not Recovered/Not Resolved - )","COMIRNATY ORIGINAL/OMICRON BA.1 [TOZINAMERAN, RILTOZINAMERAN] (S - COVID-19 immunisation - Not applicable - [n/a - 1{DF} - n/a])","NOT AVAILABLE (C - n/a - n/a - [n/a - n/a - n/a]),<BR><BR>[FORMOTEROL FUMARATE DIHYDRATE, BECLOMETASONE DIPROPIONATE ANHYDROUS] (C - n/a - n/a - [n/a - n/a - n/a])","<a target=""_blank"" href=""https://dap.ema.europa.eu/xmlpserver/PHV%20DAP/Reports/ICSR.xdo?_xpf=&_xt=form&SR_ID=10016608369&_xpt=1&_xf=pdf"">ICSR</a>"
EU-EC-10016610099,Spontaneous,2024-01-11 00:00:00,Healthcare Professional,Non European Economic Area,Not available,65-85 Years,Not Specified,No,Female,"Arrhythmia (n/a - Recovering/Resolving - Other Medically Important Condition),<BR><BR>Atrial tachycardia (n/a - Recovering/Resolving - ),<BR><BR>Blood immunoglobulin G increased (n/a - Unknown - Other Medically Important Condition),<BR><BR>Bradycardia (n/a - Unknown - Other Medically Important Condition),<BR><BR>Cardiac failure (n/a - Unknown - Other Medically Important Condition),<BR><BR>Cardiomegaly (n/a - Unknown - ),<BR><BR>Gait disturbance (n/a - Recovered/Resolved - ),<BR><BR>Myocarditis (n/a - Not Recovered/Not Resolved - Other Medically Important Condition),<BR><BR>Pericarditis (n/a - Not Recovered/Not Resolved - Other Medically Important Condition),<BR><BR>Supraventricular extrasystoles (n/a - Recovering/Resolving - ),<BR><BR>Ventricular extrasystoles (n/a - Unknown - )","COMIRNATY ORIGINAL/OMICRON BA.1 [TOZINAMERAN, RILTOZINAMERAN] (S - COVID-19 immunisation - Not applicable - [1d - n/a - Intramuscular use])","[AMLODIPINE, AMLODIPINE BESILATE, AMLODIPINE MALEATE, AMLODIPINE MESILATE] (C - Hypertension - n/a - [n/a - n/a - Oral use]),<BR><BR>[ROSUVASTATIN, ROSUVASTATIN CALCIUM] (C - Hyperlipidaemia - n/a - [n/a - n/a - Oral use])","<a target=""_blank"" href=""https://dap.ema.europa.eu/xmlpserver/PHV%20DAP/Reports/ICSR.xdo?_xpf=&_xt=form&SR_ID=10016610099&_xpt=1&_xf=pdf"">ICSR</a>"
EU-EC-10016610363,Spontaneous,2024-01-11 00:00:00,Healthcare Professional,Non European Economic Area,Not available,65-85 Years,Not Specified,No,Female,"Arrhythmia (n/a - Not Recovered/Not Resolved - Other Medically Important Condition),<BR><BR>Blood immunoglobulin G increased (n/a - Unknown - Other Medically Important Condition),<BR><BR>Supraventricular extrasystoles (n/a - Not Recovered/Not Resolved - )","COMIRNATY ORIGINAL/OMICRON BA.1 [TOZINAMERAN, RILTOZINAMERAN] (S - COVID-19 immunisation - Not applicable - [1d - n/a - Intramuscular use])","[AMLODIPINE, AMLODIPINE BESILATE, AMLODIPINE MALEATE, AMLODIPINE MESILATE] (C - Hypertension - n/a - [n/a - n/a - Oral use]),<BR><BR>[ROSUVASTATIN, ROSUVASTATIN CALCIUM] (C - Hyperlipidaemia - n/a - [n/a - n/a - Oral use])","<a target=""_blank"" href=""https://dap.ema.europa.eu/xmlpserver/PHV%20DAP/Reports/ICSR.xdo?_xpf=&_xt=form&SR_ID=10016610363&_xpt=1&_xf=pdf"">ICSR</a>"
EU-EC-10016611814,Spontaneous,2024-01-11 00:00:00,Healthcare Professional,European Economic Area,Not available,18-64 Years,Adult,No,Male,Gynaecomastia (n/a - Not Recovered/Not Resolved - ),"COMIRNATY ORIGINAL/OMICRON BA.1 [TOZINAMERAN, RILTOZINAMERAN] (S - COVID-19 immunisation - Not applicable - [n/a - 1{DF} - Intramuscular use]),<BR><BR>[B/BRISBANE/60/2008 (VICTORIA LINEAGE)-LIKE STRAIN (B/BRISBANE/60/2008, MEDI 228030), B/MASSACHUSETTS/2/2012 (YAMAGATA LINEAGE)-LIKE STRAIN (B/MASSACHUSETTS/2/2012, MEDI 237751), A/TEXAS/50/2012 (H3N2)-LIKE STRAIN (A/TEXAS/50/2012, X-223A), A/CALIFORNIA/7/2009 (H1N1)PDM09 - DERIVED STRAIN USED NYMC X-179A, B/PHUKET/3073/2013-LIKE VIRUS (B/PHUKET/3073/2013, WILD TYPE), A/GUANGDONG-MAONAN/SWL1536/2019 (H1N1)PDM09 - LIKE VIRUS (A/GUANGDONG-MAONAN/SWL1536/2019, CNIC-1909), A/HONG KONG/2671/2019 (H3N2) - LIKE VIRUS (A/HONG KONG/2671/2019, IVR-208), B/WASHINGTON/02/2019 - LIKE VIRUS (B/WASHINGTON/02/2019, WILD TYPE), B/PHUKET/3073/2013-LIKE VIRUS (B/PHUKET/3073/2013, WILD TYPE), A/VICTORIA/2570/2019 (H1N1)PDM09-LIKE STRAIN (A/VICTORIA/2570/2019, IVR-215), INFLUENZA VIRUS A/DARWIN/9/2021 SAN-010 (H3N2), INFLUENZA VIRUS B/MICHIGAN/01/2021, B/PHUKET/3073/2013-LIKE VIRUS (B/PHUKET/3073/2013, WILD TYPE), B/BRISBANE/60/2008-LIKE STRAIN (B/BRISBANE/60/2008, WILD TYPE), A/MICHIGAN/45/2015 (H1N1)PDM09-LIKE STRAIN (A/MICHIGAN/45/2015, NYMC X-275), A/HONG KONG/4801/2014 (H3N2)-LIKE STRAIN (A/HONG KONG/4801/2014, NYMC X-263B), B/PHUKET/3073/2013-LIKE VIRUS (B/PHUKET/3073/2013, WILD TYPE), B/WASHINGTON/02/2019 - LIKE VIRUS (B/WASHINGTON/02/2019, WILD TYPE), A/VICTORIA/2570/2019 (H1N1)PDM09-LIKE STRAIN (A/VICTORIA/2570/2019, IVR-215), INFLUENZA A VIRUS, A/CAMBODIA/E0826360/2020 (H3N2) - LIKE STRAIN (A/TASMANIA/503/2020, IVR-221), INACTIVATED, B/PHUKET/3073/2013-LIKE VIRUS (B/PHUKET/3073/2013, WILD TYPE), INFLUENZA VIRUS A/DARWIN/9/2021 IVR-228 (H3N2), B/AUSTRIA/1359417/2021 LIKE STRAIN-(B/MICHIGAN/01/2021, WILD TYPE), A/VICTORIA/4897/2022 (H1N1)PDM09-LIKE STRAIN (A/VICTORIA/4897/2022, IVR-238), B/PHUKET/3073/2013-LIKE VIRUS (B/PHUKET/3073/2013, WILD TYPE), INFLUENZA VIRUS A/DARWIN/9/2021 IVR-228 (H3N2), B/AUSTRIA/1359417/2021 LIKE STRAIN-(B/MICHIGAN/01/2021, WILD TYPE), INFLUENZA A/VICTORIA/4897/2022 IVR-238 (H1N1), INACTIVATED, B/PHUKET/3073/2013-LIKE VIRUS (B/PHUKET/3073/2013, WILD TYPE), INFLUENZA VIRUS A/DARWIN/9/2021 SAN-010 (H3N2), INFLUENZA VIRUS B/MICHIGAN/01/2021, INFLUENZA A/VICTORIA/4897/2022 IVR-238 (H1N1), INACTIVATED] (S - Influenza immunisation - Not applicable - [n/a - 1{DF} - Intramuscular use]),<BR><BR>[PNEUMOCOCCAL POLYSACCHARIDE SEROTYPE 4, PNEUMOCOCCAL POLYSACCHARIDE SEROTYPE 6B, PNEUMOCOCCAL POLYSACCHARIDE SEROTYPE 9V, PNEUMOCOCCAL POLYSACCHARIDE SEROTYPE 14, PNEUMOCOCCAL POLYSACCHARIDE SEROTYPE 18C, PNEUMOCOCCAL POLYSACCHARIDE SEROTYPE 19F, PNEUMOCOCCAL POLYSACCHARIDE SEROTYPE 23F, PNEUMOCOCCAL POLYSACCHARIDE SEROTYPE 33F, PNEUMOCOCCAL POLYSACCHARIDE SEROTYPE 8, PNEUMOCOCCAL POLYSACCHARIDE SEROTYPE 22F, PNEUMOCOCCAL POLYSACCHARIDE SEROTYPE 20, PNEUMOCOCCAL POLYSACCHARIDE SEROTYPE 19A, PNEUMOCOCCAL POLYSACCHARIDE SEROTYPE 17F, PNEUMOCOCCAL POLYSACCHARIDE SEROTYPE 15B, PNEUMOCOCCAL POLYSACCHARIDE SEROTYPE 12F, PNEUMOCOCCAL POLYSACCHARIDE SEROTYPE 11A, PNEUMOCOCCAL POLYSACCHARIDE SEROTYPE 9N, PNEUMOCOCCAL POLYSACCHARIDE SEROTYPE 7F, PNEUMOCOCCAL POLYSACCHARIDE SEROTYPE 5, PNEUMOCOCCAL POLYSACCHARIDE SEROTYPE 3, PNEUMOCOCCAL POLYSACCHARIDE SEROTYPE 2, PNEUMOCOCCAL POLYSACCHARIDE SEROTYPE 1, PNEUMOCOCCAL POLYSACCHARIDE SEROTYPE 10A, PNEUMOCOCCAL POLYSACCHARIDE VACCINE (23 VALENT)] (S - Pneumococcal immunisation - Not applicable - [n/a - 1{DF} - Intramuscular use])",Not reported,"<a target=""_blank"" href=""https://dap.ema.europa.eu/xmlpserver/PHV%20DAP/Reports/ICSR.xdo?_xpf=&_xt=form&SR_ID=10016611814&_xpt=1&_xf=pdf"">ICSR</a>"
EU-EC-10016599870,Spontaneous,2024-01-10 00:00:00,Non Healthcare Professional,European Economic Area,Not available,65-85 Years,Elderly,No,Male,"Chills (2d - Recovered/Resolved - ),<BR><BR>Halo vision (n/a - Not Recovered/Not Resolved - ),<BR><BR>Headache (n/a - Recovering/Resolving - ),<BR><BR>Injection site pain (n/a - Recovering/Resolving - ),<BR><BR>Myalgia (3d - Recovered/Resolved - ),<BR><BR>Pyrexia (3d - Recovered/Resolved - ),<BR><BR>Vitreous detachment (n/a - Not Recovered/Not Resolved - ),<BR><BR>Vitreous floaters (n/a - Not Recovered/Not Resolved - )","COMIRNATY ORIGINAL/OMICRON BA.1 [TOZINAMERAN, RILTOZINAMERAN] (S - COVID-19 immunisation - Not applicable - [n/a - 1{DF} - n/a])",Not reported,"<a target=""_blank"" href=""https://dap.ema.europa.eu/xmlpserver/PHV%20DAP/Reports/ICSR.xdo?_xpf=&_xt=form&SR_ID=10016599870&_xpt=1&_xf=pdf"">ICSR</a>"
EU-EC-10016601715,Spontaneous,2024-01-10 00:00:00,Healthcare Professional,European Economic Area,Not available,18-64 Years,Not Specified,No,Female,"Injected limb mobility decreased (n/a - Not Recovered/Not Resolved - ),<BR><BR>Vaccination site pain (n/a - Not Recovered/Not Resolved - )","COMIRNATY ORIGINAL/OMICRON BA.1 [TOZINAMERAN, RILTOZINAMERAN] (S - n/a - n/a - [n/a - n/a - n/a])",Not reported,"<a target=""_blank"" href=""https://dap.ema.europa.eu/xmlpserver/PHV%20DAP/Reports/ICSR.xdo?_xpf=&_xt=form&SR_ID=10016601715&_xpt=1&_xf=pdf"">ICSR</a>"
EU-EC-10016604029,Spontaneous,2024-01-10 00:00:00,Non Healthcare Professional,European Economic Area,Not available,18-64 Years,Not Specified,No,Male,"Condition aggravated (n/a - Unknown - ),<BR><BR>Fall (n/a - Unknown - )","COMIRNATY ORIGINAL/OMICRON BA.1 [TOZINAMERAN, RILTOZINAMERAN] (S - COVID-19 immunisation - Not applicable - [1d - .3mL - n/a])",Not reported,"<a target=""_blank"" href=""https://dap.ema.europa.eu/xmlpserver/PHV%20DAP/Reports/ICSR.xdo?_xpf=&_xt=form&SR_ID=10016604029&_xpt=1&_xf=pdf"">ICSR</a>"
EU-EC-10016592955,Spontaneous,2024-01-09 00:00:00,Non Healthcare Professional,Non European Economic Area,Not available,18-64 Years,Not Specified,No,Male,"Malaise (n/a - Recovered/Resolved - Life Threatening, Caused/Prolonged Hospitalisation, Other Medically Important Condition),<BR><BR>Pyrexia (n/a - Recovered/Resolved - Life Threatening, Caused/Prolonged Hospitalisation, Other Medically Important Condition)","COMIRNATY ORIGINAL/OMICRON BA.1 [TOZINAMERAN, RILTOZINAMERAN] (S - COVID-19 immunisation - Not applicable - [1d - n/a - n/a])",Not reported,"<a target=""_blank"" href=""https://dap.ema.europa.eu/xmlpserver/PHV%20DAP/Reports/ICSR.xdo?_xpf=&_xt=form&SR_ID=10016592955&_xpt=1&_xf=pdf"">ICSR</a>"
EU-EC-10016595023,Spontaneous,2024-01-09 00:00:00,Non Healthcare Professional,European Economic Area,Not available,18-64 Years,Not Specified,No,Female,Heavy menstrual bleeding (n/a - Recovering/Resolving - ),"COMIRNATY ORIGINAL/OMICRON BA.1 [TOZINAMERAN, RILTOZINAMERAN] (S - n/a - n/a - [n/a - n/a - n/a])",Not reported,"<a target=""_blank"" href=""https://dap.ema.europa.eu/xmlpserver/PHV%20DAP/Reports/ICSR.xdo?_xpf=&_xt=form&SR_ID=10016595023&_xpt=1&_xf=pdf"">ICSR</a>"
EU-EC-10016595328,Spontaneous,2024-01-09 00:00:00,Healthcare Professional,European Economic Area,Not available,Not Specified,Not Specified,No,Female,"Arthralgia (n/a - Not Recovered/Not Resolved - ),<BR><BR>Bursitis (n/a - Not Recovered/Not Resolved - ),<BR><BR>Pain in extremity (n/a - Not Recovered/Not Resolved - )","COMIRNATY ORIGINAL/OMICRON BA.1 [TOZINAMERAN, RILTOZINAMERAN] (S - n/a - n/a - [n/a - n/a - n/a]),<BR><BR>COMIRNATY [TOZINAMERAN] (S - n/a - n/a - [n/a - n/a - n/a])","AZOPT [BRINZOLAMIDE] (C - n/a - n/a - [n/a - n/a - n/a]),<BR><BR>[COLECALCIFEROL, CALCIUM, COLECALCIFEROL, CALCIUM CARBONATE] (C - n/a - n/a - [n/a - n/a - n/a]),<BR><BR>[LEVOTHYROXINE, LEVOTHYROXINE SODIUM] (C - n/a - n/a - [n/a - n/a - n/a]),<BR><BR>[PREDNISOLONE] (C - n/a - n/a - [n/a - n/a - n/a]),<BR><BR>[TIMOLOL MALEATE, LATANOPROST] (C - n/a - n/a - [n/a - n/a - n/a])","<a target=""_blank"" href=""https://dap.ema.europa.eu/xmlpserver/PHV%20DAP/Reports/ICSR.xdo?_xpf=&_xt=form&SR_ID=10016595328&_xpt=1&_xf=pdf"">ICSR</a>"
EU-EC-10016595494,Spontaneous,2024-01-09 00:00:00,Non Healthcare Professional,European Economic Area,Not available,65-85 Years,Not Specified,No,Female,"Motor dysfunction (n/a - Not Recovered/Not Resolved - ),<BR><BR>Vaccination site pain (n/a - Not Recovered/Not Resolved - )","COMIRNATY ORIGINAL/OMICRON BA.1 [TOZINAMERAN, RILTOZINAMERAN] (S - n/a - n/a - [n/a - n/a - n/a])",Not reported,"<a target=""_blank"" href=""https://dap.ema.europa.eu/xmlpserver/PHV%20DAP/Reports/ICSR.xdo?_xpf=&_xt=form&SR_ID=10016595494&_xpt=1&_xf=pdf"">ICSR</a>"
EU-EC-10016595620,Spontaneous,2024-01-09 00:00:00,Healthcare Professional,European Economic Area,Not available,18-64 Years,Not Specified,No,Female,"Motor dysfunction (n/a - Not Recovered/Not Resolved - ),<BR><BR>Myalgia (n/a - Not Recovered/Not Resolved - )","COMIRNATY ORIGINAL/OMICRON BA.1 [TOZINAMERAN, RILTOZINAMERAN] (S - n/a - n/a - [n/a - n/a - n/a])","[DESOGESTREL] (C - n/a - n/a - [n/a - n/a - Oral use]),<BR><BR>[HYDROXYCHLOROQUINE SULFATE] (C - n/a - n/a - [n/a - n/a - Oral use])","<a target=""_blank"" href=""https://dap.ema.europa.eu/xmlpserver/PHV%20DAP/Reports/ICSR.xdo?_xpf=&_xt=form&SR_ID=10016595620&_xpt=1&_xf=pdf"">ICSR</a>"
EU-EC-10016595652,Spontaneous,2024-01-09 00:00:00,Non Healthcare Professional,European Economic Area,Not available,65-85 Years,Not Specified,No,Female,Limb immobilisation (n/a - Not Recovered/Not Resolved - ),"COMIRNATY ORIGINAL/OMICRON BA.1 [TOZINAMERAN, RILTOZINAMERAN] (S - n/a - Not applicable - [n/a - n/a - n/a])",Not reported,"<a target=""_blank"" href=""https://dap.ema.europa.eu/xmlpserver/PHV%20DAP/Reports/ICSR.xdo?_xpf=&_xt=form&SR_ID=10016595652&_xpt=1&_xf=pdf"">ICSR</a>"
EU-EC-10016595657,Spontaneous,2024-01-09 00:00:00,Non Healthcare Professional,European Economic Area,Not available,18-64 Years,Not Specified,No,Male,Vaccination site pain (n/a - Not Recovered/Not Resolved - ),"COMIRNATY ORIGINAL/OMICRON BA.1 [TOZINAMERAN, RILTOZINAMERAN] (S - n/a - n/a - [n/a - n/a - n/a])",Not reported,"<a target=""_blank"" href=""https://dap.ema.europa.eu/xmlpserver/PHV%20DAP/Reports/ICSR.xdo?_xpf=&_xt=form&SR_ID=10016595657&_xpt=1&_xf=pdf"">ICSR</a>"
EU-EC-10016595829,Spontaneous,2024-01-09 00:00:00,Healthcare Professional,European Economic Area,Not available,18-64 Years,Not Specified,No,Female,"Fatigue (2d - Recovered/Resolved - ),<BR><BR>Lymphadenopathy (3d - Recovered/Resolved - ),<BR><BR>Malaise (2d - Recovered/Resolved - ),<BR><BR>Vaccination site pain (2d - Recovered/Resolved - )","COMIRNATY ORIGINAL/OMICRON BA.1 [TOZINAMERAN, RILTOZINAMERAN] (S - n/a - n/a - [n/a - n/a - n/a])",Not reported,"<a target=""_blank"" href=""https://dap.ema.europa.eu/xmlpserver/PHV%20DAP/Reports/ICSR.xdo?_xpf=&_xt=form&SR_ID=10016595829&_xpt=1&_xf=pdf"">ICSR</a>"
EU-EC-10016586225,Spontaneous,2024-01-08 00:00:00,Non Healthcare Professional,European Economic Area,Not available,18-64 Years,Not Specified,No,Female,"Lymphadenopathy (n/a - Recovering/Resolving - ),<BR><BR>Malaise (1d - Recovered/Resolved - ),<BR><BR>Myalgia (4d - Recovered/Resolved - ),<BR><BR>Pyrexia (1d - Recovered/Resolved - ),<BR><BR>Vaccination site erythema (1d - Recovered/Resolved - ),<BR><BR>Vaccination site swelling (n/a - Recovering/Resolving - )","COMIRNATY ORIGINAL/OMICRON BA.1 [TOZINAMERAN, RILTOZINAMERAN] (S - n/a - n/a - [n/a - n/a - n/a])","NOVORAPID [INSULIN ASPART] (C - n/a - n/a - [n/a - n/a - n/a]),<BR><BR>[CETIRIZINE DIHYDROCHLORIDE] (C - n/a - n/a - [n/a - 10mg - Oral use]),<BR><BR>[CYANOCOBALAMIN] (C - n/a - n/a - [n/a - 1mg - Oral use]),<BR><BR>[DRIED FERROUS SULFATE, FERROUS SULFATE] (C - n/a - n/a - [n/a - 100mg - Oral use]),<BR><BR>[HYDROCHLOROTHIAZIDE, LOSARTAN, LOSARTAN POTASSIUM, HYDROCHLOROTHIAZIDE] (C - n/a - n/a - [n/a - 1{DF} - Oral use]),<BR><BR>[LAMOTRIGINE] (C - n/a - n/a - [n/a - 100mg - Oral use]),<BR><BR>[MACROGOL 400, OMEPRAZOLE] (C - n/a - n/a - [n/a - n/a - Oral use])","<a target=""_blank"" href=""https://dap.ema.europa.eu/xmlpserver/PHV%20DAP/Reports/ICSR.xdo?_xpf=&_xt=form&SR_ID=10016586225&_xpt=1&_xf=pdf"">ICSR</a>"
EU-EC-10016586991,Spontaneous,2024-01-08 00:00:00,Non Healthcare Professional,European Economic Area,Not available,18-64 Years,Not Specified,No,Female,Vaccination site pain (n/a - Not Recovered/Not Resolved - ),"COMIRNATY ORIGINAL/OMICRON BA.1 [TOZINAMERAN, RILTOZINAMERAN] (S - n/a - n/a - [n/a - n/a - n/a])",Not reported,"<a target=""_blank"" href=""https://dap.ema.europa.eu/xmlpserver/PHV%20DAP/Reports/ICSR.xdo?_xpf=&_xt=form&SR_ID=10016586991&_xpt=1&_xf=pdf"">ICSR</a>"
EU-EC-10016587340,Spontaneous,2024-01-08 00:00:00,Non Healthcare Professional,European Economic Area,Not available,65-85 Years,Not Specified,No,Female,"Abdominal pain (12d - Recovered/Resolved - ),<BR><BR>Fatigue (n/a - Recovered/Resolved With Sequelae - ),<BR><BR>Pyrexia (1d - Recovered/Resolved - )","COMIRNATY ORIGINAL/OMICRON BA.1 [TOZINAMERAN, RILTOZINAMERAN] (S - n/a - n/a - [n/a - n/a - n/a])",Not reported,"<a target=""_blank"" href=""https://dap.ema.europa.eu/xmlpserver/PHV%20DAP/Reports/ICSR.xdo?_xpf=&_xt=form&SR_ID=10016587340&_xpt=1&_xf=pdf"">ICSR</a>"
EU-EC-10016587851,Spontaneous,2024-01-08 00:00:00,Non Healthcare Professional,European Economic Area,Not available,18-64 Years,Not Specified,No,Male,Vaccination site pain (n/a - Not Recovered/Not Resolved - ),"COMIRNATY ORIGINAL/OMICRON BA.1 [TOZINAMERAN, RILTOZINAMERAN] (S - n/a - Not applicable - [n/a - n/a - n/a])",Not reported,"<a target=""_blank"" href=""https://dap.ema.europa.eu/xmlpserver/PHV%20DAP/Reports/ICSR.xdo?_xpf=&_xt=form&SR_ID=10016587851&_xpt=1&_xf=pdf"">ICSR</a>"
EU-EC-10016588185,Spontaneous,2024-01-08 00:00:00,Healthcare Professional,European Economic Area,Not available,65-85 Years,Elderly,No,Female,Vaccination site reaction (n/a - Not Recovered/Not Resolved - ),"COMIRNATY ORIGINAL/OMICRON BA.1 [TOZINAMERAN, RILTOZINAMERAN] (S - COVID-19 immunisation - Drug withdrawn - [1d - 1{DF} - Intramuscular use])",Not reported,"<a target=""_blank"" href=""https://dap.ema.europa.eu/xmlpserver/PHV%20DAP/Reports/ICSR.xdo?_xpf=&_xt=form&SR_ID=10016588185&_xpt=1&_xf=pdf"">ICSR</a>"
EU-EC-10016589041,Spontaneous,2024-01-08 00:00:00,Non Healthcare Professional,European Economic Area,Not available,18-64 Years,Not Specified,No,Female,Lymphadenopathy (n/a - Recovering/Resolving - ),"COMIRNATY ORIGINAL/OMICRON BA.1 [TOZINAMERAN, RILTOZINAMERAN] (S - n/a - n/a - [n/a - n/a - n/a])",Not reported,"<a target=""_blank"" href=""https://dap.ema.europa.eu/xmlpserver/PHV%20DAP/Reports/ICSR.xdo?_xpf=&_xt=form&SR_ID=10016589041&_xpt=1&_xf=pdf"">ICSR</a>"
EU-EC-10016589173,Spontaneous,2024-01-08 00:00:00,Non Healthcare Professional,European Economic Area,Not available,65-85 Years,Not Specified,No,Male,Arthralgia (n/a - Not Recovered/Not Resolved - ),"COMIRNATY ORIGINAL/OMICRON BA.1 [TOZINAMERAN, RILTOZINAMERAN] (S - n/a - n/a - [n/a - n/a - n/a])",Not reported,"<a target=""_blank"" href=""https://dap.ema.europa.eu/xmlpserver/PHV%20DAP/Reports/ICSR.xdo?_xpf=&_xt=form&SR_ID=10016589173&_xpt=1&_xf=pdf"">ICSR</a>"
EU-EC-10016579215,Spontaneous,2024-01-05 00:00:00,Non Healthcare Professional,Non European Economic Area,Not available,18-64 Years,Not Specified,No,Female,"Chills (n/a - Unknown - Other Medically Important Condition),<BR><BR>Diarrhoea (4d - Recovered/Resolved - Other Medically Important Condition),<BR><BR>Dizziness (n/a - Not Recovered/Not Resolved - Other Medically Important Condition)","COMIRNATY ORIGINAL/OMICRON BA.1 [TOZINAMERAN, RILTOZINAMERAN] (S - COVID-19 immunisation - Not applicable - [1d - n/a - n/a])",[RAMIPRIL] (C - Blood pressure increased - n/a - [n/a - n/a - n/a]),"<a target=""_blank"" href=""https://dap.ema.europa.eu/xmlpserver/PHV%20DAP/Reports/ICSR.xdo?_xpf=&_xt=form&SR_ID=10016579215&_xpt=1&_xf=pdf"">ICSR</a>"
EU-EC-10016580433,Spontaneous,2024-01-05 00:00:00,Non Healthcare Professional,Non European Economic Area,Not available,18-64 Years,Not Specified,No,Female,"Arthralgia (n/a - Recovered/Resolved - Other Medically Important Condition),<BR><BR>Fatigue (n/a - Recovered/Resolved - Other Medically Important Condition),<BR><BR>Headache (n/a - Recovered/Resolved - Other Medically Important Condition),<BR><BR>Myalgia (n/a - Recovered/Resolved - Other Medically Important Condition),<BR><BR>Vaccination site pain (n/a - Unknown - Other Medically Important Condition)","COMIRNATY ORIGINAL/OMICRON BA.1 [TOZINAMERAN, RILTOZINAMERAN] (S - COVID-19 immunisation - Not applicable - [n/a - n/a - n/a])","[A/HONG KONG/4801/2014 (H3N2)-LIKE STRAIN (A/HONG KONG/4801/2014, X-263B), B/BRISBANE/60/2008-LIKE STRAIN (B/BRISBANE/60/2008, WILD TYPE), A/CALIFORNIA/7/2009 (H1N1)PDM09-DERIVED STRAIN USED (NYMC X-181), A/HONG KONG/4801/2014 (H3N2)-LIKE STRAIN (A/HONG KONG/4801/2014, X-263B), B/BRISBANE/60/2008-LIKE STRAIN (B/BRISBANE/60/2008, WILD TYPE), A/MICHIGAN/45/2015 (H1N1)PDM09-LIKE STRAIN (A/SINGAPORE/GP1908/2015, IVR-180), INFLUENZA VACCINE] (C - Immunisation - n/a - [n/a - n/a - n/a]),<BR><BR>[ALUMINIUM CHLORIDE] (C - Hyperhidrosis - n/a - [n/a - n/a - n/a]),<BR><BR>[ASCORBIC ACID, CALCIUM GLUBIONATE, CALCIUM CARBONATE, CALCIUM, CALCIUM GLUBIONATE, CALCIUM CARBONATE, COLECALCIFEROL, CALCIUM] (C - Prophylaxis - n/a - [n/a - n/a - n/a]),<BR><BR>[CYANOCOBALAMIN] (C - Prophylaxis - n/a - [n/a - n/a - n/a]),<BR><BR>[DOCUSATE] (C - n/a - n/a - [n/a - n/a - n/a]),<BR><BR>[ETHINYLESTRADIOL, GESTODENE] (C - Heavy menstrual bleeding - n/a - [n/a - n/a - n/a]),<BR><BR>[FLUTICASONE] (C - Rhinitis allergic - n/a - [n/a - n/a - n/a]),<BR><BR>[LACTULOSE] (C - n/a - n/a - [n/a - n/a - n/a]),<BR><BR>[LIDOCAINE, LIDOCAINE PH. EUR.] (C - n/a - n/a - [n/a - n/a - n/a]),<BR><BR>[LIQUID PARAFFIN] (C - n/a - n/a - [n/a - n/a - n/a]),<BR><BR>[PARACETAMOL] (C - Headache - n/a - [n/a - n/a - n/a]),<BR><BR>[POTASSIUM HYDROGEN CARBONATE, SODIUM ALGINATE] (C - n/a - n/a - [n/a - n/a - n/a]),<BR><BR>[POTASSIUM, SODIUM, MACROGOL 3350, CHLORIDE ION, HYDROGEN CARBONATE, SODIUM HYDROGEN CARBONATE, POTASSIUM CHLORIDE, SODIUM CHLORIDE, MACROGOL 3350] (C - n/a - n/a - [n/a - n/a - n/a]),<BR><BR>[SODIUM HYALURONATE] (C - Blepharitis - n/a - [n/a - n/a - n/a]),<BR><BR>[TRANEXAMIC ACID] (C - Heavy menstrual bleeding - n/a - [n/a - n/a - n/a]),<BR><BR>[VITAMIN D] (C - Prophylaxis - n/a - [n/a - n/a - n/a])","<a target=""_blank"" href=""https://dap.ema.europa.eu/xmlpserver/PHV%20DAP/Reports/ICSR.xdo?_xpf=&_xt=form&SR_ID=10016580433&_xpt=1&_xf=pdf"">ICSR</a>"
EU-EC-10016572213,Spontaneous,2024-01-04 00:00:00,Non Healthcare Professional,European Economic Area,Not available,18-64 Years,Not Specified,No,Female,"Menstrual clots (n/a - Not Recovered/Not Resolved - ),<BR><BR>Oligomenorrhoea (n/a - Not Recovered/Not Resolved - )","COMIRNATY ORIGINAL/OMICRON BA.1 [TOZINAMERAN, RILTOZINAMERAN] (S - n/a - Not applicable - [n/a - n/a - n/a])",Not reported,"<a target=""_blank"" href=""https://dap.ema.europa.eu/xmlpserver/PHV%20DAP/Reports/ICSR.xdo?_xpf=&_xt=form&SR_ID=10016572213&_xpt=1&_xf=pdf"">ICSR</a>"
EU-EC-10016572733,Spontaneous,2024-01-04 00:00:00,Non Healthcare Professional,European Economic Area,Not available,65-85 Years,Not Specified,No,Male,"Vaccination site erythema (n/a - Not Recovered/Not Resolved - ),<BR><BR>Vaccination site pruritus (n/a - Not Recovered/Not Resolved - ),<BR><BR>Vaccination site warmth (n/a - Not Recovered/Not Resolved - )","COMIRNATY ORIGINAL/OMICRON BA.1 [TOZINAMERAN, RILTOZINAMERAN] (S - n/a - n/a - [n/a - n/a - n/a])",Not reported,"<a target=""_blank"" href=""https://dap.ema.europa.eu/xmlpserver/PHV%20DAP/Reports/ICSR.xdo?_xpf=&_xt=form&SR_ID=10016572733&_xpt=1&_xf=pdf"">ICSR</a>"
EU-EC-10016572837,Spontaneous,2024-01-04 00:00:00,Non Healthcare Professional,European Economic Area,Not available,65-85 Years,Not Specified,No,Female,"Myalgia (n/a - Not Recovered/Not Resolved - ),<BR><BR>Product administered at inappropriate site (n/a - Not Recovered/Not Resolved - )","COMIRNATY ORIGINAL/OMICRON BA.1 [TOZINAMERAN, RILTOZINAMERAN] (S - n/a - n/a - [n/a - n/a - n/a])",Not reported,"<a target=""_blank"" href=""https://dap.ema.europa.eu/xmlpserver/PHV%20DAP/Reports/ICSR.xdo?_xpf=&_xt=form&SR_ID=10016572837&_xpt=1&_xf=pdf"">ICSR</a>"
EU-EC-10016573036,Spontaneous,2024-01-04 00:00:00,Healthcare Professional,European Economic Area,Not available,More than 85 Years,Not Specified,No,Female,Herpes zoster (n/a - Not Recovered/Not Resolved - ),"COMIRNATY ORIGINAL/OMICRON BA.1 [TOZINAMERAN, RILTOZINAMERAN] (S - COVID-19 immunisation - Not applicable - [n/a - 1{DF} - n/a])",Not reported,"<a target=""_blank"" href=""https://dap.ema.europa.eu/xmlpserver/PHV%20DAP/Reports/ICSR.xdo?_xpf=&_xt=form&SR_ID=10016573036&_xpt=1&_xf=pdf"">ICSR</a>"
EU-EC-10016573762,Spontaneous,2024-01-04 00:00:00,Non Healthcare Professional,Non European Economic Area,Not available,More than 85 Years,Not Specified,No,Male,"Fall (n/a - Unknown - Other Medically Important Condition),<BR><BR>Flat affect (n/a - Not Recovered/Not Resolved - Other Medically Important Condition),<BR><BR>Syncope (n/a - Unknown - Other Medically Important Condition)","COMIRNATY ORIGINAL/OMICRON BA.1 [TOZINAMERAN, RILTOZINAMERAN] (S - COVID-19 immunisation - Not applicable - [1d - n/a - n/a])",Not reported,"<a target=""_blank"" href=""https://dap.ema.europa.eu/xmlpserver/PHV%20DAP/Reports/ICSR.xdo?_xpf=&_xt=form&SR_ID=10016573762&_xpt=1&_xf=pdf"">ICSR</a>"
EU-EC-10016573881,Spontaneous,2024-01-04 00:00:00,Non Healthcare Professional,European Economic Area,Not available,65-85 Years,Not Specified,No,Male,"Muscular weakness (n/a - Not Recovered/Not Resolved - ),<BR><BR>Myalgia (n/a - Not Recovered/Not Resolved - )","COMIRNATY ORIGINAL/OMICRON BA.1 [TOZINAMERAN, RILTOZINAMERAN] (S - n/a - n/a - [n/a - n/a - n/a])",Not reported,"<a target=""_blank"" href=""https://dap.ema.europa.eu/xmlpserver/PHV%20DAP/Reports/ICSR.xdo?_xpf=&_xt=form&SR_ID=10016573881&_xpt=1&_xf=pdf"">ICSR</a>"
EU-EC-10016573894,Spontaneous,2024-01-04 00:00:00,Healthcare Professional,European Economic Area,Not available,18-64 Years,Adult,No,Female,Chronic obstructive pulmonary disease (n/a - Not Recovered/Not Resolved - Caused/Prolonged Hospitalisation),"COMIRNATY ORIGINAL/OMICRON BA.1 [TOZINAMERAN, RILTOZINAMERAN] (S - COVID-19 immunisation - n/a - [n/a - 4{DF} - n/a]),<BR><BR>[B/PHUKET/3073/2013-LIKE VIRUS (B/PHUKET/3073/2013, WILD TYPE), A/MICHIGAN/45/2015 (H1N1)PDM09-LIKE STRAIN (A/MICHIGAN/45/2015, NYMC X-275), B/COLORADO/06/2017-LIKE VIRUS (B/VICTORIA/2/87 LINEAGE) (B/MARYLAND/15/2016, NYMC BX-69A), A/SINGAPORE/INFIMH-16-0019/2016 (H3N2)-LIKE STRAIN (A/SINGAPORE/INFIMH-16-0019/2016, IVR-186), B/PHUKET/3073/2013-LIKE VIRUS (B/PHUKET/3073/2013, WILD TYPE), A/VICTORIA/2570/2019 (H1N1)PDM09-LIKE STRAIN (A/VICTORIA/2570/2019, IVR-215), INFLUENZA VIRUS A/DARWIN/9/2021 IVR-228 (H3N2), B/AUSTRIA/1359417/2021 LIKE STRAIN-(B/MICHIGAN/01/2021, WILD TYPE), B/PHUKET/3073/2013-LIKE VIRUS (B/PHUKET/3073/2013, WILD TYPE), A/VICTORIA/2570/2019 (H1N1)PDM09-LIKE STRAIN (A/VICTORIA/2570/2019, IVR-215), INFLUENZA VIRUS A/DARWIN/9/2021 SAN-010 (H3N2), INFLUENZA VIRUS B/AUSTRIA/1359417/2021 HAEMAGGLUTININ ANTIGEN, B/PHUKET/3073/2013-LIKE VIRUS (B/PHUKET/3073/2013, WILD TYPE), A/VICTORIA/2570/2019 (H1N1)PDM09-LIKE STRAIN (A/VICTORIA/2570/2019, IVR-215), INFLUENZA VIRUS A/DARWIN/9/2021 SAN-010 (H3N2), INFLUENZA VIRUS B/MICHIGAN/01/2021, B/PHUKET/3073/2013-LIKE VIRUS (B/PHUKET/3073/2013, WILD TYPE), A/VICTORIA/2570/2019 (H1N1)PDM09-LIKE STRAIN (A/VICTORIA/2570/2019, IVR-215), INFLUENZA VIRUS B/MICHIGAN/01/2021, INFLUENZA VIRUS A/DARWIN/9/2021 IVR-228 (H3N2), B/PHUKET/3073/2013-LIKE VIRUS (B/PHUKET/3073/2013, WILD TYPE), B/WASHINGTON/02/2019 - LIKE VIRUS (B/WASHINGTON/02/2019, WILD TYPE), A/VICTORIA/2570/2019 (H1N1)PDM09-LIKE STRAIN (A/VICTORIA/2570/2019, IVR-215), INFLUENZA A VIRUS, A/CAMBODIA/E0826360/2020 (H3N2) - LIKE STRAIN (A/TASMANIA/503/2020, IVR-221), INACTIVATED, B/PHUKET/3073/2013-LIKE VIRUS (B/PHUKET/3073/2013, WILD TYPE), INFLUENZA VIRUS A/DARWIN/9/2021 SAN-010 (H3N2), B/AUSTRIA/1359417/2021 LIKE STRAIN-(B/MICHIGAN/01/2021, WILD TYPE), A/VICTORIA/4897/2022 (H1N1)PDM09-LIKE STRAIN (A/VICTORIA/4897/2022, IVR-238), B/PHUKET/3073/2013-LIKE VIRUS (B/PHUKET/3073/2013, WILD TYPE), INFLUENZA VIRUS A/DARWIN/9/2021 SAN-010 (H3N2), B/AUSTRIA/1359417/2021 LIKE STRAIN-(B/MICHIGAN/01/2021, WILD TYPE), INFLUENZA A/VICTORIA/4897/2022 IVR-238 (H1N1), INACTIVATED, B/PHUKET/3073/2013-LIKE VIRUS (B/PHUKET/3073/2013, WILD TYPE), INFLUENZA VIRUS B/MICHIGAN/01/2021, INFLUENZA VIRUS A/DARWIN/9/2021 IVR-228 (H3N2), INFLUENZA A/VICTORIA/4897/2022 IVR-238 (H1N1), INACTIVATED] (S - Immunisation - n/a - [n/a - n/a - n/a])",Not reported,"<a target=""_blank"" href=""https://dap.ema.europa.eu/xmlpserver/PHV%20DAP/Reports/ICSR.xdo?_xpf=&_xt=form&SR_ID=10016573894&_xpt=1&_xf=pdf"">ICSR</a>"
EU-EC-10016565561,Spontaneous,2024-01-03 00:00:00,Non Healthcare Professional,European Economic Area,Not available,65-85 Years,Not Specified,No,Male,"Chest discomfort (n/a - Recovering/Resolving - ),<BR><BR>Pyrexia (n/a - Recovering/Resolving - ),<BR><BR>Urine abnormality (n/a - Recovering/Resolving - )","COMIRNATY ORIGINAL/OMICRON BA.1 [TOZINAMERAN, RILTOZINAMERAN] (S - n/a - n/a - [n/a - n/a - n/a])",Not reported,"<a target=""_blank"" href=""https://dap.ema.europa.eu/xmlpserver/PHV%20DAP/Reports/ICSR.xdo?_xpf=&_xt=form&SR_ID=10016565561&_xpt=1&_xf=pdf"">ICSR</a>"
EU-EC-10016565732,Spontaneous,2024-01-03 00:00:00,Non Healthcare Professional,European Economic Area,Not available,18-64 Years,Not Specified,No,Female,"Night blindness (n/a - Not Recovered/Not Resolved - ),<BR><BR>Photophobia (n/a - Not Recovered/Not Resolved - ),<BR><BR>Vision blurred (n/a - Not Recovered/Not Resolved - ),<BR><BR>Visual impairment (n/a - Not Recovered/Not Resolved - )","COMIRNATY ORIGINAL/OMICRON BA.1 [TOZINAMERAN, RILTOZINAMERAN] (S - n/a - Not applicable - [n/a - n/a - n/a])",Not reported,"<a target=""_blank"" href=""https://dap.ema.europa.eu/xmlpserver/PHV%20DAP/Reports/ICSR.xdo?_xpf=&_xt=form&SR_ID=10016565732&_xpt=1&_xf=pdf"">ICSR</a>"
EU-EC-10016565840,Spontaneous,2024-01-03 00:00:00,Healthcare Professional,European Economic Area,Not available,18-64 Years,Not Specified,No,Female,"Fatigue (23d - Recovered/Resolved - ),<BR><BR>Headache (24d - Recovered/Resolved - )","COMIRNATY ORIGINAL/OMICRON BA.1 [TOZINAMERAN, RILTOZINAMERAN] (S - n/a - n/a - [n/a - n/a - n/a])",Not reported,"<a target=""_blank"" href=""https://dap.ema.europa.eu/xmlpserver/PHV%20DAP/Reports/ICSR.xdo?_xpf=&_xt=form&SR_ID=10016565840&_xpt=1&_xf=pdf"">ICSR</a>"
EU-EC-10016565930,Spontaneous,2024-01-03 00:00:00,Non Healthcare Professional,European Economic Area,Not available,18-64 Years,Not Specified,No,Male,"Fatigue (n/a - Not Recovered/Not Resolved - ),<BR><BR>Nasopharyngitis (n/a - Not Recovered/Not Resolved - )","COMIRNATY ORIGINAL/OMICRON BA.1 [TOZINAMERAN, RILTOZINAMERAN] (S - n/a - n/a - [n/a - n/a - n/a])",Not reported,"<a target=""_blank"" href=""https://dap.ema.europa.eu/xmlpserver/PHV%20DAP/Reports/ICSR.xdo?_xpf=&_xt=form&SR_ID=10016565930&_xpt=1&_xf=pdf"">ICSR</a>"
EU-EC-10016566666,Spontaneous,2024-01-03 00:00:00,Non Healthcare Professional,European Economic Area,Not available,18-64 Years,Not Specified,No,Female,"Breast pain (n/a - Not Recovered/Not Resolved - ),<BR><BR>Breast swelling (n/a - Not Recovered/Not Resolved - )","COMIRNATY ORIGINAL/OMICRON BA.1 [TOZINAMERAN, RILTOZINAMERAN] (S - n/a - n/a - [n/a - n/a - n/a])","[LEVOTHYROXINE, LEVOTHYROXINE SODIUM] (C - n/a - n/a - [320d - n/a - Oral use])","<a target=""_blank"" href=""https://dap.ema.europa.eu/xmlpserver/PHV%20DAP/Reports/ICSR.xdo?_xpf=&_xt=form&SR_ID=10016566666&_xpt=1&_xf=pdf"">ICSR</a>"
EU-EC-10016566823,Spontaneous,2024-01-03 00:00:00,Non Healthcare Professional,European Economic Area,Not available,18-64 Years,Not Specified,No,Female,Heavy menstrual bleeding (n/a - Recovering/Resolving - ),"COMIRNATY ORIGINAL/OMICRON BA.1 [TOZINAMERAN, RILTOZINAMERAN] (S - n/a - n/a - [n/a - n/a - n/a])","[LEVONORGESTREL, LEVONORGESTREL MICRONISED] (C - n/a - n/a - [n/a - n/a - Intrauterine use])","<a target=""_blank"" href=""https://dap.ema.europa.eu/xmlpserver/PHV%20DAP/Reports/ICSR.xdo?_xpf=&_xt=form&SR_ID=10016566823&_xpt=1&_xf=pdf"">ICSR</a>"
EU-EC-10016566980,Spontaneous,2024-01-03 00:00:00,Non Healthcare Professional,Non European Economic Area,Not available,18-64 Years,Not Specified,No,Female,Skin lesion (n/a - Not Recovered/Not Resolved - Other Medically Important Condition),"COMIRNATY ORIGINAL/OMICRON BA.1 [TOZINAMERAN, RILTOZINAMERAN] (S - COVID-19 immunisation - Not applicable - [1d - n/a - n/a])",Not reported,"<a target=""_blank"" href=""https://dap.ema.europa.eu/xmlpserver/PHV%20DAP/Reports/ICSR.xdo?_xpf=&_xt=form&SR_ID=10016566980&_xpt=1&_xf=pdf"">ICSR</a>"
EU-EC-10016567084,Spontaneous,2024-01-03 00:00:00,Healthcare Professional,European Economic Area,Not available,65-85 Years,Not Specified,No,Female,"Laryngitis (12d - Recovered/Resolved - ),<BR><BR>Lymphadenopathy (4d - Recovered/Resolved - )","COMIRNATY ORIGINAL/OMICRON BA.1 [TOZINAMERAN, RILTOZINAMERAN] (S - n/a - Not applicable - [n/a - n/a - n/a])","[BISOPROLOL FUMARATE] (C - n/a - n/a - [n/a - n/a - Oral use]),<BR><BR>[GLUCOSAMINE, GLUCOSAMINE HYDROCHLORIDE] (C - n/a - n/a - [n/a - n/a - Oral use]),<BR><BR>[LEVOTHYROXINE, LEVOTHYROXINE SODIUM] (C - n/a - n/a - [n/a - n/a - Oral use]),<BR><BR>[LIOTHYRONINE SODIUM] (C - n/a - n/a - [n/a - n/a - Oral use])","<a target=""_blank"" href=""https://dap.ema.europa.eu/xmlpserver/PHV%20DAP/Reports/ICSR.xdo?_xpf=&_xt=form&SR_ID=10016567084&_xpt=1&_xf=pdf"">ICSR</a>"
EU-EC-10016567094,Spontaneous,2024-01-03 00:00:00,Non Healthcare Professional,European Economic Area,Not available,18-64 Years,Not Specified,No,Male,"Chills (n/a - Unknown - ),<BR><BR>Dizziness (n/a - Recovering/Resolving - )","COMIRNATY ORIGINAL/OMICRON BA.1 [TOZINAMERAN, RILTOZINAMERAN] (S - n/a - n/a - [n/a - n/a - n/a])","[ALFUZOSIN HYDROCHLORIDE] (C - n/a - n/a - [n/a - n/a - Oral use]),<BR><BR>[ENALAPRIL MALEATE] (C - n/a - n/a - [103d - n/a - Oral use]),<BR><BR>[FELODIPINE] (C - n/a - n/a - [n/a - n/a - n/a])","<a target=""_blank"" href=""https://dap.ema.europa.eu/xmlpserver/PHV%20DAP/Reports/ICSR.xdo?_xpf=&_xt=form&SR_ID=10016567094&_xpt=1&_xf=pdf"">ICSR</a>"
EU-EC-10016568757,Spontaneous,2024-01-03 00:00:00,Non Healthcare Professional,Non European Economic Area,Not available,18-64 Years,Not Specified,No,Female,"Asthenia (n/a - Unknown - ),<BR><BR>Fatigue (n/a - Unknown - ),<BR><BR>Heart rate increased (n/a - Unknown - ),<BR><BR>Hypertension (n/a - Unknown - ),<BR><BR>Hypoaesthesia (n/a - Unknown - ),<BR><BR>Muscle spasms (2d - Recovered/Resolved - Other Medically Important Condition),<BR><BR>Urinary tract infection bacterial (n/a - Unknown - )","COMIRNATY ORIGINAL/OMICRON BA.1 [TOZINAMERAN, RILTOZINAMERAN] (S - COVID-19 immunisation - Not applicable - [1d - n/a - n/a])",[INFLUENZA VIRUS] (C - Influenza immunisation - n/a - [1d - n/a - n/a]),"<a target=""_blank"" href=""https://dap.ema.europa.eu/xmlpserver/PHV%20DAP/Reports/ICSR.xdo?_xpf=&_xt=form&SR_ID=10016568757&_xpt=1&_xf=pdf"">ICSR</a>"
EU-EC-10016559040,Spontaneous,2024-01-02 00:00:00,Non Healthcare Professional,European Economic Area,Not available,18-64 Years,Not Specified,No,Female,"Arthralgia (n/a - Not Recovered/Not Resolved - ),<BR><BR>Myalgia (n/a - Not Recovered/Not Resolved - )","COMIRNATY ORIGINAL/OMICRON BA.1 [TOZINAMERAN, RILTOZINAMERAN] (S - COVID-19 immunisation - Not applicable - [n/a - 1{DF} - n/a])",Not reported,"<a target=""_blank"" href=""https://dap.ema.europa.eu/xmlpserver/PHV%20DAP/Reports/ICSR.xdo?_xpf=&_xt=form&SR_ID=10016559040&_xpt=1&_xf=pdf"">ICSR</a>"