﻿EU Local Number,Report Type,EV Gateway Receipt Date,Primary Source Qualification,Primary Source Country for Regulatory Purposes,Literature Reference,Patient Age Group,Patient Age Group (as per reporter),Parent Child Report,Patient Sex,Reaction List PT (Duration – Outcome - Seriousness Criteria),Suspect/interacting Drug List (Drug Char - Indication PT - Action taken - [Duration - Dose - Route]),Concomitant/Not Administered Drug List (Drug Char - Indication PT - Action taken - [Duration - Dose - Route]),ICSR Form
EU-EC-10017100990,Spontaneous,2024-04-01 00:00:00,Healthcare Professional,Non European Economic Area,Not available,Not Specified,Not Specified,No,Not Specified,Cerebrovascular accident (n/a - Recovered/Resolved - Other Medically Important Condition),"BIKTARVY [EMTRICITABINE, TENOFOVIR ALAFENAMIDE, BICTEGRAVIR] (S - HIV infection - Drug withdrawn - [n/a - 1{DF} - n/a]),<BR><BR>SPIKEVAX BIVALENT ORIGINAL/OMICRON BA.4-5 [ELASOMERAN, DAVESOMERAN] (S - COVID-19 prophylaxis - Unknown - [31d - 1{DF} - Intramuscular use - More in ICSR])",Not reported,"<a target=""_blank"" href=""https://dap.ema.europa.eu/xmlpserver/PHV%20DAP/Reports/ICSR.xdo?_xpf=&_xt=form&SR_ID=10017100990&_xpt=1&_xf=pdf"">ICSR</a>"
EU-EC-10017103864,Spontaneous,2024-04-01 00:00:00,Healthcare Professional,Non European Economic Area,Not available,18-64 Years,Not Specified,No,Male,Chest discomfort (n/a - Recovering/Resolving - Caused/Prolonged Hospitalisation),"SPIKEVAX BIVALENT ORIGINAL/OMICRON BA.4-5 [ELASOMERAN, DAVESOMERAN] (S - COVID-19 prophylaxis - Not applicable - [n/a - 1{DF} - Intramuscular use])",Not reported,"<a target=""_blank"" href=""https://dap.ema.europa.eu/xmlpserver/PHV%20DAP/Reports/ICSR.xdo?_xpf=&_xt=form&SR_ID=10017103864&_xpt=1&_xf=pdf"">ICSR</a>"
EU-EC-10017077002,Spontaneous,2024-03-27 00:00:00,Non Healthcare Professional,Non European Economic Area,Not available,65-85 Years,Not Specified,No,Female,"COVID-19 (n/a - Unknown - Other Medically Important Condition),<BR><BR>Drug ineffective (n/a - Unknown - Other Medically Important Condition),<BR><BR>Interchange of vaccine products (n/a - Unknown - Other Medically Important Condition)","SPIKEVAX BIVALENT ORIGINAL/OMICRON BA.4-5 [ELASOMERAN, DAVESOMERAN] (S - COVID-19 immunisation - Not applicable - [n/a - n/a - n/a]),<BR><BR>TOZINAMERAN [TOZINAMERAN] (S - COVID-19 immunisation - Not applicable - [1d - n/a - n/a]),<BR><BR>TOZINAMERAN, FAMTOZINAMERAN [TOZINAMERAN, FAMTOZINAMERAN] (S - COVID-19 immunisation - Not applicable - [1d - n/a - n/a])",Not reported,"<a target=""_blank"" href=""https://dap.ema.europa.eu/xmlpserver/PHV%20DAP/Reports/ICSR.xdo?_xpf=&_xt=form&SR_ID=10017077002&_xpt=1&_xf=pdf"">ICSR</a>"
EU-EC-10017054617,Spontaneous,2024-03-23 00:00:00,Healthcare Professional,Non European Economic Area,Not available,18-64 Years,Not Specified,No,Male,"Back pain (n/a - Unknown - ),<BR><BR>Constipation (n/a - Unknown - ),<BR><BR>Erectile dysfunction (n/a - Unknown - Other Medically Important Condition),<BR><BR>Fatigue (n/a - Unknown - ),<BR><BR>Glucose-6-phosphate dehydrogenase deficiency (n/a - Unknown - ),<BR><BR>Hepatitis A (n/a - Unknown - ),<BR><BR>Herpes simplex (n/a - Unknown - ),<BR><BR>Hyperglycaemia (n/a - Unknown - ),<BR><BR>Insomnia (n/a - Unknown - ),<BR><BR>Microalbuminuria (n/a - Unknown - ),<BR><BR>Paraesthesia (n/a - Unknown - ),<BR><BR>Rhinitis allergic (n/a - Unknown - ),<BR><BR>Snoring (n/a - Unknown - ),<BR><BR>Somnolence (n/a - Unknown - ),<BR><BR>Trigger finger (n/a - Unknown - ),<BR><BR>Visual impairment (n/a - Unknown - ),<BR><BR>Vitamin D deficiency (n/a - Unknown - )","HUMALOG [INSULIN LISPRO] (S - Product used for unknown indication - Unknown - [n/a - n/a - n/a]),<BR><BR>SHINGRIX [RECOMBINANT VARICELLA ZOSTER VIRUS GLYCOPROTEIN E, RECOMBINANT VARICELLA ZOSTER VIRUS GLYCOPROTEIN E, STIMULON, MONOPHOSPHORYL LIPID A] (S - Prophylaxis - Not applicable - [n/a - n/a - n/a]),<BR><BR>SPIKEVAX BIVALENT ORIGINAL/OMICRON BA.4-5 [ELASOMERAN, DAVESOMERAN] (S - Prophylaxis - Not applicable - [n/a - n/a - n/a]),<BR><BR>SPIKEVAX [ELASOMERAN] (S - Prophylaxis - Not applicable - [n/a - n/a - n/a]),<BR><BR>VIAGRA [SILDENAFIL, SILDENAFIL CITRATE] (S - Product used for unknown indication - Unknown - [n/a - n/a - n/a]),<BR><BR>[A/HONG KONG/4801/2014 (H3N2)-LIKE STRAIN (A/HONG KONG/4801/2014, X-263B), B/BRISBANE/60/2008-LIKE STRAIN (B/BRISBANE/60/2008, WILD TYPE), A/CALIFORNIA/7/2009 (H1N1)PDM09-DERIVED STRAIN USED (NYMC X-181), A/HONG KONG/4801/2014 (H3N2)-LIKE STRAIN (A/HONG KONG/4801/2014, X-263B), B/BRISBANE/60/2008-LIKE STRAIN (B/BRISBANE/60/2008, WILD TYPE), A/MICHIGAN/45/2015 (H1N1)PDM09-LIKE STRAIN (A/SINGAPORE/GP1908/2015, IVR-180), INFLUENZA VACCINE] (S - Prophylaxis - Not applicable - [n/a - n/a - n/a]),<BR><BR>[ATORVASTATIN, ATORVASTATIN CALCIUM, ATORVASTATIN CALCIUM TRIHYDRATE] (S - Product used for unknown indication - Unknown - [n/a - n/a - n/a]),<BR><BR>[CABOTEGRAVIR, RILPIVIRINE] (S - HIV infection - Unknown - [n/a - n/a - n/a]),<BR><BR>[CETIRIZINE, CETIRIZINE DIHYDROCHLORIDE] (S - Product used for unknown indication - Unknown - [n/a - n/a - n/a]),<BR><BR>[DICLOFENAC, DICLOFENAC DIETHYLAMINE, DICLOFENAC EPOLAMINE, DICLOFENAC POTASSIUM, DICLOFENAC RESINATE, DICLOFENAC SODIUM] (S - Product used for unknown indication - Unknown - [n/a - n/a - n/a]),<BR><BR>[DIPHENHYDRAMINE] (S - Product used for unknown indication - Unknown - [n/a - n/a - n/a]),<BR><BR>[DIPHTHERIA AND TETANUS TOXOIDS AND PERTUSSIS] (S - Prophylaxis - Not applicable - [n/a - n/a - n/a]),<BR><BR>[DOCUSATE SODIUM] (S - Product used for unknown indication - Unknown - [n/a - n/a - n/a]),<BR><BR>[ERGOCALCIFEROL] (S - Product used for unknown indication - Unknown - [n/a - n/a - n/a]),<BR><BR>[FLUOCINOLONE ACETONIDE, FLUOCINOLONE ACETONIDE PH. EUR, NEOMYCIN SULFATE, POLYMYXIN B SULFATE, FLUOCINOLONE ACETONIDE, NEOMYCIN, POLYMYXIN B, FLUOCINOLONE ACETONIDE] (S - Product used for unknown indication - Unknown - [n/a - n/a - n/a]),<BR><BR>[GABAPENTIN] (S - Product used for unknown indication - Unknown - [n/a - n/a - n/a]),<BR><BR>[HYDROCHLOROTHIAZIDE, LOSARTAN, LOSARTAN POTASSIUM, HYDROCHLOROTHIAZIDE] (S - Product used for unknown indication - Unknown - [n/a - n/a - n/a]),<BR><BR>[INSULIN GLARGINE] (S - Product used for unknown indication - Unknown - [n/a - n/a - n/a]),<BR><BR>[LATANOPROST] (S - Product used for unknown indication - Unknown - [n/a - n/a - n/a]),<BR><BR>[MACROGOL 3350] (S - Product used for unknown indication - Unknown - [n/a - n/a - n/a]),<BR><BR>[MODIFIED VACCINIA ANKARA – BAVARIAN NORDIC LIVE VIRUS] (S - Prophylaxis - Not applicable - [n/a - n/a - n/a]),<BR><BR>[NYSTATIN, TRIAMCINOLONE ACETONIDE] (S - Product used for unknown indication - Unknown - [n/a - n/a - n/a])","[INFLUENZA A VIRUS A/BRISBANE/10/2010 (H1N1) ANTIGEN (MDCK CELL DERIVED, PROPIOLACTONE INACTIVATED), INFLUENZA A VIRUS A/TEXAS/50/2012 X-223A (H3N2) ANTIGEN (MDCK CELL DERIVED, PROPIOLACTONE INACTIVATED), INFLUENZA B VIRUS B/MASSACHUSETTS/2/2012 ANTIGEN (MDCK CELL DERIVED, PROPIOLACTONE INACTIVATED)] (C - Prophylaxis - Unknown - [n/a - n/a - n/a])","<a target=""_blank"" href=""https://dap.ema.europa.eu/xmlpserver/PHV%20DAP/Reports/ICSR.xdo?_xpf=&_xt=form&SR_ID=10017054617&_xpt=1&_xf=pdf"">ICSR</a>"
EU-EC-10017041083,Spontaneous,2024-03-21 00:00:00,Healthcare Professional,Non European Economic Area,Not available,18-64 Years,Adult,No,Male,"Back pain (n/a - Unknown - ),<BR><BR>Constipation (n/a - Unknown - ),<BR><BR>Erectile dysfunction (n/a - Unknown - Other Medically Important Condition),<BR><BR>Fatigue (n/a - Unknown - ),<BR><BR>Glucose-6-phosphate dehydrogenase deficiency (n/a - Unknown - ),<BR><BR>Hepatitis A (n/a - Unknown - ),<BR><BR>Herpes simplex (n/a - Unknown - ),<BR><BR>Hyperglycaemia (n/a - Unknown - ),<BR><BR>Insomnia (n/a - Unknown - ),<BR><BR>Microalbuminuria (n/a - Unknown - ),<BR><BR>Paraesthesia (n/a - Unknown - ),<BR><BR>Rhinitis allergic (n/a - Unknown - ),<BR><BR>Snoring (n/a - Unknown - ),<BR><BR>Somnolence (n/a - Unknown - ),<BR><BR>Trigger finger (n/a - Unknown - ),<BR><BR>Visual impairment (n/a - Unknown - ),<BR><BR>Vitamin D deficiency (n/a - Unknown - )","HUMALOG [INSULIN LISPRO] (S - Product used for unknown indication - Unknown - [n/a - n/a - n/a]),<BR><BR>SHINGRIX [RECOMBINANT VARICELLA ZOSTER VIRUS GLYCOPROTEIN E, RECOMBINANT VARICELLA ZOSTER VIRUS GLYCOPROTEIN E, STIMULON, MONOPHOSPHORYL LIPID A] (S - Prophylaxis - Not applicable - [n/a - n/a - n/a]),<BR><BR>SPIKEVAX BIVALENT ORIGINAL/OMICRON BA.4-5 [ELASOMERAN, DAVESOMERAN] (S - Prophylaxis - Not applicable - [n/a - n/a - n/a]),<BR><BR>SPIKEVAX [ELASOMERAN] (S - Prophylaxis - Not applicable - [n/a - n/a - n/a]),<BR><BR>VIAGRA [SILDENAFIL, SILDENAFIL CITRATE] (S - Product used for unknown indication - Unknown - [n/a - n/a - n/a]),<BR><BR>[A/HONG KONG/4801/2014 (H3N2)-LIKE STRAIN (A/HONG KONG/4801/2014, X-263B), B/BRISBANE/60/2008-LIKE STRAIN (B/BRISBANE/60/2008, WILD TYPE), A/CALIFORNIA/7/2009 (H1N1)PDM09-DERIVED STRAIN USED (NYMC X-181), A/HONG KONG/4801/2014 (H3N2)-LIKE STRAIN (A/HONG KONG/4801/2014, X-263B), B/BRISBANE/60/2008-LIKE STRAIN (B/BRISBANE/60/2008, WILD TYPE), A/MICHIGAN/45/2015 (H1N1)PDM09-LIKE STRAIN (A/SINGAPORE/GP1908/2015, IVR-180), INFLUENZA VACCINE] (S - Prophylaxis - Not applicable - [n/a - n/a - n/a]),<BR><BR>[ATORVASTATIN, ATORVASTATIN CALCIUM, ATORVASTATIN CALCIUM TRIHYDRATE] (S - Product used for unknown indication - Unknown - [n/a - n/a - n/a]),<BR><BR>[CABOTEGRAVIR, RILPIVIRINE] (S - HIV infection - Unknown - [n/a - n/a - n/a]),<BR><BR>[CETIRIZINE, CETIRIZINE DIHYDROCHLORIDE] (S - Product used for unknown indication - Unknown - [n/a - n/a - n/a]),<BR><BR>[DICLOFENAC, DICLOFENAC DIETHYLAMINE, DICLOFENAC EPOLAMINE, DICLOFENAC POTASSIUM, DICLOFENAC RESINATE, DICLOFENAC SODIUM] (S - Product used for unknown indication - Unknown - [n/a - n/a - n/a]),<BR><BR>[DIPHENHYDRAMINE] (S - Product used for unknown indication - Unknown - [n/a - n/a - n/a]),<BR><BR>[DOCUSATE SODIUM] (S - Product used for unknown indication - Unknown - [n/a - n/a - n/a]),<BR><BR>[ERGOCALCIFEROL] (S - Product used for unknown indication - Unknown - [n/a - n/a - n/a]),<BR><BR>[FLUOCINOLONE ACETONIDE, FLUOCINOLONE ACETONIDE PH. EUR, NEOMYCIN SULFATE, POLYMYXIN B SULFATE, FLUOCINOLONE ACETONIDE, NEOMYCIN, POLYMYXIN B, FLUOCINOLONE ACETONIDE] (S - Product used for unknown indication - Unknown - [n/a - n/a - n/a]),<BR><BR>[GABAPENTIN] (S - Product used for unknown indication - Unknown - [n/a - n/a - n/a]),<BR><BR>[HYDROCHLOROTHIAZIDE, LOSARTAN, LOSARTAN POTASSIUM, HYDROCHLOROTHIAZIDE] (S - Product used for unknown indication - Unknown - [n/a - n/a - n/a]),<BR><BR>[INSULIN GLARGINE] (S - Product used for unknown indication - Unknown - [n/a - n/a - n/a]),<BR><BR>[LATANOPROST] (S - Product used for unknown indication - Unknown - [n/a - n/a - n/a]),<BR><BR>[MACROGOL 3350] (S - Product used for unknown indication - Unknown - [n/a - n/a - n/a]),<BR><BR>[MODIFIED VACCINIA ANKARA – BAVARIAN NORDIC LIVE VIRUS] (S - Prophylaxis - Not applicable - [n/a - n/a - n/a]),<BR><BR>[NYSTATIN, TRIAMCINOLONE ACETONIDE] (S - Product used for unknown indication - Unknown - [n/a - n/a - n/a])","[INFLUENZA A VIRUS A/BRISBANE/10/2010 (H1N1) ANTIGEN (MDCK CELL DERIVED, PROPIOLACTONE INACTIVATED), INFLUENZA A VIRUS A/TEXAS/50/2012 X-223A (H3N2) ANTIGEN (MDCK CELL DERIVED, PROPIOLACTONE INACTIVATED), INFLUENZA B VIRUS B/MASSACHUSETTS/2/2012 ANTIGEN (MDCK CELL DERIVED, PROPIOLACTONE INACTIVATED)] (C - Prophylaxis - n/a - [n/a - n/a - n/a])","<a target=""_blank"" href=""https://dap.ema.europa.eu/xmlpserver/PHV%20DAP/Reports/ICSR.xdo?_xpf=&_xt=form&SR_ID=10017041083&_xpt=1&_xf=pdf"">ICSR</a>"
EU-EC-10017034287,Spontaneous,2024-03-20 00:00:00,Healthcare Professional,Non European Economic Area,Not available,Not Specified,Not Specified,No,Male,"COVID-19 (n/a - Unknown - Other Medically Important Condition),<BR><BR>Drug ineffective (n/a - Unknown - Other Medically Important Condition)","SPIKEVAX BIVALENT ORIGINAL/OMICRON BA.4-5 [ELASOMERAN, DAVESOMERAN] (S - COVID-19 immunisation - Not applicable - [n/a - n/a - n/a]),<BR><BR>[TOZINAMERAN NOS] (S - COVID-19 immunisation - Not applicable - [n/a - n/a - n/a])",Not reported,"<a target=""_blank"" href=""https://dap.ema.europa.eu/xmlpserver/PHV%20DAP/Reports/ICSR.xdo?_xpf=&_xt=form&SR_ID=10017034287&_xpt=1&_xf=pdf"">ICSR</a>"
EU-EC-10017035190,Spontaneous,2024-03-20 00:00:00,Healthcare Professional,Non European Economic Area,Not available,18-64 Years,Not Specified,No,Male,"Back pain (n/a - Unknown - ),<BR><BR>Constipation (n/a - Unknown - ),<BR><BR>Erectile dysfunction (n/a - Unknown - Other Medically Important Condition),<BR><BR>Fatigue (n/a - Unknown - ),<BR><BR>Glucose-6-phosphate dehydrogenase deficiency (n/a - Unknown - ),<BR><BR>Hepatitis A (n/a - Unknown - ),<BR><BR>Herpes simplex (n/a - Unknown - ),<BR><BR>Hyperglycaemia (n/a - Unknown - ),<BR><BR>Insomnia (n/a - Unknown - ),<BR><BR>Microalbuminuria (n/a - Unknown - ),<BR><BR>Paraesthesia (n/a - Unknown - ),<BR><BR>Rhinitis allergic (n/a - Unknown - ),<BR><BR>Snoring (n/a - Unknown - ),<BR><BR>Somnolence (n/a - Unknown - ),<BR><BR>Trigger finger (n/a - Unknown - ),<BR><BR>Visual impairment (n/a - Unknown - ),<BR><BR>Vitamin D deficiency (n/a - Unknown - )","HUMALOG [INSULIN LISPRO] (S - Product used for unknown indication - Unknown - [n/a - n/a - n/a]),<BR><BR>SHINGRIX [RECOMBINANT VARICELLA ZOSTER VIRUS GLYCOPROTEIN E, RECOMBINANT VARICELLA ZOSTER VIRUS GLYCOPROTEIN E, STIMULON, MONOPHOSPHORYL LIPID A] (S - Prophylaxis - Not applicable - [n/a - n/a - n/a]),<BR><BR>SPIKEVAX BIVALENT ORIGINAL/OMICRON BA.4-5 [ELASOMERAN, DAVESOMERAN] (S - Prophylaxis - Not applicable - [n/a - n/a - n/a]),<BR><BR>SPIKEVAX [ELASOMERAN] (S - Prophylaxis - Not applicable - [n/a - n/a - n/a]),<BR><BR>VIAGRA [SILDENAFIL, SILDENAFIL CITRATE] (S - Product used for unknown indication - Unknown - [n/a - n/a - n/a]),<BR><BR>[A/HONG KONG/4801/2014 (H3N2)-LIKE STRAIN (A/HONG KONG/4801/2014, X-263B), B/BRISBANE/60/2008-LIKE STRAIN (B/BRISBANE/60/2008, WILD TYPE), A/CALIFORNIA/7/2009 (H1N1)PDM09-DERIVED STRAIN USED (NYMC X-181), A/HONG KONG/4801/2014 (H3N2)-LIKE STRAIN (A/HONG KONG/4801/2014, X-263B), B/BRISBANE/60/2008-LIKE STRAIN (B/BRISBANE/60/2008, WILD TYPE), A/MICHIGAN/45/2015 (H1N1)PDM09-LIKE STRAIN (A/SINGAPORE/GP1908/2015, IVR-180), INFLUENZA VACCINE] (S - Prophylaxis - Not applicable - [n/a - n/a - n/a]),<BR><BR>[ATORVASTATIN, ATORVASTATIN CALCIUM, ATORVASTATIN CALCIUM TRIHYDRATE] (S - Product used for unknown indication - Unknown - [n/a - n/a - n/a]),<BR><BR>[CABOTEGRAVIR, RILPIVIRINE] (S - HIV infection - Unknown - [n/a - n/a - n/a]),<BR><BR>[CETIRIZINE, CETIRIZINE DIHYDROCHLORIDE] (S - Product used for unknown indication - Unknown - [n/a - n/a - n/a]),<BR><BR>[DICLOFENAC, DICLOFENAC DIETHYLAMINE, DICLOFENAC EPOLAMINE, DICLOFENAC POTASSIUM, DICLOFENAC RESINATE, DICLOFENAC SODIUM] (S - Product used for unknown indication - Unknown - [n/a - n/a - n/a]),<BR><BR>[DIPHTHERIA TOXOID, TETANUS TOXOID, PERTUSSIS TOXOID, PERTUSSIS PERTACTIN, ALUMINIUM HYDROXIDE, FILAMENTOUS HAEMAGGLUTININ] (S - Prophylaxis - Not applicable - [n/a - n/a - n/a]),<BR><BR>[DOCUSATE SODIUM] (S - Product used for unknown indication - Unknown - [n/a - n/a - n/a]),<BR><BR>[DOXYLAMINE HYDROGEN SUCCINATE] (S - Product used for unknown indication - Unknown - [n/a - n/a - n/a]),<BR><BR>[ERGOCALCIFEROL] (S - Product used for unknown indication - Unknown - [n/a - n/a - n/a]),<BR><BR>[FLUOCINOLONE ACETONIDE, FLUOCINOLONE ACETONIDE PH. EUR, NEOMYCIN SULFATE, POLYMYXIN B SULFATE, FLUOCINOLONE ACETONIDE, NEOMYCIN, POLYMYXIN B, FLUOCINOLONE ACETONIDE] (S - Product used for unknown indication - Unknown - [n/a - n/a - n/a]),<BR><BR>[GABAPENTIN] (S - Product used for unknown indication - Unknown - [n/a - n/a - n/a]),<BR><BR>[HYDROCHLOROTHIAZIDE, LOSARTAN, LOSARTAN POTASSIUM, HYDROCHLOROTHIAZIDE] (S - Product used for unknown indication - Unknown - [n/a - n/a - n/a]),<BR><BR>[INSULIN GLARGINE] (S - Product used for unknown indication - Unknown - [n/a - n/a - n/a]),<BR><BR>[LATANOPROST] (S - Product used for unknown indication - Unknown - [n/a - n/a - n/a]),<BR><BR>[MACROGOL 3350] (S - Product used for unknown indication - Unknown - [n/a - n/a - n/a]),<BR><BR>[MODIFIED VACCINIA ANKARA – BAVARIAN NORDIC LIVE VIRUS] (S - Prophylaxis - Not applicable - [n/a - n/a - n/a]),<BR><BR>[NYSTATIN, TRIAMCINOLONE ACETONIDE] (S - Product used for unknown indication - Unknown - [n/a - n/a - n/a])","[INFLUENZA A VIRUS A/BRISBANE/10/2010 (H1N1) ANTIGEN (MDCK CELL DERIVED, PROPIOLACTONE INACTIVATED), INFLUENZA A VIRUS A/TEXAS/50/2012 X-223A (H3N2) ANTIGEN (MDCK CELL DERIVED, PROPIOLACTONE INACTIVATED), INFLUENZA B VIRUS B/MASSACHUSETTS/2/2012 ANTIGEN (MDCK CELL DERIVED, PROPIOLACTONE INACTIVATED)] (C - Prophylaxis - Not applicable - [n/a - n/a - n/a])","<a target=""_blank"" href=""https://dap.ema.europa.eu/xmlpserver/PHV%20DAP/Reports/ICSR.xdo?_xpf=&_xt=form&SR_ID=10017035190&_xpt=1&_xf=pdf"">ICSR</a>"
EU-EC-10017021894,Spontaneous,2024-03-19 00:00:00,Healthcare Professional,Non European Economic Area,Not available,65-85 Years,Not Specified,No,Female,"COVID-19 (n/a - Recovered/Resolved - Other Medically Important Condition),<BR><BR>Drug ineffective (n/a - Recovered/Resolved - Other Medically Important Condition),<BR><BR>Interchange of vaccine products (n/a - Recovered/Resolved - Other Medically Important Condition)","COMIRNATY [TOZINAMERAN] (S - COVID-19 immunisation - Not applicable - [n/a - 1{DF} - Intramuscular use]),<BR><BR>COMIRNATY [TOZINAMERAN] (S - COVID-19 immunisation - Not applicable - [n/a - 1{DF} - n/a]),<BR><BR>SPIKEVAX BIVALENT ORIGINAL/OMICRON BA.4-5 [ELASOMERAN, DAVESOMERAN] (S - COVID-19 immunisation - Not applicable - [n/a - 1{DF} - n/a])","[ACETYLSALICYLIC ACID] (C - Coronary artery disease - n/a - [n/a - n/a - Oral use]),<BR><BR>[ACETYLSALICYLIC ACID] (C - Product used for unknown indication - n/a - [n/a - 81mg - n/a]),<BR><BR>[ATORVASTATIN, ATORVASTATIN CALCIUM, ATORVASTATIN CALCIUM TRIHYDRATE] (C - Product used for unknown indication - n/a - [n/a - 40mg - n/a]),<BR><BR>[ATORVASTATIN, ATORVASTATIN CALCIUM, ATORVASTATIN CALCIUM TRIHYDRATE] (C - Product used for unknown indication - n/a - [n/a - n/a - Oral use]),<BR><BR>[CANDESARTAN CILEXETIL] (C - Product used for unknown indication - n/a - [n/a - 8mg - n/a]),<BR><BR>[CANDESARTAN, CANDESARTAN CILEXETIL] (C - Hypertension - n/a - [n/a - n/a - Oral use]),<BR><BR>[COLECALCIFEROL] (C - Product used for unknown indication - n/a - [n/a - 1000[iU] - n/a]),<BR><BR>[EZETIMIBE] (C - Product used for unknown indication - n/a - [n/a - 10mg - n/a]),<BR><BR>[FENOFIBRATE] (C - Product used for unknown indication - n/a - [n/a - n/a - Oral use]),<BR><BR>[FOLIC ACID, FERRIC HYDROXIDE POLYMALTOSE COMPLEX] (C - Product used for unknown indication - n/a - [n/a - 30mg - n/a]),<BR><BR>[METOPROLOL TARTRATE] (C - Product used for unknown indication - n/a - [n/a - 25mg - n/a]),<BR><BR>[METOPROLOL, METOPROLOL TARTRATE] (C - Coronary artery disease, Hypertension - n/a - [n/a - n/a - Oral use]),<BR><BR>[PANTOPRAZOLE SODIUM] (C - Product used for unknown indication - n/a - [n/a - 40mg - n/a])","<a target=""_blank"" href=""https://dap.ema.europa.eu/xmlpserver/PHV%20DAP/Reports/ICSR.xdo?_xpf=&_xt=form&SR_ID=10017021894&_xpt=1&_xf=pdf"">ICSR</a>"
EU-EC-10017026146,Spontaneous,2024-03-19 00:00:00,Non Healthcare Professional,Non European Economic Area,Not available,18-64 Years,Not Specified,No,Male,"COVID-19 (n/a - Recovering/Resolving - Other Medically Important Condition),<BR><BR>Drug ineffective (n/a - Recovering/Resolving - Other Medically Important Condition),<BR><BR>Interchange of vaccine products (n/a - Recovering/Resolving - Other Medically Important Condition)","COMIRNATY [TOZINAMERAN] (S - COVID-19 immunisation - Unknown - [n/a - 1{DF} - n/a]),<BR><BR>SPIKEVAX BIVALENT ORIGINAL/OMICRON BA.4-5 [ELASOMERAN, DAVESOMERAN] (S - COVID-19 immunisation - Not applicable - [n/a - 1{DF} - n/a]),<BR><BR>SPIKEVAX [ELASOMERAN] (S - COVID-19 immunisation - Not applicable - [n/a - 1{DF} - n/a])",[PARACETAMOL] (C - Product used for unknown indication - n/a - [n/a - n/a - n/a]),"<a target=""_blank"" href=""https://dap.ema.europa.eu/xmlpserver/PHV%20DAP/Reports/ICSR.xdo?_xpf=&_xt=form&SR_ID=10017026146&_xpt=1&_xf=pdf"">ICSR</a>"
EU-EC-10017017014,Spontaneous,2024-03-18 00:00:00,Healthcare Professional,Non European Economic Area,Not available,65-85 Years,Not Specified,No,Male,"Hepatic cancer (n/a - Recovering/Resolving - Caused/Prolonged Hospitalisation, Other Medically Important Condition),<BR><BR>Herpes zoster (n/a - Recovering/Resolving - Caused/Prolonged Hospitalisation, Other Medically Important Condition)","SPIKEVAX BIVALENT ORIGINAL/OMICRON BA.4-5 [ELASOMERAN, DAVESOMERAN] (S - COVID-19 prophylaxis - Not applicable - [n/a - 1{DF} - n/a])",Not reported,"<a target=""_blank"" href=""https://dap.ema.europa.eu/xmlpserver/PHV%20DAP/Reports/ICSR.xdo?_xpf=&_xt=form&SR_ID=10017017014&_xpt=1&_xf=pdf"">ICSR</a>"
EU-EC-10017008769,Spontaneous,2024-03-15 00:00:00,Healthcare Professional,Non European Economic Area,Not available,65-85 Years,Not Specified,No,Male,"COVID-19 (n/a - Unknown - Other Medically Important Condition),<BR><BR>Drug ineffective (n/a - Unknown - Other Medically Important Condition),<BR><BR>Interchange of vaccine products (n/a - Unknown - Other Medically Important Condition)","SPIKEVAX BIVALENT ORIGINAL/OMICRON BA.4-5 [ELASOMERAN, DAVESOMERAN] (S - COVID-19 immunisation - Not applicable - [1d - 50ug - Intramuscular use - More in ICSR]),<BR><BR>SPIKEVAX [ELASOMERAN] (S - COVID-19 immunisation - Not applicable - [1d - n/a - Intramuscular use]),<BR><BR>TOZINAMERAN [TOZINAMERAN] (S - COVID-19 immunisation - Not applicable - [1d - n/a - n/a])",Not reported,"<a target=""_blank"" href=""https://dap.ema.europa.eu/xmlpserver/PHV%20DAP/Reports/ICSR.xdo?_xpf=&_xt=form&SR_ID=10017008769&_xpt=1&_xf=pdf"">ICSR</a>"
EU-EC-10016994071,Spontaneous,2024-03-14 00:00:00,Healthcare Professional,Non European Economic Area,Not available,65-85 Years,Not Specified,No,Female,"COVID-19 (n/a - Unknown - Other Medically Important Condition),<BR><BR>Drug ineffective (n/a - Unknown - Other Medically Important Condition),<BR><BR>Interchange of vaccine products (n/a - Unknown - Other Medically Important Condition)","SPIKEVAX BIVALENT ORIGINAL/OMICRON BA.4-5 [ELASOMERAN, DAVESOMERAN] (S - COVID-19 immunisation - Not applicable - [n/a - n/a - n/a]),<BR><BR>SPIKEVAX [ELASOMERAN] (S - COVID-19 immunisation - Not applicable - [n/a - n/a - n/a]),<BR><BR>TOZINAMERAN [TOZINAMERAN] (S - COVID-19 immunisation - Not applicable - [n/a - n/a - n/a])",[LEVOTHYROXINE SODIUM] (C - n/a - n/a - [n/a - n/a - n/a]),"<a target=""_blank"" href=""https://dap.ema.europa.eu/xmlpserver/PHV%20DAP/Reports/ICSR.xdo?_xpf=&_xt=form&SR_ID=10016994071&_xpt=1&_xf=pdf"">ICSR</a>"
EU-EC-10017000012,Spontaneous,2024-03-14 00:00:00,Healthcare Professional,Non European Economic Area,Not available,Not Specified,Not Specified,No,Male,"Back pain (n/a - Unknown - ),<BR><BR>Constipation (n/a - Unknown - ),<BR><BR>Erectile dysfunction (n/a - Unknown - Other Medically Important Condition),<BR><BR>Fatigue (n/a - Unknown - ),<BR><BR>Glucose-6-phosphate dehydrogenase deficiency (n/a - Unknown - ),<BR><BR>Hepatitis A (n/a - Unknown - ),<BR><BR>Herpes simplex (n/a - Unknown - ),<BR><BR>Hyperglycaemia (n/a - Unknown - ),<BR><BR>Insomnia (n/a - Unknown - ),<BR><BR>Microalbuminuria (n/a - Unknown - ),<BR><BR>Paraesthesia (n/a - Unknown - ),<BR><BR>Rhinitis allergic (n/a - Unknown - ),<BR><BR>Snoring (n/a - Unknown - ),<BR><BR>Somnolence (n/a - Unknown - ),<BR><BR>Trigger finger (n/a - Unknown - ),<BR><BR>Visual impairment (n/a - Unknown - ),<BR><BR>Vitamin D deficiency (n/a - Unknown - )","HUMALOG [INSULIN LISPRO] (S - Product used for unknown indication - Unknown - [n/a - n/a - n/a]),<BR><BR>SHINGRIX [RECOMBINANT VARICELLA ZOSTER VIRUS GLYCOPROTEIN E, RECOMBINANT VARICELLA ZOSTER VIRUS GLYCOPROTEIN E, STIMULON, MONOPHOSPHORYL LIPID A] (S - Prophylaxis - Not applicable - [n/a - n/a - n/a]),<BR><BR>SPIKEVAX BIVALENT ORIGINAL/OMICRON BA.4-5 [ELASOMERAN, DAVESOMERAN] (S - Prophylaxis - Not applicable - [n/a - n/a - n/a]),<BR><BR>SPIKEVAX [ELASOMERAN] (S - Prophylaxis - Not applicable - [n/a - n/a - n/a]),<BR><BR>VIAGRA [SILDENAFIL, SILDENAFIL CITRATE] (S - Product used for unknown indication - Unknown - [n/a - n/a - n/a]),<BR><BR>[A/HONG KONG/4801/2014 (H3N2)-LIKE STRAIN (A/HONG KONG/4801/2014, X-263B), B/BRISBANE/60/2008-LIKE STRAIN (B/BRISBANE/60/2008, WILD TYPE), A/CALIFORNIA/7/2009 (H1N1)PDM09-DERIVED STRAIN USED (NYMC X-181), A/HONG KONG/4801/2014 (H3N2)-LIKE STRAIN (A/HONG KONG/4801/2014, X-263B), B/BRISBANE/60/2008-LIKE STRAIN (B/BRISBANE/60/2008, WILD TYPE), A/MICHIGAN/45/2015 (H1N1)PDM09-LIKE STRAIN (A/SINGAPORE/GP1908/2015, IVR-180), INFLUENZA VACCINE] (S - Prophylaxis - Not applicable - [n/a - n/a - n/a]),<BR><BR>[ATORVASTATIN, ATORVASTATIN CALCIUM, ATORVASTATIN CALCIUM TRIHYDRATE] (S - Product used for unknown indication - Unknown - [n/a - n/a - n/a]),<BR><BR>[CABOTEGRAVIR, RILPIVIRINE] (S - HIV infection - Unknown - [n/a - n/a - n/a]),<BR><BR>[CETIRIZINE, CETIRIZINE DIHYDROCHLORIDE] (S - Product used for unknown indication - Unknown - [n/a - n/a - n/a]),<BR><BR>[DICLOFENAC, DICLOFENAC DIETHYLAMINE, DICLOFENAC EPOLAMINE, DICLOFENAC POTASSIUM, DICLOFENAC RESINATE, DICLOFENAC SODIUM] (S - Product used for unknown indication - Unknown - [n/a - n/a - n/a]),<BR><BR>[DIPHTHERIA TOXOID, TETANUS TOXOID, PERTUSSIS TOXOID, PERTUSSIS PERTACTIN, FILAMENTOUS HAEMAGGLUTININ] (S - Prophylaxis - Not applicable - [n/a - n/a - n/a]),<BR><BR>[DOCUSATE SODIUM] (S - Product used for unknown indication - Unknown - [n/a - n/a - n/a]),<BR><BR>[DOXYLAMINE HYDROGEN SUCCINATE] (S - Product used for unknown indication - Unknown - [n/a - n/a - n/a]),<BR><BR>[ERGOCALCIFEROL] (S - Product used for unknown indication - Unknown - [n/a - n/a - n/a]),<BR><BR>[FLUOCINOLONE ACETONIDE, FLUOCINOLONE ACETONIDE PH. EUR, NEOMYCIN SULFATE, POLYMYXIN B SULFATE, FLUOCINOLONE ACETONIDE, NEOMYCIN, POLYMYXIN B, FLUOCINOLONE ACETONIDE] (S - Product used for unknown indication - Unknown - [n/a - n/a - n/a]),<BR><BR>[GABAPENTIN] (S - Product used for unknown indication - Unknown - [n/a - n/a - n/a]),<BR><BR>[HYDROCHLOROTHIAZIDE, LOSARTAN, LOSARTAN POTASSIUM, HYDROCHLOROTHIAZIDE] (S - Product used for unknown indication - Unknown - [n/a - n/a - n/a]),<BR><BR>[INSULIN GLARGINE] (S - Product used for unknown indication - Unknown - [n/a - n/a - n/a]),<BR><BR>[LATANOPROST] (S - Product used for unknown indication - Unknown - [n/a - n/a - n/a]),<BR><BR>[MACROGOL 3350] (S - Product used for unknown indication - Unknown - [n/a - n/a - n/a]),<BR><BR>[MODIFIED VACCINIA ANKARA – BAVARIAN NORDIC LIVE VIRUS] (S - Prophylaxis - Not applicable - [n/a - n/a - n/a]),<BR><BR>[NYSTATIN, TRIAMCINOLONE ACETONIDE] (S - Product used for unknown indication - Unknown - [n/a - n/a - n/a])","[INFLUENZA A VIRUS A/BRISBANE/10/2010 (H1N1) ANTIGEN (MDCK CELL DERIVED, PROPIOLACTONE INACTIVATED), INFLUENZA A VIRUS A/TEXAS/50/2012 X-223A (H3N2) ANTIGEN (MDCK CELL DERIVED, PROPIOLACTONE INACTIVATED), INFLUENZA B VIRUS B/MASSACHUSETTS/2/2012 ANTIGEN (MDCK CELL DERIVED, PROPIOLACTONE INACTIVATED)] (C - Prophylaxis - Not applicable - [n/a - n/a - n/a])","<a target=""_blank"" href=""https://dap.ema.europa.eu/xmlpserver/PHV%20DAP/Reports/ICSR.xdo?_xpf=&_xt=form&SR_ID=10017000012&_xpt=1&_xf=pdf"">ICSR</a>"
EU-EC-10017000101,Spontaneous,2024-03-14 00:00:00,Healthcare Professional,Non European Economic Area,Not available,65-85 Years,Not Specified,No,Male,"Thalamus haemorrhage (n/a - Unknown - Caused/Prolonged Hospitalisation, Disabling, Other Medically Important Condition)","SPIKEVAX BIVALENT ORIGINAL/OMICRON BA.4-5 [ELASOMERAN, DAVESOMERAN] (S - COVID-19 prophylaxis - Not applicable - [n/a - 1{DF} - Intramuscular use])",Not reported,"<a target=""_blank"" href=""https://dap.ema.europa.eu/xmlpserver/PHV%20DAP/Reports/ICSR.xdo?_xpf=&_xt=form&SR_ID=10017000101&_xpt=1&_xf=pdf"">ICSR</a>"
EU-EC-10016989739,Spontaneous,2024-03-13 00:00:00,Non Healthcare Professional,Non European Economic Area,Not available,65-85 Years,Not Specified,No,Female,"COVID-19 (n/a - Unknown - Other Medically Important Condition),<BR><BR>Drug ineffective (n/a - Unknown - Other Medically Important Condition),<BR><BR>Interchange of vaccine products (n/a - Unknown - Other Medically Important Condition)","SPIKEVAX BIVALENT ORIGINAL/OMICRON BA.4-5 [ELASOMERAN, DAVESOMERAN] (S - COVID-19 immunisation - Not applicable - [n/a - n/a - n/a]),<BR><BR>SPIKEVAX [ELASOMERAN] (S - COVID-19 immunisation - Not applicable - [1d - n/a - n/a - More in ICSR]),<BR><BR>TOZINAMERAN [TOZINAMERAN] (S - COVID-19 immunisation - Not applicable - [n/a - n/a - n/a]),<BR><BR>[COVID-19 VACCINE] (S - COVID-19 immunisation - Not applicable - [n/a - n/a - n/a])",Not reported,"<a target=""_blank"" href=""https://dap.ema.europa.eu/xmlpserver/PHV%20DAP/Reports/ICSR.xdo?_xpf=&_xt=form&SR_ID=10016989739&_xpt=1&_xf=pdf"">ICSR</a>"
EU-EC-10016990073,Spontaneous,2024-03-13 00:00:00,Healthcare Professional,Non European Economic Area,Not available,65-85 Years,Not Specified,No,Female,"Atrial fibrillation (n/a - Unknown - Other Medically Important Condition),<BR><BR>Hyperhidrosis (n/a - Unknown - ),<BR><BR>Nausea (n/a - Unknown - ),<BR><BR>Pyrexia (0d - Recovered/Resolved - ),<BR><BR>Vomiting (0d - Recovered/Resolved - )","SPIKEVAX BIVALENT ORIGINAL/OMICRON BA.4-5 [ELASOMERAN, DAVESOMERAN] (S - n/a - Not applicable - [n/a - n/a - n/a]),<BR><BR>[INFLUENZA VACCINE] (S - n/a - Not applicable - [n/a - n/a - n/a])",Not reported,"<a target=""_blank"" href=""https://dap.ema.europa.eu/xmlpserver/PHV%20DAP/Reports/ICSR.xdo?_xpf=&_xt=form&SR_ID=10016990073&_xpt=1&_xf=pdf"">ICSR</a>"
EU-EC-10016978081,Spontaneous,2024-03-12 00:00:00,Healthcare Professional,Non European Economic Area,Not available,Not Specified,Adult,No,Female,"Ankle fracture (n/a - Unknown - ),<BR><BR>Thrombosis (n/a - Unknown - Other Medically Important Condition)","SPIKEVAX BIVALENT ORIGINAL/OMICRON BA.4-5 [ELASOMERAN, DAVESOMERAN] (S - COVID-19 prophylaxis - Not applicable - [n/a - 1{DF} - n/a])",Not reported,"<a target=""_blank"" href=""https://dap.ema.europa.eu/xmlpserver/PHV%20DAP/Reports/ICSR.xdo?_xpf=&_xt=form&SR_ID=10016978081&_xpt=1&_xf=pdf"">ICSR</a>"
EU-EC-10016972580,Spontaneous,2024-03-11 00:00:00,Non Healthcare Professional,Non European Economic Area,Not available,18-64 Years,Not Specified,No,Male,"COVID-19 (n/a - Unknown - Other Medically Important Condition),<BR><BR>Drug ineffective (n/a - Unknown - Other Medically Important Condition),<BR><BR>Interchange of vaccine products (n/a - Unknown - Other Medically Important Condition)","SPIKEVAX BIVALENT ORIGINAL/OMICRON BA.4-5 [ELASOMERAN, DAVESOMERAN] (S - COVID-19 immunisation - Not applicable - [n/a - n/a - n/a]),<BR><BR>SPIKEVAX [ELASOMERAN] (S - COVID-19 immunisation - Not applicable - [n/a - n/a - n/a]),<BR><BR>TOZINAMERAN, FAMTOZINAMERAN [TOZINAMERAN, FAMTOZINAMERAN] (S - COVID-19 immunisation - Not applicable - [n/a - n/a - n/a])",Not reported,"<a target=""_blank"" href=""https://dap.ema.europa.eu/xmlpserver/PHV%20DAP/Reports/ICSR.xdo?_xpf=&_xt=form&SR_ID=10016972580&_xpt=1&_xf=pdf"">ICSR</a>"
EU-EC-10016963504,Spontaneous,2024-03-08 00:00:00,Non Healthcare Professional,Non European Economic Area,Not available,Not Specified,Not Specified,No,Male,"Atrial fibrillation (n/a - Unknown - Other Medically Important Condition),<BR><BR>Interchange of vaccine products (n/a - Unknown - Other Medically Important Condition)","SPIKEVAX BIVALENT ORIGINAL/OMICRON BA.4-5 [ELASOMERAN, DAVESOMERAN] (S - COVID-19 immunisation - Not applicable - [n/a - n/a - n/a]),<BR><BR>[TOZINAMERAN NOS] (S - COVID-19 immunisation - Not applicable - [n/a - n/a - n/a])",Not reported,"<a target=""_blank"" href=""https://dap.ema.europa.eu/xmlpserver/PHV%20DAP/Reports/ICSR.xdo?_xpf=&_xt=form&SR_ID=10016963504&_xpt=1&_xf=pdf"">ICSR</a>"
EU-EC-10016954255,Spontaneous,2024-03-07 00:00:00,Healthcare Professional,Non European Economic Area,Not available,18-64 Years,Not Specified,No,Female,"COVID-19 (n/a - Unknown - Other Medically Important Condition),<BR><BR>Drug ineffective (n/a - Unknown - Other Medically Important Condition),<BR><BR>Interchange of vaccine products (n/a - Unknown - )","SPIKEVAX BIVALENT ORIGINAL/OMICRON BA.4-5 [ELASOMERAN, DAVESOMERAN] (S - COVID-19 immunisation - Not applicable - [n/a - n/a - n/a]),<BR><BR>SPIKEVAX [ELASOMERAN] (S - COVID-19 immunisation - Not applicable - [1d - n/a - n/a - More in ICSR]),<BR><BR>TOZINAMERAN [TOZINAMERAN] (S - COVID-19 immunisation - Not applicable - [n/a - n/a - n/a])","[LEVOTHYROXINE, LEVOTHYROXINE SODIUM] (C - n/a - n/a - [n/a - n/a - n/a])","<a target=""_blank"" href=""https://dap.ema.europa.eu/xmlpserver/PHV%20DAP/Reports/ICSR.xdo?_xpf=&_xt=form&SR_ID=10016954255&_xpt=1&_xf=pdf"">ICSR</a>"
EU-EC-10016936930,Spontaneous,2024-03-05 00:00:00,Healthcare Professional,European Economic Area,Not available,18-64 Years,Not Specified,No,Female,Fatigue (n/a - Not Recovered/Not Resolved - Disabling),"SPIKEVAX BIVALENT ORIGINAL/OMICRON BA.4-5 [ELASOMERAN, DAVESOMERAN] (S - Immunisation - n/a - [n/a - n/a - n/a])",Not reported,"<a target=""_blank"" href=""https://dap.ema.europa.eu/xmlpserver/PHV%20DAP/Reports/ICSR.xdo?_xpf=&_xt=form&SR_ID=10016936930&_xpt=1&_xf=pdf"">ICSR</a>"
EU-EC-10016922420,Spontaneous,2024-03-01 00:00:00,Non Healthcare Professional,Non European Economic Area,Not available,18-64 Years,Not Specified,No,Male,"COVID-19 (n/a - Not Recovered/Not Resolved - Other Medically Important Condition),<BR><BR>Drug ineffective (n/a - Not Recovered/Not Resolved - Other Medically Important Condition),<BR><BR>Interchange of vaccine products (n/a - Not Recovered/Not Resolved - Other Medically Important Condition)","SPIKEVAX BIVALENT ORIGINAL/OMICRON BA.4-5 [ELASOMERAN, DAVESOMERAN] (S - COVID-19 immunisation - Not applicable - [1d - n/a - n/a - More in ICSR]),<BR><BR>TOZINAMERAN [TOZINAMERAN] (S - COVID-19 immunisation - Not applicable - [1d - n/a - n/a - More in ICSR])",Not reported,"<a target=""_blank"" href=""https://dap.ema.europa.eu/xmlpserver/PHV%20DAP/Reports/ICSR.xdo?_xpf=&_xt=form&SR_ID=10016922420&_xpt=1&_xf=pdf"">ICSR</a>"
EU-EC-10016910353,Spontaneous,2024-02-29 00:00:00,Healthcare Professional,Non European Economic Area,Not available,18-64 Years,Not Specified,No,Female,"COVID-19 (n/a - Unknown - Other Medically Important Condition),<BR><BR>Drug ineffective (n/a - Unknown - Other Medically Important Condition),<BR><BR>Interchange of vaccine products (n/a - Unknown - Other Medically Important Condition)","SPIKEVAX BIVALENT ORIGINAL/OMICRON BA.4-5 [ELASOMERAN, DAVESOMERAN] (S - COVID-19 immunisation - Not applicable - [1d - n/a - n/a]),<BR><BR>TOZINAMERAN [TOZINAMERAN] (S - COVID-19 immunisation - Not applicable - [1d - n/a - Intramuscular use - More in ICSR]),<BR><BR>TOZINAMERAN, FAMTOZINAMERAN [TOZINAMERAN, FAMTOZINAMERAN] (S - COVID-19 immunisation - Not applicable - [1d - n/a - Intramuscular use])","LYRICA [PREGABALIN] (C - Neuralgia - n/a - [n/a - 600mg - Oral use - More in ICSR]),<BR><BR>MEXILETINE [MEXILETINE] (C - Neuralgia - n/a - [n/a - n/a - n/a]),<BR><BR>[AMOXICILLIN, AMOXICILLIN TRIHYDRATE] (C - n/a - n/a - [n/a - 1500mg - Oral use]),<BR><BR>[ANHYDROUS NALOXONE HYDROCHLORIDE, NALOXONE, NALOXONE HYDROCHLORIDE] (C - n/a - n/a - [n/a - 4mg - Nasal use]),<BR><BR>[AZELASTINE HYDROCHLORIDE] (C - n/a - n/a - [n/a - n/a - Nasal use]),<BR><BR>[BACLOFEN, BACLOFEN PH. EUR.] (C - n/a - n/a - [n/a - 30mg - Oral use]),<BR><BR>[BACLOFEN] (C - Neuralgia - n/a - [n/a - n/a - n/a]),<BR><BR>[FLUTICASONE PROPIONATE] (C - Rhinitis - n/a - [n/a - n/a - Nasal use]),<BR><BR>[LOSARTAN, LOSARTAN POTASSIUM] (C - n/a - n/a - [n/a - 50mg - Oral use]),<BR><BR>[METHYLPREDNISOLONE] (C - n/a - n/a - [n/a - n/a - n/a]),<BR><BR>[MEXILETINE HYDROCHLORIDE] (C - n/a - n/a - [n/a - 300mg - Oral use]),<BR><BR>[MONTELUKAST, MONTELUKAST SODIUM] (C - n/a - n/a - [n/a - 10mg - Oral use]),<BR><BR>[OMEPRAZOLE, PANTOPRAZOLE, PANTOPRAZOLE SODIUM] (C - n/a - n/a - [n/a - 80mg - Oral use]),<BR><BR>[OXYCODONE, OXYCODONE HYDROCHLORIDE] (C - n/a - n/a - [n/a - n/a - n/a])","<a target=""_blank"" href=""https://dap.ema.europa.eu/xmlpserver/PHV%20DAP/Reports/ICSR.xdo?_xpf=&_xt=form&SR_ID=10016910353&_xpt=1&_xf=pdf"">ICSR</a>"
EU-EC-10016912619,Spontaneous,2024-02-29 00:00:00,Non Healthcare Professional,European Economic Area,Not available,18-64 Years,Not Specified,No,Female,"Chills (n/a - Not Recovered/Not Resolved - ),<BR><BR>Fatigue (n/a - Not Recovered/Not Resolved - ),<BR><BR>Headache (n/a - Not Recovered/Not Resolved - ),<BR><BR>Myalgia (n/a - Not Recovered/Not Resolved - ),<BR><BR>Pyrexia (n/a - Not Recovered/Not Resolved - )","SPIKEVAX BIVALENT ORIGINAL/OMICRON BA.4-5 [ELASOMERAN, DAVESOMERAN] (S - n/a - n/a - [n/a - n/a - n/a])",Not reported,"<a target=""_blank"" href=""https://dap.ema.europa.eu/xmlpserver/PHV%20DAP/Reports/ICSR.xdo?_xpf=&_xt=form&SR_ID=10016912619&_xpt=1&_xf=pdf"">ICSR</a>"
EU-EC-10016894047,Spontaneous,2024-02-27 00:00:00,Healthcare Professional,Non European Economic Area,Not available,18-64 Years,Not Specified,No,Female,"Erythema (n/a - Not Recovered/Not Resolved - ),<BR><BR>Haematoma (n/a - Not Recovered/Not Resolved - ),<BR><BR>Hypotonia (n/a - Not Recovered/Not Resolved - Other Medically Important Condition),<BR><BR>Inflammation (n/a - Not Recovered/Not Resolved - ),<BR><BR>Irritability (n/a - Not Recovered/Not Resolved - ),<BR><BR>Pain (n/a - Not Recovered/Not Resolved - ),<BR><BR>Swelling (n/a - Not Recovered/Not Resolved - ),<BR><BR>Vaccination complication (n/a - Not Recovered/Not Resolved - )","SPIKEVAX BIVALENT ORIGINAL/OMICRON BA.4-5 [ELASOMERAN, DAVESOMERAN] (S - COVID-19 prophylaxis - Not applicable - [n/a - 1{DF} - n/a])",Not reported,"<a target=""_blank"" href=""https://dap.ema.europa.eu/xmlpserver/PHV%20DAP/Reports/ICSR.xdo?_xpf=&_xt=form&SR_ID=10016894047&_xpt=1&_xf=pdf"">ICSR</a>"
EU-EC-10016894750,Spontaneous,2024-02-27 00:00:00,Healthcare Professional,Non European Economic Area,Not available,65-85 Years,Not Specified,No,Female,"COVID-19 (n/a - Unknown - Other Medically Important Condition),<BR><BR>Drug ineffective (n/a - Unknown - Other Medically Important Condition),<BR><BR>Interchange of vaccine products (n/a - Unknown - Other Medically Important Condition)","COMIRNATY [TOZINAMERAN] (S - COVID-19 immunisation - Not applicable - [1d - n/a - n/a - More in ICSR]),<BR><BR>SPIKEVAX BIVALENT ORIGINAL/OMICRON BA.4-5 [ELASOMERAN, DAVESOMERAN] (S - COVID-19 immunisation - Not applicable - [1d - n/a - n/a])","[ACETYLSALICYLIC ACID] (C - Coronary artery disease - n/a - [n/a - n/a - Oral use]),<BR><BR>[ACETYLSALICYLIC ACID] (C - n/a - n/a - [n/a - 81mg - n/a]),<BR><BR>[ATORVASTATIN, ATORVASTATIN CALCIUM, ATORVASTATIN CALCIUM TRIHYDRATE] (C - n/a - n/a - [n/a - 40mg - n/a - More in ICSR]),<BR><BR>[CANDESARTAN CILEXETIL] (C - n/a - n/a - [n/a - 8mg - n/a]),<BR><BR>[CANDESARTAN, CANDESARTAN CILEXETIL] (C - Hypertension - n/a - [n/a - n/a - Oral use]),<BR><BR>[COLECALCIFEROL] (C - n/a - n/a - [n/a - 1000[iU] - n/a]),<BR><BR>[EZETIMIBE] (C - n/a - n/a - [n/a - 10mg - n/a]),<BR><BR>[FENOFIBRATE] (C - n/a - n/a - [n/a - n/a - Oral use]),<BR><BR>[FOLIC ACID, FERRIC HYDROXIDE POLYMALTOSE COMPLEX] (C - n/a - n/a - [n/a - 30mg - n/a]),<BR><BR>[METOPROLOL TARTRATE] (C - n/a - n/a - [n/a - 25mg - n/a]),<BR><BR>[METOPROLOL, METOPROLOL TARTRATE] (C - Coronary artery disease, Hypertension - n/a - [n/a - n/a - Oral use]),<BR><BR>[PANTOPRAZOLE] (C - n/a - n/a - [n/a - 40mg - n/a])","<a target=""_blank"" href=""https://dap.ema.europa.eu/xmlpserver/PHV%20DAP/Reports/ICSR.xdo?_xpf=&_xt=form&SR_ID=10016894750&_xpt=1&_xf=pdf"">ICSR</a>"
EU-EC-10016898114,Spontaneous,2024-02-27 00:00:00,Healthcare Professional,Non European Economic Area,Not available,18-64 Years,Not Specified,No,Female,"Confusional state (n/a - Not Recovered/Not Resolved - Caused/Prolonged Hospitalisation),<BR><BR>Headache (n/a - Not Recovered/Not Resolved - Caused/Prolonged Hospitalisation),<BR><BR>Seizure (n/a - Not Recovered/Not Resolved - Caused/Prolonged Hospitalisation, Other Medically Important Condition)","SPIKEVAX BIVALENT ORIGINAL/OMICRON BA.4-5 [ELASOMERAN, DAVESOMERAN] (S - COVID-19 prophylaxis - Not applicable - [n/a - 1{DF} - n/a])",Not reported,"<a target=""_blank"" href=""https://dap.ema.europa.eu/xmlpserver/PHV%20DAP/Reports/ICSR.xdo?_xpf=&_xt=form&SR_ID=10016898114&_xpt=1&_xf=pdf"">ICSR</a>"
EU-EC-10016886870,Spontaneous,2024-02-26 00:00:00,Healthcare Professional,Non European Economic Area,Not available,18-64 Years,Not Specified,No,Female,"Erythema (n/a - Not Recovered/Not Resolved - Caused/Prolonged Hospitalisation),<BR><BR>Headache (n/a - Not Recovered/Not Resolved - Caused/Prolonged Hospitalisation),<BR><BR>Pain (n/a - Not Recovered/Not Resolved - Caused/Prolonged Hospitalisation),<BR><BR>Pyrexia (n/a - Not Recovered/Not Resolved - Caused/Prolonged Hospitalisation),<BR><BR>Swelling (n/a - Not Recovered/Not Resolved - Caused/Prolonged Hospitalisation)","SPIKEVAX BIVALENT ORIGINAL/OMICRON BA.4-5 [ELASOMERAN, DAVESOMERAN] (S - COVID-19 prophylaxis - Not applicable - [n/a - 1{DF} - n/a])",Not reported,"<a target=""_blank"" href=""https://dap.ema.europa.eu/xmlpserver/PHV%20DAP/Reports/ICSR.xdo?_xpf=&_xt=form&SR_ID=10016886870&_xpt=1&_xf=pdf"">ICSR</a>"
EU-EC-10016888057,Spontaneous,2024-02-26 00:00:00,Healthcare Professional,Non European Economic Area,Not available,3-11 Years,Not Specified,No,Male,"Anxiety (n/a - Not Recovered/Not Resolved - ),<BR><BR>Syncope (n/a - Not Recovered/Not Resolved - Other Medically Important Condition)","SPIKEVAX BIVALENT ORIGINAL/OMICRON BA.4-5 [ELASOMERAN, DAVESOMERAN] (S - COVID-19 prophylaxis - Not applicable - [n/a - 1{DF} - n/a])",Not reported,"<a target=""_blank"" href=""https://dap.ema.europa.eu/xmlpserver/PHV%20DAP/Reports/ICSR.xdo?_xpf=&_xt=form&SR_ID=10016888057&_xpt=1&_xf=pdf"">ICSR</a>"
EU-EC-10016889148,Spontaneous,2024-02-26 00:00:00,Healthcare Professional,Non European Economic Area,Not available,65-85 Years,Not Specified,No,Female,"Death (1d - Fatal - Results in Death, Other Medically Important Condition)","SPIKEVAX BIVALENT ORIGINAL/OMICRON BA.4-5 [ELASOMERAN, DAVESOMERAN] (S - COVID-19 prophylaxis - Not applicable - [n/a - 1{DF} - n/a])",Not reported,"<a target=""_blank"" href=""https://dap.ema.europa.eu/xmlpserver/PHV%20DAP/Reports/ICSR.xdo?_xpf=&_xt=form&SR_ID=10016889148&_xpt=1&_xf=pdf"">ICSR</a>"
EU-EC-10016892037,Spontaneous,2024-02-26 00:00:00,Healthcare Professional,Non European Economic Area,Not available,65-85 Years,Not Specified,No,Male,"Asthenia (n/a - Recovered/Resolved With Sequelae - ),<BR><BR>COVID-19 (n/a - Recovered/Resolved With Sequelae - ),<BR><BR>Erectile dysfunction (n/a - Recovered/Resolved With Sequelae - Other Medically Important Condition),<BR><BR>Fatigue (n/a - Recovered/Resolved With Sequelae - ),<BR><BR>Myalgia (n/a - Recovered/Resolved With Sequelae - ),<BR><BR>Vaccination complication (n/a - Recovered/Resolved With Sequelae - ),<BR><BR>Weight decreased (n/a - Recovered/Resolved With Sequelae - )","SPIKEVAX BIVALENT ORIGINAL/OMICRON BA.4-5 [ELASOMERAN, DAVESOMERAN] (S - COVID-19 prophylaxis - Not applicable - [n/a - 1{DF} - n/a])",Not reported,"<a target=""_blank"" href=""https://dap.ema.europa.eu/xmlpserver/PHV%20DAP/Reports/ICSR.xdo?_xpf=&_xt=form&SR_ID=10016892037&_xpt=1&_xf=pdf"">ICSR</a>"
EU-EC-10016892916,Spontaneous,2024-02-26 00:00:00,Non Healthcare Professional,European Economic Area,Not available,18-64 Years,Adult,No,Male,"Muscular weakness (n/a - Recovered/Resolved - ),<BR><BR>Peripheral swelling (n/a - Recovered/Resolved - )","SPIKEVAX BIVALENT ORIGINAL/OMICRON BA.4-5 [ELASOMERAN, DAVESOMERAN] (S - COVID-19 immunisation - Not applicable - [n/a - 1{DF} - n/a])",Not reported,"<a target=""_blank"" href=""https://dap.ema.europa.eu/xmlpserver/PHV%20DAP/Reports/ICSR.xdo?_xpf=&_xt=form&SR_ID=10016892916&_xpt=1&_xf=pdf"">ICSR</a>"
EU-EC-10016893357,Spontaneous,2024-02-26 00:00:00,Non Healthcare Professional,Non European Economic Area,Not available,18-64 Years,Not Specified,No,Female,"COVID-19 (n/a - Not Recovered/Not Resolved - Other Medically Important Condition),<BR><BR>Drug ineffective (n/a - Not Recovered/Not Resolved - Other Medically Important Condition),<BR><BR>Interchange of vaccine products (n/a - Unknown - Other Medically Important Condition)","SPIKEVAX BIVALENT ORIGINAL/OMICRON BA.4-5 [ELASOMERAN, DAVESOMERAN] (S - COVID-19 immunisation - Not applicable - [1d - n/a - n/a]),<BR><BR>SPIKEVAX [ELASOMERAN] (S - COVID-19 immunisation - Not applicable - [1d - n/a - n/a]),<BR><BR>TOZINAMERAN [TOZINAMERAN] (S - COVID-19 immunisation - Not applicable - [1d - n/a - n/a])",Not reported,"<a target=""_blank"" href=""https://dap.ema.europa.eu/xmlpserver/PHV%20DAP/Reports/ICSR.xdo?_xpf=&_xt=form&SR_ID=10016893357&_xpt=1&_xf=pdf"">ICSR</a>"
EU-EC-10016872846,Spontaneous,2024-02-22 00:00:00,Healthcare Professional,Non European Economic Area,Not available,65-85 Years,Not Specified,No,Male,"Pulmonary embolism (n/a - Recovering/Resolving - Caused/Prolonged Hospitalisation, Other Medically Important Condition)","SPIKEVAX BIVALENT ORIGINAL/OMICRON BA.4-5 [ELASOMERAN, DAVESOMERAN] (S - COVID-19 prophylaxis - Not applicable - [n/a - 5mL - Intramuscular use])",Not reported,"<a target=""_blank"" href=""https://dap.ema.europa.eu/xmlpserver/PHV%20DAP/Reports/ICSR.xdo?_xpf=&_xt=form&SR_ID=10016872846&_xpt=1&_xf=pdf"">ICSR</a>"
EU-EC-10016864162,Spontaneous,2024-02-21 00:00:00,Non Healthcare Professional,Non European Economic Area,Not available,65-85 Years,Not Specified,No,Male,"COVID-19 (n/a - Unknown - Other Medically Important Condition),<BR><BR>Drug ineffective (n/a - Unknown - Other Medically Important Condition)","SPIKEVAX BIVALENT ORIGINAL/OMICRON BA.4-5 [ELASOMERAN, DAVESOMERAN] (S - COVID-19 immunisation - Not applicable - [1d - n/a - n/a]),<BR><BR>SPIKEVAX [ELASOMERAN] (S - COVID-19 immunisation - Not applicable - [1d - n/a - n/a]),<BR><BR>TOZINAMERAN, FAMTOZINAMERAN [TOZINAMERAN, FAMTOZINAMERAN] (S - COVID-19 immunisation - Not applicable - [1d - n/a - n/a])",Not reported,"<a target=""_blank"" href=""https://dap.ema.europa.eu/xmlpserver/PHV%20DAP/Reports/ICSR.xdo?_xpf=&_xt=form&SR_ID=10016864162&_xpt=1&_xf=pdf"">ICSR</a>"
EU-EC-10016858305,Spontaneous,2024-02-20 00:00:00,Healthcare Professional,Non European Economic Area,Not available,65-85 Years,Not Specified,No,Female,"COVID-19 (8d - Recovered/Resolved - Caused/Prolonged Hospitalisation, Other Medically Important Condition),<BR><BR>Drug ineffective (8d - Recovered/Resolved - Caused/Prolonged Hospitalisation, Other Medically Important Condition),<BR><BR>Interchange of vaccine products (n/a - Recovered/Resolved - Caused/Prolonged Hospitalisation, Other Medically Important Condition)","COMIRNATY [TOZINAMERAN] (S - COVID-19 immunisation - Not applicable - [1d - n/a - n/a]),<BR><BR>SPIKEVAX BIVALENT ORIGINAL/OMICRON BA.4-5 [ELASOMERAN, DAVESOMERAN] (S - COVID-19 immunisation - Not applicable - [1d - n/a - n/a]),<BR><BR>SPIKEVAX XBB.1.5 [ANDUSOMERAN] (S - COVID-19 immunisation - Not applicable - [1d - n/a - n/a]),<BR><BR>SPIKEVAX [ELASOMERAN] (S - COVID-19 immunisation - Not applicable - [1d - n/a - n/a])","TELMISARTAN [TELMISARTAN] (C - Blood pressure abnormal - n/a - [n/a - 80mg - Oral use]),<BR><BR>[AMLODIPINE BESILATE] (C - Blood pressure abnormal - n/a - [n/a - 5mg - Oral use]),<BR><BR>[FLUOXETINE HYDROCHLORIDE] (C - Stress - n/a - [n/a - 20mg - Oral use])","<a target=""_blank"" href=""https://dap.ema.europa.eu/xmlpserver/PHV%20DAP/Reports/ICSR.xdo?_xpf=&_xt=form&SR_ID=10016858305&_xpt=1&_xf=pdf"">ICSR</a>"
EU-EC-10016829863,Spontaneous,2024-02-15 00:00:00,Healthcare Professional,Non European Economic Area,Not available,18-64 Years,Not Specified,No,Male,"Abdominal pain (n/a - Not Recovered/Not Resolved - Other Medically Important Condition),<BR><BR>Anxiety (n/a - Unknown - ),<BR><BR>Arthralgia (n/a - Not Recovered/Not Resolved - ),<BR><BR>Back pain (n/a - Not Recovered/Not Resolved - Disabling),<BR><BR>Chest pain (n/a - Not Recovered/Not Resolved - Other Medically Important Condition),<BR><BR>Gait disturbance (n/a - Unknown - Other Medically Important Condition),<BR><BR>Headache (n/a - Unknown - ),<BR><BR>Hydrocele (n/a - Unknown - Other Medically Important Condition),<BR><BR>Hypoaesthesia (n/a - Unknown - ),<BR><BR>Memory impairment (n/a - Not Recovered/Not Resolved - ),<BR><BR>Neck pain (n/a - Not Recovered/Not Resolved - Disabling),<BR><BR>Neuralgia (n/a - Not Recovered/Not Resolved - ),<BR><BR>Pain in extremity (n/a - Not Recovered/Not Resolved - Disabling),<BR><BR>Paraesthesia (n/a - Not Recovered/Not Resolved - Disabling),<BR><BR>Pudendal canal syndrome (n/a - Not Recovered/Not Resolved - Disabling, Other Medically Important Condition)","SPIKEVAX BIVALENT ORIGINAL/OMICRON BA.4-5 [ELASOMERAN, DAVESOMERAN] (S - COVID-19 prophylaxis - Not applicable - [n/a - 1{DF} - Intramuscular use])","[GABAPENTIN] (C - Product used for unknown indication - n/a - [n/a - n/a - n/a]),<BR><BR>[HYDROMORPHONE HYDROCHLORIDE] (C - Product used for unknown indication - n/a - [n/a - n/a - n/a]),<BR><BR>[LORAZEPAM] (C - Product used for unknown indication - n/a - [n/a - n/a - n/a])","<a target=""_blank"" href=""https://dap.ema.europa.eu/xmlpserver/PHV%20DAP/Reports/ICSR.xdo?_xpf=&_xt=form&SR_ID=10016829863&_xpt=1&_xf=pdf"">ICSR</a>"
EU-EC-10016817821,Spontaneous,2024-02-14 00:00:00,Healthcare Professional,Non European Economic Area,Not available,More than 85 Years,Not Specified,No,Male,"Interstitial lung disease (n/a - Fatal - Results in Death, Caused/Prolonged Hospitalisation, Other Medically Important Condition),<BR><BR>Shock (n/a - Fatal - Results in Death, Other Medically Important Condition)","SPIKEVAX BIVALENT ORIGINAL/OMICRON BA.4-5 [ELASOMERAN, DAVESOMERAN] (S - COVID-19 prophylaxis - Not applicable - [n/a - 1{DF} - Intramuscular use])",Not reported,"<a target=""_blank"" href=""https://dap.ema.europa.eu/xmlpserver/PHV%20DAP/Reports/ICSR.xdo?_xpf=&_xt=form&SR_ID=10016817821&_xpt=1&_xf=pdf"">ICSR</a>"
EU-EC-10016799316,Spontaneous,2024-02-09 00:00:00,Non Healthcare Professional,Non European Economic Area,Not available,65-85 Years,Not Specified,No,Male,"Muscle twitching (n/a - Not Recovered/Not Resolved - ),<BR><BR>Oedema peripheral (n/a - Unknown - ),<BR><BR>Pain in extremity (n/a - Not Recovered/Not Resolved - ),<BR><BR>Peripheral coldness (n/a - Not Recovered/Not Resolved - ),<BR><BR>Urinary tract infection (n/a - Not Recovered/Not Resolved - Caused/Prolonged Hospitalisation),<BR><BR>Urinary tract infection (n/a - Unknown - Caused/Prolonged Hospitalisation)","SPIKEVAX BIVALENT ORIGINAL/OMICRON BA.4-5 [ELASOMERAN, DAVESOMERAN] (S - COVID-19 prophylaxis - Not applicable - [n/a - 1{DF} - n/a])",[SODIUM HYALURONATE] (C - Product used for unknown indication - n/a - [n/a - n/a - n/a]),"<a target=""_blank"" href=""https://dap.ema.europa.eu/xmlpserver/PHV%20DAP/Reports/ICSR.xdo?_xpf=&_xt=form&SR_ID=10016799316&_xpt=1&_xf=pdf"">ICSR</a>"
EU-EC-10016784687,Spontaneous,2024-02-08 00:00:00,Healthcare Professional,Non European Economic Area,Not available,65-85 Years,Not Specified,No,Female,"Cerebral artery embolism (n/a - Recovering/Resolving - Caused/Prolonged Hospitalisation, Other Medically Important Condition),<BR><BR>Thrombosis with thrombocytopenia syndrome (n/a - Recovering/Resolving - Caused/Prolonged Hospitalisation, Other Medically Important Condition)","SPIKEVAX BIVALENT ORIGINAL/OMICRON BA.4-5 [ELASOMERAN, DAVESOMERAN] (S - COVID-19 prophylaxis - Not applicable - [n/a - 1{DF} - Intramuscular use]),<BR><BR>SPIKEVAX XBB.1.5 [ANDUSOMERAN] (S - COVID-19 prophylaxis - Not applicable - [n/a - 1{DF} - n/a]),<BR><BR>SPIKEVAX [ELASOMERAN] (S - COVID-19 prophylaxis - Not applicable - [n/a - 1{DF} - Intramuscular use])","IRBESARTAN [IRBESARTAN] (C - Product used for unknown indication - n/a - [n/a - n/a - n/a]),<BR><BR>[CILOSTAZOL] (C - Product used for unknown indication - n/a - [n/a - n/a - n/a]),<BR><BR>[ETIZOLAM] (C - Product used for unknown indication - n/a - [n/a - n/a - n/a]),<BR><BR>[PITAVASTATIN] (C - Product used for unknown indication - n/a - [n/a - n/a - n/a])","<a target=""_blank"" href=""https://dap.ema.europa.eu/xmlpserver/PHV%20DAP/Reports/ICSR.xdo?_xpf=&_xt=form&SR_ID=10016784687&_xpt=1&_xf=pdf"">ICSR</a>"
EU-EC-10016760455,Spontaneous,2024-02-06 00:00:00,Healthcare Professional,Non European Economic Area,Not available,65-85 Years,Not Specified,No,Male,"Fatigue (n/a - Recovering/Resolving - Caused/Prolonged Hospitalisation),<BR><BR>Injection site pain (n/a - Recovering/Resolving - Caused/Prolonged Hospitalisation),<BR><BR>Malaise (n/a - Recovering/Resolving - Caused/Prolonged Hospitalisation),<BR><BR>Myalgia (n/a - Recovering/Resolving - Caused/Prolonged Hospitalisation),<BR><BR>Vestibular neuronitis (n/a - Recovering/Resolving - Caused/Prolonged Hospitalisation, Other Medically Important Condition)","SPIKEVAX BIVALENT ORIGINAL/OMICRON BA.4-5 [ELASOMERAN, DAVESOMERAN] (S - COVID-19 prophylaxis - Not applicable - [n/a - 1{DF} - n/a])",Not reported,"<a target=""_blank"" href=""https://dap.ema.europa.eu/xmlpserver/PHV%20DAP/Reports/ICSR.xdo?_xpf=&_xt=form&SR_ID=10016760455&_xpt=1&_xf=pdf"">ICSR</a>"
EU-EC-10016765185,Spontaneous,2024-02-06 00:00:00,Non Healthcare Professional,Non European Economic Area,Not available,65-85 Years,Not Specified,No,Female,"Aneurysm (n/a - Unknown - Caused/Prolonged Hospitalisation, Other Medically Important Condition),<BR><BR>COVID-19 (n/a - Unknown - ),<BR><BR>Conjunctival haemorrhage (n/a - Unknown - ),<BR><BR>Transient ischaemic attack (n/a - Unknown - Other Medically Important Condition),<BR><BR>Ventricular tachycardia (n/a - Unknown - Caused/Prolonged Hospitalisation, Other Medically Important Condition)","SPIKEVAX BIVALENT ORIGINAL/OMICRON BA.4-5 [ELASOMERAN, DAVESOMERAN] (S - COVID-19 prophylaxis - Not applicable - [n/a - 1{DF} - n/a])","[ATENOLOL, ATENOLOL BP] (C - Hypertension - n/a - [n/a - 25mg - Oral use])","<a target=""_blank"" href=""https://dap.ema.europa.eu/xmlpserver/PHV%20DAP/Reports/ICSR.xdo?_xpf=&_xt=form&SR_ID=10016765185&_xpt=1&_xf=pdf"">ICSR</a>"
EU-EC-10016747256,Spontaneous,2024-02-02 00:00:00,Healthcare Professional,Non European Economic Area,Not available,More than 85 Years,Not Specified,No,Male,"Dyspnoea (n/a - Recovering/Resolving - Caused/Prolonged Hospitalisation),<BR><BR>Pulmonary hypertension (n/a - Recovering/Resolving - Other Medically Important Condition)","SPIKEVAX BIVALENT ORIGINAL/OMICRON BA.4-5 [ELASOMERAN, DAVESOMERAN] (S - COVID-19 prophylaxis - Not applicable - [n/a - 1{DF} - n/a])",Not reported,"<a target=""_blank"" href=""https://dap.ema.europa.eu/xmlpserver/PHV%20DAP/Reports/ICSR.xdo?_xpf=&_xt=form&SR_ID=10016747256&_xpt=1&_xf=pdf"">ICSR</a>"
EU-EC-10016733785,Spontaneous,2024-02-01 00:00:00,Healthcare Professional,Non European Economic Area,Not available,65-85 Years,Not Specified,No,Female,"Cardiac flutter (n/a - Recovered/Resolved - Other Medically Important Condition),<BR><BR>Erythema (1wk - Recovered/Resolved - ),<BR><BR>Palpitations (1wk - Recovered/Resolved - ),<BR><BR>Peripheral swelling (1wk - Recovered/Resolved - ),<BR><BR>Tachycardia (n/a - Recovered/Resolved - )","SPIKEVAX BIVALENT ORIGINAL/OMICRON BA.4-5 [ELASOMERAN, DAVESOMERAN] (S - COVID-19 prophylaxis - Not applicable - [n/a - 1{DF} - n/a])",Not reported,"<a target=""_blank"" href=""https://dap.ema.europa.eu/xmlpserver/PHV%20DAP/Reports/ICSR.xdo?_xpf=&_xt=form&SR_ID=10016733785&_xpt=1&_xf=pdf"">ICSR</a>"
EU-EC-10016740666,Spontaneous,2024-02-01 00:00:00,Non Healthcare Professional,Non European Economic Area,Not available,65-85 Years,Not Specified,No,Female,"COVID-19 (n/a - Unknown - Other Medically Important Condition),<BR><BR>Drug ineffective (n/a - Unknown - Other Medically Important Condition),<BR><BR>Interchange of vaccine products (n/a - Unknown - Other Medically Important Condition)","SPIKEVAX BIVALENT ORIGINAL/OMICRON BA.4-5 [ELASOMERAN, DAVESOMERAN] (S - COVID-19 immunisation - Not applicable - [1d - n/a - n/a - More in ICSR]),<BR><BR>SPIKEVAX [ELASOMERAN] (S - COVID-19 immunisation - Not applicable - [1d - n/a - n/a]),<BR><BR>TOZINAMERAN [TOZINAMERAN] (S - COVID-19 immunisation - Not applicable - [1d - n/a - Intramuscular use])",Not reported,"<a target=""_blank"" href=""https://dap.ema.europa.eu/xmlpserver/PHV%20DAP/Reports/ICSR.xdo?_xpf=&_xt=form&SR_ID=10016740666&_xpt=1&_xf=pdf"">ICSR</a>"
EU-EC-10016727281,Spontaneous,2024-01-31 00:00:00,Non Healthcare Professional,Non European Economic Area,Not available,18-64 Years,Not Specified,No,Female,"COVID-19 (n/a - Unknown - Other Medically Important Condition),<BR><BR>Drug ineffective (n/a - Unknown - Other Medically Important Condition),<BR><BR>Interchange of vaccine products (n/a - Unknown - Other Medically Important Condition)","SPIKEVAX BIVALENT ORIGINAL/OMICRON BA.4-5 [ELASOMERAN, DAVESOMERAN] (S - COVID-19 immunisation - Not applicable - [n/a - n/a - n/a]),<BR><BR>SPIKEVAX [ELASOMERAN] (S - COVID-19 immunisation - Not applicable - [n/a - n/a - n/a]),<BR><BR>TOZINAMERAN [TOZINAMERAN] (S - COVID-19 immunisation - Not applicable - [n/a - n/a - n/a])","[AMLODIPINE, AMLODIPINE BESILATE] (C - n/a - n/a - [1034d - n/a - n/a]),<BR><BR>[ISOSORBIDE] (C - n/a - n/a - [1034d - n/a - n/a]),<BR><BR>[NEBIVOLOL, NEBIVOLOL HYDROCHLORIDE] (C - n/a - n/a - [1034d - n/a - n/a]),<BR><BR>[ROSUVASTATIN, ROSUVASTATIN CALCIUM] (C - n/a - n/a - [1022d - n/a - n/a])","<a target=""_blank"" href=""https://dap.ema.europa.eu/xmlpserver/PHV%20DAP/Reports/ICSR.xdo?_xpf=&_xt=form&SR_ID=10016727281&_xpt=1&_xf=pdf"">ICSR</a>"
EU-EC-10016703613,Spontaneous,2024-01-26 00:00:00,Non Healthcare Professional,European Economic Area,Not available,18-64 Years,Not Specified,No,Female,"Blood pressure abnormal (n/a - Not Recovered/Not Resolved - Disabling),<BR><BR>Chronic disease (n/a - Not Recovered/Not Resolved - Disabling),<BR><BR>Condition aggravated (n/a - Not Recovered/Not Resolved - Disabling),<BR><BR>Pericardial effusion (n/a - Not Recovered/Not Resolved - Disabling),<BR><BR>Pericarditis (n/a - Not Recovered/Not Resolved - Disabling),<BR><BR>Pyrexia (n/a - Not Recovered/Not Resolved - Disabling)","SPIKEVAX BIVALENT ORIGINAL/OMICRON BA.4-5 [ELASOMERAN, DAVESOMERAN] (S - n/a - n/a - [n/a - n/a - n/a]),<BR><BR>SPIKEVAX [ELASOMERAN] (S - n/a - n/a - [n/a - n/a - n/a])",ELIQUIS [APIXABAN] (C - n/a - n/a - [n/a - n/a - n/a]),"<a target=""_blank"" href=""https://dap.ema.europa.eu/xmlpserver/PHV%20DAP/Reports/ICSR.xdo?_xpf=&_xt=form&SR_ID=10016703613&_xpt=1&_xf=pdf"">ICSR</a>"
EU-EC-10016698653,Spontaneous,2024-01-25 00:00:00,Non Healthcare Professional,Non European Economic Area,Not available,65-85 Years,Not Specified,No,Female,"COVID-19 (n/a - Not Recovered/Not Resolved - Other Medically Important Condition),<BR><BR>Drug ineffective (n/a - Not Recovered/Not Resolved - Other Medically Important Condition),<BR><BR>Interchange of vaccine products (n/a - Not Recovered/Not Resolved - Other Medically Important Condition)","SPIKEVAX BIVALENT ORIGINAL/OMICRON BA.4-5 [ELASOMERAN, DAVESOMERAN] (S - COVID-19 immunisation - Not applicable - [1d - n/a - n/a]),<BR><BR>SPIKEVAX [ELASOMERAN] (S - COVID-19 immunisation - Not applicable - [1d - n/a - n/a]),<BR><BR>TOZINAMERAN [TOZINAMERAN] (S - COVID-19 immunisation - Not applicable - [1d - n/a - n/a]),<BR><BR>TOZINAMERAN, FAMTOZINAMERAN [TOZINAMERAN, FAMTOZINAMERAN] (S - COVID-19 immunisation - Not applicable - [1d - n/a - n/a])",Not reported,"<a target=""_blank"" href=""https://dap.ema.europa.eu/xmlpserver/PHV%20DAP/Reports/ICSR.xdo?_xpf=&_xt=form&SR_ID=10016698653&_xpt=1&_xf=pdf"">ICSR</a>"
EU-EC-10016674762,Spontaneous,2024-01-23 00:00:00,Healthcare Professional,Non European Economic Area,Not available,18-64 Years,Not Specified,No,Male,"Hypoaesthesia (n/a - Recovering/Resolving - Caused/Prolonged Hospitalisation),<BR><BR>Muscular weakness (n/a - Recovering/Resolving - Caused/Prolonged Hospitalisation),<BR><BR>Myalgia (n/a - Recovering/Resolving - Caused/Prolonged Hospitalisation),<BR><BR>Pain in extremity (n/a - Recovering/Resolving - Caused/Prolonged Hospitalisation),<BR><BR>Pyrexia (n/a - Recovering/Resolving - Caused/Prolonged Hospitalisation),<BR><BR>Sensory disturbance (n/a - Recovering/Resolving - Caused/Prolonged Hospitalisation)","SPIKEVAX BIVALENT ORIGINAL/OMICRON BA.4-5 [ELASOMERAN, DAVESOMERAN] (S - COVID-19 prophylaxis - Not applicable - [n/a - .5mL - Intramuscular use])",Not reported,"<a target=""_blank"" href=""https://dap.ema.europa.eu/xmlpserver/PHV%20DAP/Reports/ICSR.xdo?_xpf=&_xt=form&SR_ID=10016674762&_xpt=1&_xf=pdf"">ICSR</a>"
EU-EC-10016663749,Spontaneous,2024-01-22 00:00:00,Non Healthcare Professional,Non European Economic Area,Not available,65-85 Years,Not Specified,No,Female,"Atypical pneumonia (n/a - Recovered/Resolved - Other Medically Important Condition),<BR><BR>COVID-19 (n/a - Recovered/Resolved - ),<BR><BR>Flushing (1d - Recovered/Resolved - ),<BR><BR>Gait disturbance (1d - Recovered/Resolved - ),<BR><BR>Hypertension (1d - Recovered/Resolved - ),<BR><BR>Palpitations (1d - Recovered/Resolved - ),<BR><BR>Tachycardia (n/a - Unknown - )","SPIKEVAX BIVALENT ORIGINAL/OMICRON BA.4-5 [ELASOMERAN, DAVESOMERAN] (S - COVID-19 prophylaxis - Not applicable - [n/a - 1{DF} - n/a]),<BR><BR>[A/HONG KONG/4801/2014 (H3N2)-LIKE STRAIN (A/HONG KONG/4801/2014, X-263B), B/BRISBANE/60/2008-LIKE STRAIN (B/BRISBANE/60/2008, WILD TYPE), A/CALIFORNIA/7/2009 (H1N1)PDM09-DERIVED STRAIN USED (NYMC X-181), A/HONG KONG/4801/2014 (H3N2)-LIKE STRAIN (A/HONG KONG/4801/2014, X-263B), B/BRISBANE/60/2008-LIKE STRAIN (B/BRISBANE/60/2008, WILD TYPE), A/MICHIGAN/45/2015 (H1N1)PDM09-LIKE STRAIN (A/SINGAPORE/GP1908/2015, IVR-180), INFLUENZA VACCINE] (S - Product used for unknown indication - Unknown - [n/a - 1{DF} - n/a])",Not reported,"<a target=""_blank"" href=""https://dap.ema.europa.eu/xmlpserver/PHV%20DAP/Reports/ICSR.xdo?_xpf=&_xt=form&SR_ID=10016663749&_xpt=1&_xf=pdf"">ICSR</a>"
EU-EC-10016668428,Spontaneous,2024-01-22 00:00:00,Healthcare Professional,Non European Economic Area,Not available,18-64 Years,Not Specified,No,Female,Blindness unilateral (n/a - Not Recovered/Not Resolved - Other Medically Important Condition),"SPIKEVAX BIVALENT ORIGINAL/OMICRON BA.4-5 [ELASOMERAN, DAVESOMERAN] (S - COVID-19 prophylaxis - Not applicable - [n/a - .5mL - Intramuscular use])",Not reported,"<a target=""_blank"" href=""https://dap.ema.europa.eu/xmlpserver/PHV%20DAP/Reports/ICSR.xdo?_xpf=&_xt=form&SR_ID=10016668428&_xpt=1&_xf=pdf"">ICSR</a>"
EU-EC-10016671376,Spontaneous,2024-01-22 00:00:00,Non Healthcare Professional,Non European Economic Area,Not available,18-64 Years,Not Specified,No,Female,"Arthralgia (n/a - Not Recovered/Not Resolved - Disabling),<BR><BR>Hypersensitivity (n/a - Unknown - ),<BR><BR>Myalgia (n/a - Not Recovered/Not Resolved - Disabling),<BR><BR>Pain (n/a - Not Recovered/Not Resolved - Disabling),<BR><BR>Pain (n/a - Unknown - ),<BR><BR>Paraesthesia (n/a - Not Recovered/Not Resolved - Disabling),<BR><BR>Skin burning sensation (n/a - Not Recovered/Not Resolved - Disabling)","SPIKEVAX BIVALENT ORIGINAL/OMICRON BA.4-5 [ELASOMERAN, DAVESOMERAN] (S - COVID-19 prophylaxis - Not applicable - [n/a - 1{DF} - n/a])",Not reported,"<a target=""_blank"" href=""https://dap.ema.europa.eu/xmlpserver/PHV%20DAP/Reports/ICSR.xdo?_xpf=&_xt=form&SR_ID=10016671376&_xpt=1&_xf=pdf"">ICSR</a>"
EU-EC-10016661950,Spontaneous,2024-01-20 00:00:00,Non Healthcare Professional,Non European Economic Area,Not available,18-64 Years,Not Specified,No,Female,"Angioedema (n/a - Not Recovered/Not Resolved - Other Medically Important Condition),<BR><BR>Post-acute COVID-19 syndrome (n/a - Not Recovered/Not Resolved - Other Medically Important Condition),<BR><BR>Urticaria (n/a - Not Recovered/Not Resolved - )","SPIKEVAX BIVALENT ORIGINAL/OMICRON BA.4-5 [ELASOMERAN, DAVESOMERAN] (S - COVID-19 prophylaxis - Not applicable - [n/a - .5mL - Intramuscular use]),<BR><BR>[A/HONG KONG/4801/2014 (H3N2)-LIKE STRAIN (A/HONG KONG/4801/2014, X-263B), B/BRISBANE/60/2008-LIKE STRAIN (B/BRISBANE/60/2008, WILD TYPE), A/CALIFORNIA/7/2009 (H1N1)PDM09-DERIVED STRAIN USED (NYMC X-181), A/HONG KONG/4801/2014 (H3N2)-LIKE STRAIN (A/HONG KONG/4801/2014, X-263B), B/BRISBANE/60/2008-LIKE STRAIN (B/BRISBANE/60/2008, WILD TYPE), A/MICHIGAN/45/2015 (H1N1)PDM09-LIKE STRAIN (A/SINGAPORE/GP1908/2015, IVR-180), INFLUENZA VACCINE] (S - n/a - Not applicable - [n/a - 1{DF} - n/a])",Not reported,"<a target=""_blank"" href=""https://dap.ema.europa.eu/xmlpserver/PHV%20DAP/Reports/ICSR.xdo?_xpf=&_xt=form&SR_ID=10016661950&_xpt=1&_xf=pdf"">ICSR</a>"
EU-EC-10016654913,Spontaneous,2024-01-19 00:00:00,Healthcare Professional,Non European Economic Area,Not available,65-85 Years,Not Specified,No,Male,"Guillain-Barre syndrome (109d - Recovered/Resolved - Caused/Prolonged Hospitalisation, Other Medically Important Condition)","SPIKEVAX BIVALENT ORIGINAL/OMICRON BA.4-5 [ELASOMERAN, DAVESOMERAN] (S - COVID-19 prophylaxis - Not applicable - [n/a - 1{DF} - Intramuscular use]),<BR><BR>SPIKEVAX [ELASOMERAN] (S - COVID-19 prophylaxis - Not applicable - [n/a - 1{DF} - Intramuscular use])","[AMLODIPINE, AMLODIPINE BESILATE, AMLODIPINE MALEATE, AMLODIPINE MESILATE] (C - Product used for unknown indication - n/a - [n/a - 1{DF} - n/a])","<a target=""_blank"" href=""https://dap.ema.europa.eu/xmlpserver/PHV%20DAP/Reports/ICSR.xdo?_xpf=&_xt=form&SR_ID=10016654913&_xpt=1&_xf=pdf"">ICSR</a>"
EU-EC-10016658898,Spontaneous,2024-01-19 00:00:00,Healthcare Professional,Non European Economic Area,Not available,65-85 Years,Not Specified,No,Male,"Facial paralysis (15d - Recovered/Resolved With Sequelae - Caused/Prolonged Hospitalisation, Other Medically Important Condition)","SPIKEVAX BIVALENT ORIGINAL/OMICRON BA.4-5 [ELASOMERAN, DAVESOMERAN] (S - COVID-19 prophylaxis - Not applicable - [n/a - 1{DF} - Intramuscular use])","BRINZOLAMIDE [BRINZOLAMIDE] (C - Product used for unknown indication - n/a - [n/a - n/a - n/a]),<BR><BR>EDOXABAN [EDOXABAN] (C - Product used for unknown indication - n/a - [n/a - 1{DF} - n/a]),<BR><BR>LATANOPROST [LATANOPROST] (C - Product used for unknown indication - n/a - [n/a - n/a - n/a]),<BR><BR>[BENZBROMARONE] (C - Product used for unknown indication - n/a - [n/a - 1{DF} - n/a]),<BR><BR>[BISOPROLOL, BISOPROLOL FUMARATE, BISOPROLOL HEMIFUMARATE] (C - Product used for unknown indication - n/a - [n/a - 1{DF} - n/a]),<BR><BR>[RIPASUDIL] (C - Product used for unknown indication - n/a - [n/a - n/a - n/a])","<a target=""_blank"" href=""https://dap.ema.europa.eu/xmlpserver/PHV%20DAP/Reports/ICSR.xdo?_xpf=&_xt=form&SR_ID=10016658898&_xpt=1&_xf=pdf"">ICSR</a>"
EU-EC-10016647837,Spontaneous,2024-01-18 00:00:00,Healthcare Professional,Non European Economic Area,Not available,65-85 Years,Not Specified,No,Female,"Drug ineffective (n/a - Recovering/Resolving - Other Medically Important Condition),<BR><BR>Interchange of vaccine products (n/a - Recovering/Resolving - Other Medically Important Condition),<BR><BR>Off label use (n/a - Recovering/Resolving - Other Medically Important Condition),<BR><BR>Sudden hearing loss (n/a - Recovering/Resolving - Other Medically Important Condition),<BR><BR>Suspected COVID-19 (n/a - Recovering/Resolving - Other Medically Important Condition)","SPIKEVAX BIVALENT ORIGINAL/OMICRON BA.4-5 [ELASOMERAN, DAVESOMERAN] (S - COVID-19 immunisation - Not applicable - [n/a - 1{DF} - n/a]),<BR><BR>SPIKEVAX [ELASOMERAN] (S - COVID-19 immunisation - Not applicable - [n/a - 1{DF} - Intramuscular use - More in ICSR]),<BR><BR>TOZINAMERAN [TOZINAMERAN] (S - COVID-19 immunisation - Unknown - [n/a - 1{DF} - Intramuscular use])",Not reported,"<a target=""_blank"" href=""https://dap.ema.europa.eu/xmlpserver/PHV%20DAP/Reports/ICSR.xdo?_xpf=&_xt=form&SR_ID=10016647837&_xpt=1&_xf=pdf"">ICSR</a>"
EU-EC-10016640884,Spontaneous,2024-01-17 00:00:00,Non Healthcare Professional,Non European Economic Area,Not available,Not Specified,Elderly,No,Female,"COVID-19 (n/a - Unknown - ),<BR><BR>Fatigue (n/a - Unknown - ),<BR><BR>Headache (n/a - Unknown - ),<BR><BR>Influenza (n/a - Unknown - Other Medically Important Condition),<BR><BR>Pain (n/a - Unknown - )","SPIKEVAX BIVALENT ORIGINAL/OMICRON BA.4-5 [ELASOMERAN, DAVESOMERAN] (S - COVID-19 prophylaxis - Not applicable - [n/a - 1{DF} - n/a]),<BR><BR>[A/HONG KONG/4801/2014 (H3N2)-LIKE STRAIN (A/HONG KONG/4801/2014, X-263B), B/BRISBANE/60/2008-LIKE STRAIN (B/BRISBANE/60/2008, WILD TYPE), A/CALIFORNIA/7/2009 (H1N1)PDM09-DERIVED STRAIN USED (NYMC X-181), A/HONG KONG/4801/2014 (H3N2)-LIKE STRAIN (A/HONG KONG/4801/2014, X-263B), B/BRISBANE/60/2008-LIKE STRAIN (B/BRISBANE/60/2008, WILD TYPE), A/MICHIGAN/45/2015 (H1N1)PDM09-LIKE STRAIN (A/SINGAPORE/GP1908/2015, IVR-180), INFLUENZA VACCINE] (S - n/a - Not applicable - [n/a - 1{DF} - n/a])",Not reported,"<a target=""_blank"" href=""https://dap.ema.europa.eu/xmlpserver/PHV%20DAP/Reports/ICSR.xdo?_xpf=&_xt=form&SR_ID=10016640884&_xpt=1&_xf=pdf"">ICSR</a>"
EU-EC-10016630401,Spontaneous,2024-01-16 00:00:00,Healthcare Professional,Non European Economic Area,Not available,18-64 Years,Not Specified,No,Female,"Anaphylactic reaction (n/a - Not Recovered/Not Resolved - Other Medically Important Condition),<BR><BR>Dyspnoea (n/a - Unknown - ),<BR><BR>Hypersensitivity (n/a - Unknown - ),<BR><BR>Impaired healing (n/a - Unknown - ),<BR><BR>Sinusitis (n/a - Not Recovered/Not Resolved - )","SPIKEVAX BIVALENT ORIGINAL/OMICRON BA.4-5 [ELASOMERAN, DAVESOMERAN] (S - COVID-19 prophylaxis - Not applicable - [n/a - 1{DF} - n/a])",Not reported,"<a target=""_blank"" href=""https://dap.ema.europa.eu/xmlpserver/PHV%20DAP/Reports/ICSR.xdo?_xpf=&_xt=form&SR_ID=10016630401&_xpt=1&_xf=pdf"">ICSR</a>"
EU-EC-10016630850,Spontaneous,2024-01-16 00:00:00,Healthcare Professional,Non European Economic Area,"Ito T, Kanai O, Saito Z, Imakita T, Oi I, Fujita K, et al. A case of small cell lung cancer in which aortitis developed after administration of pegfilgrastim. Japanese Journal of Lung Cancer/The 64th Annual Meeting of the Japan Lung Cancer. 2023;63(5):591. doi:10.1159/000534931 Ito T, Kanai O, Saito Z, Imakita T, Oi I, Fujita K, et al. Pegfilgrastim-induced Aortitis in a patient with small-cell lung cancer who received immunotherapy combined with chemotherapy. Case Rep Oncol. 2023;16(1):1466-74. doi:10.1159/000534931",65-85 Years,Not Specified,No,Male,"Aortitis (n/a - Recovering/Resolving - Caused/Prolonged Hospitalisation, Other Medically Important Condition),<BR><BR>Cytopenia (n/a - Unknown - Caused/Prolonged Hospitalisation, Other Medically Important Condition),<BR><BR>Ear pain (n/a - Recovering/Resolving - Caused/Prolonged Hospitalisation),<BR><BR>Pyrexia (n/a - Recovered/Resolved - Caused/Prolonged Hospitalisation)","PEGFILGRASTIM [PEGFILGRASTIM] (S - Product used for unknown indication - n/a - [n/a - n/a - n/a]),<BR><BR>SPIKEVAX BIVALENT ORIGINAL/OMICRON BA.4-5 [ELASOMERAN, DAVESOMERAN] (S - COVID-19 prophylaxis - Not applicable - [n/a - 1{DF} - n/a])","DURVALUMAB [DURVALUMAB] (C - Small cell lung cancer extensive stage - n/a - [n/a - n/a - n/a]),<BR><BR>SILODOSIN [SILODOSIN] (C - Product used for unknown indication - n/a - [n/a - n/a - n/a]),<BR><BR>[BISOPROLOL FUMARATE] (C - Product used for unknown indication - n/a - [n/a - n/a - n/a]),<BR><BR>[CARBOPLATIN] (C - Small cell lung cancer extensive stage - n/a - [n/a - n/a - n/a]),<BR><BR>[EDOXABAN TOSYLATE] (C - Product used for unknown indication - n/a - [n/a - n/a - n/a]),<BR><BR>[ETOPOSIDE] (C - Small cell lung cancer extensive stage - n/a - [n/a - n/a - n/a])","<a target=""_blank"" href=""https://dap.ema.europa.eu/xmlpserver/PHV%20DAP/Reports/ICSR.xdo?_xpf=&_xt=form&SR_ID=10016630850&_xpt=1&_xf=pdf"">ICSR</a>"
EU-EC-10016617895,Spontaneous,2024-01-12 00:00:00,Healthcare Professional,Non European Economic Area,Not available,18-64 Years,Not Specified,No,Male,Urticaria chronic (n/a - Unknown - Other Medically Important Condition),"SPIKEVAX BIVALENT ORIGINAL/OMICRON BA.4-5 [ELASOMERAN, DAVESOMERAN] (S - COVID-19 prophylaxis - Not applicable - [n/a - .5mL - Intramuscular use])",Not reported,"<a target=""_blank"" href=""https://dap.ema.europa.eu/xmlpserver/PHV%20DAP/Reports/ICSR.xdo?_xpf=&_xt=form&SR_ID=10016617895&_xpt=1&_xf=pdf"">ICSR</a>"
EU-EC-10016605970,Spontaneous,2024-01-11 00:00:00,Non Healthcare Professional,Non European Economic Area,Not available,65-85 Years,Not Specified,No,Female,"COVID-19 (n/a - Unknown - Other Medically Important Condition),<BR><BR>Drug ineffective (n/a - Unknown - Other Medically Important Condition),<BR><BR>Interchange of vaccine products (n/a - Unknown - Other Medically Important Condition)","SPIKEVAX BIVALENT ORIGINAL/OMICRON BA.4-5 [ELASOMERAN, DAVESOMERAN] (S - COVID-19 immunisation - Not applicable - [n/a - n/a - n/a]),<BR><BR>SPIKEVAX [ELASOMERAN] (S - COVID-19 immunisation - Not applicable - [n/a - n/a - n/a]),<BR><BR>TOZINAMERAN [TOZINAMERAN] (S - COVID-19 immunisation - Not applicable - [n/a - n/a - n/a]),<BR><BR>TOZINAMERAN, FAMTOZINAMERAN [TOZINAMERAN, FAMTOZINAMERAN] (S - COVID-19 immunisation - Not applicable - [n/a - n/a - n/a])",Not reported,"<a target=""_blank"" href=""https://dap.ema.europa.eu/xmlpserver/PHV%20DAP/Reports/ICSR.xdo?_xpf=&_xt=form&SR_ID=10016605970&_xpt=1&_xf=pdf"">ICSR</a>"
EU-EC-10016563761,Spontaneous,2024-01-03 00:00:00,Healthcare Professional,Non European Economic Area,Not available,65-85 Years,Not Specified,No,Male,Coagulopathy (n/a - Not Recovered/Not Resolved - Caused/Prolonged Hospitalisation),"SPIKEVAX BIVALENT ORIGINAL/OMICRON BA.4-5 [ELASOMERAN, DAVESOMERAN] (S - COVID-19 prophylaxis - Not applicable - [n/a - 1{DF} - n/a])",Not reported,"<a target=""_blank"" href=""https://dap.ema.europa.eu/xmlpserver/PHV%20DAP/Reports/ICSR.xdo?_xpf=&_xt=form&SR_ID=10016563761&_xpt=1&_xf=pdf"">ICSR</a>"
EU-EC-10016564227,Spontaneous,2024-01-03 00:00:00,Healthcare Professional,Non European Economic Area,Not available,65-85 Years,Not Specified,No,Male,"Febrile convulsion (n/a - Not Recovered/Not Resolved - Other Medically Important Condition),<BR><BR>Pain (n/a - Not Recovered/Not Resolved - ),<BR><BR>Seizure (n/a - Not Recovered/Not Resolved - Other Medically Important Condition)","SPIKEVAX BIVALENT ORIGINAL/OMICRON BA.4-5 [ELASOMERAN, DAVESOMERAN] (S - COVID-19 prophylaxis - Not applicable - [n/a - 1{DF} - n/a])",Not reported,"<a target=""_blank"" href=""https://dap.ema.europa.eu/xmlpserver/PHV%20DAP/Reports/ICSR.xdo?_xpf=&_xt=form&SR_ID=10016564227&_xpt=1&_xf=pdf"">ICSR</a>"
EU-EC-10016566696,Spontaneous,2024-01-03 00:00:00,Healthcare Professional,Non European Economic Area,Not available,65-85 Years,Not Specified,No,Female,"Erythema (n/a - Recovered/Resolved - Other Medically Important Condition),<BR><BR>Headache (n/a - Recovered/Resolved - Other Medically Important Condition),<BR><BR>Induration (n/a - Recovered/Resolved - Other Medically Important Condition),<BR><BR>Local reaction (n/a - Recovered/Resolved - Other Medically Important Condition),<BR><BR>Pain (n/a - Recovered/Resolved - Other Medically Important Condition),<BR><BR>Pyrexia (n/a - Recovered/Resolved - Other Medically Important Condition),<BR><BR>Swelling (n/a - Recovered/Resolved - Other Medically Important Condition)","SPIKEVAX BIVALENT ORIGINAL/OMICRON BA.4-5 [ELASOMERAN, DAVESOMERAN] (S - COVID-19 prophylaxis - Not applicable - [n/a - 1{DF} - n/a])",Not reported,"<a target=""_blank"" href=""https://dap.ema.europa.eu/xmlpserver/PHV%20DAP/Reports/ICSR.xdo?_xpf=&_xt=form&SR_ID=10016566696&_xpt=1&_xf=pdf"">ICSR</a>"
EU-EC-10016557569,Spontaneous,2024-01-02 00:00:00,Healthcare Professional,Non European Economic Area,Not available,18-64 Years,Not Specified,No,Male,Medication error (n/a - Recovered/Resolved - Caused/Prolonged Hospitalisation),"SPIKEVAX BIVALENT ORIGINAL/OMICRON BA.4-5 [ELASOMERAN, DAVESOMERAN] (S - COVID-19 prophylaxis - Not applicable - [n/a - 1{DF} - n/a])",Not reported,"<a target=""_blank"" href=""https://dap.ema.europa.eu/xmlpserver/PHV%20DAP/Reports/ICSR.xdo?_xpf=&_xt=form&SR_ID=10016557569&_xpt=1&_xf=pdf"">ICSR</a>"
EU-EC-10016557608,Spontaneous,2024-01-02 00:00:00,Healthcare Professional,Non European Economic Area,Not available,18-64 Years,Not Specified,No,Female,"Guillain-Barre syndrome (n/a - Not Recovered/Not Resolved - Caused/Prolonged Hospitalisation, Other Medically Important Condition)","SPIKEVAX BIVALENT ORIGINAL/OMICRON BA.4-5 [ELASOMERAN, DAVESOMERAN] (S - COVID-19 prophylaxis - Not applicable - [n/a - 1{DF} - n/a])",Not reported,"<a target=""_blank"" href=""https://dap.ema.europa.eu/xmlpserver/PHV%20DAP/Reports/ICSR.xdo?_xpf=&_xt=form&SR_ID=10016557608&_xpt=1&_xf=pdf"">ICSR</a>"
EU-EC-10016557609,Spontaneous,2024-01-02 00:00:00,Healthcare Professional,Non European Economic Area,Not available,18-64 Years,Not Specified,No,Female,"Erythema (n/a - Not Recovered/Not Resolved - Other Medically Important Condition),<BR><BR>Irritability (n/a - Not Recovered/Not Resolved - Other Medically Important Condition),<BR><BR>Irritability postvaccinal (n/a - Not Recovered/Not Resolved - Other Medically Important Condition),<BR><BR>Pain (n/a - Not Recovered/Not Resolved - Other Medically Important Condition),<BR><BR>Swelling (n/a - Not Recovered/Not Resolved - Other Medically Important Condition)","SPIKEVAX BIVALENT ORIGINAL/OMICRON BA.4-5 [ELASOMERAN, DAVESOMERAN] (S - COVID-19 prophylaxis - Not applicable - [n/a - 1{DF} - n/a])",Not reported,"<a target=""_blank"" href=""https://dap.ema.europa.eu/xmlpserver/PHV%20DAP/Reports/ICSR.xdo?_xpf=&_xt=form&SR_ID=10016557609&_xpt=1&_xf=pdf"">ICSR</a>"
EU-EC-10016558206,Spontaneous,2024-01-02 00:00:00,Healthcare Professional,Non European Economic Area,Not available,65-85 Years,Not Specified,No,Male,"Death (1d - Fatal - Results in Death, Other Medically Important Condition)","SPIKEVAX BIVALENT ORIGINAL/OMICRON BA.4-5 [ELASOMERAN, DAVESOMERAN] (S - COVID-19 prophylaxis - Not applicable - [n/a - 1{DF} - n/a])",Not reported,"<a target=""_blank"" href=""https://dap.ema.europa.eu/xmlpserver/PHV%20DAP/Reports/ICSR.xdo?_xpf=&_xt=form&SR_ID=10016558206&_xpt=1&_xf=pdf"">ICSR</a>"
EU-EC-10016561754,Spontaneous,2024-01-02 00:00:00,Healthcare Professional,Non European Economic Area,Not available,18-64 Years,Not Specified,No,Male,"Induration (n/a - Not Recovered/Not Resolved - ),<BR><BR>Neuropathy peripheral (n/a - Not Recovered/Not Resolved - Other Medically Important Condition),<BR><BR>Pain (n/a - Not Recovered/Not Resolved - )","SPIKEVAX BIVALENT ORIGINAL/OMICRON BA.4-5 [ELASOMERAN, DAVESOMERAN] (S - COVID-19 prophylaxis - Not applicable - [n/a - 1{DF} - n/a])",Not reported,"<a target=""_blank"" href=""https://dap.ema.europa.eu/xmlpserver/PHV%20DAP/Reports/ICSR.xdo?_xpf=&_xt=form&SR_ID=10016561754&_xpt=1&_xf=pdf"">ICSR</a>"