^C:\USERS\CHELIMONNN\DOCUMENTS\VISUAL STUDIO 2010\PROJECTS\SISVENTAS\SISVENTAS\MY PROJECT\RESOURCES.RESX
C:\WINDOWS\ASSEMBLY\PUBPOL37.DAT
C:\WINDOWS\MICROSOFT.NET\ASSEMBLY\GAC_MSIL\MICROSOFT.BUILD.TASKS.V4.0\V4.0_4.0.0.0__B03F5F7F11D50A3A\MICROSOFT.BUILD.TASKS.V4.0.DLL
C:\USERS\CHELIMONNN\DOCUMENTS\VISUAL STUDIO 2010\PROJECTS\SISVENTAS\SISVENTAS\RESOURCES\ADD TO BASKET.PNG
C:\USERS\CHELIMONNN\DOCUMENTS\VISUAL STUDIO 2010\PROJECTS\SISVENTAS\SISVENTAS\RESOURCES\PRINTER.PNG
C:\USERS\CHELIMONNN\DOCUMENTS\VISUAL STUDIO 2010\PROJECTS\SISVENTAS\SISVENTAS\RESOURCES\MY ICONS.PNG
C:\USERS\CHELIMONNN\DOCUMENTS\VISUAL STUDIO 2010\PROJECTS\SISVENTAS\SISVENTAS\RESOURCES\FILE_ADD.PNG
C:\USERS\CHELIMONNN\DOCUMENTS\VISUAL STUDIO 2010\PROJECTS\SISVENTAS\SISVENTAS\RESOURCES\BOOKS.PNG
C:\USERS\CHELIMONNN\DOCUMENTS\VISUAL STUDIO 2010\PROJECTS\SISVENTAS\SISVENTAS\RESOURCES\FILE_DELETE.PNG
C:\USERS\CHELIMONNN\DOCUMENTS\VISUAL STUDIO 2010\PROJECTS\SISVENTAS\SISVENTAS\RESOURCES\BANNED USER.PNG
C:\USERS\CHELIMONNN\DOCUMENTS\VISUAL STUDIO 2010\PROJECTS\SISVENTAS\SISVENTAS\RESOURCES\FILE.PNG
C:\USERS\CHELIMONNN\DOCUMENTS\VISUAL STUDIO 2010\PROJECTS\SISVENTAS\SISVENTAS\RESOURCES\LEATHER-BAG.PNG
C:\USERS\CHELIMONNN\DOCUMENTS\VISUAL STUDIO 2010\PROJECTS\SISVENTAS\SISVENTAS\RESOURCES\KDICT.ICO
C:\USERS\CHELIMONNN\DOCUMENTS\VISUAL STUDIO 2010\PROJECTS\SISVENTAS\SISVENTAS\RESOURCES\MAGNIFIER.PNG
C:\USERS\CHELIMONNN\DOCUMENTS\VISUAL STUDIO 2010\PROJECTS\SISVENTAS\SISVENTAS\RESOURCES\KGHOSTVIEW.ICO
C:\USERS\CHELIMONNN\DOCUMENTS\VISUAL STUDIO 2010\PROJECTS\SISVENTAS\SISVENTAS\RESOURCES\SPREADSHEET.ICO
C:\USERS\CHELIMONNN\DOCUMENTS\VISUAL STUDIO 2010\PROJECTS\SISVENTAS\SISVENTAS\RESOURCES\SHOP_CART2.ICO
^C:\USERS\CHELIMONNN\DOCUMENTS\VISUAL STUDIO 2010\PROJECTS\SISVENTAS\SISVENTAS\REPORTES\FRMREPORTEPRODUCTOS.RESX
^C:\USERS\CHELIMONNN\DOCUMENTS\VISUAL STUDIO 2010\PROJECTS\SISVENTAS\SISVENTAS\REPORTES\FRMREGISTRO_PERMANENTE.RESX
^C:\USERS\CHELIMONNN\DOCUMENTS\VISUAL STUDIO 2010\PROJECTS\SISVENTAS\SISVENTAS\REPORTES\FRMREGISTROPERMANENTE.RESX
^C:\USERS\CHELIMONNN\DOCUMENTS\VISUAL STUDIO 2010\PROJECTS\SISVENTAS\SISVENTAS\CONSULTAS\FRMCPRODUCTOS.RESX
^C:\USERS\CHELIMONNN\DOCUMENTS\VISUAL STUDIO 2010\PROJECTS\SISVENTAS\SISVENTAS\REPORTES\FRMRPERMANENTE.RESX
^C:\USERS\CHELIMONNN\DOCUMENTS\VISUAL STUDIO 2010\PROJECTS\SISVENTAS\SISVENTAS\REPORTES\FRMREPORTE_UTILIDADES.RESX
^C:\USERS\CHELIMONNN\DOCUMENTS\VISUAL STUDIO 2010\PROJECTS\SISVENTAS\SISVENTAS\REPORTES\FRMREPORTECOMPROBANTE.RESX
^C:\USERS\CHELIMONNN\DOCUMENTS\VISUAL STUDIO 2010\PROJECTS\SISVENTAS\SISVENTAS\REPORTES\FRMREPORTEDOSFECHAS.RESX
^C:\USERS\CHELIMONNN\DOCUMENTS\VISUAL STUDIO 2010\PROJECTS\SISVENTAS\SISVENTAS\CONSULTAS\FRMCVENTAS.RESX
^C:\USERS\CHELIMONNN\DOCUMENTS\VISUAL STUDIO 2010\PROJECTS\SISVENTAS\SISVENTAS\REPORTES\FRMCIERRECAJA.RESX
^C:\USERS\CHELIMONNN\DOCUMENTS\VISUAL STUDIO 2010\PROJECTS\SISVENTAS\SISVENTAS\PRESENTACION\FRMCIERRACAJA.RESX
^C:\USERS\CHELIMONNN\DOCUMENTS\VISUAL STUDIO 2010\PROJECTS\SISVENTAS\SISVENTAS\CIERRE CAJAS\REPORTES\FRMREPORTEEGRESOS.RESX
^C:\USERS\CHELIMONNN\DOCUMENTS\VISUAL STUDIO 2010\PROJECTS\SISVENTAS\SISVENTAS\CIERRE CAJAS\REPORTES\FRMREPORTEINGRESOS.RESX
^C:\USERS\CHELIMONNN\DOCUMENTS\VISUAL STUDIO 2010\PROJECTS\SISVENTAS\SISVENTAS\PRESENTACION\FRMLOGIN.RESX
^C:\USERS\CHELIMONNN\DOCUMENTS\VISUAL STUDIO 2010\PROJECTS\SISVENTAS\SISVENTAS\CONSULTAS\FRMCPERMANENTEVALORIZADO.RESX
^C:\USERS\CHELIMONNN\DOCUMENTS\VISUAL STUDIO 2010\PROJECTS\SISVENTAS\SISVENTAS\PRESENTACIONCOMPRAS\FRMPRODUCTOCOMPRA.RESX
^C:\USERS\CHELIMONNN\DOCUMENTS\VISUAL STUDIO 2010\PROJECTS\SISVENTAS\SISVENTAS\PRESENTACION\FRMCLIENTE.RESX
^C:\USERS\CHELIMONNN\DOCUMENTS\VISUAL STUDIO 2010\PROJECTS\SISVENTAS\SISVENTAS\PRESENTACION\FRMDETALLE_VENTA.RESX
^C:\USERS\CHELIMONNN\DOCUMENTS\VISUAL STUDIO 2010\PROJECTS\SISVENTAS\SISVENTAS\PRESENTACIONCOMPRAS\FRMDETALLE_COMPRA.RESX
^C:\USERS\CHELIMONNN\DOCUMENTS\VISUAL STUDIO 2010\PROJECTS\SISVENTAS\SISVENTAS\PRESENTACIONCOMPRAS\FRMCOMPRAS.RESX
^C:\USERS\CHELIMONNN\DOCUMENTS\VISUAL STUDIO 2010\PROJECTS\SISVENTAS\SISVENTAS\PRESENTACION\FRMCATEGORIA.RESX
^C:\USERS\CHELIMONNN\DOCUMENTS\VISUAL STUDIO 2010\PROJECTS\SISVENTAS\SISVENTAS\PRESENTACION\FRMVENTA.RESX
^C:\USERS\CHELIMONNN\DOCUMENTS\VISUAL STUDIO 2010\PROJECTS\SISVENTAS\SISVENTAS\CONSULTAS\FRMCCANTIDADPRODUCTOSPORUSUARIO.RESX
^C:\USERS\CHELIMONNN\DOCUMENTS\VISUAL STUDIO 2010\PROJECTS\SISVENTAS\SISVENTAS\CIERRE CAJAS\FRMCIERREDECAJA.RESX
^C:\USERS\CHELIMONNN\DOCUMENTS\VISUAL STUDIO 2010\PROJECTS\SISVENTAS\SISVENTAS\PRESENTACION\FRMLABORATORIO.RESX
^C:\USERS\CHELIMONNN\DOCUMENTS\VISUAL STUDIO 2010\PROJECTS\SISVENTAS\SISVENTAS\PRESENTACION\FRMINICIO.RESX
^C:\USERS\CHELIMONNN\DOCUMENTS\VISUAL STUDIO 2010\PROJECTS\SISVENTAS\SISVENTAS\CONSULTAS\FRMCPRODUCTOSMVENDIDOS.RESX
^C:\USERS\CHELIMONNN\DOCUMENTS\VISUAL STUDIO 2010\PROJECTS\SISVENTAS\SISVENTAS\PRESENTACION\FRMPRODUCTO.RESX
^C:\USERS\CHELIMONNN\DOCUMENTS\VISUAL STUDIO 2010\PROJECTS\SISVENTAS\SISVENTAS\SISVENTAS\CIERRE CAJAS\FRMCIERREDECAJA.RESX
^C:\USERS\CHELIMONNN\DOCUMENTS\VISUAL STUDIO 2010\PROJECTS\SISVENTAS\SISVENTAS\SISVENTAS\CIERRE CAJAS\REPORTES\FRMREPORTEEGRESOS.RESX
^C:\USERS\CHELIMONNN\DOCUMENTS\VISUAL STUDIO 2010\PROJECTS\SISVENTAS\SISVENTAS\SISVENTAS\CIERRE CAJAS\REPORTES\FRMREPORTEINGRESOS.RESX
^C:\USERS\CHELIMONNN\DOCUMENTS\VISUAL STUDIO 2010\PROJECTS\SISVENTAS\SISVENTAS\SISVENTAS\CONSULTAS\FRMCPERMANENTEVALORIZADO.RESX
^C:\USERS\CHELIMONNN\DOCUMENTS\VISUAL STUDIO 2010\PROJECTS\SISVENTAS\SISVENTAS\SISVENTAS\CONSULTAS\FRMCPRODUCTOSMVENDIDOS.RESX
^C:\USERS\CHELIMONNN\DOCUMENTS\VISUAL STUDIO 2010\PROJECTS\SISVENTAS\SISVENTAS\SISVENTAS\CONSULTAS\FRMCCANTIDADPRODUCTOSPORUSUARIO.RESX
^C:\USERS\CHELIMONNN\DOCUMENTS\VISUAL STUDIO 2010\PROJECTS\SISVENTAS\SISVENTAS\SISVENTAS\MY PROJECT\RESOURCES.RESX
C:\WINDOWS\ASSEMBLY\PUBPOL37.DAT
C:\WINDOWS\MICROSOFT.NET\ASSEMBLY\GAC_MSIL\MICROSOFT.BUILD.TASKS.V4.0\V4.0_4.0.0.0__B03F5F7F11D50A3A\MICROSOFT.BUILD.TASKS.V4.0.DLL
C:\USERS\CHELIMONNN\DOCUMENTS\VISUAL STUDIO 2010\PROJECTS\SISVENTAS\SISVENTAS\SISVENTAS\RESOURCES\KDICT.ICO
C:\USERS\CHELIMONNN\DOCUMENTS\VISUAL STUDIO 2010\PROJECTS\SISVENTAS\SISVENTAS\SISVENTAS\RESOURCES\ADD TO BASKET.PNG
C:\USERS\CHELIMONNN\DOCUMENTS\VISUAL STUDIO 2010\PROJECTS\SISVENTAS\SISVENTAS\SISVENTAS\RESOURCES\KGHOSTVIEW.ICO
C:\USERS\CHELIMONNN\DOCUMENTS\VISUAL STUDIO 2010\PROJECTS\SISVENTAS\SISVENTAS\SISVENTAS\RESOURCES\FILE_DELETE.PNG
C:\USERS\CHELIMONNN\DOCUMENTS\VISUAL STUDIO 2010\PROJECTS\SISVENTAS\SISVENTAS\SISVENTAS\RESOURCES\FILE_ADD.PNG
C:\USERS\CHELIMONNN\DOCUMENTS\VISUAL STUDIO 2010\PROJECTS\SISVENTAS\SISVENTAS\SISVENTAS\RESOURCES\MY ICONS.PNG
C:\USERS\CHELIMONNN\DOCUMENTS\VISUAL STUDIO 2010\PROJECTS\SISVENTAS\SISVENTAS\SISVENTAS\RESOURCES\FILE.PNG
C:\USERS\CHELIMONNN\DOCUMENTS\VISUAL STUDIO 2010\PROJECTS\SISVENTAS\SISVENTAS\SISVENTAS\RESOURCES\PRINTER.PNG
C:\USERS\CHELIMONNN\DOCUMENTS\VISUAL STUDIO 2010\PROJECTS\SISVENTAS\SISVENTAS\SISVENTAS\RESOURCES\BOOKS.PNG
C:\USERS\CHELIMONNN\DOCUMENTS\VISUAL STUDIO 2010\PROJECTS\SISVENTAS\SISVENTAS\SISVENTAS\RESOURCES\BANNED USER.PNG
C:\USERS\CHELIMONNN\DOCUMENTS\VISUAL STUDIO 2010\PROJECTS\SISVENTAS\SISVENTAS\SISVENTAS\RESOURCES\LEATHER-BAG.PNG
C:\USERS\CHELIMONNN\DOCUMENTS\VISUAL STUDIO 2010\PROJECTS\SISVENTAS\SISVENTAS\SISVENTAS\RESOURCES\MAGNIFIER.PNG
C:\USERS\CHELIMONNN\DOCUMENTS\VISUAL STUDIO 2010\PROJECTS\SISVENTAS\SISVENTAS\SISVENTAS\RESOURCES\SPREADSHEET.ICO
C:\USERS\CHELIMONNN\DOCUMENTS\VISUAL STUDIO 2010\PROJECTS\SISVENTAS\SISVENTAS\SISVENTAS\RESOURCES\SHOP_CART2.ICO
^C:\USERS\CHELIMONNN\DOCUMENTS\VISUAL STUDIO 2010\PROJECTS\SISVENTAS\SISVENTAS\SISVENTAS\PRESENTACIONCOMPRAS\FRMCOMPRAS.RESX
^C:\USERS\CHELIMONNN\DOCUMENTS\VISUAL STUDIO 2010\PROJECTS\SISVENTAS\SISVENTAS\SISVENTAS\PRESENTACIONCOMPRAS\FRMDETALLE_COMPRA.RESX
^C:\USERS\CHELIMONNN\DOCUMENTS\VISUAL STUDIO 2010\PROJECTS\SISVENTAS\SISVENTAS\SISVENTAS\PRESENTACIONCOMPRAS\FRMPRODUCTOCOMPRA.RESX
^C:\USERS\CHELIMONNN\DOCUMENTS\VISUAL STUDIO 2010\PROJECTS\SISVENTAS\SISVENTAS\SISVENTAS\PRESENTACION\FRMLABORATORIO.RESX
^C:\USERS\CHELIMONNN\DOCUMENTS\VISUAL STUDIO 2010\PROJECTS\SISVENTAS\SISVENTAS\SISVENTAS\PRESENTACION\FRMLOGIN.RESX
^C:\USERS\CHELIMONNN\DOCUMENTS\VISUAL STUDIO 2010\PROJECTS\SISVENTAS\SISVENTAS\SISVENTAS\PRESENTACION\FRMINICIO.RESX
^C:\USERS\CHELIMONNN\DOCUMENTS\VISUAL STUDIO 2010\PROJECTS\SISVENTAS\SISVENTAS\SISVENTAS\PRESENTACION\FRMCATEGORIA.RESX
^C:\USERS\CHELIMONNN\DOCUMENTS\VISUAL STUDIO 2010\PROJECTS\SISVENTAS\SISVENTAS\SISVENTAS\PRESENTACION\FRMCLIENTE.RESX
^C:\USERS\CHELIMONNN\DOCUMENTS\VISUAL STUDIO 2010\PROJECTS\SISVENTAS\SISVENTAS\SISVENTAS\PRESENTACION\FRMDETALLE_VENTA.RESX
^C:\USERS\CHELIMONNN\DOCUMENTS\VISUAL STUDIO 2010\PROJECTS\SISVENTAS\SISVENTAS\SISVENTAS\PRESENTACION\FRMPRODUCTO.RESX
^C:\USERS\CHELIMONNN\DOCUMENTS\VISUAL STUDIO 2010\PROJECTS\SISVENTAS\SISVENTAS\SISVENTAS\PRESENTACION\FRMVENTA.RESX
^C:\USERS\CHELIMONNN\DOCUMENTS\VISUAL STUDIO 2010\PROJECTS\SISVENTAS\SISVENTAS\SISVENTAS\REPORTES\FRMREPORTECOMPROBANTE.RESX
^C:\USERS\CHELIMONNN\DOCUMENTS\VISUAL STUDIO 2010\PROJECTS\SISVENTAS\SISVENTAS\SISVENTAS\REPORTES\FRMREPORTEDOSFECHAS.RESX
^C:\USERS\CHELIMONNN\DOCUMENTS\VISUAL STUDIO 2010\PROJECTS\SISVENTAS\SISVENTAS\SISVENTAS\REPORTES\FRMREPORTEPRODUCTOS.RESX
^C:\USERS\CHELIMONNN\DOCUMENTS\VISUAL STUDIO 2010\PROJECTS\SISVENTAS\SISVENTAS\SISVENTAS\REPORTES\FRMREPORTE_UTILIDADES.RESX
^C:\USERS\CHELIMONNN\DOCUMENTS\VISUAL STUDIO 2010\PROJECTS\SISVENTAS\SISVENTAS\SISVENTAS\REPORTES\FRMRPERMANENTE.RESX
