{
    "name": "EB_IMB_R",
    "title": "Table des données médicalisées des bénéficiaires de l'EGB",
    "produit": "EGB",
    "champ": "",
    "history": {
        "dateCreated": "",
        "dateDeleted": "",
        "dateMissing": []
    },
    "observation": "",
    "missingValues": [
        ""
    ],
    "fields": [
        {
            "name": "IMB_MLP_BTR",
            "description": "Tableau des maladies professionnelles (bis, ter)",
            "type": "string",
            "length": "1",
            "nomenclature": "-",
            "dateCreated": "",
            "dateDeleted": "",
            "dateMissing": [],
            "format": "default",
            "regle_gestion": "",
            "observation": "",
            "type_oracle": "string"
        },
        {
            "name": "MED_MTF_COD",
            "description": "Motif médical ou pathologie (code CIM10)",
            "type": "string",
            "length": "5",
            "nomenclature": "IR_CIM_V",
            "dateCreated": "",
            "dateDeleted": "",
            "dateMissing": [],
            "format": "default",
            "regle_gestion": "",
            "observation": "",
            "type_oracle": "string"
        },
        {
            "name": "IMB_MLP_TAB",
            "description": "Numéro de tableau des maladies professionnelles (MP)",
            "type": "string",
            "length": "3",
            "nomenclature": "AT_MLP_V",
            "dateCreated": "",
            "dateDeleted": "",
            "dateMissing": [],
            "format": "default",
            "regle_gestion": "",
            "observation": "",
            "type_oracle": "string"
        },
        {
            "name": "IMB_ALD_DTD",
            "description": "Date de début d'exonération du ticket modérateur attribuée par les services médicaux (ALD, AT, MP)",
            "type": "date",
            "length": "8",
            "nomenclature": "IR_DTE_V",
            "dateCreated": "",
            "dateDeleted": "",
            "dateMissing": [],
            "format": "default",
            "regle_gestion": "",
            "observation": "",
            "type_oracle": "date"
        },
        {
            "name": "IMB_ETM_NAT",
            "description": "Motif d'exonération du bénéficiaire",
            "type": "integer",
            "length": "2",
            "nomenclature": "IR_ETM_V",
            "dateCreated": "",
            "dateDeleted": "",
            "dateMissing": [],
            "format": "default",
            "regle_gestion": "",
            "observation": "",
            "type_oracle": "number"
        },
        {
            "name": "IMB_ALD_NUM",
            "description": "Numéro d'ALD",
            "type": "integer",
            "length": "2",
            "nomenclature": "IR_ALD_V",
            "dateCreated": "",
            "dateDeleted": "",
            "dateMissing": [],
            "format": "default",
            "regle_gestion": "",
            "observation": "",
            "type_oracle": "number"
        },
        {
            "name": "INS_DTE",
            "description": "Date d'insertion",
            "type": "date",
            "length": "8",
            "nomenclature": "-",
            "dateCreated": "",
            "dateDeleted": "",
            "dateMissing": [],
            "format": "default",
            "regle_gestion": "",
            "observation": "",
            "type_oracle": "date"
        },
        {
            "name": "UPD_DTE",
            "description": "Date de la dernière sélection des bénéficiaires de l'EGB",
            "type": "date",
            "length": "8",
            "nomenclature": "-",
            "dateCreated": "",
            "dateDeleted": "",
            "dateMissing": [],
            "format": "default",
            "regle_gestion": "Dans la table IR_IMB_R, la variable UPD_DTE correspond à la date du dernier chargement.  Deux cas de figures :     1. Si création => nouvel enregistrement créé avec date d'insertion INS_DTE renseignée et date de mise à jour UPD_DTE manquante lors de la création initiale de l'enregistrement puis UPD_DTE renseignée à chaque nouveau chargement à l'identique (la date du dernier chargement écrase la précédente) ;     2. Si modification => insertion d'un nouvel enregistrement avec nouvelle date d'insertion INS_DTE et date de mise à jour UPD_DTE manquante à la création puis UPD_DTE renseignée à chaque nouveau chargement à l'identique.",
            "observation": "",
            "type_oracle": "date"
        },
        {
            "name": "IMB_ALD_DTF",
            "description": "Date de fin de l'exonération attribuée par les services médicaux (ALD, AT, MP)",
            "type": "date",
            "length": "8",
            "nomenclature": "IR_DTE_V",
            "dateCreated": "",
            "dateDeleted": "",
            "dateMissing": [],
            "format": "default",
            "regle_gestion": "",
            "observation": "",
            "type_oracle": "date"
        },
        {
            "name": "BEN_NIR_IDT",
            "description": "NIR anonyme du bénéficiaire dans l'échantillon",
            "type": "string",
            "length": "17",
            "nomenclature": "-",
            "dateCreated": "",
            "dateDeleted": "",
            "dateMissing": [],
            "format": "default",
            "regle_gestion": "",
            "observation": "",
            "type_oracle": "string"
        },
        {
            "name": "MED_NCL_IDT",
            "description": "Nomenclature médicale",
            "type": "string",
            "length": "10",
            "nomenclature": "IR_NMD_V",
            "dateCreated": "",
            "dateDeleted": "",
            "dateMissing": [],
            "format": "default",
            "regle_gestion": "",
            "observation": "",
            "type_oracle": "string"
        },
        {
            "name": "IMB_SDR_LOP",
            "description": "Localisation - paragraphe syndrome",
            "type": "string",
            "length": "1",
            "nomenclature": "-",
            "dateCreated": "",
            "dateDeleted": "",
            "dateMissing": [],
            "format": "default",
            "regle_gestion": "",
            "observation": "",
            "type_oracle": "string"
        }
    ]
}