{
    "timeout": 100,
    "map_file": "map3",
    "map_dimensions": [5,3],
    "k": 2,
    "use_agents": 2,
    "agents": [
        {
            "start": [0,1],
            "target": [4,1],
            "heading": 0.0,
            "radius": 0.45,
            "movement_speed": 1.0,
            "rotation_speed": 180.0
        },
        {
            "start": [4,1],
            "target": [0,1],
            "heading": 180.0,
            "radius": 0.3,
            "movement_speed": 1.0,
            "rotation_speed": 180.0
        }
    ]
}