{
    "timeout": 5,
    "map_file": "map1",
    "map_dimensions": [4,4],
    "k": 2,
    "use_agents": 2,
    "agents": [
        {
            "start": [0,2],
            "target": [3,1],
            "heading": 0.0,
            "radius": 0.3,
            "movement_speed": 1.0,
            "rotation_speed": 360.0
        },
        {
            "start": [1,3],
            "target": [2,0],
            "heading": 270.0,
            "radius": 0.45,
            "movement_speed": 1.0,
            "rotation_speed": 360.0
        }
    ]
}