{
    "explored_nodes": 359,
    "solution": {
        "ancestors": [
            {
                "conflict": {
                    "A": {
                        "action": "MOVE to [2, 0] at 0.147584s",
                        "agent": 1,
                        "at": "[pos=[0, 1], h=14/-26.565050deg]"
                    },
                    "B": {
                        "action": "MOVE to [2, 1] at 0.147584s",
                        "agent": 0,
                        "at": "[pos=[0, 0], h=12/26.565050deg]"
                    },
                    "collision_interval": "[0.259387; 2.271848]",
                    "overlap_interval": "[0.147584; 2.383652]"
                },
                "f_value": 0.0,
                "node_id": 0
            },
            {
                "conflict": {
                    "A": {
                        "action": "MOVE to [2, 1] at 0.147584s",
                        "agent": 0,
                        "at": "[pos=[0, 0], h=12/26.565050deg]"
                    },
                    "B": {
                        "action": "MOVE to [1, 1] at 0.000000s",
                        "agent": 1,
                        "at": "[pos=[0, 1], h=1/0.000000deg]"
                    },
                    "collision_interval": "[0.409716; 3.973936]",
                    "overlap_interval": "[0.147584; 1.000000]"
                },
                "constraint": {
                    "action": "MOVE to [2, 0] at 0.147584s",
                    "agent": 1,
                    "at": "[pos=[0, 1], h=14/-26.565050deg]",
                    "interval": "[0.146584; 1.176175]"
                },
                "f_value": 5.047865390777588,
                "node_id": 2
            },
            {
                "conflict": {
                    "A": {
                        "action": "MOVE to [1, 0] at 0.250000s",
                        "agent": 1,
                        "at": "[pos=[0, 1], h=6/-45.000000deg]"
                    },
                    "B": {
                        "action": "MOVE to [2, 1] at 0.147584s",
                        "agent": 0,
                        "at": "[pos=[0, 0], h=12/26.565050deg]"
                    },
                    "collision_interval": "[0.301910; 1.783839]",
                    "overlap_interval": "[0.250000; 1.664214]"
                },
                "constraint": {
                    "action": "MOVE to [1, 1] at 0.000000s",
                    "agent": 1,
                    "at": "[pos=[0, 1], h=1/0.000000deg]",
                    "interval": "[-0.001000; 1.001000]"
                },
                "f_value": 5.297865390777588,
                "node_id": 5
            },
            {
                "conflict": {
                    "A": {
                        "action": "MOVE to [2, 1] at 0.147584s",
                        "agent": 0,
                        "at": "[pos=[0, 0], h=12/26.565050deg]"
                    },
                    "B": {
                        "action": "WAIT at 0.147584s",
                        "agent": 1,
                        "at": "[pos=[0, 1], h=14/-26.565050deg]"
                    },
                    "collision_interval": "[0.494798; 0.694797]",
                    "overlap_interval": "[0.147584; 1.176175]"
                },
                "constraint": {
                    "action": "MOVE to [1, 0] at 0.250000s",
                    "agent": 1,
                    "at": "[pos=[0, 1], h=6/-45.000000deg]",
                    "interval": "[0.249000; 1.084194]"
                },
                "f_value": 5.795894622802734,
                "node_id": 10
            },
            {
                "conflict": {
                    "A": {
                        "action": "MOVE to [2, 1] at 1.250000s",
                        "agent": 0,
                        "at": "[pos=[1, 0], h=4/45.000000deg]"
                    },
                    "B": {
                        "action": "MOVE to [2, 0] at 1.176175s",
                        "agent": 1,
                        "at": "[pos=[0, 1], h=14/-26.565050deg]"
                    },
                    "collision_interval": "[1.791521; 2.596770]",
                    "overlap_interval": "[1.250000; 2.664214]"
                },
                "constraint": {
                    "action": "MOVE to [2, 1] at 0.147584s",
                    "agent": 0,
                    "at": "[pos=[0, 0], h=12/26.565050deg]",
                    "interval": "[0.146584; 0.829961]"
                },
                "f_value": 6.076456546783447,
                "node_id": 31
            },
            {
                "conflict": {
                    "A": {
                        "action": "WAIT at 2.664214s",
                        "agent": 0,
                        "at": "[pos=[2, 1], h=4/45.000000deg]"
                    },
                    "B": {
                        "action": "MOVE to [2, 0] at 1.364756s",
                        "agent": 1,
                        "at": "[pos=[0, 1], h=14/-26.565050deg]"
                    },
                    "collision_interval": "[3.053610; 3.253610]",
                    "overlap_interval": "[2.664214; 3.600824]"
                },
                "constraint": {
                    "action": "MOVE to [2, 0] at 1.176175s",
                    "agent": 1,
                    "at": "[pos=[0, 1], h=14/-26.565050deg]",
                    "interval": "[1.175175; 1.364756]"
                },
                "f_value": 6.265037536621094,
                "node_id": 81
            },
            {
                "conflict": {
                    "A": {
                        "action": "MOVE to [2, 1] at 1.250000s",
                        "agent": 0,
                        "at": "[pos=[1, 0], h=4/45.000000deg]"
                    },
                    "B": {
                        "action": "MOVE to [1, 1] at 1.001000s",
                        "agent": 1,
                        "at": "[pos=[0, 1], h=1/0.000000deg]"
                    },
                    "collision_interval": "[1.729210; 3.936004]",
                    "overlap_interval": "[1.250000; 2.001000]"
                },
                "constraint": {
                    "action": "MOVE to [2, 0] at 1.364756s",
                    "agent": 1,
                    "at": "[pos=[0, 1], h=14/-26.565050deg]",
                    "interval": "[1.363756; 3.601824]"
                },
                "f_value": 6.329427242279053,
                "node_id": 151
            },
            {
                "conflict": {
                    "A": {
                        "action": "MOVE to [2, 1] at 1.250000s",
                        "agent": 0,
                        "at": "[pos=[1, 0], h=4/45.000000deg]"
                    },
                    "B": {
                        "action": "MOVE to [1, 0] at 1.084194s",
                        "agent": 1,
                        "at": "[pos=[0, 1], h=6/-45.000000deg]"
                    },
                    "collision_interval": "[1.750229; 1.998179]",
                    "overlap_interval": "[1.250000; 2.498407]"
                },
                "constraint": {
                    "action": "MOVE to [1, 1] at 1.001000s",
                    "agent": 1,
                    "at": "[pos=[0, 1], h=1/0.000000deg]",
                    "interval": "[1.000000; 1.660015]"
                },
                "f_value": 6.412621021270752,
                "node_id": 189
            }
        ],
        "constraint": {
            "action": "MOVE to [1, 0] at 1.084194s",
            "agent": 1,
            "at": "[pos=[0, 1], h=6/-45.000000deg]",
            "interval": "[1.083194; 1.136863]"
        },
        "cost": 6.465290069580078,
        "traj_0": [
            "MOVE to [1, 0] at 0.000000s",
            "ROTATE to head 4/45.000000deg at 1.000000s",
            "MOVE to [2, 1] at 1.250000s",
            "WAIT at 2.664214s"
        ],
        "traj_1": [
            "ROTATE to head 6/-45.000000deg at 0.000000s",
            "WAIT at 0.250000s",
            "MOVE to [1, 0] at 1.136863s",
            "ROTATE to head 1/0.000000deg at 2.551076s",
            "MOVE to [2, 0] at 2.801076s",
            "WAIT at 3.801076s"
        ]
    }
}