{
    "explored_nodes": 7,
    "solution": {
        "ancestors": [
            {
                "conflict": {
                    "A": {
                        "action": "MOVE to [1, 2] at 0.000000s",
                        "agent": 0,
                        "at": "[pos=[0, 2], h=1/0.000000deg]"
                    },
                    "B": {
                        "action": "MOVE to [1, 2] at 0.000000s",
                        "agent": 1,
                        "at": "[pos=[1, 3], h=2/-90.000000deg]"
                    },
                    "collision_interval": "[0.469670; 1.530330]",
                    "overlap_interval": "[0.000000; 1.000000]"
                },
                "f_value": 0.0,
                "node_id": 0
            },
            {
                "conflict": {
                    "A": {
                        "action": "MOVE to [2, 2] at 2.000000s",
                        "agent": 1,
                        "at": "[pos=[2, 3], h=2/-90.000000deg]"
                    },
                    "B": {
                        "action": "MOVE to [3, 2] at 2.000000s",
                        "agent": 0,
                        "at": "[pos=[2, 2], h=1/0.000000deg]"
                    },
                    "collision_interval": "[2.323223; 2.676777]",
                    "overlap_interval": "[2.000000; 3.000000]"
                },
                "constraint": {
                    "action": "MOVE to [1, 2] at 0.000000s",
                    "agent": 1,
                    "at": "[pos=[1, 3], h=2/-90.000000deg]",
                    "interval": "[-0.001000; 1.001000]"
                },
                "f_value": 12.029411315917969,
                "node_id": 1
            }
        ],
        "constraint": {
            "action": "MOVE to [2, 2] at 2.000000s",
            "agent": 1,
            "at": "[pos=[2, 3], h=2/-90.000000deg]",
            "interval": "[1.999000; 2.088944]"
        },
        "cost": 12.118356704711914,
        "traj_0": [
            "MOVE to [1, 2] at 0.000000s",
            "MOVE to [2, 2] at 1.000000s",
            "MOVE to [3, 2] at 2.000000s",
            "ROTATE to head 2/-90.000000deg at 3.000000s",
            "MOVE to [3, 1] at 3.500000s",
            "WAIT at 4.500000s"
        ],
        "traj_1": [
            "ROTATE to head 1/0.000000deg at 0.000000s",
            "MOVE to [2, 3] at 0.500000s",
            "ROTATE to head 2/-90.000000deg at 1.500000s",
            "WAIT at 2.000000s",
            "MOVE to [2, 2] at 2.088944s",
            "MOVE to [2, 1] at 3.088944s",
            "MOVE to [2, 0] at 4.088944s",
            "WAIT at 5.088944s"
        ],
        "traj_2": [
            "MOVE to [2, 1] at 0.000000s",
            "MOVE to [1, 1] at 0.500000s",
            "MOVE to [0, 1] at 1.000000s",
            "ROTATE to head 0/90.000000deg at 1.500000s",
            "MOVE to [0, 2] at 2.029412s",
            "WAIT at 2.529412s"
        ]
    }
}