{
    "explored_nodes": 79,
    "solution": {
        "ancestors": [
            {
                "conflict": {
                    "A": {
                        "action": "MOVE to [1, 2] at 0.000000s",
                        "agent": 0,
                        "at": "[pos=[0, 2], h=1/0.000000deg]"
                    },
                    "B": {
                        "action": "MOVE to [1, 2] at 0.000000s",
                        "agent": 1,
                        "at": "[pos=[1, 3], h=2/-90.000000deg]"
                    },
                    "collision_interval": "[0.469670; 1.530330]",
                    "overlap_interval": "[0.000000; 1.000000]"
                },
                "f_value": 0.0,
                "node_id": 0
            },
            {
                "conflict": {
                    "A": {
                        "action": "MOVE to [2, 2] at 0.250000s",
                        "agent": 1,
                        "at": "[pos=[1, 3], h=6/-45.000000deg]"
                    },
                    "B": {
                        "action": "MOVE to [1, 2] at 0.000000s",
                        "agent": 0,
                        "at": "[pos=[0, 2], h=1/0.000000deg]"
                    },
                    "collision_interval": "[0.939944; 2.724270]",
                    "overlap_interval": "[0.250000; 1.000000]"
                },
                "constraint": {
                    "action": "MOVE to [1, 2] at 0.000000s",
                    "agent": 1,
                    "at": "[pos=[1, 3], h=2/-90.000000deg]",
                    "interval": "[-0.001000; 1.001000]"
                },
                "f_value": 9.550239562988281,
                "node_id": 1
            },
            {
                "conflict": {
                    "A": {
                        "action": "MOVE to [1, 2] at 1.001000s",
                        "agent": 1,
                        "at": "[pos=[1, 3], h=2/-90.000000deg]"
                    },
                    "B": {
                        "action": "MOVE to [2, 2] at 1.000000s",
                        "agent": 0,
                        "at": "[pos=[1, 2], h=1/0.000000deg]"
                    },
                    "collision_interval": "[1.325144; 1.675856]",
                    "overlap_interval": "[1.001000; 2.000000]"
                },
                "constraint": {
                    "action": "MOVE to [2, 2] at 0.250000s",
                    "agent": 1,
                    "at": "[pos=[1, 3], h=6/-45.000000deg]",
                    "interval": "[0.249000; 1.001000]"
                },
                "f_value": 10.301240921020508,
                "node_id": 4
            },
            {
                "conflict": {
                    "A": {
                        "action": "MOVE to [2, 2] at 1.001000s",
                        "agent": 1,
                        "at": "[pos=[1, 3], h=6/-45.000000deg]"
                    },
                    "B": {
                        "action": "MOVE to [2, 2] at 1.000000s",
                        "agent": 0,
                        "at": "[pos=[1, 2], h=1/0.000000deg]"
                    },
                    "collision_interval": "[1.365562; 3.049652]",
                    "overlap_interval": "[1.001000; 2.000000]"
                },
                "constraint": {
                    "action": "MOVE to [1, 2] at 1.001000s",
                    "agent": 1,
                    "at": "[pos=[1, 3], h=2/-90.000000deg]",
                    "interval": "[1.000000; 1.088945]"
                },
                "f_value": 10.301240921020508,
                "node_id": 42
            }
        ],
        "constraint": {
            "action": "MOVE to [2, 2] at 1.001000s",
            "agent": 1,
            "at": "[pos=[1, 3], h=6/-45.000000deg]",
            "interval": "[1.000000; 1.419228]"
        },
        "cost": 10.389184951782227,
        "traj_0": [
            "MOVE to [1, 2] at 0.000000s",
            "MOVE to [2, 2] at 1.000000s",
            "ROTATE to head 6/-45.000000deg at 2.000000s",
            "MOVE to [3, 1] at 2.250000s",
            "WAIT at 3.664214s"
        ],
        "traj_1": [
            "WAIT at 0.000000s",
            "MOVE to [1, 2] at 1.088944s",
            "MOVE to [1, 1] at 2.088944s",
            "ROTATE to head 6/-45.000000deg at 3.088944s",
            "MOVE to [2, 0] at 3.338944s",
            "WAIT at 4.753158s"
        ],
        "traj_2": [
            "MOVE to [2, 1] at 0.000000s",
            "MOVE to [1, 1] at 0.500000s",
            "ROTATE to head 5/135.000000deg at 1.000000s",
            "MOVE to [0, 2] at 1.264706s",
            "WAIT at 1.971813s"
        ]
    }
}