<svg xmlns="http://www.w3.org/2000/svg" xmlns:xlink="http://www.w3.org/1999/xlink" width="500px" height="400px" viewBox="0 0 500 400">
  <g id="grid">
    <path d=" M 100.000000 300.000000 L 100.000000 100.000000 M 200.000000 300.000000 L 200.000000 100.000000 M 300.000000 300.000000 L 300.000000 100.000000 M 400.000000 300.000000 L 400.000000 100.000000 M 100.000000 300.000000 L 400.000000 300.000000 M 100.000000 200.000000 L 400.000000 200.000000 M 100.000000 100.000000 L 400.000000 100.000000" fill="none" stroke="black" stroke-width="1" stroke-linecap="square"/>
    <text x="150.000000" y="310.000000" fill="black" font-size="10px" text-anchor="middle">0</text>
    <text x="250.000000" y="310.000000" fill="black" font-size="10px" text-anchor="middle">1</text>
    <text x="350.000000" y="310.000000" fill="black" font-size="10px" text-anchor="middle">2</text>
    <text x="90.000000" y="250.000000" fill="black" font-size="10px" text-anchor="right">0</text>
    <text x="90.000000" y="150.000000" fill="black" font-size="10px" text-anchor="right">1</text>
  </g>
  <g id="graph">
    <circle r="3.000000" cx="150.000000" cy="250.000000" fill="#bababa"/>
    <circle r="3.000000" cx="250.000000" cy="250.000000" fill="#bababa"/>
    <circle r="3.000000" cx="350.000000" cy="250.000000" fill="#bababa"/>
    <circle r="3.000000" cx="150.000000" cy="150.000000" fill="#bababa"/>
    <circle r="3.000000" cx="250.000000" cy="150.000000" fill="#bababa"/>
    <circle r="3.000000" cx="350.000000" cy="150.000000" fill="#bababa"/>
    <path d=" M 151.000000 250.000000 L 151.000000 150.000000 M 150.000000 251.000000 L 250.000000 251.000000 M 150.707108 250.707108 L 250.707108 150.707108 M 150.447220 250.894424 L 350.447205 150.894424 M 251.000000 250.000000 L 251.000000 150.000000 M 250.000000 251.000000 L 350.000000 251.000000 M 250.000000 249.000000 L 150.000000 249.000000 M 250.707108 250.707108 L 350.707092 150.707108 M 250.707108 249.292892 L 150.707108 149.292892 M 351.000000 250.000000 L 351.000000 150.000000 M 350.000000 249.000000 L 250.000000 249.000000 M 350.707092 249.292892 L 250.707108 149.292892 M 350.447205 249.105576 L 150.447220 149.105576 M 150.000000 151.000000 L 250.000000 151.000000 M 149.000000 150.000000 L 149.000000 250.000000 M 149.292892 150.707108 L 249.292892 250.707108 M 149.552780 150.894424 L 349.552795 250.894424 M 250.000000 151.000000 L 350.000000 151.000000 M 249.000000 150.000000 L 249.000000 250.000000 M 250.000000 149.000000 L 150.000000 149.000000 M 249.292892 150.707108 L 349.292908 250.707108 M 249.292892 149.292892 L 149.292892 249.292892 M 349.000000 150.000000 L 349.000000 250.000000 M 350.000000 149.000000 L 250.000000 149.000000 M 349.292908 149.292892 L 249.292892 249.292892 M 349.552795 149.105576 L 149.552780 249.105576" fill="none" stroke="#bababa" stroke-width="0.5"/>
  </g>
  <g id="graph_labels">
    <text x="150.000000" y="245.000000" fill="black" font-size="10px" text-anchor="middle">0</text>
    <text x="250.000000" y="245.000000" fill="black" font-size="10px" text-anchor="middle">1</text>
    <text x="350.000000" y="245.000000" fill="black" font-size="10px" text-anchor="middle">2</text>
    <text x="150.000000" y="145.000000" fill="black" font-size="10px" text-anchor="middle">3</text>
    <text x="250.000000" y="145.000000" fill="black" font-size="10px" text-anchor="middle">4</text>
    <text x="350.000000" y="145.000000" fill="black" font-size="10px" text-anchor="middle">5</text>
  </g>
  <g id="agent_motion">
    <g id="agent_trajectories">
      <path d=" M 150.000000 250.000000 L 350.000000 150.000000" fill="none" stroke="orange" stroke-width="2.0"/>
      <path d=" M 150.000000 150.000000 L 250.000000 150.000000 L 350.000000 250.000000" fill="none" stroke="red" stroke-width="2.0"/>
    </g>
    <g id="agent1_pos">
      <g id="agent1_rot">
        <circle r="45.000000" cx="0.000000" cy="0.000000" fill="orange"/>
        <path d=" M 0.000000 0.000000 L 45.000000 -0.000000" fill="none" stroke="grey" stroke-width="4"/>
        <animateTransform attributeName="transform" attributeType="XML" type="rotate" dur="4.664214s" repeatCount="indefinite" values="-0.000000;-0.000000;-26.565050;-26.565050" keyTimes="0.000000;0.214398;0.246040;1.000000"/>
      </g>
      <text x="0.000000" y="10.000000" fill="black" font-size="10px" text-anchor="middle">A1</text>
      <animateTransform attributeName="transform" attributeType="XML" type="translate" dur="4.664214s" repeatCount="indefinite" values="150.000000 250.000000;150.000000 250.000000;350.000000 150.000000;350.000000 150.000000" keyTimes="0.000000;0.246040;0.725450;1.000000"/>
    </g>
    <g id="agent2_pos">
      <g id="agent2_rot">
        <circle r="45.000000" cx="0.000000" cy="0.000000" fill="red"/>
        <path d=" M 0.000000 0.000000 L 45.000000 -0.000000" fill="none" stroke="grey" stroke-width="4"/>
        <animateTransform attributeName="transform" attributeType="XML" type="rotate" dur="4.664214s" repeatCount="indefinite" values="-0.000000;-0.000000;45.000000;45.000000" keyTimes="0.000000;0.428797;0.482396;1.000000"/>
      </g>
      <text x="0.000000" y="10.000000" fill="black" font-size="10px" text-anchor="middle">A2</text>
      <animateTransform attributeName="transform" attributeType="XML" type="translate" dur="4.664214s" repeatCount="indefinite" values="150.000000 150.000000;150.000000 150.000000;250.000000 150.000000;250.000000 150.000000;350.000000 250.000000;350.000000 250.000000" keyTimes="0.000000;0.214398;0.428797;0.482396;0.785602;1.000000"/>
    </g>
  </g>
</svg>