<svg xmlns="http://www.w3.org/2000/svg" xmlns:xlink="http://www.w3.org/1999/xlink" width="600px" height="600px" viewBox="0 0 600 600">
  <g id="grid">
    <rect x="100.000000" y="400.000000" width="100.000000" height="100.000000" fill="black"/>
    <rect x="400.000000" y="400.000000" width="100.000000" height="100.000000" fill="black"/>
    <rect x="100.000000" y="100.000000" width="100.000000" height="100.000000" fill="black"/>
    <rect x="400.000000" y="100.000000" width="100.000000" height="100.000000" fill="black"/>
    <path d=" M 100.000000 500.000000 L 100.000000 100.000000 M 200.000000 500.000000 L 200.000000 100.000000 M 300.000000 500.000000 L 300.000000 100.000000 M 400.000000 500.000000 L 400.000000 100.000000 M 500.000000 500.000000 L 500.000000 100.000000 M 100.000000 500.000000 L 500.000000 500.000000 M 100.000000 400.000000 L 500.000000 400.000000 M 100.000000 300.000000 L 500.000000 300.000000 M 100.000000 200.000000 L 500.000000 200.000000 M 100.000000 100.000000 L 500.000000 100.000000" fill="none" stroke="black" stroke-width="1" stroke-linecap="square"/>
    <text x="150.000000" y="510.000000" fill="black" font-size="10px" text-anchor="middle">0</text>
    <text x="250.000000" y="510.000000" fill="black" font-size="10px" text-anchor="middle">1</text>
    <text x="350.000000" y="510.000000" fill="black" font-size="10px" text-anchor="middle">2</text>
    <text x="450.000000" y="510.000000" fill="black" font-size="10px" text-anchor="middle">3</text>
    <text x="90.000000" y="450.000000" fill="black" font-size="10px" text-anchor="right">0</text>
    <text x="90.000000" y="350.000000" fill="black" font-size="10px" text-anchor="right">1</text>
    <text x="90.000000" y="250.000000" fill="black" font-size="10px" text-anchor="right">2</text>
    <text x="90.000000" y="150.000000" fill="black" font-size="10px" text-anchor="right">3</text>
  </g>
  <g id="graph">
    <circle r="3.000000" cx="250.000000" cy="450.000000" fill="#bababa"/>
    <circle r="3.000000" cx="350.000000" cy="450.000000" fill="#bababa"/>
    <circle r="3.000000" cx="150.000000" cy="350.000000" fill="#bababa"/>
    <circle r="3.000000" cx="250.000000" cy="350.000000" fill="#bababa"/>
    <circle r="3.000000" cx="350.000000" cy="350.000000" fill="#bababa"/>
    <circle r="3.000000" cx="450.000000" cy="350.000000" fill="#bababa"/>
    <circle r="3.000000" cx="150.000000" cy="250.000000" fill="#bababa"/>
    <circle r="3.000000" cx="250.000000" cy="250.000000" fill="#bababa"/>
    <circle r="3.000000" cx="350.000000" cy="250.000000" fill="#bababa"/>
    <circle r="3.000000" cx="450.000000" cy="250.000000" fill="#bababa"/>
    <circle r="3.000000" cx="250.000000" cy="150.000000" fill="#bababa"/>
    <circle r="3.000000" cx="350.000000" cy="150.000000" fill="#bababa"/>
    <path d=" M 251.000000 450.000000 L 251.000000 350.000000 M 250.000000 451.000000 L 350.000000 451.000000 M 351.000000 450.000000 L 351.000000 350.000000 M 350.000000 449.000000 L 250.000000 449.000000 M 151.000000 350.000000 L 151.000000 250.000000 M 150.000000 351.000000 L 250.000000 351.000000 M 251.000000 350.000000 L 251.000000 250.000000 M 250.000000 351.000000 L 350.000000 351.000000 M 249.000000 350.000000 L 249.000000 450.000000 M 250.000000 349.000000 L 150.000000 349.000000 M 351.000000 350.000000 L 351.000000 250.000000 M 350.000000 351.000000 L 450.000000 351.000000 M 349.000000 350.000000 L 349.000000 450.000000 M 350.000000 349.000000 L 250.000000 349.000000 M 451.000000 350.000000 L 451.000000 250.000000 M 450.000000 349.000000 L 350.000000 349.000000 M 150.000000 251.000000 L 250.000000 251.000000 M 149.000000 250.000000 L 149.000000 350.000000 M 251.000000 250.000000 L 251.000000 150.000000 M 250.000000 251.000000 L 350.000000 251.000000 M 249.000000 250.000000 L 249.000000 350.000000 M 250.000000 249.000000 L 150.000000 249.000000 M 351.000000 250.000000 L 351.000000 150.000000 M 350.000000 251.000000 L 450.000000 251.000000 M 349.000000 250.000000 L 349.000000 350.000000 M 350.000000 249.000000 L 250.000000 249.000000 M 449.000000 250.000000 L 449.000000 350.000000 M 450.000000 249.000000 L 350.000000 249.000000 M 250.000000 151.000000 L 350.000000 151.000000 M 249.000000 150.000000 L 249.000000 250.000000 M 349.000000 150.000000 L 349.000000 250.000000 M 350.000000 149.000000 L 250.000000 149.000000" fill="none" stroke="#bababa" stroke-width="0.5"/>
  </g>
  <g id="graph_labels">
    <text x="250.000000" y="445.000000" fill="black" font-size="10px" text-anchor="middle">0</text>
    <text x="350.000000" y="445.000000" fill="black" font-size="10px" text-anchor="middle">1</text>
    <text x="150.000000" y="345.000000" fill="black" font-size="10px" text-anchor="middle">2</text>
    <text x="250.000000" y="345.000000" fill="black" font-size="10px" text-anchor="middle">3</text>
    <text x="350.000000" y="345.000000" fill="black" font-size="10px" text-anchor="middle">4</text>
    <text x="450.000000" y="345.000000" fill="black" font-size="10px" text-anchor="middle">5</text>
    <text x="150.000000" y="245.000000" fill="black" font-size="10px" text-anchor="middle">6</text>
    <text x="250.000000" y="245.000000" fill="black" font-size="10px" text-anchor="middle">7</text>
    <text x="350.000000" y="245.000000" fill="black" font-size="10px" text-anchor="middle">8</text>
    <text x="450.000000" y="245.000000" fill="black" font-size="10px" text-anchor="middle">9</text>
    <text x="250.000000" y="145.000000" fill="black" font-size="10px" text-anchor="middle">10</text>
    <text x="350.000000" y="145.000000" fill="black" font-size="10px" text-anchor="middle">11</text>
  </g>
</svg>