<svg xmlns="http://www.w3.org/2000/svg" xmlns:xlink="http://www.w3.org/1999/xlink" width="2100px" height="900px" viewBox="0 0 2100 900">
  <g id="grid">
    <rect x="500.000000" y="600.000000" width="100.000000" height="100.000000" fill="black"/>
    <rect x="600.000000" y="600.000000" width="100.000000" height="100.000000" fill="black"/>
    <rect x="700.000000" y="600.000000" width="100.000000" height="100.000000" fill="black"/>
    <rect x="900.000000" y="600.000000" width="100.000000" height="100.000000" fill="black"/>
    <rect x="1000.000000" y="600.000000" width="100.000000" height="100.000000" fill="black"/>
    <rect x="1100.000000" y="600.000000" width="100.000000" height="100.000000" fill="black"/>
    <rect x="1300.000000" y="600.000000" width="100.000000" height="100.000000" fill="black"/>
    <rect x="1400.000000" y="600.000000" width="100.000000" height="100.000000" fill="black"/>
    <rect x="1500.000000" y="600.000000" width="100.000000" height="100.000000" fill="black"/>
    <rect x="500.000000" y="400.000000" width="100.000000" height="100.000000" fill="black"/>
    <rect x="600.000000" y="400.000000" width="100.000000" height="100.000000" fill="black"/>
    <rect x="700.000000" y="400.000000" width="100.000000" height="100.000000" fill="black"/>
    <rect x="900.000000" y="400.000000" width="100.000000" height="100.000000" fill="black"/>
    <rect x="1000.000000" y="400.000000" width="100.000000" height="100.000000" fill="black"/>
    <rect x="1100.000000" y="400.000000" width="100.000000" height="100.000000" fill="black"/>
    <rect x="1300.000000" y="400.000000" width="100.000000" height="100.000000" fill="black"/>
    <rect x="1400.000000" y="400.000000" width="100.000000" height="100.000000" fill="black"/>
    <rect x="1500.000000" y="400.000000" width="100.000000" height="100.000000" fill="black"/>
    <rect x="500.000000" y="200.000000" width="100.000000" height="100.000000" fill="black"/>
    <rect x="600.000000" y="200.000000" width="100.000000" height="100.000000" fill="black"/>
    <rect x="700.000000" y="200.000000" width="100.000000" height="100.000000" fill="black"/>
    <rect x="900.000000" y="200.000000" width="100.000000" height="100.000000" fill="black"/>
    <rect x="1000.000000" y="200.000000" width="100.000000" height="100.000000" fill="black"/>
    <rect x="1100.000000" y="200.000000" width="100.000000" height="100.000000" fill="black"/>
    <rect x="1300.000000" y="200.000000" width="100.000000" height="100.000000" fill="black"/>
    <rect x="1400.000000" y="200.000000" width="100.000000" height="100.000000" fill="black"/>
    <rect x="1500.000000" y="200.000000" width="100.000000" height="100.000000" fill="black"/>
    <path d=" M 100.000000 800.000000 L 100.000000 100.000000 M 200.000000 800.000000 L 200.000000 100.000000 M 300.000000 800.000000 L 300.000000 100.000000 M 400.000000 800.000000 L 400.000000 100.000000 M 500.000000 800.000000 L 500.000000 100.000000 M 600.000000 800.000000 L 600.000000 100.000000 M 700.000000 800.000000 L 700.000000 100.000000 M 800.000000 800.000000 L 800.000000 100.000000 M 900.000000 800.000000 L 900.000000 100.000000 M 1000.000000 800.000000 L 1000.000000 100.000000 M 1100.000000 800.000000 L 1100.000000 100.000000 M 1200.000000 800.000000 L 1200.000000 100.000000 M 1300.000000 800.000000 L 1300.000000 100.000000 M 1400.000000 800.000000 L 1400.000000 100.000000 M 1500.000000 800.000000 L 1500.000000 100.000000 M 1600.000000 800.000000 L 1600.000000 100.000000 M 1700.000000 800.000000 L 1700.000000 100.000000 M 1800.000000 800.000000 L 1800.000000 100.000000 M 1900.000000 800.000000 L 1900.000000 100.000000 M 2000.000000 800.000000 L 2000.000000 100.000000 M 100.000000 800.000000 L 2000.000000 800.000000 M 100.000000 700.000000 L 2000.000000 700.000000 M 100.000000 600.000000 L 2000.000000 600.000000 M 100.000000 500.000000 L 2000.000000 500.000000 M 100.000000 400.000000 L 2000.000000 400.000000 M 100.000000 300.000000 L 2000.000000 300.000000 M 100.000000 200.000000 L 2000.000000 200.000000 M 100.000000 100.000000 L 2000.000000 100.000000" fill="none" stroke="black" stroke-width="1" stroke-linecap="square"/>
    <text x="150.000000" y="810.000000" fill="black" font-size="10px" text-anchor="middle">0</text>
    <text x="250.000000" y="810.000000" fill="black" font-size="10px" text-anchor="middle">1</text>
    <text x="350.000000" y="810.000000" fill="black" font-size="10px" text-anchor="middle">2</text>
    <text x="450.000000" y="810.000000" fill="black" font-size="10px" text-anchor="middle">3</text>
    <text x="550.000000" y="810.000000" fill="black" font-size="10px" text-anchor="middle">4</text>
    <text x="650.000000" y="810.000000" fill="black" font-size="10px" text-anchor="middle">5</text>
    <text x="750.000000" y="810.000000" fill="black" font-size="10px" text-anchor="middle">6</text>
    <text x="850.000000" y="810.000000" fill="black" font-size="10px" text-anchor="middle">7</text>
    <text x="950.000000" y="810.000000" fill="black" font-size="10px" text-anchor="middle">8</text>
    <text x="1050.000000" y="810.000000" fill="black" font-size="10px" text-anchor="middle">9</text>
    <text x="1150.000000" y="810.000000" fill="black" font-size="10px" text-anchor="middle">10</text>
    <text x="1250.000000" y="810.000000" fill="black" font-size="10px" text-anchor="middle">11</text>
    <text x="1350.000000" y="810.000000" fill="black" font-size="10px" text-anchor="middle">12</text>
    <text x="1450.000000" y="810.000000" fill="black" font-size="10px" text-anchor="middle">13</text>
    <text x="1550.000000" y="810.000000" fill="black" font-size="10px" text-anchor="middle">14</text>
    <text x="1650.000000" y="810.000000" fill="black" font-size="10px" text-anchor="middle">15</text>
    <text x="1750.000000" y="810.000000" fill="black" font-size="10px" text-anchor="middle">16</text>
    <text x="1850.000000" y="810.000000" fill="black" font-size="10px" text-anchor="middle">17</text>
    <text x="1950.000000" y="810.000000" fill="black" font-size="10px" text-anchor="middle">18</text>
    <text x="90.000000" y="750.000000" fill="black" font-size="10px" text-anchor="right">0</text>
    <text x="90.000000" y="650.000000" fill="black" font-size="10px" text-anchor="right">1</text>
    <text x="90.000000" y="550.000000" fill="black" font-size="10px" text-anchor="right">2</text>
    <text x="90.000000" y="450.000000" fill="black" font-size="10px" text-anchor="right">3</text>
    <text x="90.000000" y="350.000000" fill="black" font-size="10px" text-anchor="right">4</text>
    <text x="90.000000" y="250.000000" fill="black" font-size="10px" text-anchor="right">5</text>
    <text x="90.000000" y="150.000000" fill="black" font-size="10px" text-anchor="right">6</text>
  </g>
  <g id="graph">
    <circle r="3.000000" cx="150.000000" cy="750.000000" fill="#bababa"/>
    <circle r="3.000000" cx="250.000000" cy="750.000000" fill="#bababa"/>
    <circle r="3.000000" cx="350.000000" cy="750.000000" fill="#bababa"/>
    <circle r="3.000000" cx="450.000000" cy="750.000000" fill="#bababa"/>
    <circle r="3.000000" cx="550.000000" cy="750.000000" fill="#bababa"/>
    <circle r="3.000000" cx="650.000000" cy="750.000000" fill="#bababa"/>
    <circle r="3.000000" cx="750.000000" cy="750.000000" fill="#bababa"/>
    <circle r="3.000000" cx="850.000000" cy="750.000000" fill="#bababa"/>
    <circle r="3.000000" cx="950.000000" cy="750.000000" fill="#bababa"/>
    <circle r="3.000000" cx="1050.000000" cy="750.000000" fill="#bababa"/>
    <circle r="3.000000" cx="1150.000000" cy="750.000000" fill="#bababa"/>
    <circle r="3.000000" cx="1250.000000" cy="750.000000" fill="#bababa"/>
    <circle r="3.000000" cx="1350.000000" cy="750.000000" fill="#bababa"/>
    <circle r="3.000000" cx="1450.000000" cy="750.000000" fill="#bababa"/>
    <circle r="3.000000" cx="1550.000000" cy="750.000000" fill="#bababa"/>
    <circle r="3.000000" cx="1650.000000" cy="750.000000" fill="#bababa"/>
    <circle r="3.000000" cx="1750.000000" cy="750.000000" fill="#bababa"/>
    <circle r="3.000000" cx="1850.000000" cy="750.000000" fill="#bababa"/>
    <circle r="3.000000" cx="1950.000000" cy="750.000000" fill="#bababa"/>
    <circle r="3.000000" cx="150.000000" cy="650.000000" fill="#bababa"/>
    <circle r="3.000000" cx="250.000000" cy="650.000000" fill="#bababa"/>
    <circle r="3.000000" cx="350.000000" cy="650.000000" fill="#bababa"/>
    <circle r="3.000000" cx="450.000000" cy="650.000000" fill="#bababa"/>
    <circle r="3.000000" cx="850.000000" cy="650.000000" fill="#bababa"/>
    <circle r="3.000000" cx="1250.000000" cy="650.000000" fill="#bababa"/>
    <circle r="3.000000" cx="1650.000000" cy="650.000000" fill="#bababa"/>
    <circle r="3.000000" cx="1750.000000" cy="650.000000" fill="#bababa"/>
    <circle r="3.000000" cx="1850.000000" cy="650.000000" fill="#bababa"/>
    <circle r="3.000000" cx="1950.000000" cy="650.000000" fill="#bababa"/>
    <circle r="3.000000" cx="150.000000" cy="550.000000" fill="#bababa"/>
    <circle r="3.000000" cx="250.000000" cy="550.000000" fill="#bababa"/>
    <circle r="3.000000" cx="350.000000" cy="550.000000" fill="#bababa"/>
    <circle r="3.000000" cx="450.000000" cy="550.000000" fill="#bababa"/>
    <circle r="3.000000" cx="550.000000" cy="550.000000" fill="#bababa"/>
    <circle r="3.000000" cx="650.000000" cy="550.000000" fill="#bababa"/>
    <circle r="3.000000" cx="750.000000" cy="550.000000" fill="#bababa"/>
    <circle r="3.000000" cx="850.000000" cy="550.000000" fill="#bababa"/>
    <circle r="3.000000" cx="950.000000" cy="550.000000" fill="#bababa"/>
    <circle r="3.000000" cx="1050.000000" cy="550.000000" fill="#bababa"/>
    <circle r="3.000000" cx="1150.000000" cy="550.000000" fill="#bababa"/>
    <circle r="3.000000" cx="1250.000000" cy="550.000000" fill="#bababa"/>
    <circle r="3.000000" cx="1350.000000" cy="550.000000" fill="#bababa"/>
    <circle r="3.000000" cx="1450.000000" cy="550.000000" fill="#bababa"/>
    <circle r="3.000000" cx="1550.000000" cy="550.000000" fill="#bababa"/>
    <circle r="3.000000" cx="1650.000000" cy="550.000000" fill="#bababa"/>
    <circle r="3.000000" cx="1750.000000" cy="550.000000" fill="#bababa"/>
    <circle r="3.000000" cx="1850.000000" cy="550.000000" fill="#bababa"/>
    <circle r="3.000000" cx="1950.000000" cy="550.000000" fill="#bababa"/>
    <circle r="3.000000" cx="150.000000" cy="450.000000" fill="#bababa"/>
    <circle r="3.000000" cx="250.000000" cy="450.000000" fill="#bababa"/>
    <circle r="3.000000" cx="350.000000" cy="450.000000" fill="#bababa"/>
    <circle r="3.000000" cx="450.000000" cy="450.000000" fill="#bababa"/>
    <circle r="3.000000" cx="850.000000" cy="450.000000" fill="#bababa"/>
    <circle r="3.000000" cx="1250.000000" cy="450.000000" fill="#bababa"/>
    <circle r="3.000000" cx="1650.000000" cy="450.000000" fill="#bababa"/>
    <circle r="3.000000" cx="1750.000000" cy="450.000000" fill="#bababa"/>
    <circle r="3.000000" cx="1850.000000" cy="450.000000" fill="#bababa"/>
    <circle r="3.000000" cx="1950.000000" cy="450.000000" fill="#bababa"/>
    <circle r="3.000000" cx="150.000000" cy="350.000000" fill="#bababa"/>
    <circle r="3.000000" cx="250.000000" cy="350.000000" fill="#bababa"/>
    <circle r="3.000000" cx="350.000000" cy="350.000000" fill="#bababa"/>
    <circle r="3.000000" cx="450.000000" cy="350.000000" fill="#bababa"/>
    <circle r="3.000000" cx="550.000000" cy="350.000000" fill="#bababa"/>
    <circle r="3.000000" cx="650.000000" cy="350.000000" fill="#bababa"/>
    <circle r="3.000000" cx="750.000000" cy="350.000000" fill="#bababa"/>
    <circle r="3.000000" cx="850.000000" cy="350.000000" fill="#bababa"/>
    <circle r="3.000000" cx="950.000000" cy="350.000000" fill="#bababa"/>
    <circle r="3.000000" cx="1050.000000" cy="350.000000" fill="#bababa"/>
    <circle r="3.000000" cx="1150.000000" cy="350.000000" fill="#bababa"/>
    <circle r="3.000000" cx="1250.000000" cy="350.000000" fill="#bababa"/>
    <circle r="3.000000" cx="1350.000000" cy="350.000000" fill="#bababa"/>
    <circle r="3.000000" cx="1450.000000" cy="350.000000" fill="#bababa"/>
    <circle r="3.000000" cx="1550.000000" cy="350.000000" fill="#bababa"/>
    <circle r="3.000000" cx="1650.000000" cy="350.000000" fill="#bababa"/>
    <circle r="3.000000" cx="1750.000000" cy="350.000000" fill="#bababa"/>
    <circle r="3.000000" cx="1850.000000" cy="350.000000" fill="#bababa"/>
    <circle r="3.000000" cx="1950.000000" cy="350.000000" fill="#bababa"/>
    <circle r="3.000000" cx="150.000000" cy="250.000000" fill="#bababa"/>
    <circle r="3.000000" cx="250.000000" cy="250.000000" fill="#bababa"/>
    <circle r="3.000000" cx="350.000000" cy="250.000000" fill="#bababa"/>
    <circle r="3.000000" cx="450.000000" cy="250.000000" fill="#bababa"/>
    <circle r="3.000000" cx="850.000000" cy="250.000000" fill="#bababa"/>
    <circle r="3.000000" cx="1250.000000" cy="250.000000" fill="#bababa"/>
    <circle r="3.000000" cx="1650.000000" cy="250.000000" fill="#bababa"/>
    <circle r="3.000000" cx="1750.000000" cy="250.000000" fill="#bababa"/>
    <circle r="3.000000" cx="1850.000000" cy="250.000000" fill="#bababa"/>
    <circle r="3.000000" cx="1950.000000" cy="250.000000" fill="#bababa"/>
    <circle r="3.000000" cx="150.000000" cy="150.000000" fill="#bababa"/>
    <circle r="3.000000" cx="250.000000" cy="150.000000" fill="#bababa"/>
    <circle r="3.000000" cx="350.000000" cy="150.000000" fill="#bababa"/>
    <circle r="3.000000" cx="450.000000" cy="150.000000" fill="#bababa"/>
    <circle r="3.000000" cx="550.000000" cy="150.000000" fill="#bababa"/>
    <circle r="3.000000" cx="650.000000" cy="150.000000" fill="#bababa"/>
    <circle r="3.000000" cx="750.000000" cy="150.000000" fill="#bababa"/>
    <circle r="3.000000" cx="850.000000" cy="150.000000" fill="#bababa"/>
    <circle r="3.000000" cx="950.000000" cy="150.000000" fill="#bababa"/>
    <circle r="3.000000" cx="1050.000000" cy="150.000000" fill="#bababa"/>
    <circle r="3.000000" cx="1150.000000" cy="150.000000" fill="#bababa"/>
    <circle r="3.000000" cx="1250.000000" cy="150.000000" fill="#bababa"/>
    <circle r="3.000000" cx="1350.000000" cy="150.000000" fill="#bababa"/>
    <circle r="3.000000" cx="1450.000000" cy="150.000000" fill="#bababa"/>
    <circle r="3.000000" cx="1550.000000" cy="150.000000" fill="#bababa"/>
    <circle r="3.000000" cx="1650.000000" cy="150.000000" fill="#bababa"/>
    <circle r="3.000000" cx="1750.000000" cy="150.000000" fill="#bababa"/>
    <circle r="3.000000" cx="1850.000000" cy="150.000000" fill="#bababa"/>
    <circle r="3.000000" cx="1950.000000" cy="150.000000" fill="#bababa"/>
    <path d=" M 151.000000 750.000000 L 151.000000 650.000000 M 150.000000 751.000000 L 250.000000 751.000000 M 251.000000 750.000000 L 251.000000 650.000000 M 250.000000 751.000000 L 350.000000 751.000000 M 250.000000 749.000000 L 150.000000 749.000000 M 351.000000 750.000000 L 351.000000 650.000000 M 350.000000 751.000000 L 450.000000 751.000000 M 350.000000 749.000000 L 250.000000 749.000000 M 451.000000 750.000000 L 451.000000 650.000000 M 450.000000 751.000000 L 550.000000 751.000000 M 450.000000 749.000000 L 350.000000 749.000000 M 550.000000 751.000000 L 650.000000 751.000000 M 550.000000 749.000000 L 450.000000 749.000000 M 650.000000 751.000000 L 750.000000 751.000000 M 650.000000 749.000000 L 550.000000 749.000000 M 750.000000 751.000000 L 850.000000 751.000000 M 750.000000 749.000000 L 650.000000 749.000000 M 851.000000 750.000000 L 851.000000 650.000000 M 850.000000 751.000000 L 950.000000 751.000000 M 850.000000 749.000000 L 750.000000 749.000000 M 950.000000 751.000000 L 1050.000000 751.000000 M 950.000000 749.000000 L 850.000000 749.000000 M 1050.000000 751.000000 L 1150.000000 751.000000 M 1050.000000 749.000000 L 950.000000 749.000000 M 1150.000000 751.000000 L 1250.000000 751.000000 M 1150.000000 749.000000 L 1050.000000 749.000000 M 1251.000000 750.000000 L 1251.000000 650.000000 M 1250.000000 751.000000 L 1350.000000 751.000000 M 1250.000000 749.000000 L 1150.000000 749.000000 M 1350.000000 751.000000 L 1450.000000 751.000000 M 1350.000000 749.000000 L 1250.000000 749.000000 M 1450.000000 751.000000 L 1550.000000 751.000000 M 1450.000000 749.000000 L 1350.000000 749.000000 M 1550.000000 751.000000 L 1650.000000 751.000000 M 1550.000000 749.000000 L 1450.000000 749.000000 M 1651.000000 750.000000 L 1651.000000 650.000000 M 1650.000000 751.000000 L 1750.000000 751.000000 M 1650.000000 749.000000 L 1550.000000 749.000000 M 1751.000000 750.000000 L 1751.000000 650.000000 M 1750.000000 751.000000 L 1850.000000 751.000000 M 1750.000000 749.000000 L 1650.000000 749.000000 M 1851.000000 750.000000 L 1851.000000 650.000000 M 1850.000000 751.000000 L 1950.000000 751.000000 M 1850.000000 749.000000 L 1750.000000 749.000000 M 1951.000000 750.000000 L 1951.000000 650.000000 M 1950.000000 749.000000 L 1850.000000 749.000000 M 151.000000 650.000000 L 151.000000 550.000000 M 150.000000 651.000000 L 250.000000 651.000000 M 149.000000 650.000000 L 149.000000 750.000000 M 251.000000 650.000000 L 251.000000 550.000000 M 250.000000 651.000000 L 350.000000 651.000000 M 249.000000 650.000000 L 249.000000 750.000000 M 250.000000 649.000000 L 150.000000 649.000000 M 351.000000 650.000000 L 351.000000 550.000000 M 350.000000 651.000000 L 450.000000 651.000000 M 349.000000 650.000000 L 349.000000 750.000000 M 350.000000 649.000000 L 250.000000 649.000000 M 451.000000 650.000000 L 451.000000 550.000000 M 449.000000 650.000000 L 449.000000 750.000000 M 450.000000 649.000000 L 350.000000 649.000000 M 851.000000 650.000000 L 851.000000 550.000000 M 849.000000 650.000000 L 849.000000 750.000000 M 1251.000000 650.000000 L 1251.000000 550.000000 M 1249.000000 650.000000 L 1249.000000 750.000000 M 1651.000000 650.000000 L 1651.000000 550.000000 M 1650.000000 651.000000 L 1750.000000 651.000000 M 1649.000000 650.000000 L 1649.000000 750.000000 M 1751.000000 650.000000 L 1751.000000 550.000000 M 1750.000000 651.000000 L 1850.000000 651.000000 M 1749.000000 650.000000 L 1749.000000 750.000000 M 1750.000000 649.000000 L 1650.000000 649.000000 M 1851.000000 650.000000 L 1851.000000 550.000000 M 1850.000000 651.000000 L 1950.000000 651.000000 M 1849.000000 650.000000 L 1849.000000 750.000000 M 1850.000000 649.000000 L 1750.000000 649.000000 M 1951.000000 650.000000 L 1951.000000 550.000000 M 1949.000000 650.000000 L 1949.000000 750.000000 M 1950.000000 649.000000 L 1850.000000 649.000000 M 151.000000 550.000000 L 151.000000 450.000000 M 150.000000 551.000000 L 250.000000 551.000000 M 149.000000 550.000000 L 149.000000 650.000000 M 251.000000 550.000000 L 251.000000 450.000000 M 250.000000 551.000000 L 350.000000 551.000000 M 249.000000 550.000000 L 249.000000 650.000000 M 250.000000 549.000000 L 150.000000 549.000000 M 351.000000 550.000000 L 351.000000 450.000000 M 350.000000 551.000000 L 450.000000 551.000000 M 349.000000 550.000000 L 349.000000 650.000000 M 350.000000 549.000000 L 250.000000 549.000000 M 451.000000 550.000000 L 451.000000 450.000000 M 450.000000 551.000000 L 550.000000 551.000000 M 449.000000 550.000000 L 449.000000 650.000000 M 450.000000 549.000000 L 350.000000 549.000000 M 550.000000 551.000000 L 650.000000 551.000000 M 550.000000 549.000000 L 450.000000 549.000000 M 650.000000 551.000000 L 750.000000 551.000000 M 650.000000 549.000000 L 550.000000 549.000000 M 750.000000 551.000000 L 850.000000 551.000000 M 750.000000 549.000000 L 650.000000 549.000000 M 851.000000 550.000000 L 851.000000 450.000000 M 850.000000 551.000000 L 950.000000 551.000000 M 849.000000 550.000000 L 849.000000 650.000000 M 850.000000 549.000000 L 750.000000 549.000000 M 950.000000 551.000000 L 1050.000000 551.000000 M 950.000000 549.000000 L 850.000000 549.000000 M 1050.000000 551.000000 L 1150.000000 551.000000 M 1050.000000 549.000000 L 950.000000 549.000000 M 1150.000000 551.000000 L 1250.000000 551.000000 M 1150.000000 549.000000 L 1050.000000 549.000000 M 1251.000000 550.000000 L 1251.000000 450.000000 M 1250.000000 551.000000 L 1350.000000 551.000000 M 1249.000000 550.000000 L 1249.000000 650.000000 M 1250.000000 549.000000 L 1150.000000 549.000000 M 1350.000000 551.000000 L 1450.000000 551.000000 M 1350.000000 549.000000 L 1250.000000 549.000000 M 1450.000000 551.000000 L 1550.000000 551.000000 M 1450.000000 549.000000 L 1350.000000 549.000000 M 1550.000000 551.000000 L 1650.000000 551.000000 M 1550.000000 549.000000 L 1450.000000 549.000000 M 1651.000000 550.000000 L 1651.000000 450.000000 M 1650.000000 551.000000 L 1750.000000 551.000000 M 1649.000000 550.000000 L 1649.000000 650.000000 M 1650.000000 549.000000 L 1550.000000 549.000000 M 1751.000000 550.000000 L 1751.000000 450.000000 M 1750.000000 551.000000 L 1850.000000 551.000000 M 1749.000000 550.000000 L 1749.000000 650.000000 M 1750.000000 549.000000 L 1650.000000 549.000000 M 1851.000000 550.000000 L 1851.000000 450.000000 M 1850.000000 551.000000 L 1950.000000 551.000000 M 1849.000000 550.000000 L 1849.000000 650.000000 M 1850.000000 549.000000 L 1750.000000 549.000000 M 1951.000000 550.000000 L 1951.000000 450.000000 M 1949.000000 550.000000 L 1949.000000 650.000000 M 1950.000000 549.000000 L 1850.000000 549.000000 M 151.000000 450.000000 L 151.000000 350.000000 M 150.000000 451.000000 L 250.000000 451.000000 M 149.000000 450.000000 L 149.000000 550.000000 M 251.000000 450.000000 L 251.000000 350.000000 M 250.000000 451.000000 L 350.000000 451.000000 M 249.000000 450.000000 L 249.000000 550.000000 M 250.000000 449.000000 L 150.000000 449.000000 M 351.000000 450.000000 L 351.000000 350.000000 M 350.000000 451.000000 L 450.000000 451.000000 M 349.000000 450.000000 L 349.000000 550.000000 M 350.000000 449.000000 L 250.000000 449.000000 M 451.000000 450.000000 L 451.000000 350.000000 M 449.000000 450.000000 L 449.000000 550.000000 M 450.000000 449.000000 L 350.000000 449.000000 M 851.000000 450.000000 L 851.000000 350.000000 M 849.000000 450.000000 L 849.000000 550.000000 M 1251.000000 450.000000 L 1251.000000 350.000000 M 1249.000000 450.000000 L 1249.000000 550.000000 M 1651.000000 450.000000 L 1651.000000 350.000000 M 1650.000000 451.000000 L 1750.000000 451.000000 M 1649.000000 450.000000 L 1649.000000 550.000000 M 1751.000000 450.000000 L 1751.000000 350.000000 M 1750.000000 451.000000 L 1850.000000 451.000000 M 1749.000000 450.000000 L 1749.000000 550.000000 M 1750.000000 449.000000 L 1650.000000 449.000000 M 1851.000000 450.000000 L 1851.000000 350.000000 M 1850.000000 451.000000 L 1950.000000 451.000000 M 1849.000000 450.000000 L 1849.000000 550.000000 M 1850.000000 449.000000 L 1750.000000 449.000000 M 1951.000000 450.000000 L 1951.000000 350.000000 M 1949.000000 450.000000 L 1949.000000 550.000000 M 1950.000000 449.000000 L 1850.000000 449.000000 M 151.000000 350.000000 L 151.000000 250.000000 M 150.000000 351.000000 L 250.000000 351.000000 M 149.000000 350.000000 L 149.000000 450.000000 M 251.000000 350.000000 L 251.000000 250.000000 M 250.000000 351.000000 L 350.000000 351.000000 M 249.000000 350.000000 L 249.000000 450.000000 M 250.000000 349.000000 L 150.000000 349.000000 M 351.000000 350.000000 L 351.000000 250.000000 M 350.000000 351.000000 L 450.000000 351.000000 M 349.000000 350.000000 L 349.000000 450.000000 M 350.000000 349.000000 L 250.000000 349.000000 M 451.000000 350.000000 L 451.000000 250.000000 M 450.000000 351.000000 L 550.000000 351.000000 M 449.000000 350.000000 L 449.000000 450.000000 M 450.000000 349.000000 L 350.000000 349.000000 M 550.000000 351.000000 L 650.000000 351.000000 M 550.000000 349.000000 L 450.000000 349.000000 M 650.000000 351.000000 L 750.000000 351.000000 M 650.000000 349.000000 L 550.000000 349.000000 M 750.000000 351.000000 L 850.000000 351.000000 M 750.000000 349.000000 L 650.000000 349.000000 M 851.000000 350.000000 L 851.000000 250.000000 M 850.000000 351.000000 L 950.000000 351.000000 M 849.000000 350.000000 L 849.000000 450.000000 M 850.000000 349.000000 L 750.000000 349.000000 M 950.000000 351.000000 L 1050.000000 351.000000 M 950.000000 349.000000 L 850.000000 349.000000 M 1050.000000 351.000000 L 1150.000000 351.000000 M 1050.000000 349.000000 L 950.000000 349.000000 M 1150.000000 351.000000 L 1250.000000 351.000000 M 1150.000000 349.000000 L 1050.000000 349.000000 M 1251.000000 350.000000 L 1251.000000 250.000000 M 1250.000000 351.000000 L 1350.000000 351.000000 M 1249.000000 350.000000 L 1249.000000 450.000000 M 1250.000000 349.000000 L 1150.000000 349.000000 M 1350.000000 351.000000 L 1450.000000 351.000000 M 1350.000000 349.000000 L 1250.000000 349.000000 M 1450.000000 351.000000 L 1550.000000 351.000000 M 1450.000000 349.000000 L 1350.000000 349.000000 M 1550.000000 351.000000 L 1650.000000 351.000000 M 1550.000000 349.000000 L 1450.000000 349.000000 M 1651.000000 350.000000 L 1651.000000 250.000000 M 1650.000000 351.000000 L 1750.000000 351.000000 M 1649.000000 350.000000 L 1649.000000 450.000000 M 1650.000000 349.000000 L 1550.000000 349.000000 M 1751.000000 350.000000 L 1751.000000 250.000000 M 1750.000000 351.000000 L 1850.000000 351.000000 M 1749.000000 350.000000 L 1749.000000 450.000000 M 1750.000000 349.000000 L 1650.000000 349.000000 M 1851.000000 350.000000 L 1851.000000 250.000000 M 1850.000000 351.000000 L 1950.000000 351.000000 M 1849.000000 350.000000 L 1849.000000 450.000000 M 1850.000000 349.000000 L 1750.000000 349.000000 M 1951.000000 350.000000 L 1951.000000 250.000000 M 1949.000000 350.000000 L 1949.000000 450.000000 M 1950.000000 349.000000 L 1850.000000 349.000000 M 151.000000 250.000000 L 151.000000 150.000000 M 150.000000 251.000000 L 250.000000 251.000000 M 149.000000 250.000000 L 149.000000 350.000000 M 251.000000 250.000000 L 251.000000 150.000000 M 250.000000 251.000000 L 350.000000 251.000000 M 249.000000 250.000000 L 249.000000 350.000000 M 250.000000 249.000000 L 150.000000 249.000000 M 351.000000 250.000000 L 351.000000 150.000000 M 350.000000 251.000000 L 450.000000 251.000000 M 349.000000 250.000000 L 349.000000 350.000000 M 350.000000 249.000000 L 250.000000 249.000000 M 451.000000 250.000000 L 451.000000 150.000000 M 449.000000 250.000000 L 449.000000 350.000000 M 450.000000 249.000000 L 350.000000 249.000000 M 851.000000 250.000000 L 851.000000 150.000000 M 849.000000 250.000000 L 849.000000 350.000000 M 1251.000000 250.000000 L 1251.000000 150.000000 M 1249.000000 250.000000 L 1249.000000 350.000000 M 1651.000000 250.000000 L 1651.000000 150.000000 M 1650.000000 251.000000 L 1750.000000 251.000000 M 1649.000000 250.000000 L 1649.000000 350.000000 M 1751.000000 250.000000 L 1751.000000 150.000000 M 1750.000000 251.000000 L 1850.000000 251.000000 M 1749.000000 250.000000 L 1749.000000 350.000000 M 1750.000000 249.000000 L 1650.000000 249.000000 M 1851.000000 250.000000 L 1851.000000 150.000000 M 1850.000000 251.000000 L 1950.000000 251.000000 M 1849.000000 250.000000 L 1849.000000 350.000000 M 1850.000000 249.000000 L 1750.000000 249.000000 M 1951.000000 250.000000 L 1951.000000 150.000000 M 1949.000000 250.000000 L 1949.000000 350.000000 M 1950.000000 249.000000 L 1850.000000 249.000000 M 150.000000 151.000000 L 250.000000 151.000000 M 149.000000 150.000000 L 149.000000 250.000000 M 250.000000 151.000000 L 350.000000 151.000000 M 249.000000 150.000000 L 249.000000 250.000000 M 250.000000 149.000000 L 150.000000 149.000000 M 350.000000 151.000000 L 450.000000 151.000000 M 349.000000 150.000000 L 349.000000 250.000000 M 350.000000 149.000000 L 250.000000 149.000000 M 450.000000 151.000000 L 550.000000 151.000000 M 449.000000 150.000000 L 449.000000 250.000000 M 450.000000 149.000000 L 350.000000 149.000000 M 550.000000 151.000000 L 650.000000 151.000000 M 550.000000 149.000000 L 450.000000 149.000000 M 650.000000 151.000000 L 750.000000 151.000000 M 650.000000 149.000000 L 550.000000 149.000000 M 750.000000 151.000000 L 850.000000 151.000000 M 750.000000 149.000000 L 650.000000 149.000000 M 850.000000 151.000000 L 950.000000 151.000000 M 849.000000 150.000000 L 849.000000 250.000000 M 850.000000 149.000000 L 750.000000 149.000000 M 950.000000 151.000000 L 1050.000000 151.000000 M 950.000000 149.000000 L 850.000000 149.000000 M 1050.000000 151.000000 L 1150.000000 151.000000 M 1050.000000 149.000000 L 950.000000 149.000000 M 1150.000000 151.000000 L 1250.000000 151.000000 M 1150.000000 149.000000 L 1050.000000 149.000000 M 1250.000000 151.000000 L 1350.000000 151.000000 M 1249.000000 150.000000 L 1249.000000 250.000000 M 1250.000000 149.000000 L 1150.000000 149.000000 M 1350.000000 151.000000 L 1450.000000 151.000000 M 1350.000000 149.000000 L 1250.000000 149.000000 M 1450.000000 151.000000 L 1550.000000 151.000000 M 1450.000000 149.000000 L 1350.000000 149.000000 M 1550.000000 151.000000 L 1650.000000 151.000000 M 1550.000000 149.000000 L 1450.000000 149.000000 M 1650.000000 151.000000 L 1750.000000 151.000000 M 1649.000000 150.000000 L 1649.000000 250.000000 M 1650.000000 149.000000 L 1550.000000 149.000000 M 1750.000000 151.000000 L 1850.000000 151.000000 M 1749.000000 150.000000 L 1749.000000 250.000000 M 1750.000000 149.000000 L 1650.000000 149.000000 M 1850.000000 151.000000 L 1950.000000 151.000000 M 1849.000000 150.000000 L 1849.000000 250.000000 M 1850.000000 149.000000 L 1750.000000 149.000000 M 1949.000000 150.000000 L 1949.000000 250.000000 M 1950.000000 149.000000 L 1850.000000 149.000000" fill="none" stroke="#bababa" stroke-width="0.5"/>
  </g>
  <g id="graph_labels">
    <text x="150.000000" y="745.000000" fill="black" font-size="10px" text-anchor="middle">0</text>
    <text x="250.000000" y="745.000000" fill="black" font-size="10px" text-anchor="middle">1</text>
    <text x="350.000000" y="745.000000" fill="black" font-size="10px" text-anchor="middle">2</text>
    <text x="450.000000" y="745.000000" fill="black" font-size="10px" text-anchor="middle">3</text>
    <text x="550.000000" y="745.000000" fill="black" font-size="10px" text-anchor="middle">4</text>
    <text x="650.000000" y="745.000000" fill="black" font-size="10px" text-anchor="middle">5</text>
    <text x="750.000000" y="745.000000" fill="black" font-size="10px" text-anchor="middle">6</text>
    <text x="850.000000" y="745.000000" fill="black" font-size="10px" text-anchor="middle">7</text>
    <text x="950.000000" y="745.000000" fill="black" font-size="10px" text-anchor="middle">8</text>
    <text x="1050.000000" y="745.000000" fill="black" font-size="10px" text-anchor="middle">9</text>
    <text x="1150.000000" y="745.000000" fill="black" font-size="10px" text-anchor="middle">10</text>
    <text x="1250.000000" y="745.000000" fill="black" font-size="10px" text-anchor="middle">11</text>
    <text x="1350.000000" y="745.000000" fill="black" font-size="10px" text-anchor="middle">12</text>
    <text x="1450.000000" y="745.000000" fill="black" font-size="10px" text-anchor="middle">13</text>
    <text x="1550.000000" y="745.000000" fill="black" font-size="10px" text-anchor="middle">14</text>
    <text x="1650.000000" y="745.000000" fill="black" font-size="10px" text-anchor="middle">15</text>
    <text x="1750.000000" y="745.000000" fill="black" font-size="10px" text-anchor="middle">16</text>
    <text x="1850.000000" y="745.000000" fill="black" font-size="10px" text-anchor="middle">17</text>
    <text x="1950.000000" y="745.000000" fill="black" font-size="10px" text-anchor="middle">18</text>
    <text x="150.000000" y="645.000000" fill="black" font-size="10px" text-anchor="middle">19</text>
    <text x="250.000000" y="645.000000" fill="black" font-size="10px" text-anchor="middle">20</text>
    <text x="350.000000" y="645.000000" fill="black" font-size="10px" text-anchor="middle">21</text>
    <text x="450.000000" y="645.000000" fill="black" font-size="10px" text-anchor="middle">22</text>
    <text x="850.000000" y="645.000000" fill="black" font-size="10px" text-anchor="middle">23</text>
    <text x="1250.000000" y="645.000000" fill="black" font-size="10px" text-anchor="middle">24</text>
    <text x="1650.000000" y="645.000000" fill="black" font-size="10px" text-anchor="middle">25</text>
    <text x="1750.000000" y="645.000000" fill="black" font-size="10px" text-anchor="middle">26</text>
    <text x="1850.000000" y="645.000000" fill="black" font-size="10px" text-anchor="middle">27</text>
    <text x="1950.000000" y="645.000000" fill="black" font-size="10px" text-anchor="middle">28</text>
    <text x="150.000000" y="545.000000" fill="black" font-size="10px" text-anchor="middle">29</text>
    <text x="250.000000" y="545.000000" fill="black" font-size="10px" text-anchor="middle">30</text>
    <text x="350.000000" y="545.000000" fill="black" font-size="10px" text-anchor="middle">31</text>
    <text x="450.000000" y="545.000000" fill="black" font-size="10px" text-anchor="middle">32</text>
    <text x="550.000000" y="545.000000" fill="black" font-size="10px" text-anchor="middle">33</text>
    <text x="650.000000" y="545.000000" fill="black" font-size="10px" text-anchor="middle">34</text>
    <text x="750.000000" y="545.000000" fill="black" font-size="10px" text-anchor="middle">35</text>
    <text x="850.000000" y="545.000000" fill="black" font-size="10px" text-anchor="middle">36</text>
    <text x="950.000000" y="545.000000" fill="black" font-size="10px" text-anchor="middle">37</text>
    <text x="1050.000000" y="545.000000" fill="black" font-size="10px" text-anchor="middle">38</text>
    <text x="1150.000000" y="545.000000" fill="black" font-size="10px" text-anchor="middle">39</text>
    <text x="1250.000000" y="545.000000" fill="black" font-size="10px" text-anchor="middle">40</text>
    <text x="1350.000000" y="545.000000" fill="black" font-size="10px" text-anchor="middle">41</text>
    <text x="1450.000000" y="545.000000" fill="black" font-size="10px" text-anchor="middle">42</text>
    <text x="1550.000000" y="545.000000" fill="black" font-size="10px" text-anchor="middle">43</text>
    <text x="1650.000000" y="545.000000" fill="black" font-size="10px" text-anchor="middle">44</text>
    <text x="1750.000000" y="545.000000" fill="black" font-size="10px" text-anchor="middle">45</text>
    <text x="1850.000000" y="545.000000" fill="black" font-size="10px" text-anchor="middle">46</text>
    <text x="1950.000000" y="545.000000" fill="black" font-size="10px" text-anchor="middle">47</text>
    <text x="150.000000" y="445.000000" fill="black" font-size="10px" text-anchor="middle">48</text>
    <text x="250.000000" y="445.000000" fill="black" font-size="10px" text-anchor="middle">49</text>
    <text x="350.000000" y="445.000000" fill="black" font-size="10px" text-anchor="middle">50</text>
    <text x="450.000000" y="445.000000" fill="black" font-size="10px" text-anchor="middle">51</text>
    <text x="850.000000" y="445.000000" fill="black" font-size="10px" text-anchor="middle">52</text>
    <text x="1250.000000" y="445.000000" fill="black" font-size="10px" text-anchor="middle">53</text>
    <text x="1650.000000" y="445.000000" fill="black" font-size="10px" text-anchor="middle">54</text>
    <text x="1750.000000" y="445.000000" fill="black" font-size="10px" text-anchor="middle">55</text>
    <text x="1850.000000" y="445.000000" fill="black" font-size="10px" text-anchor="middle">56</text>
    <text x="1950.000000" y="445.000000" fill="black" font-size="10px" text-anchor="middle">57</text>
    <text x="150.000000" y="345.000000" fill="black" font-size="10px" text-anchor="middle">58</text>
    <text x="250.000000" y="345.000000" fill="black" font-size="10px" text-anchor="middle">59</text>
    <text x="350.000000" y="345.000000" fill="black" font-size="10px" text-anchor="middle">60</text>
    <text x="450.000000" y="345.000000" fill="black" font-size="10px" text-anchor="middle">61</text>
    <text x="550.000000" y="345.000000" fill="black" font-size="10px" text-anchor="middle">62</text>
    <text x="650.000000" y="345.000000" fill="black" font-size="10px" text-anchor="middle">63</text>
    <text x="750.000000" y="345.000000" fill="black" font-size="10px" text-anchor="middle">64</text>
    <text x="850.000000" y="345.000000" fill="black" font-size="10px" text-anchor="middle">65</text>
    <text x="950.000000" y="345.000000" fill="black" font-size="10px" text-anchor="middle">66</text>
    <text x="1050.000000" y="345.000000" fill="black" font-size="10px" text-anchor="middle">67</text>
    <text x="1150.000000" y="345.000000" fill="black" font-size="10px" text-anchor="middle">68</text>
    <text x="1250.000000" y="345.000000" fill="black" font-size="10px" text-anchor="middle">69</text>
    <text x="1350.000000" y="345.000000" fill="black" font-size="10px" text-anchor="middle">70</text>
    <text x="1450.000000" y="345.000000" fill="black" font-size="10px" text-anchor="middle">71</text>
    <text x="1550.000000" y="345.000000" fill="black" font-size="10px" text-anchor="middle">72</text>
    <text x="1650.000000" y="345.000000" fill="black" font-size="10px" text-anchor="middle">73</text>
    <text x="1750.000000" y="345.000000" fill="black" font-size="10px" text-anchor="middle">74</text>
    <text x="1850.000000" y="345.000000" fill="black" font-size="10px" text-anchor="middle">75</text>
    <text x="1950.000000" y="345.000000" fill="black" font-size="10px" text-anchor="middle">76</text>
    <text x="150.000000" y="245.000000" fill="black" font-size="10px" text-anchor="middle">77</text>
    <text x="250.000000" y="245.000000" fill="black" font-size="10px" text-anchor="middle">78</text>
    <text x="350.000000" y="245.000000" fill="black" font-size="10px" text-anchor="middle">79</text>
    <text x="450.000000" y="245.000000" fill="black" font-size="10px" text-anchor="middle">80</text>
    <text x="850.000000" y="245.000000" fill="black" font-size="10px" text-anchor="middle">81</text>
    <text x="1250.000000" y="245.000000" fill="black" font-size="10px" text-anchor="middle">82</text>
    <text x="1650.000000" y="245.000000" fill="black" font-size="10px" text-anchor="middle">83</text>
    <text x="1750.000000" y="245.000000" fill="black" font-size="10px" text-anchor="middle">84</text>
    <text x="1850.000000" y="245.000000" fill="black" font-size="10px" text-anchor="middle">85</text>
    <text x="1950.000000" y="245.000000" fill="black" font-size="10px" text-anchor="middle">86</text>
    <text x="150.000000" y="145.000000" fill="black" font-size="10px" text-anchor="middle">87</text>
    <text x="250.000000" y="145.000000" fill="black" font-size="10px" text-anchor="middle">88</text>
    <text x="350.000000" y="145.000000" fill="black" font-size="10px" text-anchor="middle">89</text>
    <text x="450.000000" y="145.000000" fill="black" font-size="10px" text-anchor="middle">90</text>
    <text x="550.000000" y="145.000000" fill="black" font-size="10px" text-anchor="middle">91</text>
    <text x="650.000000" y="145.000000" fill="black" font-size="10px" text-anchor="middle">92</text>
    <text x="750.000000" y="145.000000" fill="black" font-size="10px" text-anchor="middle">93</text>
    <text x="850.000000" y="145.000000" fill="black" font-size="10px" text-anchor="middle">94</text>
    <text x="950.000000" y="145.000000" fill="black" font-size="10px" text-anchor="middle">95</text>
    <text x="1050.000000" y="145.000000" fill="black" font-size="10px" text-anchor="middle">96</text>
    <text x="1150.000000" y="145.000000" fill="black" font-size="10px" text-anchor="middle">97</text>
    <text x="1250.000000" y="145.000000" fill="black" font-size="10px" text-anchor="middle">98</text>
    <text x="1350.000000" y="145.000000" fill="black" font-size="10px" text-anchor="middle">99</text>
    <text x="1450.000000" y="145.000000" fill="black" font-size="10px" text-anchor="middle">100</text>
    <text x="1550.000000" y="145.000000" fill="black" font-size="10px" text-anchor="middle">101</text>
    <text x="1650.000000" y="145.000000" fill="black" font-size="10px" text-anchor="middle">102</text>
    <text x="1750.000000" y="145.000000" fill="black" font-size="10px" text-anchor="middle">103</text>
    <text x="1850.000000" y="145.000000" fill="black" font-size="10px" text-anchor="middle">104</text>
    <text x="1950.000000" y="145.000000" fill="black" font-size="10px" text-anchor="middle">105</text>
  </g>
  <g id="agent_motion">
    <g id="agent_trajectories">
      <path d=" M 150.000000 650.000000 L 150.000000 550.000000 L 150.000000 450.000000 L 150.000000 350.000000 L 250.000000 350.000000 L 350.000000 350.000000 L 450.000000 350.000000 L 550.000000 350.000000 L 650.000000 350.000000 L 750.000000 350.000000 L 850.000000 350.000000 L 950.000000 350.000000 L 1050.000000 350.000000 L 1150.000000 350.000000 L 1250.000000 350.000000 L 1350.000000 350.000000 L 1450.000000 350.000000 L 1550.000000 350.000000 L 1650.000000 350.000000 L 1750.000000 350.000000 L 1850.000000 350.000000 L 1950.000000 350.000000" fill="none" stroke="orange" stroke-width="2.0"/>
      <path d=" M 1950.000000 650.000000 L 1950.000000 550.000000 L 1950.000000 450.000000 L 1950.000000 350.000000 L 1950.000000 250.000000 L 1950.000000 150.000000 L 1850.000000 150.000000 L 1750.000000 150.000000 L 1650.000000 150.000000 L 1550.000000 150.000000 L 1450.000000 150.000000 L 1350.000000 150.000000 L 1250.000000 150.000000 L 1150.000000 150.000000 L 1050.000000 150.000000 L 950.000000 150.000000 L 850.000000 150.000000 L 750.000000 150.000000 L 650.000000 150.000000 L 550.000000 150.000000 L 450.000000 150.000000 L 350.000000 150.000000 L 250.000000 150.000000" fill="none" stroke="red" stroke-width="2.0"/>
      <path d=" M 150.000000 450.000000 L 150.000000 550.000000 L 150.000000 650.000000 L 150.000000 750.000000 L 250.000000 750.000000 L 350.000000 750.000000 L 450.000000 750.000000 L 550.000000 750.000000 L 650.000000 750.000000 L 750.000000 750.000000 L 850.000000 750.000000 L 950.000000 750.000000 L 1050.000000 750.000000 L 1150.000000 750.000000 L 1250.000000 750.000000 L 1350.000000 750.000000 L 1450.000000 750.000000 L 1550.000000 750.000000 L 1650.000000 750.000000 L 1750.000000 750.000000 L 1850.000000 750.000000 L 1950.000000 750.000000" fill="none" stroke="green" stroke-width="2.0"/>
    </g>
    <g id="agent1_pos">
      <g id="agent1_rot">
        <circle r="45.000000" cx="0.000000" cy="0.000000" fill="orange"/>
        <path d=" M 0.000000 0.000000 L 45.000000 -0.000000" fill="none" stroke="grey" stroke-width="4"/>
        <animateTransform attributeName="transform" attributeType="XML" type="rotate" dur="25.500000s" repeatCount="indefinite" values="-0.000000;-0.000000;-90.000000;-90.000000;-0.000000;-0.000000" keyTimes="0.000000;0.039216;0.058824;0.176471;0.196078;1.000000"/>
      </g>
      <text x="0.000000" y="10.000000" fill="black" font-size="10px" text-anchor="middle">A1</text>
      <animateTransform attributeName="transform" attributeType="XML" type="translate" dur="25.500000s" repeatCount="indefinite" values="150.000000 650.000000;150.000000 650.000000;150.000000 550.000000;150.000000 450.000000;150.000000 350.000000;150.000000 350.000000;250.000000 350.000000;350.000000 350.000000;450.000000 350.000000;550.000000 350.000000;650.000000 350.000000;750.000000 350.000000;850.000000 350.000000;950.000000 350.000000;1050.000000 350.000000;1150.000000 350.000000;1250.000000 350.000000;1350.000000 350.000000;1450.000000 350.000000;1550.000000 350.000000;1650.000000 350.000000;1750.000000 350.000000;1850.000000 350.000000;1950.000000 350.000000;1950.000000 350.000000" keyTimes="0.000000;0.058824;0.098039;0.137255;0.176471;0.196078;0.235294;0.274510;0.313726;0.352941;0.392157;0.431373;0.470588;0.509804;0.549020;0.588235;0.627451;0.666667;0.705882;0.745098;0.784314;0.823529;0.862745;0.901961;1.000000"/>
    </g>
    <g id="agent2_pos">
      <g id="agent2_rot">
        <circle r="30.000002" cx="0.000000" cy="0.000000" fill="red"/>
        <path d=" M 0.000000 0.000000 L 30.000002 -0.000000" fill="none" stroke="grey" stroke-width="4"/>
        <animateTransform attributeName="transform" attributeType="XML" type="rotate" dur="25.500000s" repeatCount="indefinite" values="90.000000;90.000000;-90.000000;-90.000000;-180.000000;-180.000000" keyTimes="0.000000;0.039216;0.078431;0.274510;0.294118;1.000000"/>
      </g>
      <text x="0.000000" y="10.000000" fill="black" font-size="10px" text-anchor="middle">A2</text>
      <animateTransform attributeName="transform" attributeType="XML" type="translate" dur="25.500000s" repeatCount="indefinite" values="1950.000000 650.000000;1950.000000 650.000000;1950.000000 550.000000;1950.000000 450.000000;1950.000000 350.000000;1950.000000 250.000000;1950.000000 150.000000;1950.000000 150.000000;1850.000000 150.000000;1750.000000 150.000000;1650.000000 150.000000;1550.000000 150.000000;1450.000000 150.000000;1350.000000 150.000000;1250.000000 150.000000;1150.000000 150.000000;1050.000000 150.000000;950.000000 150.000000;850.000000 150.000000;750.000000 150.000000;650.000000 150.000000;550.000000 150.000000;450.000000 150.000000;350.000000 150.000000;250.000000 150.000000;250.000000 150.000000" keyTimes="0.000000;0.078431;0.117647;0.156863;0.196078;0.235294;0.274510;0.294118;0.333333;0.372549;0.411765;0.450980;0.490196;0.529412;0.568627;0.607843;0.647059;0.686275;0.725490;0.764706;0.803922;0.843137;0.882353;0.921569;0.960784;1.000000"/>
    </g>
    <g id="agent3_pos">
      <g id="agent3_rot">
        <circle r="20.000000" cx="0.000000" cy="0.000000" fill="green"/>
        <path d=" M 0.000000 0.000000 L 20.000000 -0.000000" fill="none" stroke="grey" stroke-width="4"/>
        <animateTransform attributeName="transform" attributeType="XML" type="rotate" dur="25.500000s" repeatCount="indefinite" values="-180.000000;-180.000000;90.000000;90.000000;-0.000000;-0.000000" keyTimes="0.000000;0.039216;0.059977;0.137294;0.158055;1.000000"/>
      </g>
      <text x="0.000000" y="10.000000" fill="black" font-size="10px" text-anchor="middle">A3</text>
      <animateTransform attributeName="transform" attributeType="XML" type="translate" dur="25.500000s" repeatCount="indefinite" values="150.000000 450.000000;150.000000 450.000000;150.000000 550.000000;150.000000 650.000000;150.000000 750.000000;150.000000 750.000000;250.000000 750.000000;350.000000 750.000000;450.000000 750.000000;550.000000 750.000000;650.000000 750.000000;750.000000 750.000000;850.000000 750.000000;950.000000 750.000000;1050.000000 750.000000;1150.000000 750.000000;1250.000000 750.000000;1350.000000 750.000000;1450.000000 750.000000;1550.000000 750.000000;1650.000000 750.000000;1750.000000 750.000000;1850.000000 750.000000;1950.000000 750.000000;1950.000000 750.000000" keyTimes="0.000000;0.078471;0.098078;0.117686;0.137294;0.158055;0.177663;0.197271;0.216879;0.236487;0.256095;0.275702;0.295310;0.314918;0.334526;0.354134;0.373742;0.393349;0.412957;0.432565;0.452173;0.471781;0.491389;0.510997;1.000000"/>
    </g>
  </g>
</svg>