<svg xmlns="http://www.w3.org/2000/svg" xmlns:xlink="http://www.w3.org/1999/xlink" width="700px" height="500px" viewBox="0 0 700 500">
  <g id="grid">
    <rect x="100.000000" y="300.000000" width="100.000000" height="100.000000" fill="black"/>
    <rect x="200.000000" y="300.000000" width="100.000000" height="100.000000" fill="black"/>
    <rect x="400.000000" y="300.000000" width="100.000000" height="100.000000" fill="black"/>
    <rect x="500.000000" y="300.000000" width="100.000000" height="100.000000" fill="black"/>
    <rect x="100.000000" y="100.000000" width="100.000000" height="100.000000" fill="black"/>
    <rect x="200.000000" y="100.000000" width="100.000000" height="100.000000" fill="black"/>
    <rect x="300.000000" y="100.000000" width="100.000000" height="100.000000" fill="black"/>
    <rect x="400.000000" y="100.000000" width="100.000000" height="100.000000" fill="black"/>
    <rect x="500.000000" y="100.000000" width="100.000000" height="100.000000" fill="black"/>
    <path d=" M 100.000000 400.000000 L 100.000000 100.000000 M 200.000000 400.000000 L 200.000000 100.000000 M 300.000000 400.000000 L 300.000000 100.000000 M 400.000000 400.000000 L 400.000000 100.000000 M 500.000000 400.000000 L 500.000000 100.000000 M 600.000000 400.000000 L 600.000000 100.000000 M 100.000000 400.000000 L 600.000000 400.000000 M 100.000000 300.000000 L 600.000000 300.000000 M 100.000000 200.000000 L 600.000000 200.000000 M 100.000000 100.000000 L 600.000000 100.000000" fill="none" stroke="black" stroke-width="1" stroke-linecap="square"/>
    <text x="150.000000" y="410.000000" fill="black" font-size="10px" text-anchor="middle">0</text>
    <text x="250.000000" y="410.000000" fill="black" font-size="10px" text-anchor="middle">1</text>
    <text x="350.000000" y="410.000000" fill="black" font-size="10px" text-anchor="middle">2</text>
    <text x="450.000000" y="410.000000" fill="black" font-size="10px" text-anchor="middle">3</text>
    <text x="550.000000" y="410.000000" fill="black" font-size="10px" text-anchor="middle">4</text>
    <text x="90.000000" y="350.000000" fill="black" font-size="10px" text-anchor="right">0</text>
    <text x="90.000000" y="250.000000" fill="black" font-size="10px" text-anchor="right">1</text>
    <text x="90.000000" y="150.000000" fill="black" font-size="10px" text-anchor="right">2</text>
  </g>
  <g id="graph">
    <circle r="3.000000" cx="350.000000" cy="350.000000" fill="#bababa"/>
    <circle r="3.000000" cx="150.000000" cy="250.000000" fill="#bababa"/>
    <circle r="3.000000" cx="250.000000" cy="250.000000" fill="#bababa"/>
    <circle r="3.000000" cx="350.000000" cy="250.000000" fill="#bababa"/>
    <circle r="3.000000" cx="450.000000" cy="250.000000" fill="#bababa"/>
    <circle r="3.000000" cx="550.000000" cy="250.000000" fill="#bababa"/>
    <path d=" M 351.000000 350.000000 L 351.000000 250.000000 M 150.000000 251.000000 L 250.000000 251.000000 M 250.000000 251.000000 L 350.000000 251.000000 M 250.000000 249.000000 L 150.000000 249.000000 M 350.000000 251.000000 L 450.000000 251.000000 M 349.000000 250.000000 L 349.000000 350.000000 M 350.000000 249.000000 L 250.000000 249.000000 M 450.000000 251.000000 L 550.000000 251.000000 M 450.000000 249.000000 L 350.000000 249.000000 M 550.000000 249.000000 L 450.000000 249.000000" fill="none" stroke="#bababa" stroke-width="0.5"/>
  </g>
  <g id="graph_labels">
    <text x="350.000000" y="345.000000" fill="black" font-size="10px" text-anchor="middle">0</text>
    <text x="150.000000" y="245.000000" fill="black" font-size="10px" text-anchor="middle">1</text>
    <text x="250.000000" y="245.000000" fill="black" font-size="10px" text-anchor="middle">2</text>
    <text x="350.000000" y="245.000000" fill="black" font-size="10px" text-anchor="middle">3</text>
    <text x="450.000000" y="245.000000" fill="black" font-size="10px" text-anchor="middle">4</text>
    <text x="550.000000" y="245.000000" fill="black" font-size="10px" text-anchor="middle">5</text>
  </g>
  <g id="agent_motion">
    <g id="agent_trajectories">
      <path d=" M 150.000000 250.000000 L 250.000000 250.000000 L 350.000000 250.000000 L 450.000000 250.000000 L 550.000000 250.000000" fill="none" stroke="orange" stroke-width="2.0"/>
      <path d=" M 550.000000 250.000000 L 450.000000 250.000000 L 350.000000 250.000000 L 250.000000 250.000000 L 150.000000 250.000000" fill="none" stroke="red" stroke-width="2.0"/>
    </g>
    <g id="agent1_pos">
      <g id="agent1_rot">
        <circle r="45.000000" cx="0.000000" cy="0.000000" fill="orange"/>
        <path d=" M 0.000000 0.000000 L 45.000000 -0.000000" fill="none" stroke="grey" stroke-width="4"/>
        <animateTransform attributeName="transform" attributeType="XML" type="rotate" dur="8.503000s" repeatCount="indefinite" values="-0.000000;-0.000000" keyTimes="0.000000;1.000000"/>
      </g>
      <text x="0.000000" y="10.000000" fill="black" font-size="10px" text-anchor="middle">A1</text>
      <animateTransform attributeName="transform" attributeType="XML" type="translate" dur="8.503000s" repeatCount="indefinite" values="150.000000 250.000000;150.000000 250.000000;250.000000 250.000000;350.000000 250.000000;450.000000 250.000000;550.000000 250.000000;550.000000 250.000000" keyTimes="0.000000;0.411972;0.529578;0.647183;0.764789;0.882394;1.000000"/>
    </g>
    <g id="agent2_pos">
      <g id="agent2_rot">
        <circle r="30.000002" cx="0.000000" cy="0.000000" fill="red"/>
        <path d=" M 0.000000 0.000000 L 30.000002 -0.000000" fill="none" stroke="grey" stroke-width="4"/>
        <animateTransform attributeName="transform" attributeType="XML" type="rotate" dur="8.503000s" repeatCount="indefinite" values="-180.000000;-180.000000" keyTimes="0.000000;1.000000"/>
      </g>
      <text x="0.000000" y="10.000000" fill="black" font-size="10px" text-anchor="middle">A2</text>
      <animateTransform attributeName="transform" attributeType="XML" type="translate" dur="8.503000s" repeatCount="indefinite" values="550.000000 250.000000;550.000000 250.000000;450.000000 250.000000;350.000000 250.000000;350.000000 250.000000;250.000000 250.000000;150.000000 250.000000;150.000000 250.000000" keyTimes="0.000000;0.117606;0.235211;0.352817;0.411855;0.529460;0.647066;1.000000"/>
    </g>
  </g>
</svg>