^D:\DEV\UTILS\TEST\CMAKELISTS.TXT
setlocal
"C:\Program Files\CMake\bin\cmake.exe" -SD:/dev/Utils -BD:/dev/Utils/build --check-stamp-file D:/dev/Utils/build/test/CMakeFiles/generate.stamp
if %errorlevel% neq 0 goto :cmEnd
:cmEnd
endlocal & call :cmErrorLevel %errorlevel% & goto :cmDone
:cmErrorLevel
exit /b %1
:cmDone
if %errorlevel% neq 0 goto :VCEnd
