^D:\DEV\UTILS\SRC\TEST\TEST.CPP
/c /ID:\DEV\UTILS\INCLUDE\TEST /ID:\DEV\UTILS\INCLUDE\BASE /ID:\DEV\UTILS\INCLUDE\FILESYSTEM /ID:\DEV\UTILS\INCLUDE\EXCEPTIONS /ID:\DEV\UTILS\INCLUDE\STREAM /ID:\DEV\UTILS\INCLUDE\CONSOLE /nologo /W1 /WX- /diagnostics:column /O2 /Ob2 /D WIN32 /D _WINDOWS /D NDEBUG /D "CMAKE_INTDIR=\"Release\"" /D _MBCS /Gm- /EHsc /MD /GS /fp:precise /Zc:wchar_t /Zc:forScope /Zc:inline /GR /std:c++17 /Fo"UTEST.DIR\RELEASE\\" /Fd"UTEST.DIR\RELEASE\UTEST.PDB" /Gd /TP D:\DEV\UTILS\SRC\TEST\TEST.CPP
^D:\DEV\UTILS\SRC\TEST.CPP
/c /ID:\DEV\UTILS\INCLUDE\TEST /ID:\DEV\UTILS\INCLUDE\BASE /ID:\DEV\UTILS\INCLUDE\FILESYSTEM /ID:\DEV\UTILS\INCLUDE\EXCEPTIONS /ID:\DEV\UTILS\INCLUDE\STREAM /ID:\DEV\UTILS\INCLUDE\CONSOLE /ID:\DEV\UTILS\INCLUDE\SERIALIZATION /nologo /W1 /WX- /diagnostics:column /O2 /Ob2 /D WIN32 /D _WINDOWS /D NDEBUG /D "CMAKE_INTDIR=\"Release\"" /D _MBCS /Gm- /EHsc /MD /GS /fp:precise /Zc:wchar_t /Zc:forScope /Zc:inline /GR /std:c++17 /Fo"UTEST.DIR\RELEASE\\" /Fd"UTEST.DIR\RELEASE\UTEST.PDB" /Gd /TP D:\DEV\UTILS\SRC\TEST.CPP
