^D:\DEV\UTILS\TEST\SRC\TEST_MAIN.CPP
/c /ID:\DEV\UTILS\INCLUDE\UTILS /ID:\DEV\UTILS\INCLUDE\FILESYSTEM /ID:\DEV\UTILS\INCLUDE\EXCEPTIONS /ID:\DEV\UTILS\INCLUDE\STREAM /ID:\DEV\UTILS\INCLUDE\CONSOLE /ID:\DEV\UTILS\INCLUDE\TEST /Zi /nologo /W1 /WX- /diagnostics:column /Od /Ob0 /D WIN32 /D _WINDOWS /D "CMAKE_INTDIR=\"Debug\"" /D _MBCS /Gm- /EHsc /RTC1 /MDd /GS /fp:precise /Zc:wchar_t /Zc:forScope /Zc:inline /GR /std:c++17 /Fo"UTILS_TEST.DIR\DEBUG\\" /Fd"UTILS_TEST.DIR\DEBUG\VC142.PDB" /Gd /TP D:\DEV\UTILS\TEST\SRC\TEST_MAIN.CPP
^D:\DEV\UTILS\TEST\SRC\FILE_SYSTEM_TEST.CPP
/c /ID:\DEV\UTILS\INCLUDE\UTILS /ID:\DEV\UTILS\INCLUDE\FILESYSTEM /ID:\DEV\UTILS\INCLUDE\EXCEPTIONS /ID:\DEV\UTILS\INCLUDE\STREAM /ID:\DEV\UTILS\INCLUDE\CONSOLE /ID:\DEV\UTILS\INCLUDE\TEST /Zi /nologo /W1 /WX- /diagnostics:column /Od /Ob0 /D WIN32 /D _WINDOWS /D "CMAKE_INTDIR=\"Debug\"" /D _MBCS /Gm- /EHsc /RTC1 /MDd /GS /fp:precise /Zc:wchar_t /Zc:forScope /Zc:inline /GR /std:c++17 /Fo"UTILS_TEST.DIR\DEBUG\\" /Fd"UTILS_TEST.DIR\DEBUG\VC142.PDB" /Gd /TP D:\DEV\UTILS\TEST\SRC\FILE_SYSTEM_TEST.CPP
^D:\DEV\UTILS\TEST\SRC\TEST_BITS.CPP
/c /ID:\DEV\UTILS\INCLUDE\UTILS /ID:\DEV\UTILS\INCLUDE\FILESYSTEM /ID:\DEV\UTILS\INCLUDE\EXCEPTIONS /ID:\DEV\UTILS\INCLUDE\STREAM /ID:\DEV\UTILS\INCLUDE\CONSOLE /ID:\DEV\UTILS\INCLUDE\TEST /Zi /nologo /W1 /WX- /diagnostics:column /Od /Ob0 /D WIN32 /D _WINDOWS /D "CMAKE_INTDIR=\"Debug\"" /D _MBCS /Gm- /EHsc /RTC1 /MDd /GS /fp:precise /Zc:wchar_t /Zc:forScope /Zc:inline /GR /std:c++17 /Fo"UTILS_TEST.DIR\DEBUG\\" /Fd"UTILS_TEST.DIR\DEBUG\VC142.PDB" /Gd /TP D:\DEV\UTILS\TEST\SRC\TEST_BITS.CPP
