^D:\DEV\UTILS\BUILD\TEST\UTILS_TEST.DIR\DEBUG\FILE_SYSTEM_TEST.OBJ|D:\DEV\UTILS\BUILD\TEST\UTILS_TEST.DIR\DEBUG\TEST_BITS.OBJ|D:\DEV\UTILS\BUILD\TEST\UTILS_TEST.DIR\DEBUG\TEST_MAIN.OBJ
D:\DEV\UTILS\BUILD\TEST\DEBUG\UTILS_TEST.EXE
D:\DEV\UTILS\BUILD\TEST\DEBUG\UTILS_TEST.ILK
D:\DEV\UTILS\BUILD\TEST\DEBUG\UTILS_TEST.PDB
