{
	"info": {
		"_postman_id": "2fe209ce-5063-454a-8ab2-6566c8946594",
		"name": "RobinFood",
		"schema": "https://schema.getpostman.com/json/collection/v2.1.0/collection.json"
	},
	"item": [
		{
			"name": "CreateEncuesta",
			"request": {
				"method": "POST",
				"header": [],
				"body": {
					"mode": "raw",
					"raw": "{   \"nombreEncuesta\": \"Encuesta Cartagena 2023\",\r\n    \"descripcionEncuesta\": \"Comensal, en la siguiente encuesta queremos saber algunos datos para nuestra sede en la ciudad de Cartagena\",\r\n    \"preguntas\": [\r\n        {\r\n            \"pregunta\": \"¿En qué puntos de la ciudad te gustaría ver alguna de nuestras sedes?\",\r\n            \"tipoPregunta\": {\r\n                \"id\": 2,\r\n                \"descripcion\": \"Opción Multiple\"\r\n            },\r\n            \"opcionRespuestas\": [\r\n                {\r\n                    \"texto\": \"Mall Plaza\"\r\n                },\r\n                {\r\n                    \"texto\": \"Caribe Plaza\"\r\n                },\r\n                {\r\n                    \"texto\": \"Paseo de la Castellana\"\r\n                },\r\n                {\r\n                    \"texto\": \"La Serrezuela\"\r\n                }\r\n            ]\r\n        },\r\n        {\r\n            \"pregunta\": \"Describe la experiencia en alguna de nuestras sedes del país\",\r\n            \"tipoPregunta\": {\r\n                \"id\": 1,\r\n                \"descripcion\": \"Abierta\"\r\n            },\r\n            \"opcionRespuestas\": []\r\n        }\r\n    ]\r\n}",
					"options": {
						"raw": {
							"language": "json"
						}
					}
				},
				"url": {
					"raw": "http://localhost:8080/api/encuestas",
					"protocol": "http",
					"host": [
						"localhost"
					],
					"port": "8080",
					"path": [
						"api",
						"encuestas"
					]
				}
			},
			"response": []
		},
		{
			"name": "ListEncuestas",
			"request": {
				"method": "GET",
				"header": []
			},
			"response": []
		},
		{
			"name": "AnswerEncuesta",
			"request": {
				"method": "POST",
				"header": [],
				"body": {
					"mode": "raw",
					"raw": "{\r\n  \"idEncuesta\": 1,\r\n  \"idCliente\": 3,\r\n  \"preguntas\": [\r\n    {\r\n      \"idPregunta\": 1,\r\n      \"respuestas\": {\r\n        \"opcionRespuestas\": [\r\n          {\r\n            \"idOpcionRespuesta\": 2\r\n          },\r\n          {\r\n            \"idOpcionRespuesta\": 3\r\n          }\r\n        ],\r\n        \"respuestaAbierta\": null\r\n      }\r\n    },\r\n    {\r\n      \"idPregunta\": 2,\r\n      \"respuestas\": {\r\n        \"opcionRespuestas\": [],\r\n        \"respuestaAbierta\": \"Muy amables todos en el punto de venta\"\r\n      }\r\n    }\r\n  ]\r\n}",
					"options": {
						"raw": {
							"language": "json"
						}
					}
				}
			},
			"response": []
		},
		{
			"name": "FindEncuestaByID",
			"request": {
				"method": "GET",
				"header": []
			},
			"response": []
		}
	]
}