  0
SECTION
  2
BLOCKS
  0
ENDSEC
  0
SECTION
  2
ENTITIES
  0
LINE
  8
0
 10
0
 20
-20
 11
30
 21
-20
  0
LINE
  8
0
 10
30
 20
-20
 11
30
 21
-10
  0
LINE
  8
0
 10
30
 20
-10
 11
0
 21
-10
  0
LINE
  8
0
 10
0
 20
-10
 11
0
 21
-20
  0
LINE
  8
0
 10
12.4
 20
-16.2
 11
12.4
 21
-13.8
  0
LINE
  8
0
 10
12.4
 20
-13.8
 11
20
 21
-13.8
  0
LINE
  8
0
 10
20
 20
-13.8
 11
20
 21
-12.5
  0
LINE
  8
0
 10
20
 20
-12.5
 11
22.4
 21
-12.5
  0
LINE
  8
0
 10
22.4
 20
-12.5
 11
22.4
 21
-17.5
  0
LINE
  8
0
 10
22.4
 20
-17.5
 11
20
 21
-17.5
  0
LINE
  8
0
 10
20
 20
-17.5
 11
20
 21
-16.2
  0
LINE
  8
0
 10
20
 20
-16.2
 11
12.4
 21
-16.2
  0
LINE
  8
0
 10
0
 20
0
 11
30
 21
0
  0
LINE
  8
0
 10
30
 20
0
 11
30
 21
10
  0
LINE
  8
0
 10
30
 20
10
 11
0
 21
10
  0
LINE
  8
0
 10
0
 20
10
 11
0
 21
0
  0
LINE
  8
0
 10
12.4
 20
3.8
 11
12.4
 21
6.2
  0
LINE
  8
0
 10
12.4
 20
6.2
 11
20
 21
6.2
  0
LINE
  8
0
 10
20
 20
6.2
 11
20
 21
7.5
  0
LINE
  8
0
 10
20
 20
7.5
 11
22.4
 21
7.5
  0
LINE
  8
0
 10
22.4
 20
7.5
 11
22.4
 21
2.5
  0
LINE
  8
0
 10
22.4
 20
2.5
 11
20
 21
2.5
  0
LINE
  8
0
 10
20
 20
2.5
 11
20
 21
3.8
  0
LINE
  8
0
 10
20
 20
3.8
 11
12.4
 21
3.8
  0
LINE
  8
0
 10
0
 20
20
 11
21.8
 21
20
  0
LINE
  8
0
 10
21.8
 20
20
 11
21.8
 21
22.5
  0
LINE
  8
0
 10
21.8
 20
22.5
 11
25
 21
22.5
  0
LINE
  8
0
 10
25
 20
22.5
 11
25
 21
20
  0
LINE
  8
0
 10
25
 20
20
 11
25.314
 21
20.0099
  0
LINE
  8
0
 10
25.314
 20
20.0099
 11
25.6267
 21
20.0394
  0
LINE
  8
0
 10
25.6267
 20
20.0394
 11
25.9369
 21
20.0886
  0
LINE
  8
0
 10
25.9369
 20
20.0886
 11
26.2434
 21
20.1571
  0
LINE
  8
0
 10
26.2434
 20
20.1571
 11
26.5451
 21
20.2447
  0
LINE
  8
0
 10
26.5451
 20
20.2447
 11
26.8406
 21
20.3511
  0
LINE
  8
0
 10
26.8406
 20
20.3511
 11
27.1289
 21
20.4759
  0
LINE
  8
0
 10
27.1289
 20
20.4759
 11
27.4088
 21
20.6185
  0
LINE
  8
0
 10
27.4088
 20
20.6185
 11
27.6791
 21
20.7784
  0
LINE
  8
0
 10
27.6791
 20
20.7784
 11
27.9389
 21
20.9549
  0
LINE
  8
0
 10
27.9389
 20
20.9549
 11
28.1871
 21
21.1474
  0
LINE
  8
0
 10
28.1871
 20
21.1474
 11
28.4227
 21
21.3552
  0
LINE
  8
0
 10
28.4227
 20
21.3552
 11
28.6448
 21
21.5773
  0
LINE
  8
0
 10
28.6448
 20
21.5773
 11
28.8526
 21
21.8129
  0
LINE
  8
0
 10
28.8526
 20
21.8129
 11
29.0451
 21
22.0611
  0
LINE
  8
0
 10
29.0451
 20
22.0611
 11
29.2216
 21
22.3209
  0
LINE
  8
0
 10
29.2216
 20
22.3209
 11
29.3815
 21
22.5912
  0
LINE
  8
0
 10
29.3815
 20
22.5912
 11
29.5241
 21
22.8711
  0
LINE
  8
0
 10
29.5241
 20
22.8711
 11
29.6489
 21
23.1594
  0
LINE
  8
0
 10
29.6489
 20
23.1594
 11
29.7553
 21
23.4549
  0
LINE
  8
0
 10
29.7553
 20
23.4549
 11
29.8429
 21
23.7565
  0
LINE
  8
0
 10
29.8429
 20
23.7565
 11
29.9114
 21
24.0631
  0
LINE
  8
0
 10
29.9114
 20
24.0631
 11
29.9606
 21
24.3733
  0
LINE
  8
0
 10
29.9606
 20
24.3733
 11
29.9901
 21
24.686
  0
LINE
  8
0
 10
29.9901
 20
24.686
 11
30
 21
25
  0
LINE
  8
0
 10
30
 20
25
 11
29.9901
 21
25.314
  0
LINE
  8
0
 10
29.9901
 20
25.314
 11
29.9606
 21
25.6267
  0
LINE
  8
0
 10
29.9606
 20
25.6267
 11
29.9114
 21
25.9369
  0
LINE
  8
0
 10
29.9114
 20
25.9369
 11
29.8429
 21
26.2434
  0
LINE
  8
0
 10
29.8429
 20
26.2434
 11
29.7553
 21
26.5451
  0
LINE
  8
0
 10
29.7553
 20
26.5451
 11
29.6489
 21
26.8406
  0
LINE
  8
0
 10
29.6489
 20
26.8406
 11
29.5241
 21
27.1289
  0
LINE
  8
0
 10
29.5241
 20
27.1289
 11
29.3815
 21
27.4088
  0
LINE
  8
0
 10
29.3815
 20
27.4088
 11
29.2216
 21
27.6791
  0
LINE
  8
0
 10
29.2216
 20
27.6791
 11
29.0451
 21
27.9389
  0
LINE
  8
0
 10
29.0451
 20
27.9389
 11
28.8526
 21
28.1871
  0
LINE
  8
0
 10
28.8526
 20
28.1871
 11
28.6448
 21
28.4227
  0
LINE
  8
0
 10
28.6448
 20
28.4227
 11
28.4227
 21
28.6448
  0
LINE
  8
0
 10
28.4227
 20
28.6448
 11
28.1871
 21
28.8526
  0
LINE
  8
0
 10
28.1871
 20
28.8526
 11
27.9389
 21
29.0451
  0
LINE
  8
0
 10
27.9389
 20
29.0451
 11
27.6791
 21
29.2216
  0
LINE
  8
0
 10
27.6791
 20
29.2216
 11
27.4088
 21
29.3815
  0
LINE
  8
0
 10
27.4088
 20
29.3815
 11
27.1289
 21
29.5241
  0
LINE
  8
0
 10
27.1289
 20
29.5241
 11
26.8406
 21
29.6489
  0
LINE
  8
0
 10
26.8406
 20
29.6489
 11
26.5451
 21
29.7553
  0
LINE
  8
0
 10
26.5451
 20
29.7553
 11
26.2434
 21
29.8429
  0
LINE
  8
0
 10
26.2434
 20
29.8429
 11
25.9369
 21
29.9114
  0
LINE
  8
0
 10
25.9369
 20
29.9114
 11
25.6267
 21
29.9606
  0
LINE
  8
0
 10
25.6267
 20
29.9606
 11
25.314
 21
29.9901
  0
LINE
  8
0
 10
25.314
 20
29.9901
 11
25
 21
30
  0
LINE
  8
0
 10
25
 20
30
 11
25
 21
27.5
  0
LINE
  8
0
 10
25
 20
27.5
 11
21.8
 21
27.5
  0
LINE
  8
0
 10
21.8
 20
27.5
 11
21.8
 21
30
  0
LINE
  8
0
 10
21.8
 20
30
 11
0
 21
30
  0
LINE
  8
0
 10
0
 20
30
 11
0
 21
20
  0
ENDSEC
  0
SECTION
  2
OBJECTS
  0
DICTIONARY
  0
ENDSEC
  0
EOF
