<svg width="25" height="24" viewBox="0 0 25 24" fill="none" xmlns="http://www.w3.org/2000/svg">
<path d="M8.43701 3.97822C8.43701 3.43796 8.87498 3 9.41523 3H14.8231C15.3634 3 15.8013 3.43796 15.8013 3.97822V20.608C15.8013 21.1482 15.3634 21.5862 14.8231 21.5862H9.41523C8.87498 21.5862 8.43701 21.1482 8.43701 20.608V3.97822Z" fill="white"/>
<path d="M9.04883 4.44993C9.04883 4.05434 9.36698 3.73364 9.75943 3.73364H14.4521C14.8446 3.73364 15.1627 4.05434 15.1627 4.44993V20.1362C15.1627 20.5318 14.8446 20.8525 14.4521 20.8525H9.75943C9.36698 20.8525 9.04883 20.5318 9.04883 20.1362V4.44993Z" fill="#46BFE5"/>
<path fill-rule="evenodd" clip-rule="evenodd" d="M15.2753 17.2029L11.9438 17.2029L11.9438 16.3262L15.2753 16.3262L15.2753 17.2029Z" fill="white"/>
<path fill-rule="evenodd" clip-rule="evenodd" d="M15.2753 12.8191L11.9438 12.8191L11.9438 11.9424L15.2753 11.9424L15.2753 12.8191Z" fill="white"/>
<path fill-rule="evenodd" clip-rule="evenodd" d="M15.2753 8.43579L11.9438 8.43579L11.9438 7.55908L15.2753 7.55908L15.2753 8.43579Z" fill="white"/>
<path fill-rule="evenodd" clip-rule="evenodd" d="M11.2046 8.33396C11.0178 7.94865 10.5556 7.7835 10.1662 7.96521C9.77326 8.14858 9.60336 8.61579 9.78674 9.00874L10.4982 8.67671C9.78674 9.00874 9.78692 9.00913 9.7871 9.00952L9.78748 9.01032L9.78828 9.01201L9.79004 9.01574C9.7913 9.01837 9.79271 9.02131 9.79429 9.02453C9.79743 9.03097 9.80122 9.03858 9.80566 9.04727C9.81454 9.06464 9.82608 9.08641 9.84042 9.11194C9.86906 9.1629 9.90919 9.2294 9.96207 9.30616C10.0673 9.45896 10.2263 9.65709 10.4499 9.85433C10.9065 10.2573 11.6161 10.6396 12.6182 10.6396C13.6203 10.6396 14.3298 10.2573 14.7865 9.85433C15.01 9.65709 15.169 9.45896 15.2743 9.30616C15.3272 9.2294 15.3673 9.1629 15.3959 9.11194C15.4103 9.08641 15.4218 9.06464 15.4307 9.04727C15.4351 9.03858 15.4389 9.03097 15.4421 9.02453C15.4436 9.02131 15.4451 9.01837 15.4463 9.01574L15.4481 9.01201L15.4489 9.01032L15.4493 9.00952C15.4494 9.00913 15.4496 9.00874 14.7381 8.67671L15.4496 9.00874C15.633 8.61579 15.4631 8.14858 15.0702 7.96521C14.6808 7.7835 14.2185 7.94865 14.0317 8.33396C14.0309 8.33555 14.0293 8.3385 14.0269 8.34269C14.0194 8.35613 14.0043 8.38164 13.9811 8.4153C13.9343 8.48333 13.8577 8.57963 13.7475 8.67684C13.5368 8.86277 13.1864 9.06929 12.6182 9.06929C12.05 9.06929 11.6995 8.86277 11.4888 8.67684C11.3787 8.57963 11.3021 8.48333 11.2552 8.4153C11.2321 8.38164 11.217 8.35613 11.2094 8.34269C11.2071 8.3385 11.2055 8.33554 11.2046 8.33396Z" fill="white"/>
<path fill-rule="evenodd" clip-rule="evenodd" d="M15.4445 8.33396C15.2577 7.94865 14.7954 7.7835 14.4061 7.96521C14.0131 8.14858 13.8432 8.61579 14.0266 9.00874L14.7381 8.67671C14.0266 9.00874 14.0268 9.00913 14.027 9.00952L14.0274 9.01032L14.0282 9.01201L14.0299 9.01574C14.0312 9.01837 14.0326 9.02131 14.0342 9.02453C14.0373 9.03097 14.0411 9.03858 14.0455 9.04727C14.0544 9.06464 14.066 9.08641 14.0803 9.11194C14.1089 9.1629 14.1491 9.2294 14.2019 9.30616C14.3072 9.45896 14.4662 9.65709 14.6897 9.85433C15.1464 10.2573 15.8559 10.6396 16.8581 10.6396C17.8602 10.6396 18.5697 10.2573 19.0264 9.85433C19.2499 9.65709 19.4089 9.45896 19.5142 9.30616C19.5671 9.2294 19.6072 9.1629 19.6358 9.11194C19.6502 9.08641 19.6617 9.06464 19.6706 9.04727C19.675 9.03858 19.6788 9.03097 19.682 9.02453C19.6835 9.02131 19.6849 9.01837 19.6862 9.01574L19.688 9.01201L19.6888 9.01032L19.6891 9.00952C19.6893 9.00913 19.6895 9.00874 18.978 8.67671L19.6895 9.00874C19.8729 8.61579 19.703 8.14858 19.31 7.96521C18.9207 7.7835 18.4584 7.94865 18.2716 8.33396C18.2708 8.33555 18.2692 8.3385 18.2668 8.34269C18.2593 8.35613 18.2442 8.38164 18.221 8.4153C18.1741 8.48333 18.0976 8.57963 17.9874 8.67684C17.7767 8.86277 17.4263 9.06929 16.8581 9.06929C16.2899 9.06929 15.9394 8.86277 15.7287 8.67684C15.6185 8.57963 15.542 8.48333 15.4951 8.4153C15.4719 8.38164 15.4569 8.35613 15.4493 8.34269C15.447 8.3385 15.4454 8.33554 15.4445 8.33396Z" fill="white"/>
<path fill-rule="evenodd" clip-rule="evenodd" d="M19.6844 8.33396C19.4976 7.94865 19.0353 7.7835 18.646 7.96521C18.253 8.14858 18.0831 8.61579 18.2665 9.00874L18.978 8.67671C18.2665 9.00874 18.2667 9.00913 18.2669 9.00952L18.2672 9.01032L18.268 9.01201L18.2698 9.01574C18.2711 9.01837 18.2725 9.02131 18.2741 9.02453C18.2772 9.03097 18.281 9.03858 18.2854 9.04727C18.2943 9.06464 18.3058 9.08641 18.3202 9.11194C18.3488 9.1629 18.389 9.2294 18.4418 9.30616C18.5471 9.45896 18.7061 9.65709 18.9296 9.85433C19.3863 10.2573 20.0958 10.6396 21.0979 10.6396C22.1001 10.6396 22.8096 10.2573 23.2663 9.85433C23.4898 9.65709 23.6488 9.45896 23.7541 9.30616C23.8069 9.2294 23.8471 9.1629 23.8757 9.11194C23.8901 9.08641 23.9016 9.06464 23.9105 9.04727C23.9149 9.03858 23.9187 9.03097 23.9218 9.02453C23.9234 9.02131 23.9248 9.01837 23.9261 9.01574L23.9279 9.01201L23.9287 9.01032L23.929 9.00952C23.9292 9.00913 23.9294 9.00874 23.2179 8.67671L23.9294 9.00874C24.1128 8.61579 23.9429 8.14858 23.5499 7.96521C23.1606 7.7835 22.6983 7.94865 22.5115 8.33396C22.5106 8.33555 22.5091 8.3385 22.5067 8.34269C22.4991 8.35613 22.4841 8.38164 22.4609 8.4153C22.414 8.48333 22.3375 8.57963 22.2273 8.67684C22.0166 8.86277 21.6661 9.06929 21.0979 9.06929C20.5297 9.06929 20.1793 8.86277 19.9686 8.67684C19.8584 8.57963 19.7819 8.48333 19.735 8.4153C19.7118 8.38164 19.6967 8.35613 19.6892 8.34269C19.6868 8.3385 19.6852 8.33554 19.6844 8.33396Z" fill="white"/>
<path d="M10.8527 8.46902C10.7602 8.27433 10.5278 8.1905 10.3321 8.2818C10.1357 8.37349 10.0507 8.60709 10.1424 8.80357L10.1426 8.80396L10.1428 8.80438L10.1432 8.80531L10.1442 8.80749C10.145 8.80909 10.1459 8.81098 10.147 8.81315C10.1491 8.81748 10.1518 8.82294 10.1551 8.82944C10.1618 8.84244 10.1709 8.85965 10.1826 8.88047C10.2059 8.92205 10.2398 8.9783 10.2853 9.04428C10.3759 9.17589 10.5143 9.34857 10.7095 9.52079C11.1047 9.86948 11.7244 10.2079 12.6181 10.2079C13.5117 10.2079 14.1315 9.86948 14.5267 9.52079C14.6064 9.45044 14.6767 9.38 14.7381 9.31233C14.7995 9.38 14.8697 9.45044 14.9495 9.52079C15.3446 9.86948 15.9644 10.2079 16.858 10.2079C17.7517 10.2079 18.3715 9.86948 18.7666 9.52079C18.8463 9.45045 18.9166 9.38004 18.978 9.31237C19.0394 9.38004 19.1096 9.45046 19.1893 9.52081C19.5845 9.8695 20.2043 10.2079 21.0979 10.2079C21.9916 10.2079 22.6113 9.8695 23.0065 9.52081C23.2017 9.34859 23.3401 9.17591 23.4308 9.0443C23.4762 8.97832 23.5101 8.92207 23.5334 8.88048C23.5451 8.85967 23.5542 8.84246 23.5609 8.82946C23.5642 8.82296 23.5669 8.8175 23.569 8.81317C23.5701 8.811 23.571 8.80911 23.5718 8.80751L23.5728 8.80533L23.5732 8.8044L23.5734 8.80398L23.5736 8.80358C23.6653 8.60711 23.5804 8.3735 23.3839 8.28181C23.1883 8.19052 22.9558 8.27435 22.8633 8.46903L22.8629 8.46985C22.8626 8.47041 22.8622 8.47117 22.8617 8.47212C22.8596 8.47638 22.8553 8.48447 22.8489 8.49586C22.8361 8.51868 22.8148 8.55444 22.7842 8.59887C22.7227 8.68809 22.6255 8.80985 22.487 8.93207C22.2148 9.17225 21.7746 9.42273 21.0979 9.42273C20.4213 9.42273 19.981 9.17225 19.7088 8.93207C19.5703 8.80985 19.4732 8.68809 19.4117 8.59887C19.3811 8.55444 19.3597 8.51868 19.3469 8.49586C19.3405 8.48447 19.3363 8.47638 19.3341 8.47212C19.3338 8.47153 19.3335 8.47101 19.3333 8.47057C19.3332 8.47024 19.333 8.46995 19.3329 8.4697C19.2951 8.38979 19.2303 8.32209 19.144 8.2818C19.086 8.25473 19.0248 8.24306 18.9649 8.2451C18.9225 8.24649 18.8797 8.25483 18.8382 8.2707C18.7587 8.30099 18.6889 8.35702 18.6424 8.43383C18.6355 8.44511 18.6292 8.45685 18.6234 8.46901C18.6232 8.4695 18.6227 8.47054 18.6219 8.47211C18.6197 8.47636 18.6155 8.48445 18.6091 8.49584C18.5962 8.51867 18.5749 8.55442 18.5443 8.59886C18.4828 8.68808 18.3857 8.80984 18.2471 8.93205C17.9749 9.17223 17.5347 9.42271 16.858 9.42271C16.1814 9.42271 15.7412 9.17223 15.4689 8.93205C15.3304 8.80984 15.2333 8.68808 15.1718 8.59886C15.1412 8.55442 15.1199 8.51867 15.107 8.49584C15.1006 8.48445 15.0964 8.47636 15.0942 8.47211C15.0936 8.4708 15.0931 8.46986 15.0928 8.46931L15.0927 8.46902C15.0463 8.37139 14.9647 8.30163 14.8702 8.26786C14.8268 8.25229 14.7822 8.24485 14.7381 8.24487C14.694 8.24485 14.6493 8.25229 14.6059 8.26786C14.5114 8.30163 14.4299 8.37138 14.3835 8.46901C14.3832 8.4695 14.3827 8.47054 14.3819 8.47211C14.3797 8.47636 14.3755 8.48445 14.3691 8.49584C14.3563 8.51867 14.3349 8.55442 14.3043 8.59886C14.2429 8.68808 14.1457 8.80984 14.0072 8.93205C13.735 9.17223 13.2948 9.42271 12.6181 9.42271C11.9414 9.42271 11.5012 9.17223 11.229 8.93205C11.0905 8.80984 10.9933 8.68808 10.9319 8.59886C10.9012 8.55442 10.8799 8.51867 10.8671 8.49584C10.8607 8.48445 10.8564 8.47636 10.8543 8.47211C10.8535 8.47055 10.853 8.46951 10.8527 8.46902Z" fill="#353F5B"/>
<path fill-rule="evenodd" clip-rule="evenodd" d="M1.49175 15.6704C1.30494 15.2851 0.842676 15.1199 0.453316 15.3016C0.0603648 15.485 -0.109529 15.9522 0.0738488 16.3452L0.785351 16.0131C0.0738488 16.3452 0.0740288 16.3456 0.0742111 16.3459L0.0745877 16.3467L0.0753846 16.3484L0.0771533 16.3522C0.0784103 16.3548 0.0798243 16.3577 0.0813972 16.361C0.0845426 16.3674 0.0883275 16.375 0.0927697 16.3837C0.101649 16.4011 0.113187 16.4228 0.127531 16.4484C0.156167 16.4993 0.196301 16.5658 0.249176 16.6426C0.35444 16.7954 0.513439 16.9935 0.736968 17.1908C1.19363 17.5937 1.90316 17.976 2.90529 17.976C3.90742 17.976 4.61695 17.5937 5.07362 17.1908C5.29714 16.9935 5.45614 16.7954 5.56141 16.6426C5.61428 16.5658 5.65442 16.4993 5.68305 16.4484C5.6974 16.4228 5.70893 16.4011 5.71781 16.3837C5.72226 16.375 5.72604 16.3674 5.72919 16.361C5.73076 16.3577 5.73217 16.3548 5.73343 16.3522L5.7352 16.3484L5.736 16.3467L5.73637 16.3459C5.73655 16.3456 5.73673 16.3452 5.02523 16.0131L5.73673 16.3452C5.92011 15.9522 5.75022 15.485 5.35727 15.3016C4.96791 15.1199 4.50564 15.2851 4.31883 15.6704C4.31799 15.672 4.3164 15.6749 4.31405 15.6791C4.30649 15.6926 4.29142 15.7181 4.26823 15.7517C4.22137 15.8198 4.14482 15.9161 4.03465 16.0133C3.82393 16.1992 3.47349 16.4057 2.90529 16.4057C2.33709 16.4057 1.98666 16.1992 1.77593 16.0133C1.66576 15.9161 1.58921 15.8198 1.54235 15.7517C1.51916 15.7181 1.50409 15.6926 1.49654 15.6791C1.49418 15.6749 1.49259 15.672 1.49175 15.6704Z" fill="white"/>
<path fill-rule="evenodd" clip-rule="evenodd" d="M5.73164 15.6704C5.54482 15.2851 5.08256 15.1199 4.6932 15.3016C4.30025 15.485 4.13035 15.9522 4.31373 16.3452L5.02523 16.0131C4.31373 16.3452 4.31391 16.3456 4.31409 16.3459L4.31447 16.3467L4.31527 16.3484L4.31704 16.3522C4.31829 16.3548 4.31971 16.3577 4.32128 16.361C4.32442 16.3674 4.32821 16.375 4.33265 16.3837C4.34153 16.4011 4.35307 16.4228 4.36741 16.4484C4.39605 16.4993 4.43618 16.5658 4.48906 16.6426C4.59432 16.7954 4.75332 16.9935 4.97685 17.1908C5.43351 17.5937 6.14305 17.976 7.14517 17.976C8.1473 17.976 8.85684 17.5937 9.3135 17.1908C9.53703 16.9935 9.69603 16.7954 9.80129 16.6426C9.85416 16.5658 9.8943 16.4993 9.92293 16.4484C9.93728 16.4228 9.94882 16.4011 9.9577 16.3837C9.96214 16.375 9.96592 16.3674 9.96907 16.361C9.97064 16.3577 9.97206 16.3548 9.97331 16.3522L9.97508 16.3484L9.97588 16.3467L9.97625 16.3459C9.97644 16.3456 9.97662 16.3452 9.26511 16.0131L9.97662 16.3452C10.16 15.9522 9.9901 15.485 9.59715 15.3016C9.20779 15.1199 8.74552 15.2851 8.55871 15.6704C8.55787 15.672 8.55628 15.6749 8.55393 15.6791C8.54637 15.6926 8.5313 15.7181 8.50811 15.7517C8.46125 15.8198 8.3847 15.9161 8.27454 16.0133C8.06381 16.1992 7.71337 16.4057 7.14517 16.4057C6.57697 16.4057 6.22654 16.1992 6.01581 16.0133C5.90565 15.9161 5.8291 15.8198 5.78223 15.7517C5.75905 15.7181 5.74397 15.6926 5.73642 15.6791C5.73406 15.6749 5.73248 15.672 5.73164 15.6704Z" fill="white"/>
<path fill-rule="evenodd" clip-rule="evenodd" d="M9.97152 15.6704C9.7847 15.2851 9.32244 15.1199 8.93308 15.3016C8.54013 15.485 8.37024 15.9522 8.55361 16.3452L9.26511 16.0131C8.55361 16.3452 8.55379 16.3456 8.55398 16.3459L8.55435 16.3467L8.55515 16.3484L8.55692 16.3522C8.55817 16.3548 8.55959 16.3577 8.56116 16.361C8.56431 16.3674 8.56809 16.375 8.57253 16.3837C8.58141 16.4011 8.59295 16.4228 8.6073 16.4484C8.63593 16.4993 8.67607 16.5658 8.72894 16.6426C8.8342 16.7954 8.9932 16.9935 9.21673 17.1908C9.67339 17.5937 10.3829 17.976 11.3851 17.976C12.3872 17.976 13.0967 17.5937 13.5534 17.1908C13.7769 16.9935 13.9359 16.7954 14.0412 16.6426C14.094 16.5658 14.1342 16.4993 14.1628 16.4484C14.1772 16.4228 14.1887 16.4011 14.1976 16.3837C14.202 16.375 14.2058 16.3674 14.209 16.361C14.2105 16.3577 14.2119 16.3548 14.2132 16.3522L14.215 16.3484L14.2158 16.3467L14.2161 16.3459C14.2163 16.3456 14.2165 16.3452 13.505 16.0131L14.2165 16.3452C14.3999 15.9522 14.23 15.485 13.837 15.3016C13.4477 15.1199 12.9854 15.2851 12.7986 15.6704C12.7978 15.672 12.7962 15.6749 12.7938 15.6791C12.7863 15.6926 12.7712 15.7181 12.748 15.7517C12.7011 15.8198 12.6246 15.9161 12.5144 16.0133C12.3037 16.1992 11.9533 16.4057 11.3851 16.4057C10.8169 16.4057 10.4664 16.1992 10.2557 16.0133C10.1455 15.9161 10.069 15.8198 10.0221 15.7517C9.99893 15.7181 9.98386 15.6926 9.9763 15.6791C9.97395 15.6749 9.97236 15.672 9.97152 15.6704Z" fill="white"/>
<path d="M1.13982 15.8057C1.04732 15.611 0.814873 15.5272 0.619236 15.6185C0.422761 15.7102 0.337814 15.9438 0.429503 16.1402L0.429687 16.1406L0.429885 16.1411L0.430321 16.142L0.431357 16.1442C0.432121 16.1458 0.433031 16.1477 0.434089 16.1498C0.436206 16.1542 0.438918 16.1596 0.442241 16.1661C0.448885 16.1791 0.457989 16.1963 0.469685 16.2171C0.493051 16.2587 0.52692 16.315 0.572373 16.381C0.663037 16.5126 0.801423 16.6852 0.996611 16.8575C1.39179 17.2061 2.01155 17.5445 2.90519 17.5445C3.79884 17.5445 4.4186 17.2061 4.81378 16.8575C4.89352 16.7871 4.96378 16.7167 5.02517 16.649C5.08657 16.7167 5.15683 16.7871 5.23657 16.8575C5.63175 17.2061 6.25151 17.5445 7.14515 17.5445C8.0388 17.5445 8.65856 17.2061 9.05374 16.8575C9.13346 16.7871 9.2037 16.7167 9.26509 16.649C9.32648 16.7167 9.39673 16.7871 9.47646 16.8575C9.87163 17.2062 10.4914 17.5446 11.385 17.5446C12.2787 17.5446 12.8984 17.2062 13.2936 16.8575C13.4888 16.6853 13.6272 16.5126 13.7179 16.381C13.7633 16.315 13.7972 16.2587 13.8206 16.2172C13.8322 16.1963 13.8414 16.1791 13.848 16.1661C13.8513 16.1596 13.854 16.1542 13.8561 16.1498C13.8572 16.1477 13.8581 16.1458 13.8589 16.1442L13.8599 16.142L13.8604 16.1411L13.8605 16.1406L13.8607 16.1403C13.9524 15.9438 13.8675 15.7102 13.671 15.6185C13.4754 15.5272 13.2429 15.611 13.1504 15.8057L13.15 15.8065C13.1497 15.8071 13.1493 15.8078 13.1489 15.8088C13.1467 15.813 13.1424 15.8211 13.136 15.8325C13.1232 15.8554 13.1019 15.8911 13.0713 15.9355C13.0098 16.0248 12.9126 16.1465 12.7741 16.2687C12.5019 16.5089 12.0617 16.7594 11.385 16.7594C10.7084 16.7594 10.2681 16.5089 9.99594 16.2687C9.85743 16.1465 9.76027 16.0248 9.69881 15.9355C9.6682 15.8911 9.64686 15.8554 9.63403 15.8325C9.62763 15.8211 9.6234 15.813 9.62122 15.8088C9.62092 15.8082 9.62066 15.8077 9.62044 15.8072C9.62027 15.8069 9.62012 15.8066 9.62 15.8064C9.58226 15.7265 9.51746 15.6588 9.43111 15.6185C9.37312 15.5914 9.31189 15.5797 9.25203 15.5818C9.2096 15.5832 9.16682 15.5915 9.12531 15.6074C9.04578 15.6377 8.97597 15.6937 8.92947 15.7705C8.92264 15.7818 8.91631 15.7935 8.91053 15.8057C8.91029 15.8062 8.90977 15.8072 8.90897 15.8088C8.9068 15.813 8.90256 15.8211 8.89616 15.8325C8.88334 15.8553 8.862 15.8911 8.83139 15.9355C8.76993 16.0247 8.67276 16.1465 8.53426 16.2687C8.26205 16.5089 7.82184 16.7594 7.14515 16.7594C6.46847 16.7594 6.02826 16.5089 5.75605 16.2687C5.61754 16.1465 5.52038 16.0247 5.45892 15.9355C5.42831 15.8911 5.40697 15.8553 5.39415 15.8325C5.38775 15.8211 5.38351 15.813 5.38134 15.8088C5.38067 15.8075 5.3802 15.8065 5.37992 15.806L5.37978 15.8057C5.33339 15.7081 5.25181 15.6383 5.15732 15.6045C5.11393 15.589 5.06928 15.5815 5.02517 15.5815C4.98107 15.5815 4.93642 15.589 4.89303 15.6045C4.79854 15.6383 4.71696 15.7081 4.67057 15.8057C4.67033 15.8062 4.66981 15.8072 4.66901 15.8088C4.66684 15.813 4.6626 15.8211 4.6562 15.8325C4.64338 15.8553 4.62204 15.8911 4.59143 15.9355C4.52997 16.0247 4.4328 16.1465 4.2943 16.2687C4.02209 16.5089 3.58188 16.7594 2.90519 16.7594C2.22851 16.7594 1.7883 16.5089 1.51609 16.2687C1.37759 16.1465 1.28042 16.0247 1.21896 15.9355C1.18835 15.8911 1.16701 15.8553 1.15419 15.8325C1.14779 15.8211 1.14355 15.813 1.14138 15.8088C1.14058 15.8072 1.14006 15.8062 1.13982 15.8057Z" fill="#353F5B"/>
</svg>
