<svg width="93"
     height="50"
     viewBox="0 0 93 50"
     fill="none"
     xmlns="http://www.w3.org/2000/svg">
  <path d="M9.75378 33.4063C8.1975 34.5584 7.0444 36.1721 6.45869 38.0176C5.87298 39.8632 5.88453 41.8465 6.4917 43.6852C7.09886 45.5238 8.27069 47.1239 9.84028 48.2578C11.4099 49.3916 13.2972 50.0013 15.2335 50C17.1698 49.9986 19.0563 49.3864 20.6243 48.2505C22.1924 47.1145 23.362 45.5128 23.9667 43.6733C24.5714 41.8339 24.5802 39.8505 23.992 38.0058C23.4038 36.161 22.2485 34.5488 20.6907 33.3989L15.22 40.7855L9.75378 33.4063Z"
        fill="#28A8E0" />
  <path d="M9.75378 33.4064L15.22 40.7856L20.6907 33.399C19.1066 32.2303 17.1895 31.6004 15.221 31.6017C13.2525 31.603 11.3363 32.2356 9.75378 33.4064Z"
        fill="#049C57" />
  <path d="M30.454 15.2273C30.454 6.81611 23.6342 0 15.2274 0C6.82058 0 1.81767e-05 6.81611 1.81767e-05 15.2273C-0.00545189 18.7615 1.22385 22.1866 3.4755 24.9107H3.46068L9.75373 33.4064C11.3362 32.2355 13.2524 31.603 15.221 31.6017C17.1895 31.6003 19.1066 32.2303 20.6906 33.399L26.9792 24.9107C29.2303 22.1863 30.4593 18.7614 30.454 15.2273ZM15.2274 23.9379C13.4079 23.9379 11.6292 23.3984 10.1164 22.3875C8.60353 21.3766 7.4244 19.9399 6.72811 18.2589C6.03182 16.5779 5.84963 14.7282 6.2046 12.9436C6.55957 11.1591 7.43574 9.51989 8.72231 8.23331C10.0089 6.94674 11.6481 6.07057 13.4326 5.7156C15.2172 5.36063 17.0669 5.54282 18.7479 6.23911C20.4289 6.9354 21.8656 8.11452 22.8765 9.62738C23.8874 11.1402 24.4269 12.9189 24.4269 14.7384C24.4269 17.1782 23.4577 19.5182 21.7324 21.2434C20.0072 22.9687 17.6672 23.9379 15.2274 23.9379Z"
        fill="#FBC82D" />
  <path d="M41.7954 5.11949L41.7613 5.11505C40.3425 4.92242 39.4809 4.73571 39.4809 3.77405C39.4809 2.39305 41.3486 2.35304 41.5612 2.35304C42.0502 2.35304 43.6535 2.44935 43.7365 3.69552L43.7506 3.90593H45.9191L45.9139 3.67551C45.8613 1.16096 43.5431 0.267456 41.5768 0.267456C39.4105 0.267456 37.2241 1.36618 37.2241 3.81998C37.2241 5.7285 38.64 6.81759 41.4294 7.05764H41.4449C42.9334 7.20582 43.9869 7.39696 43.9869 8.5394C43.9869 9.83076 42.5363 10.0212 41.6709 10.0212C40.61 10.0212 39.346 9.63295 39.2764 8.5394L39.263 8.32751H37.0315L37.0359 8.55793C37.0389 8.98903 37.1286 9.41513 37.2997 9.81085C37.4707 10.2066 37.7197 10.5638 38.0317 10.8613C38.8467 11.6467 40.1639 12.1075 41.5627 12.1075H41.7028C42.8778 12.1075 43.9632 11.826 44.7604 11.3147C45.7413 10.6857 46.2592 9.73148 46.2592 8.55496C46.2592 5.85296 44.0514 5.37361 41.7954 5.11949ZM41.5635 1.90036C40.304 1.90036 39.0311 2.47973 39.0311 3.77405C39.0311 5.20025 40.4507 5.39288 41.7028 5.56254L41.742 5.56773C42.2945 5.62295 42.8434 5.70978 43.386 5.82778C42.8434 5.70978 42.2945 5.62295 41.742 5.56773L41.7028 5.56254C40.4507 5.39288 39.0311 5.20025 39.0311 3.77405C39.0311 2.47973 40.3025 1.90036 41.5635 1.90036C42.4659 1.90036 43.432 2.15819 43.9024 2.82572C43.4298 2.15819 42.4636 1.90036 41.5635 1.90036ZM45.399 3.09244C45.216 2.22783 44.6818 1.63586 43.9839 1.2595C44.6818 1.63586 45.216 2.22783 45.3968 3.09244H45.399ZM43.8283 1.17948L43.9091 1.21875L43.8283 1.17948ZM41.4894 6.61089H41.4709C38.9178 6.38862 37.6761 5.47956 37.6761 3.82369C37.6727 3.40113 37.7622 2.98299 37.9384 2.59889C38.1145 2.21479 38.373 1.87413 38.6955 1.60104C38.373 1.87413 38.1145 2.21479 37.9384 2.59889C37.7622 2.98299 37.6727 3.40113 37.6761 3.82369C37.6761 5.47956 38.9178 6.39159 41.4709 6.61089H41.4894C41.7228 6.63385 41.9724 6.6583 42.2236 6.69387C41.9724 6.6583 41.7228 6.63385 41.4894 6.61089ZM43.4312 7.00726C44.0128 7.27027 44.4388 7.72295 44.4388 8.54459C44.4388 7.72295 44.0128 7.27027 43.4312 7.00726ZM37.5005 8.78538C37.5005 8.82242 37.5086 8.85946 37.5131 8.89651C37.5086 8.85946 37.5042 8.82242 37.5005 8.78538ZM38.3443 10.5413C38.2615 10.4614 38.1833 10.3768 38.1102 10.2879C38.1833 10.3768 38.2615 10.4614 38.3443 10.5413C38.4665 10.6572 38.5972 10.7637 38.7355 10.8598C38.7824 10.8919 38.8299 10.9231 38.8778 10.9532C38.8284 10.9231 38.781 10.8919 38.7355 10.8598C38.5973 10.764 38.4665 10.6577 38.3443 10.542V10.5413ZM41.6976 11.66C41.487 11.6645 41.2762 11.6579 41.0663 11.64C41.2762 11.6579 41.487 11.6645 41.6976 11.66C43.1215 11.66 44.7211 11.2029 45.4316 10.0093C44.7211 11.2036 43.1193 11.6607 41.6976 11.6607V11.66ZM45.8072 8.55941C45.8131 8.20579 45.7608 7.85362 45.6524 7.51699C45.7608 7.85362 45.8131 8.20579 45.8072 8.55941ZM45.4961 7.15988C45.5579 7.27321 45.6097 7.3917 45.6509 7.51402C45.6096 7.39196 45.5578 7.27371 45.4961 7.16062V7.15988Z"
        fill="white" />
  <path d="M57.1391 0.394165L51.9729 11.397V11.909H54.257L55.3239 9.63148H60.0581L61.1413 11.9067H63.4084V11.3948L58.2741 0.394165H57.1391ZM55.4299 8.09934H59.9655L57.7073 2.91316L59.9655 8.09934H55.4299ZM57.7051 4.04375L59.2758 7.6474H56.1226L57.7051 4.04375ZM57.4265 0.849807L52.4441 11.4563L57.4265 0.849807ZM60.3441 9.18473L61.4265 11.46L60.3441 9.18473Z"
        fill="white" />
  <path d="M68.087 2.5412H71.2728V11.9089H73.514V2.5412H76.6998V0.472656H68.087V2.5412ZM73.0613 11.4562H71.7277V2.08926V11.4562H73.0613V2.08926V11.4562ZM68.5419 0.924594V2.08926V0.924594Z"
        fill="white" />
  <path d="M90.1786 0.472656V7.94815C90.1786 9.17357 89.3066 9.96558 87.956 9.96558C86.5876 9.96558 85.703 9.17357 85.703 7.94815V0.472656H83.4307V7.99483C83.4307 10.4205 85.2495 12.0497 87.956 12.0497C90.5928 12.0497 92.4346 10.3827 92.4346 7.99483V0.472656H90.1786ZM89.4244 10.076L89.4 10.09L89.4244 10.076ZM89.2184 10.176C89.1821 10.1923 89.1443 10.2071 89.1073 10.2212C89.1429 10.2041 89.1799 10.1893 89.2162 10.173L89.2184 10.176ZM87.9589 11.6007C85.9319 11.6007 83.8841 10.4894 83.8841 7.99779V0.924594V7.99483C83.8841 10.4835 85.9304 11.5977 87.9589 11.5977C89.2429 11.5977 90.5342 11.1406 91.2929 10.1575C90.5357 11.1406 89.2407 11.5977 87.9567 11.5977L87.9589 11.6007Z"
        fill="white" />
  <path d="M42.4718 19.3007H37.6953V30.7369H39.9832V27.4415H42.4718C44.8478 27.4415 46.5733 25.7426 46.5733 23.4029C46.5733 22.2916 46.1888 21.2721 45.4924 20.5276C44.7404 19.7252 43.6965 19.3007 42.4718 19.3007ZM42.4718 25.3892H39.9528V21.3373H42.4718C43.5831 21.3373 44.3632 22.1671 44.3632 23.3548C44.3632 24.5424 43.5675 25.3892 42.4718 25.3892ZM44.8159 23.3555C44.8159 22.5057 44.4685 21.7945 43.9017 21.3551C43.6577 21.1673 43.3774 21.032 43.0786 20.958C43.3774 21.032 43.6577 21.1673 43.9017 21.3551C44.4685 21.793 44.8159 22.5042 44.8159 23.3555ZM43.6453 26.8139C43.6994 26.7969 43.7535 26.7791 43.8068 26.7599C43.7535 26.7791 43.6994 26.7969 43.6453 26.8139ZM45.9421 24.6083C45.8942 24.7558 45.8366 24.8998 45.7694 25.0395C45.5652 25.4612 45.2735 25.8345 44.9137 26.1346C44.87 26.1709 44.8256 26.2086 44.7796 26.2405C44.7337 26.2724 44.6885 26.3079 44.6411 26.3398C44.5937 26.3716 44.547 26.4028 44.4981 26.4316C44.3993 26.4909 44.3005 26.5455 44.2017 26.5954C44.304 26.546 44.4028 26.4914 44.4981 26.4316C44.547 26.4028 44.5944 26.3716 44.6411 26.3398C44.6878 26.3079 44.7344 26.2746 44.7796 26.2405C44.8248 26.2064 44.87 26.1709 44.9137 26.1346C45.2724 25.8349 45.5634 25.4624 45.7672 25.0418C45.8343 24.902 45.892 24.758 45.9398 24.6106C45.9591 24.5498 45.9769 24.4883 45.9932 24.4261C45.9769 24.4868 45.9591 24.5476 45.9398 24.6083H45.9421ZM46.0762 24.0349C46.0606 24.1357 46.0421 24.2335 46.0191 24.3312C46.0421 24.2357 46.0606 24.1379 46.0762 24.0349C46.0865 23.9682 46.0954 23.9001 46.1021 23.8312C46.0932 23.9001 46.0828 23.9682 46.0739 24.0349H46.0762Z"
        fill="white" />
  <path d="M56.0492 25.8723H60.6315V23.8045H56.0492V21.3536H60.9005V19.3007H53.7614V30.7369H60.9924V28.621H56.0492V25.8723ZM54.214 19.7526V30.2842V19.7526Z"
        fill="white" />
  <path d="M67.5847 21.3692H70.7705V30.7369H73.0117V21.3692H76.1975V19.3007H67.5847V21.3692ZM72.5583 30.2842H71.2247V20.9173V30.2842H72.5583V20.9173V30.2842ZM68.0389 19.7533V20.9173V19.7533Z"
        fill="white" />
  <path d="M87.3796 19.2222H86.2445L81.0784 30.228V30.7399H83.3618L84.4294 28.4647H89.1636L90.2468 30.7399H92.5139V30.228L87.3796 19.2222ZM84.5346 26.9236L86.8121 21.7375L84.5346 26.9236ZM88.3805 26.4717H85.2273L86.8098 22.868L88.3805 26.4717ZM86.5283 19.6748L81.5459 30.2843L86.5283 19.6748ZM89.4452 28.009L90.5357 30.2843L89.4452 28.009Z"
        fill="white" />
  <path d="M40.8967 40.1661H43.2186V45.6487C43.2186 46.8926 42.4296 47.635 41.1071 47.635C39.7846 47.635 38.9793 46.8941 38.9793 45.6487V44.2173H36.8167V45.6827C36.8167 48.0987 38.5399 49.722 41.1064 49.722C43.6876 49.722 45.4902 48.061 45.4902 45.6827V38.1257H40.8967V40.1661ZM42.7119 47.649C42.8077 47.5841 42.8981 47.5115 42.9823 47.432C42.8981 47.5115 42.8077 47.5841 42.7119 47.649C42.2933 47.9328 41.7487 48.0869 41.1071 48.0869C40.742 48.0913 40.3788 48.034 40.0328 47.9172C40.3788 48.034 40.742 48.0913 41.1071 48.0869C41.7487 48.0899 42.2925 47.935 42.7111 47.652L42.7119 47.649ZM37.2664 45.6827V44.6692V45.6827C37.2664 46.6888 37.6049 47.5394 38.2014 48.1595C37.6072 47.5394 37.2664 46.6888 37.2664 45.6827ZM45.0382 38.5814V45.6827C45.0382 46.8681 44.5537 47.8417 43.7224 48.4729C44.5537 47.8417 45.0382 46.8704 45.0382 45.6827V38.5814Z"
        fill="white" />
  <path d="M52.1656 38.051L46.9994 49.0531V49.5651H49.2835L50.3504 47.2898H55.0846L56.1678 49.5651H58.4349V49.0539L53.3006 38.051H52.1656ZM52.453 38.503H53.0124L53.9363 40.4833L53.0116 38.503H52.4545L49.1331 45.5762L52.453 38.503ZM51.1491 45.2998L52.7316 41.6969L54.3023 45.2998H51.1491ZM54.992 45.7518L52.7694 40.6434L54.992 45.7518ZM48.9961 49.1131L49.3295 48.4019L48.9961 49.1131ZM56.453 49.1131L56.399 48.9998L56.453 49.1131Z"
        fill="white" />
  <path d="M67.5685 43.5913C68.2197 43.1142 68.5857 42.3659 68.5857 41.4776C68.5857 39.412 67.178 38.1295 64.9072 38.1295H60.2249V49.565H65.3621C67.6159 49.565 69.0717 48.2314 69.0717 46.1696C69.0725 44.999 68.5316 44.0825 67.5685 43.5913ZM64.9072 38.5815C66.9276 38.5815 68.133 39.6639 68.133 41.4776C68.133 42.3666 67.7211 43.0571 66.9728 43.4246L66.8506 43.4846L66.9728 43.4246C67.7211 43.0542 68.133 42.3659 68.133 41.4776C68.133 39.6639 66.9276 38.5815 64.9072 38.5815ZM65.2525 47.512H62.4979V44.7493H65.0495C65.494 44.7493 65.9637 44.7723 66.3379 45.0456C66.655 45.3131 66.8157 45.691 66.8165 46.157C66.7639 47.3365 65.8141 47.512 65.2532 47.512H65.2525ZM66.6113 44.6856C66.4945 44.599 66.3673 44.5276 66.2327 44.4729C66.3673 44.5276 66.4945 44.599 66.6113 44.6856ZM64.7828 43.2572H62.0459V39.7113V43.2542H64.7828C65.6229 43.2542 66.2193 42.9904 66.5357 42.4948C66.2193 42.9934 65.6229 43.2572 64.7828 43.2572ZM66.3453 41.5213C66.3327 42.3733 65.8067 42.8052 64.7828 42.8052H62.4979V40.1662H64.7828C65.494 40.1662 66.3453 40.4018 66.3453 41.5213ZM65.7163 39.8676C66.4068 40.1284 66.798 40.7078 66.798 41.525C66.8036 41.8661 66.7138 42.202 66.5386 42.4948C66.7138 42.202 66.8036 41.8661 66.798 41.525C66.7972 40.7078 66.406 40.1284 65.7163 39.8676ZM67.2721 46.1696C67.2766 45.8823 67.2213 45.5972 67.1099 45.3324C67.2213 45.5972 67.2766 45.8823 67.2721 46.1696ZM66.7231 48.9108C67.9219 48.5085 68.6242 47.5343 68.6242 46.1696C68.6242 45.0256 68.0486 44.1988 67.0039 43.8417L66.772 43.7617L67.0039 43.8417C68.0486 44.1988 68.6242 45.0271 68.6242 46.1696C68.6205 47.5313 67.9182 48.5056 66.7194 48.9079L66.7231 48.9108ZM66.5424 48.9657C66.592 48.9523 66.6409 48.9375 66.6905 48.9219C66.6372 48.9345 66.5883 48.9494 66.5386 48.9627L66.5424 48.9657Z"
        fill="white" />
  <path d="M75.1995 38.051L70.0333 49.0531V49.5651H72.3175L73.3843 47.2898H78.1193L79.2003 49.5651H81.4681V49.0539L76.333 38.051H75.1995ZM70.5038 49.1131L75.4855 38.503H76.0456L78.3682 43.4802L76.0456 38.503H75.4855L70.5038 49.1131ZM73.4895 45.7518L73.5947 45.5124L73.4895 45.7518ZM78.0252 45.7518L75.7663 40.5656L78.0252 45.7518ZM75.7648 41.6969L77.3347 45.2998H74.1815L75.7648 41.6969ZM78.4031 46.8379L78.9958 48.0803L78.4031 46.8379ZM73.0954 46.8379L72.739 47.5988L73.0954 46.8379Z"
        fill="white" />
  <path d="M89.8786 45.3294C90.5328 45.0368 91.0875 44.5597 91.4746 43.9566C91.8618 43.3535 92.0646 42.6506 92.0582 41.9339C92.0582 39.695 90.3972 38.131 88.0197 38.131H83.2588V49.565H85.5466V45.7361H87.6211L90.3505 49.565H92.545V48.999L89.8786 45.3294ZM89.8334 41.9487C89.8334 43.0082 89.0636 43.778 88.0034 43.778H85.5155V40.1662H88.0034C89.0636 40.1662 89.8334 40.916 89.8334 41.9487ZM90.0705 42.966C90.2147 42.6464 90.288 42.2994 90.2853 41.9487C90.2886 41.5759 90.2017 41.2079 90.0319 40.8759C90.2017 41.2079 90.2886 41.5759 90.2853 41.9487C90.288 42.2994 90.2147 42.6464 90.0705 42.966ZM89.9512 40.7344C89.9675 40.7611 89.9838 40.7885 89.9993 40.8159C89.9838 40.7885 89.9675 40.7611 89.9512 40.7344ZM89.1658 45.1197L89.2718 45.0819L89.1658 45.1197ZM91.55 42.5629C91.5877 42.3559 91.6065 42.1459 91.6063 41.9354C91.6064 42.1449 91.5875 42.3539 91.55 42.56V42.5629ZM91.427 43.0386C91.4778 42.8897 91.5179 42.7375 91.547 42.5829C91.517 42.7365 91.4762 42.8878 91.4248 43.0356L91.427 43.0386ZM83.7107 38.5844H88.0167C89.7949 38.5844 91.1284 39.5653 91.4989 41.0575C91.1284 39.5653 89.7993 38.5844 88.0167 38.5844H83.7107ZM90.5839 49.116L89.56 47.6802L90.5839 49.116Z"
        fill="white" />
</svg>