[
    {
        "id" : "32.76",
        "title" : "Depok",
        "children" : [
            {
                "id" : "32.76-01",
                "title": "Peta Kemiskinan (Tematik)",
                "type" : "Feature",
                "url" : "http://idsd.depok.go.id/arcgis/rest/services/SIPPR/Rencana_Pola_Ruang/MapServer/0?f=json"
            },
            {
                "id" : "32.76-02",
                "title": "Sebaran UMKM (2017)",
                "type" : "Feature",
                "url" : "http://idsd.depok.go.id/arcgis/rest/services/Hosted/UMKM_thn_2017/FeatureServer/0?f=json"
            },
            {
                "id" : "32.76-03",
                "title": "Rencana Pola Ruang",
                "type" : "Feature",
                "url" : "http://idsd.depok.go.id/arcgis/rest/services/SIPPR/Rencana_Pola_Ruang/MapServer/0?f=json"
            }
        ]
    },
    {
        "id" : "32.01",
        "title" : "Bogor",
        "children" : [
            {
                "id" : "32.01-01",
                "title": "Jaringan Jalan",
                "type" : "Feature",
                "url" : "http://services6.arcgis.com/hdfh5OsOlUgKLttT/ArcGIS/rest/info?f=json"
            },
            {
                "id" : "32.01-02",
                "title": "SARPRASWIL Tahun 2018",
                "type" : "Feature",
                "url" : "http://services6.arcgis.com/hdfh5OsOlUgKLttT/ArcGIS/rest/services/service_4d5c6446819f431cb98644fbd241d0b7/FeatureServer/0?f=json"
            },
            {
                "id" : "32.01-03",
                "title": "Gizi Buruk (Tematik) ",
                "type" : "Feature",
                "url" : "http://services6.arcgis.com/hdfh5OsOlUgKLttT/ArcGIS/rest/services/Gizi_Buruk/FeatureServer/0?f=json"
            }
        ]
    }
]
