{
    "random_params": null,
    "latitude": 4,
    "longitude": 5,
    "coordinate": [
        {
            "x": "1",
            "y": 2,
            "place": "Bali"
        },
        {
            "x": "1",
            "y": "3",
            "place": "New Jersey"
        },
        {
            "x": 1,
            "y": "4",
            "place": "Mecca"
        }
    ],
    "line": [
        [
            8.919,
            44.4074
        ],
        [
            8.923,
            44.4075
        ]
    ],
    "location": [
        3,
        4
    ],
    "shape": [
        [
            [
                2.38,
                57.322
            ],
            [
                23.194,
                -20.28
            ],
            [
                -120.43,
                19.15
            ],
            [
                2.38,
                57.322
            ]
        ],
        [
            [
                -5.21,
                23.51
            ],
            [
                15.21,
                -10.81
            ],
            [
                -20.51,
                1.51
            ],
            [
                -5.21,
                23.51
            ]
        ]
    ],
    "more_lines": [
        [
            [
                3.75,
                9.25
            ],
            [
                -130.95,
                1.52
            ]
        ],
        [
            [
                23.15,
                -34.25
            ],
            [
                -1.35,
                -4.65
            ],
            [
                3.45,
                77.95
            ]
        ]
    ],
    "object_geometry": {
        "more_points": [
            {
                "data": {
                    "coordinates": [
                        [
                            -155.52,
                            19.61
                        ],
                        [
                            -156.22,
                            20.74
                        ],
                        [
                            -157.97,
                            21.46
                        ]
                    ],
                    "type": "MultiPoint"
                }
            },
            {
                "data": {
                    "coordinates": [
                        [
                            -155.51,
                            19.62
                        ],
                        [
                            -156.21,
                            20.72
                        ],
                        [
                            -157.91,
                            21.42
                        ]
                    ],
                    "type": "MultiPoint"
                }
            }
        ],
        "more_polygons": [
            [
                [
                    [
                        3.78,
                        9.28
                    ],
                    [
                        -130.91,
                        1.52
                    ],
                    [
                        35.12,
                        72.234
                    ],
                    [
                        3.78,
                        9.28
                    ]
                ],
                [
                    [
                        3.71,
                        9.29
                    ],
                    [
                        -130.9,
                        1.51
                    ],
                    [
                        35.11,
                        72.233
                    ],
                    [
                        3.77,
                        9.27
                    ]
                ]
            ],
            [
                [
                    [
                        23.18,
                        -34.29
                    ],
                    [
                        -1.31,
                        -4.61
                    ],
                    [
                        3.41,
                        77.91
                    ],
                    [
                        23.18,
                        -34.29
                    ]
                ]
            ]
        ]
    },
    "this_is_points": [
        [
            -155.52,
            19.61
        ],
        [
            -156.22,
            20.74
        ],
        [
            -157.97,
            21.46
        ]
    ]
}
