<?xml version="1.0" encoding="utf-8"?>
<!-- Generator: Adobe Illustrator 24.0.0, SVG Export Plug-In . SVG Version: 6.00 Build 0)  -->
<svg version="1.1" id="Layer_1" xmlns="http://www.w3.org/2000/svg" xmlns:xlink="http://www.w3.org/1999/xlink" x="0px" y="0px"
	 viewBox="0 0 88 88" style="enable-background:new 0 0 88 88;" xml:space="preserve">
<style type="text/css">
	.st0{fill:#009B57;}
	.st1{clip-path:url(#SVGID_4_);}
	.st2{fill:#006838;}
	.st3{fill:#ADD36D;}
	.st4{fill:#93B64E;}
	.st5{fill:#FCD33E;}
	.st6{fill:#DFB525;}
	.st7{fill:#56BB69;}
	.st8{fill:#93CB6C;}
	.st9{fill:none;stroke:#709D42;stroke-miterlimit:10;}
	.st10{fill:#709D42;}
	.st11{fill:#FFF7CA;}
	.st12{fill:#9FCA63;}
	.st13{fill:#A1DADF;}
	.st14{fill:#1BA891;}
	.st15{fill:#1A9984;}
	.st16{fill:#F281A3;}
	.st17{fill:#006D5C;}
	.st18{fill:#EF4E7E;}
	.st19{fill:#FDFEFE;}
	.st20{fill:#FFFFFF;}
</style>
<title>Artboard 28</title>
<g>
	<defs>
		<rect id="SVGID_1_" y="-99" width="88" height="88"/>
	</defs>
	<clipPath id="SVGID_2_">
		<use xlink:href="#SVGID_1_"  style="overflow:visible;"/>
	</clipPath>
</g>
<rect class="st0" width="88" height="88"/>
<g>
	<defs>
		<rect id="SVGID_3_" width="88" height="88"/>
	</defs>
	<clipPath id="SVGID_4_">
		<use xlink:href="#SVGID_3_"  style="overflow:visible;"/>
	</clipPath>
	<g class="st1">
		<circle class="st2" cx="44" cy="83.6" r="44.2"/>
	</g>
</g>
<path class="st3" d="M55.9,58c0.1,0,0.2-0.1,0.3-0.2c0.3-0.5-0.7-1.7-1.7-2.2c-0.3-0.1-0.6-0.2-0.9-0.2c-0.5,0-0.9,0.2-1.1,0.6
	c-0.1,0.2,0,0.5,0.1,0.7c-0.2-0.1-0.5-0.1-0.7-0.2c-0.2,0-0.4,0-0.6,0c-0.2-0.2-0.5-0.3-0.7-0.5c-0.3-0.1-0.6-0.2-0.9-0.2
	c-0.5,0-0.9,0.3-1.1,0.7c-0.1,0.2,0,0.5,0.1,0.7c-0.2-0.1-0.5-0.1-0.7-0.2c-0.3,0-0.6,0-0.9,0.1c-0.4,0.2-0.8,0.5-0.8,1
	c0,0.6,1,1.1,1.8,1.2c0.4,0,0.8,0,1.2-0.1c0.3,0.3,0.6,0.6,1,0.8c0.8,0.4,2,0.5,2.3,0c0.2-0.3,0-0.7-0.4-1.1c0.3,0,0.7,0,1-0.1
	c0.3,0.3,0.6,0.6,1,0.8c0.8,0.4,2,0.5,2.3,0S56.5,58.5,55.9,58z"/>
<path class="st4" d="M54.4,56.6c-0.2,0.1-0.4,0.3-0.3,0.5c0.1,0.2,0.3,0.4,0.6,0.3c0,0,0.1,0,0.1,0c0.2-0.1,0.2-0.3,0.2-0.5
	C54.9,56.7,54.6,56.6,54.4,56.6z"/>
<path class="st4" d="M54.1,57.7c0.3,0,0.7,0.2,0.7,0.4s-0.2,0.3-0.5,0.3s-0.7-0.4-0.6-0.6S54.1,57.7,54.1,57.7z"/>
<path class="st4" d="M55.1,57.4c0.1-0.2,0.3-0.3,0.4-0.2s0.1,0.3,0,0.4s-0.2,0.3-0.4,0.2C55,57.7,55,57.5,55.1,57.4z"/>
<rect x="40.3" y="56.4" transform="matrix(9.999500e-03 -0.9999 0.9999 9.999500e-03 -14.7439 98.3243)" class="st5" width="4" height="0.5"/>
<polygon class="st6" points="42.1,56.3 42.6,56.1 42.6,54.8 42.1,54.8 "/>
<path class="st7" d="M47.6,49.9c-0.1-0.6-0.5-1.1-1-1.4c0.6-0.4,1-1,0.9-1.4s-1.1-0.9-2.2-0.9c0.7-0.2,1.2-0.5,1.3-0.9
	c0.1-0.8-1.7-1.9-3.2-2.1c-0.4-0.1-0.8,0-1.2,0.2c-0.5,0.2-1.1,0.8-1.1,1.3c0,0.1,0,0.2,0,0.3c-0.4,0-0.7,0.2-1,0.4
	c-0.6,0.4-1,1-1,1.7c0.1,0.3,0.2,0.5,0.5,0.7c-0.9,0.5-1.5,1.4-1.5,2.5c0.2,0.8,0.8,1.4,1.5,1.6c-0.4,0.3-0.6,0.8-0.6,1.4
	c0.2,1.1,2.1,1.7,3.5,1.7c1.6,0,3.5-0.9,3.5-1.8c0-0.4-0.3-0.8-0.8-1.1C46.6,51.4,47.5,50.7,47.6,49.9z"/>
<polygon class="st5" points="62.8,62.3 62.3,62.2 62.7,55.4 63.2,55.4 "/>
<polygon class="st6" points="62.6,57.1 63.1,56.9 63.1,55.6 62.7,55.6 "/>
<path class="st7" d="M66.6,53.1c0.6-0.2,1-0.6,1.2-1.2c0.2-0.7-0.3-1.5-1.2-2.2c0.5-0.3,0.9-0.7,0.9-1.1s-0.5-0.9-1.2-1.2
	c0.3-0.2,0.5-0.5,0.5-0.9c0-1.1-2.5-2-4.3-2c-0.5,0-1,0.1-1.5,0.4c-0.7,0.4-1.1,1.1-1.1,1.9c0.1,0.3,0.2,0.5,0.4,0.7
	c-0.1,0-0.3,0.1-0.4,0.1c-1,0.4-2.2,1.3-2.3,2.4c0,0.8,0.4,1.6,1.1,2c-0.5,0.3-0.9,0.8-1,1.4c-0.1,1.2,1.9,2.3,3.4,2.6
	c1.1,0.2,2.3,0.1,3.3-0.3c1.3,0.4,3,0.3,3.3-0.5C68,54.6,67.4,53.7,66.6,53.1z"/>
<path class="st8" d="M88,76.5c-7.5-7.3-16.6-12.9-26.5-16.2c-21.8-7-43.2,1.5-54.3,11.8C4.4,74.6,2,77.5,0,80.7V88h88V76.5z"/>
<path class="st3" d="M35.3,57.8c0.1-0.1,0.2-0.2,0.2-0.3c0.1-0.6-1.3-1.3-2.4-1.4c-0.3,0-0.6,0-0.9,0.2c-0.4,0.2-0.8,0.6-0.8,1
	c0,0.2,0.2,0.4,0.4,0.6c-0.2,0-0.5,0.1-0.7,0.1c-0.2,0-0.4,0.1-0.6,0.2c-0.3-0.1-0.6-0.1-0.9-0.2c-0.3,0-0.6,0-0.9,0.2
	c-0.4,0.2-0.7,0.6-0.8,1c0,0.2,0.2,0.5,0.4,0.6c-0.2,0-0.5,0.1-0.7,0.1c-0.3,0.1-0.6,0.2-0.8,0.4c-0.3,0.3-0.5,0.8-0.4,1.2
	c0.2,0.6,1.4,0.6,2.2,0.4c0.4-0.1,0.7-0.3,1.1-0.5c0.4,0.2,0.8,0.3,1.2,0.3c0.9,0,2-0.4,2.1-0.9c0-0.3-0.3-0.6-0.8-0.9
	c0.3-0.1,0.6-0.3,0.9-0.5c0.4,0.2,0.8,0.3,1.2,0.3c0.9,0,2-0.4,2.1-0.9S36,58,35.3,57.8z"/>
<path class="st4" d="M33.3,57.1c-0.2,0.1-0.2,0.4-0.1,0.6c0.2,0.2,0.4,0.2,0.6,0.1c0,0,0,0,0.1-0.1c0.1-0.2,0.1-0.5-0.1-0.6
	C33.7,57,33.5,57,33.3,57.1L33.3,57.1z"/>
<path class="st4" d="M33.5,58.2c0.3-0.1,0.7-0.1,0.8,0.1s-0.1,0.4-0.3,0.5s-0.8-0.1-0.8-0.3S33.4,58.2,33.5,58.2z"/>
<path class="st4" d="M34.3,57.5c0-0.2,0.2-0.4,0.3-0.3s0.2,0.2,0.2,0.3s-0.1,0.3-0.2,0.3S34.3,57.7,34.3,57.5z"/>
<path class="st3" d="M9.3,69.2c0-0.1,0-0.3,0-0.4c-0.2-0.6-1.8-0.5-2.8-0.1C6.2,68.8,6,69,5.8,69.3c-0.3,0.4-0.3,0.8-0.2,1.3
	c0.1,0.2,0.4,0.3,0.6,0.3C6,71,5.9,71.1,5.7,71.3c-0.2,0.1-0.3,0.3-0.4,0.5C5,71.8,4.7,71.9,4.5,72c-0.3,0.1-0.5,0.3-0.7,0.6
	c-0.3,0.4-0.4,0.8-0.2,1.3c0.1,0.2,0.4,0.3,0.6,0.3c-0.2,0.1-0.4,0.3-0.6,0.4c-0.2,0.2-0.4,0.5-0.5,0.7c-0.2,0.4-0.1,0.9,0.2,1.3
	C3.9,77,4.9,76.5,5.5,76c0.3-0.3,0.5-0.6,0.7-1c0.4,0,0.8-0.1,1.2-0.3c0.8-0.4,1.6-1.3,1.4-1.8c-0.1-0.3-0.6-0.4-1.1-0.4
	c0.2-0.2,0.4-0.5,0.5-0.8c0.4,0,0.8-0.1,1.2-0.3c0.8-0.4,1.6-1.3,1.4-1.8S10,69.1,9.3,69.2z"/>
<path class="st4" d="M7.2,69.5c-0.1,0.2,0,0.5,0.2,0.6C7.7,70.1,7.9,70,8,69.8c0,0,0,0,0,0c0-0.2-0.2-0.4-0.4-0.5
	C7.4,69.2,7.3,69.3,7.2,69.5L7.2,69.5z"/>
<path class="st4" d="M7.8,70.4c0.2-0.3,0.6-0.4,0.7-0.3s0.1,0.4,0,0.6S7.8,71,7.7,70.8S7.8,70.4,7.8,70.4z"/>
<path class="st4" d="M8.2,69.5c-0.1-0.2,0-0.4,0.1-0.4s0.2,0.1,0.3,0.2s0.1,0.3-0.1,0.4S8.3,69.6,8.2,69.5z"/>
<path class="st3" d="M84.9,72.2c0.1,0,0.3,0,0.4-0.1c0.5-0.3,0.2-1.8-0.4-2.7c-0.2-0.3-0.4-0.5-0.7-0.6c-0.4-0.2-0.9-0.2-1.3,0
	c-0.2,0.2-0.2,0.4-0.2,0.7c-0.2-0.2-0.3-0.3-0.5-0.5c-0.2-0.1-0.3-0.2-0.5-0.3c-0.1-0.3-0.2-0.5-0.4-0.8c-0.2-0.3-0.4-0.5-0.7-0.6
	c-0.4-0.2-0.9-0.2-1.3,0c-0.2,0.2-0.3,0.4-0.2,0.7c-0.2-0.2-0.3-0.4-0.5-0.5c-0.2-0.2-0.5-0.3-0.8-0.3c-0.4-0.1-0.9,0.1-1.2,0.4
	c-0.3,0.6,0.4,1.5,1,2c0.3,0.2,0.7,0.4,1.1,0.5c0.1,0.4,0.3,0.8,0.5,1.1c0.5,0.7,1.5,1.4,2,1.1c0.3-0.2,0.3-0.6,0.2-1.2
	c0.3,0.2,0.6,0.3,0.9,0.4c0.1,0.4,0.3,0.8,0.5,1.1c0.5,0.7,1.5,1.4,2,1.1S85.1,73,84.9,72.2z"/>
<path class="st4" d="M84.2,70.3c-0.2-0.1-0.5,0.1-0.5,0.3c0,0.2,0.1,0.5,0.4,0.5c0,0,0.1,0,0.1,0c0.2,0,0.3-0.1,0.4-0.3
	C84.6,70.6,84.5,70.3,84.2,70.3z"/>
<path class="st4" d="M83.5,71c0.3,0.1,0.5,0.5,0.4,0.7s-0.4,0.2-0.6,0.1S82.9,71.1,83,71S83.4,71,83.5,71z"/>
<path class="st4" d="M84.4,71.3c0.1-0.1,0.4-0.1,0.5,0s0,0.3-0.2,0.3s-0.3,0.1-0.4,0S84.3,71.4,84.4,71.3z"/>
<path class="st3" d="M21.8,62c0.1-0.1,0.1-0.2,0.1-0.4c-0.1-0.6-1.7-0.8-2.7-0.5c-0.3,0.1-0.6,0.2-0.8,0.4c-0.3,0.3-0.5,0.8-0.4,1.2
	c0.1,0.2,0.3,0.4,0.5,0.4c-0.2,0.1-0.4,0.2-0.6,0.3c-0.3,0.2-0.5,0.4-0.6,0.7c-0.2,0.4-0.2,0.9,0,1.3c0.4,0.5,1.5,0.2,2.2-0.3
	c0.3-0.2,0.6-0.5,0.8-0.8c0.4,0,0.8,0,1.2-0.1c0.9-0.2,1.8-1,1.7-1.5S22.5,62.1,21.8,62z"/>
<path class="st4" d="M20.3,61.7c-0.2,0.1-0.2,0.4-0.1,0.5c0.1,0.2,0.4,0.2,0.6,0c0,0,0,0,0,0c0.1-0.1,0.1-0.3,0-0.4
	C20.7,61.6,20.5,61.6,20.3,61.7z"/>
<path class="st4" d="M21.1,62.1c0-0.2,0.2-0.3,0.3-0.3s0.2,0.2,0.2,0.3s-0.1,0.3-0.2,0.3S21.1,62.2,21.1,62.1z"/>
<polygon class="st5" points="24.6,64.6 24,64.6 22.9,54.3 23.5,54.3 "/>
<polygon class="st6" points="23.1,56.6 23.8,56.3 23.6,54.5 22.9,54.7 "/>
<path class="st7" d="M27.5,50.5c0.7-0.4,1.2-1,1.4-1.8c0.1-0.9-0.8-1.9-2.1-2.7c0.6-0.5,1.1-1.1,1-1.7S27,43.2,26,43
	c0.3-0.3,0.5-0.8,0.5-1.2c-0.2-1.4-3.7-2.2-6.1-1.7c-0.7,0.1-1.3,0.4-1.9,0.9c-0.8,0.7-1.2,1.7-1.1,2.7c0.1,0.3,0.4,0.6,0.7,0.8
	c-0.2,0.1-0.3,0.1-0.5,0.2c-1.2,0.7-2.7,2.1-2.6,3.6c0.2,1,0.9,1.9,1.9,2.4c-0.6,0.5-1,1.2-1,2c0.1,1.7,3,2.7,5,2.7
	c1.5,0,3-0.3,4.4-1.1c1.8,0.3,4-0.3,4.2-1.3C29.8,52.1,28.8,51.2,27.5,50.5z"/>
<rect x="12.4" y="67.8" transform="matrix(0.9845 -0.1755 0.1755 0.9845 -12.0612 3.3094)" class="st5" width="0.5" height="4"/>
<polygon class="st6" points="12.4,69.6 12.8,69.3 12.6,68 12.1,68.2 "/>
<path class="st7" d="M16.6,62.3c-0.1-0.5-0.5-0.9-1.2-1.2c0.5-0.6,0.8-1.2,0.6-1.6s-1.3-0.7-2.3-0.5c0.6-0.3,1.1-0.7,1.1-1.2
	c0-0.9-2-1.6-3.5-1.5c-0.4,0-0.8,0.1-1.2,0.4c-0.5,0.3-0.9,0.9-0.9,1.5c0,0.1,0,0.2,0.1,0.3c-0.4,0.1-0.7,0.3-0.9,0.6
	c-0.6,0.5-0.8,1.2-0.6,1.9c0.1,0.3,0.3,0.5,0.6,0.6c-0.8,0.7-1.2,1.7-1,2.7c0.3,0.7,1,1.2,1.8,1.3C8.9,66,8.8,66.5,8.9,67
	c0.4,1.1,2.4,1.3,3.8,1c1.5-0.3,3.3-1.5,3.1-2.5c-0.1-0.4-0.4-0.7-1-0.9C16,63.9,16.8,63,16.6,62.3z"/>
<path class="st9" d="M78.4,82.3c0,0,0.7,0.7,0.3,2.6"/>
<path class="st10" d="M78.8,84.1c0-0.4,0.2-0.7,0.5-0.8c0.1,0.3-0.1,0.7-0.4,0.8C78.9,84,78.9,84,78.8,84.1z"/>
<path class="st10" d="M78.8,83.5c-0.3,0.1-0.7,0-0.9-0.3c0.3-0.2,0.7-0.1,0.8,0.2C78.7,83.4,78.8,83.4,78.8,83.5z"/>
<path class="st11" d="M78.4,81.5c0,0,0.7-1.3,1.4-0.6s-1.2,1-1.2,1s1.6-0.4,1.3,0.4s-1.6,0.1-1.6,0.1s0.1,1.2-1.3,0.7s0.9-1,0.9-1
	s-1.4,0.5-1.2-0.2s1.2-0.2,1.2-0.2s-1.2-0.8-0.6-1C78.4,80.3,78.4,81.5,78.4,81.5z"/>
<path class="st10" d="M78.2,81.7c-0.1,0.1-0.1,0.2-0.1,0.3c0.1,0.1,0.2,0.1,0.4,0c0,0,0,0,0,0c0.1-0.1,0.1-0.2,0-0.3
	C78.4,81.6,78.3,81.6,78.2,81.7z"/>
<path class="st9" d="M83,75.8c0,0,0.7,0.7,0.3,2.6"/>
<path class="st10" d="M83.4,77.5c0-0.4,0.2-0.7,0.5-0.8c0.1,0.3-0.1,0.7-0.4,0.8C83.5,77.5,83.5,77.5,83.4,77.5z"/>
<path class="st10" d="M83.4,77c-0.3,0.1-0.7,0-0.9-0.3c0.3-0.2,0.7-0.1,0.8,0.2C83.4,76.9,83.4,76.9,83.4,77z"/>
<path class="st11" d="M83,74.9c0,0,0.7-1.3,1.4-0.6s-1.2,1-1.2,1s1.6-0.4,1.3,0.4S83,75.9,83,75.9s0.1,1.2-1.3,0.7s0.9-1,0.9-1
	s-1.4,0.5-1.2-0.2s1.2-0.1,1.2-0.1s-1.2-0.8-0.6-1C83.1,73.7,83,74.9,83,74.9z"/>
<path class="st10" d="M82.8,75.2c-0.1,0.1-0.1,0.2-0.1,0.3c0.1,0.1,0.3,0.1,0.4,0c0,0,0,0,0,0c0.1-0.1,0.1-0.2,0-0.3
	C83,75.1,82.9,75.1,82.8,75.2C82.8,75.2,82.8,75.2,82.8,75.2z"/>
<path class="st9" d="M21.9,71.4c0,0,0.7,0.7,0.3,2.6"/>
<path class="st10" d="M22.3,73.1c0-0.4,0.2-0.7,0.5-0.8c0.1,0.3-0.1,0.7-0.4,0.8C22.4,73.1,22.4,73.1,22.3,73.1z"/>
<path class="st10" d="M22.3,72.6c-0.3,0.1-0.7,0-0.9-0.4c0.3-0.2,0.7-0.1,0.8,0.2C22.3,72.5,22.3,72.5,22.3,72.6z"/>
<path class="st11" d="M21.9,70.6c0,0,0.7-1.3,1.4-0.6s-1.2,1-1.2,1s1.6-0.4,1.3,0.4s-1.6,0.1-1.6,0.1s0.1,1.2-1.3,0.7s0.9-1,0.9-1
	s-1.4,0.4-1.1-0.2s1.1-0.2,1.1-0.2s-1.2-0.8-0.6-1C22,69.3,21.9,70.6,21.9,70.6z"/>
<path class="st10" d="M21.7,70.8c-0.1,0.1-0.1,0.2-0.1,0.3c0.1,0.1,0.2,0.1,0.3,0c0,0,0,0,0,0c0.1-0.1,0.1-0.2,0-0.3
	C21.9,70.7,21.8,70.7,21.7,70.8z"/>
<path class="st9" d="M59.8,78.6c0,0,0.7,0.7,0.3,2.6"/>
<path class="st10" d="M60.3,80.3c0-0.4,0.2-0.7,0.5-0.8c0.1,0.3-0.1,0.7-0.4,0.8C60.4,80.3,60.3,80.3,60.3,80.3z"/>
<path class="st10" d="M60.2,79.8c-0.3,0.1-0.7,0-0.9-0.3c0.3-0.2,0.6-0.1,0.8,0.2C60.2,79.7,60.2,79.7,60.2,79.8z"/>
<path class="st11" d="M59.9,77.8c0,0,0.7-1.3,1.5-0.6s-1.2,1-1.2,1s1.6-0.4,1.3,0.4s-1.6,0.1-1.6,0.1s0.1,1.2-1.3,0.7s0.9-1,0.9-1
	s-1.4,0.4-1.2-0.2s1.2-0.1,1.2-0.1s-1.2-0.8-0.6-1C59.9,76.5,59.9,77.8,59.9,77.8z"/>
<path class="st10" d="M59.7,78c-0.1,0.1-0.1,0.2-0.1,0.3c0.1,0.1,0.3,0.1,0.4,0c0,0,0,0,0,0c0.1-0.1,0.1-0.2,0-0.3
	C59.9,77.9,59.7,77.9,59.7,78z"/>
<path class="st12" d="M49.3,62.7c5.1-1.2,9.2-1.7,11.8-2.1l-1.2-0.4c-0.9-0.3-1.9-0.6-2.8-0.8c-3.2,0-6.3,0.2-9.5,0.7
	c-9.5,1.4-18.2,4.8-18,6.2s10.9,0.2,11.2,2.1c0.3,1.6-10.1,3.8-12,4.4C12.6,77.6,8.9,79.3,7.7,83.2c-0.6,2,0.2,3.5,3,4.8h40.5
	c-8.3-0.9-25.3-2.4-25.4-6.5c-0.1-5.5,30.3-9.9,29.7-12.7c-0.4-1.8-12.5-2.6-12.6-3.8C42.9,64.7,43.2,64.1,49.3,62.7z"/>
<path class="st12" d="M52.6,62.7c4.3-1,7.9-1.5,10.5-1.9l-1.5-0.5c-1-0.3-2-0.6-3-0.8c-2.6,0.1-5.2,0.3-7.7,0.7
	c-9.5,1.4-18.2,4.8-18,6.2s10.9,0.2,11.2,2.1c0.3,1.6-10.1,3.8-12,4.4c-16.2,4.8-19.9,6.5-21.1,10.4c-0.6,2,0.2,3.5,3,4.8h40.5
	c-8.3-0.9-25.2-2.4-25.4-6.5c-0.1-5.5,30.3-9.9,29.7-12.7c-0.4-1.8-12.5-2.6-12.6-3.8C46.1,64.7,46.5,64.1,52.6,62.7z"/>
<path class="st13" d="M51,62.7c5-1.2,9.1-1.7,11.7-2.1l-1.2-0.4c-0.9-0.3-1.9-0.6-2.8-0.8c-3.2,0-6.3,0.2-9.5,0.7
	c-9.5,1.4-18.2,4.8-18,6.2s10.9,0.2,11.2,2.1c0.3,1.6-10.1,3.8-12,4.4c-16.2,4.8-19.9,6.5-21.1,10.4c-0.6,2,0.2,3.5,3,4.8h40.5
	c-8.3-0.9-25.3-2.4-25.4-6.5c-0.1-5.5,30.3-9.9,29.7-12.7c-0.4-1.8-12.5-2.6-12.6-3.8C44.5,64.7,44.9,64.1,51,62.7z"/>
<path class="st14" d="M38.9,73.3c-0.5,0.3-0.7,0.8-0.7,1.3c0.2,0.7,1.5,1,2.5,0.9s2.3-0.8,2.3-1.4s-1.8-1.3-3-1.2
	C39.6,73,39.2,73.1,38.9,73.3z"/>
<path class="st15" d="M42.7,74.6c-0.5,0-0.9,0-1.4,0c-1,0.1-1.3,0.4-1.7,0.1s-0.5-0.9-0.6-1.6c-0.1,0-0.2,0.1-0.2,0.1
	c-0.5,0.3-0.7,0.8-0.7,1.3c0.2,0.7,1.5,1,2.5,0.9C41.4,75.5,42.2,75.2,42.7,74.6z"/>
<path class="st14" d="M45.2,64c-0.3,0.2-0.6,0.7-0.5,1c0.1,0.6,1.2,0.8,1.9,0.7s1.8-0.6,1.8-1.1s-1.4-1-2.4-0.9
	C45.6,63.7,45.4,63.8,45.2,64z"/>
<path class="st15" d="M48.1,65c-0.4,0-0.7,0-1.1,0c-0.8,0-1,0.3-1.3,0.1s-0.4-0.8-0.4-1.2c-0.1,0-0.1,0.1-0.2,0.1
	c-0.3,0.2-0.6,0.7-0.5,1c0.1,0.6,1.2,0.8,1.9,0.7C47.1,65.6,47.7,65.4,48.1,65z"/>
<path class="st14" d="M48.3,59.4c-0.3,0.2-0.4,0.4-0.4,0.7c0.1,0.4,0.9,0.6,1.4,0.5s1.3-0.5,1.3-0.8s-1-0.7-1.7-0.7
	C48.6,59.3,48.4,59.3,48.3,59.4z"/>
<path class="st15" d="M50.4,60.2c-0.3,0-0.5,0-0.8,0c-0.6,0-0.7,0.2-0.9,0.1s-0.3-0.5-0.3-0.9l-0.1,0.1c-0.3,0.2-0.4,0.4-0.4,0.7
	c0.1,0.4,0.9,0.6,1.4,0.5C49.7,60.7,50.1,60.5,50.4,60.2z"/>
<path class="st16" d="M18.2,81.2c0,0,3.2-2.2,6,1.4C24.2,82.6,20.5,84.9,18.2,81.2z"/>
<path class="st11" d="M22.6,81.1c-0.2,0.4-0.3,0.8-0.3,1.2c0,0.3,0,0.7,0,1c0.7-0.1,1.4-0.3,2-0.7C23.8,81.9,23.2,81.4,22.6,81.1z"
	/>
<path class="st16" d="M18.3,81.2L18.3,81.2c-0.8-0.7-2-0.9-2.9-0.3c0.4,0.7,1.1,1,1.9,0.7c-0.5,0.4-0.9,1-1,1.7
	C16.2,83.3,17.9,83.8,18.3,81.2L18.3,81.2L18.3,81.2z"/>
<path class="st16" d="M21.6,81.1c0.4-0.6,0.2-1.4-0.4-1.8c-0.1-0.1-0.2-0.1-0.3-0.2c-0.4,0.7-0.2,1.5,0.5,1.9
	C21.5,81,21.6,81.1,21.6,81.1z"/>
<path class="st16" d="M21.1,82.7c-0.8-0.4-1.7-0.2-2.2,0.5c0.6,0.5,1.4,0.5,1.9-0.1C21,82.9,21.1,82.8,21.1,82.7z"/>
<path class="st17" d="M23.1,82.2c-0.1-0.1-0.2-0.1-0.3-0.1c0,0,0,0.1,0,0.1s0-0.1,0,0s0,0.2-0.1,0.3c-0.1,0-0.2-0.1-0.3-0.3
	c-0.1-0.2,0-0.4,0.2-0.5c0.2-0.1,0.4,0,0.5,0.1C23.3,82,23.3,82.1,23.1,82.2z"/>
<path class="st18" d="M22,81.3c-0.1-0.1-0.3-0.2-0.4-0.1s0,0.1,0,0.1c0,0,0.1,0,0.1,0l0,0v0.2c-0.1,0-0.1,0-0.2,0c0,0,0,0-0.1,0l0,0
	c0.1,0.1,0.2,0.2,0.4,0.2c-0.2,0.1-0.4,0-0.5-0.2c-0.1,0-0.1-0.1,0-0.2c0,0,0,0,0,0c0,0,0.1-0.1,0.1-0.1c0.1,0,0.2,0,0.3,0
	c0.1,0,0.1,0.1,0.1,0.1c0,0.1-0.1,0.1-0.1,0.1c0,0,0,0,0,0l0,0c-0.1,0-0.2-0.1-0.3-0.2c-0.1-0.1,0-0.3,0.1-0.3c0,0,0,0,0,0
	c0.1,0,0.2,0,0.3,0.1C21.9,81.2,21.9,81.3,22,81.3z"/>
<path class="st18" d="M20.5,81.2c-0.1-0.1-0.3-0.2-0.4-0.1s0,0.1,0,0.1c0,0,0.1,0,0.1,0l0,0v0.2H20h-0.1l0,0
	c0.1,0.1,0.2,0.2,0.4,0.2c-0.2,0-0.3,0-0.5-0.2c-0.1-0.1-0.1-0.1,0-0.2c0,0,0,0,0,0c0,0,0.1-0.1,0.2-0.1h0.3c0.1,0,0.1,0.1,0.1,0.1
	c0,0,0,0,0,0c0,0.1-0.1,0.1-0.1,0.1c0,0,0,0,0,0l0,0c-0.1,0-0.2-0.1-0.3-0.2c-0.1-0.1,0-0.2,0.1-0.3c0,0,0,0,0,0
	c0.1,0,0.2,0,0.3,0.1C20.4,81.1,20.4,81.1,20.5,81.2z"/>
<path class="st18" d="M17.3,82.1c-0.1,0.1-0.3,0.2-0.4,0.3s0.1,0.1,0.1,0.1c0,0,0.1-0.1,0.1-0.1l0,0l0.2,0.2l-0.2,0.1c0,0,0,0,0,0.1
	l0,0c0.1,0.1,0.3,0,0.4-0.1c-0.1,0.2-0.2,0.3-0.4,0.2c-0.1,0-0.1-0.1-0.1-0.1c0-0.1,0-0.1,0-0.2c0-0.1,0.1-0.1,0.2-0.2
	c0,0,0.1,0,0.2,0c0,0,0,0,0,0c0,0.1,0,0.1,0,0.2l0,0c-0.1,0.1-0.2,0.1-0.3,0.1c-0.1,0-0.2-0.1-0.2-0.3c0,0,0,0,0,0
	c0.1-0.1,0.1-0.1,0.2-0.2L17.3,82.1z"/>
<path class="st18" d="M21,82.2c-0.1-0.1-0.3-0.2-0.4-0.1s0,0.1,0,0.1c0,0,0.1,0,0.1,0l0,0v0.2h-0.2h-0.1l0,0
	c0.1,0.1,0.2,0.2,0.4,0.2c-0.2,0-0.4,0-0.5-0.2c-0.1-0.1-0.1-0.1,0-0.2c0,0,0,0,0,0c0,0,0.1-0.1,0.1-0.1c0.1,0,0.2,0,0.3,0
	c0.1,0,0.1,0.1,0.1,0.1l0,0c0,0.1-0.1,0.1-0.1,0.1c0,0,0,0,0,0l0,0c-0.1,0-0.2-0.1-0.3-0.2c-0.1-0.1,0-0.2,0.1-0.3c0,0,0,0,0,0
	c0.1,0,0.2,0,0.3,0.1C20.9,82.2,20.9,82.2,21,82.2z"/>
<path class="st16" d="M38.3,64c1.2-0.7,2.7-0.4,3.4,0.7c0,0,0,0.1,0.1,0.1c-1.1,0.7-2.7,0.4-3.4-0.7C38.4,64.1,38.4,64,38.3,64z"/>
<path class="st11" d="M40.9,64c-0.1,0.2-0.2,0.4-0.2,0.7c0,0.2,0,0.4,0,0.6c0.4-0.1,0.8-0.2,1.2-0.4C41.6,64.5,41.3,64.2,40.9,64z"
	/>
<path class="st16" d="M38.4,64.1L38.4,64.1c-0.5-0.4-1.2-0.5-1.7-0.2c0.2,0.4,0.7,0.6,1.1,0.4c-0.3,0.3-0.5,0.6-0.6,1
	C37.2,65.3,38.1,65.6,38.4,64.1L38.4,64.1L38.4,64.1z"/>
<path class="st16" d="M40.3,64c0.2-0.4,0.2-0.8-0.2-1.1c-0.1,0-0.1-0.1-0.2-0.1c-0.2,0.4-0.1,0.9,0.3,1.1C40.2,64,40.3,64,40.3,64z"
	/>
<path class="st16" d="M40,64.9c-0.4-0.2-1-0.1-1.3,0.3c0.3,0.3,0.8,0.3,1.1,0C39.9,65.1,40,65,40,64.9z"/>
<path class="st17" d="M41.2,64.7c-0.1,0-0.2-0.1-0.2,0s0.1,0.1,0.1,0.1s0.1-0.1,0-0.1s-0.1,0.1-0.1,0.2c-0.1,0-0.2-0.1-0.2-0.2
	c-0.1-0.1,0-0.3,0.2-0.4c0.1-0.1,0.3,0,0.4,0.1C41.3,64.5,41.3,64.6,41.2,64.7z"/>
<path class="st18" d="M40.5,64.1c-0.1,0-0.2-0.1-0.2,0s0,0,0,0l0,0l0,0v0.2h-0.1l0,0c0,0,0-0.1,0,0c0,0.1,0.1,0.1,0.2,0.1
	c-0.1,0-0.2,0-0.3-0.1c0,0,0-0.1,0-0.2c0,0,0.1,0,0.1-0.1h0.2c0.1,0,0.1,0.1,0.1,0.1c0,0.1,0,0.1-0.1,0.1c0,0,0,0,0,0l0,0
	c-0.1,0-0.2-0.1-0.2-0.1c0-0.1,0-0.2,0.1-0.2c0,0,0,0,0,0C40.4,64,40.5,64.1,40.5,64.1z"/>
<path class="st18" d="M39.7,64c-0.1,0-0.2-0.1-0.2,0s0,0,0,0l0,0l0,0v0.2h-0.1l0,0c0,0,0-0.1,0,0c0,0.1,0.1,0.1,0.2,0.2
	c-0.1,0-0.2,0-0.3-0.1c0,0,0-0.1,0-0.2h0.1h0.2c0.1,0,0.1,0,0.1,0.1c0,0.1-0.1,0.1-0.1,0.1l0,0c-0.1,0-0.2,0-0.2-0.1
	c0-0.1,0-0.2,0.1-0.2c0,0,0,0,0,0C39.5,63.9,39.6,64,39.7,64z"/>
<path class="st18" d="M37.8,64.6c-0.1,0-0.2,0.1-0.2,0.2s0,0,0,0l0,0l0,0l0.2,0.2l-0.1,0.1l0,0l0,0c0.1,0.1,0.2,0.1,0.2,0
	c0,0.1-0.1,0.2-0.2,0.2c-0.1,0-0.1,0-0.1-0.1c0,0,0,0,0,0c0,0,0-0.1,0-0.1l0.1-0.1c0.1,0,0.1,0,0.2,0c0,0,0,0.1,0,0.2c0,0,0,0,0,0
	l0,0C37.7,65,37.7,65,37.6,65c-0.1,0-0.1-0.1-0.1-0.2c0,0,0,0,0,0C37.6,64.6,37.7,64.6,37.8,64.6z"/>
<path class="st18" d="M40,64.7c-0.1,0-0.2-0.1-0.2,0s0,0.1,0,0s0,0,0,0l0,0v0.2h-0.1l0,0l0,0c0,0.1,0.1,0.1,0.2,0.1
	c-0.1,0-0.2,0-0.3-0.1c0,0,0-0.1,0-0.2c0,0,0,0,0,0c0,0,0.1,0,0.1,0h0.2c0.1,0,0.1,0.1,0.1,0.1c0,0.1,0,0.1-0.1,0.1c0,0,0,0,0,0l0,0
	c-0.1,0-0.2,0-0.2-0.1c0-0.1,0-0.2,0.1-0.2c0,0,0,0,0,0C39.8,64.5,39.9,64.6,40,64.7z"/>
<path class="st16" d="M44.6,60.7c-1,0-1.9,0.7-1.9,1.7c0,0,0,0,0,0.1c1,0.1,1.8-0.7,1.9-1.7C44.6,60.7,44.6,60.7,44.6,60.7z"/>
<path class="st11" d="M43,61.6c0.1,0.1,0.3,0.2,0.4,0.3c0.1,0.1,0.2,0.2,0.2,0.4c-0.3,0.1-0.6,0.2-0.9,0.2
	C42.8,62.2,42.8,61.9,43,61.6z"/>
<path class="st16" d="M44.6,60.7L44.6,60.7c0.1-0.4,0.5-0.7,1-0.7c0,0.3-0.2,0.6-0.5,0.7c0.3,0,0.5,0.2,0.7,0.4
	C45.8,61,45.3,61.5,44.6,60.7L44.6,60.7L44.6,60.7z"/>
<path class="st16" d="M43.3,61.4c-0.3-0.1-0.4-0.5-0.3-0.8c0,0,0.1-0.1,0.1-0.1C43.4,60.7,43.5,61,43.3,61.4
	C43.4,61.3,43.3,61.4,43.3,61.4z"/>
<path class="st16" d="M43.8,61.8c0.2-0.3,0.6-0.4,0.9-0.3c-0.1,0.3-0.4,0.5-0.7,0.4C43.9,61.9,43.9,61.9,43.8,61.8z"/>
<path class="st17" d="M43,62.1c-0.1,0-0.2-0.1-0.2-0.2c0-0.1,0.1-0.3,0.3-0.3c0.2,0,0.3,0.2,0.3,0.2c0,0.1-0.1,0.2-0.2,0.2
	C43.1,62.1,43.1,62.1,43,62.1C42.9,62.1,43,62.2,43,62.1c0.2,0.1,0.2,0,0.2,0S43.1,62,43,62.1z"/>
<path class="st18" d="M43.2,61.5c0-0.1,0-0.1,0.1-0.2s0.2,0,0.2,0.1c0,0.1,0,0.1-0.1,0.2l0,0C43.4,61.7,43.3,61.7,43.2,61.5
	C43.2,61.6,43.2,61.5,43.2,61.5L43.2,61.5l0.2-0.1h0.1c0,0,0.1,0.1,0.1,0.1c0,0.1-0.1,0.1-0.2,0.2c0,0,0-0.1,0-0.2l0,0l0,0v0.1
	l-0.1-0.2l0,0l0,0l0,0C43.2,61.4,43.3,61.5,43.2,61.5z"/>
<path class="st18" d="M43.8,61.2c0-0.1,0-0.2,0.1-0.2c0.1,0,0.2,0,0.2,0.1c0,0,0,0,0,0c0,0.1,0,0.1-0.1,0.2l0,0
	C43.9,61.3,43.8,61.3,43.8,61.2C43.8,61.3,43.8,61.3,43.8,61.2C43.7,61.2,43.7,61.1,43.8,61.2C43.8,61.1,43.8,61.1,43.8,61.2
	L43.8,61.2l0.1-0.1H44c0.1,0,0.1,0.1,0.1,0.1c0,0.1-0.1,0.1-0.2,0.2c0,0,0-0.1,0-0.2l0,0l0,0v0.1L43.8,61l0,0l0,0l0,0
	C43.8,61,43.8,61.1,43.8,61.2z"/>
<path class="st18" d="M45.1,60.8c0.1,0,0.2,0,0.2,0c0.1,0.1,0.1,0.1,0,0.2c0,0,0,0,0,0c-0.1,0-0.1,0-0.2,0l0,0
	C45.1,61,45.1,60.9,45.1,60.8c0,0,0.1,0,0.1,0l0,0l0.1,0.1c0,0,0.1,0,0.1,0.1c0,0,0,0.1,0,0.1c-0.1,0.1-0.2,0.1-0.2,0
	c0.1,0,0.1,0,0.2-0.1c0,0,0,0,0,0s0,0,0,0h-0.1l0.1-0.2l0,0l0,0l0,0C45.4,60.8,45.2,60.8,45.1,60.8z"/>
<path class="st18" d="M43.8,61.7c0-0.1,0-0.2,0.1-0.2c0.1,0,0.2,0,0.2,0.1c0,0,0,0,0,0c0,0.1,0,0.1-0.1,0.2l0,0
	C43.9,61.8,43.9,61.8,43.8,61.7C43.8,61.7,43.8,61.6,43.8,61.7C43.8,61.6,43.8,61.6,43.8,61.7L43.8,61.7l0.1-0.1c0,0,0.1,0,0.1,0
	c0.1,0,0.1,0.1,0.1,0.1c0,0.1-0.1,0.1-0.2,0.2c0.1,0,0.1-0.1,0-0.2l0,0l0,0c0,0,0,0,0,0.1l-0.1-0.2l0,0l0,0l0,0
	C43.8,61.6,43.8,61.6,43.8,61.7z"/>
<path class="st19" d="M44.3,68.2c-0.1,0-0.5,0.2-0.5,0.3c0,0.3,1.7,0.6,1.9,0.2c0.1-0.2-0.2-0.4-0.3-0.5
	C45,68.1,44.6,68.1,44.3,68.2z"/>
<path class="st13" d="M44.5,68.2c-0.1,0-0.4,0.1-0.4,0.2s1.2,0.4,1.3,0.2s-0.1-0.3-0.2-0.3C45,68.2,44.8,68.1,44.5,68.2z"/>
<path class="st19" d="M44.5,69.1c0.2-0.2,0.5-0.3,0.8-0.3c0.2,0,0.4-0.1,0.6-0.1l0,0c0,0-0.1,0.1-0.1,0.2l0,0c0,0,0,0,0-0.1
	c-0.1-0.2-0.2-0.5-0.3-0.7c0.3-0.1,0.6,0,0.9,0.2c0.1,0.1,0.2,0.1,0.2,0.2c0.1,0.1,0.1,0.2,0.1,0.4c0,0.2-0.1,0.4-0.2,0.5
	c-0.1,0.1-0.2,0.2-0.4,0.2c-0.3,0.1-0.6,0-0.9-0.1C44.9,69.5,44.7,69.3,44.5,69.1z"/>
<path class="st19" d="M14.2,84.9c0.2-0.2,0.4-0.3,0.6-0.4c0.2-0.1,0.3-0.1,0.5-0.1c0,0,0,0-0.1,0c0,0.1-0.1,0.1-0.1,0.2l0,0
	c0,0,0,0,0-0.1c-0.1-0.2-0.2-0.4-0.3-0.6c0.3-0.1,0.6-0.1,0.8,0c0.1,0,0.2,0.1,0.2,0.2c0.1,0.1,0.1,0.2,0.1,0.3c0,0.2,0,0.4-0.1,0.5
	c-0.1,0.1-0.2,0.2-0.3,0.2c-0.3,0.1-0.5,0.1-0.8,0C14.7,85.1,14.4,85,14.2,84.9z"/>
<path class="st19" d="M14.3,84.5c0.1-0.2,0.2-0.3,0.4-0.4C14.8,84,15,84,14.9,84c0,0-0.1,0.1-0.1,0.1c-0.1,0.1-0.1,0.2-0.1,0.3
	c0,0.1,0,0.1,0.1,0.1s0.1,0,0.1,0c0-0.2,0-0.3-0.1-0.4c0.2-0.1,0.4-0.2,0.6-0.1c0.1,0,0.1,0.1,0.2,0.1c0.1,0.1,0.1,0.2,0.1,0.3
	c0,0.2,0,0.3-0.1,0.4c-0.1,0.1-0.2,0.2-0.3,0.2c-0.2,0.1-0.4,0.1-0.5,0C14.5,84.8,14.4,84.7,14.3,84.5z"/>
<path class="st19" d="M14.6,84.2c-0.2,0.2-0.4,0.3-0.6,0.4c-0.2,0.1-0.3,0.1-0.5,0.1c0,0,0,0,0.1-0.1c0-0.1,0-0.1,0-0.2
	c0-0.1,0,0,0,0s0,0,0,0.1c0.1,0.2,0.2,0.4,0.3,0.6c-0.3,0.1-0.6,0.1-0.8-0.1c-0.1,0-0.2-0.1-0.2-0.2c-0.1-0.1-0.1-0.2-0.1-0.3
	c0-0.2,0-0.4,0.1-0.5c0.1-0.1,0.2-0.2,0.3-0.2c0.3-0.1,0.6-0.1,0.8,0C14.1,83.9,14.4,84.1,14.6,84.2z"/>
<path class="st16" d="M44.8,68.6L44.8,68.6c0.6-0.1,1.1-0.6,1.2-1.2c-0.4-0.1-0.9,0.2-1,0.6c0-0.4-0.1-0.8-0.4-1.1
	C44.6,66.9,43.8,67.5,44.8,68.6L44.8,68.6z"/>
<path class="st14" d="M17.5,73.6c-0.7,0.4-1,1.2-1,1.9c0.2,1.1,2.2,1.5,3.6,1.3c1.5-0.2,3.4-1.2,3.3-2.1c-0.1-1.1-2.6-1.9-4.4-1.7
	C18.4,73.1,17.9,73.3,17.5,73.6z"/>
<path class="st15" d="M23,75.6c-0.7-0.1-1.3-0.1-2,0c-1.5,0.1-1.9,0.5-2.4,0.2s-0.8-1.4-0.8-2.3c-0.1,0.1-0.2,0.1-0.3,0.2
	c-0.7,0.4-1,1.2-1,1.9c0.2,1.1,2.2,1.5,3.6,1.3C21.2,76.8,22.2,76.3,23,75.6z"/>
<path class="st14" d="M22.1,74.4c-0.4,0.3-0.6,0.7-0.6,1.2c0.2,0.7,1.4,0.9,2.2,0.8s2-0.7,2-1.3s-1.6-1.2-2.7-1
	C22.7,74.1,22.4,74.2,22.1,74.4z"/>
<path class="st15" d="M25.5,75.5c-0.4,0-0.8,0-1.2,0c-0.9,0.1-1.1,0.3-1.5,0.1s-0.5-0.8-0.5-1.4c-0.1,0-0.1,0.1-0.2,0.1
	c-0.4,0.3-0.6,0.7-0.6,1.2c0.2,0.7,1.4,0.9,2.2,0.8C24.4,76.3,25,76,25.5,75.5z"/>
<path class="st9" d="M29.3,65.3c0,0,0.7,0.7,0.3,2.6"/>
<path class="st10" d="M29.8,67c0-0.4,0.2-0.7,0.5-0.8c0.1,0.3-0.1,0.7-0.4,0.8C29.9,67,29.8,67,29.8,67z"/>
<path class="st10" d="M29.7,66.4c-0.3,0.1-0.7,0-0.9-0.4c0.3-0.2,0.7-0.1,0.8,0.2C29.7,66.3,29.7,66.4,29.7,66.4z"/>
<path class="st11" d="M29.4,64.4c0,0,0.7-1.3,1.4-0.6s-1.2,1-1.2,1s1.6-0.4,1.3,0.4s-1.6,0.1-1.6,0.1s0.1,1.2-1.3,0.7s0.9-1,0.9-1
	s-1.4,0.4-1.2-0.2s1.2-0.1,1.2-0.1s-1.2-0.8-0.6-1C29.4,63.2,29.4,64.4,29.4,64.4z"/>
<path class="st10" d="M29.1,64.7C29,64.7,29,64.9,29.1,65s0.2,0.1,0.3,0.1c0,0,0.1,0,0.1-0.1c0.1-0.1,0.1-0.2,0-0.3
	C29.4,64.6,29.2,64.6,29.1,64.7C29.1,64.7,29.1,64.7,29.1,64.7z"/>
<rect x="65.2" y="80.6" transform="matrix(7.184561e-02 -0.9974 0.9974 7.184561e-02 -16.8294 143.9414)" class="st5" width="7.5" height="0.9"/>
<polygon class="st6" points="68.5,80.5 69.4,80.2 69.6,77.7 68.7,77.7 "/>
<path class="st7" d="M79.6,69.1c0.1-0.9-0.6-1.9-1.7-2.8c1.2-0.8,2.1-1.8,1.9-2.6c-0.2-1.1-2-1.8-4-1.9c1.3-0.2,2.3-0.8,2.5-1.6
	c0.4-1.6-3-3.8-5.7-4.3c-0.8-0.2-1.6-0.1-2.3,0.1c-1,0.4-2.2,1.3-2.3,2.4c0,0.2,0,0.3,0.1,0.5c-0.7,0-1.4,0.2-2,0.6
	c-1,0.6-2.2,1.9-2,3.2c0.1,0.6,0.4,1.1,0.9,1.4c-1.5,0.9-3.3,2.7-3.1,4.5c0.1,1.3,1.2,2.4,2.7,3.2c-0.8,0.6-1.2,1.5-1.2,2.5
	c0.2,2.1,3.8,3.4,6.5,3.5c3,0.1,6.7-1.3,6.8-3.1c-0.1-0.9-0.5-1.7-1.3-2.1C77.7,71.8,79.5,70.5,79.6,69.1z"/>
<path class="st20" d="M65.5,35.8c-2.2,0-3.2-2.7,0-3.4c0,0-0.9-1.5,0.3-2.2s2.2,0.6,2.2,0.6c-0.3-0.8,0.1-1.8,0.9-2.1
	c0.2-0.1,0.4-0.1,0.6-0.1c2.2-0.2,1.5,3.2,1.5,3.2s0.5-1.3,1.3-0.6s0.3,1.1,0.3,1.1s0.7-0.6,1.3,0c0.3,0.2,0.3,0.7,0.1,0.9
	c0,0,0,0-0.1,0.1c0,0,2.4-2,3.6-0.3s-0.7,2.9-1.7,2.9L65.5,35.8z"/>
<path class="st20" d="M14.8,13.9c-2.2,0-3.2-2.7,0-3.4c0,0-0.9-1.5,0.4-2.2s2.2,0.6,2.2,0.6C17,8,17.4,7.1,18.3,6.7
	c0.2-0.1,0.4-0.1,0.6-0.1c2.2-0.2,1.5,3.2,1.5,3.2s0.5-1.3,1.3-0.6s0.3,1.1,0.3,1.1s0.7-0.6,1.3,0c0.3,0.2,0.3,0.7,0.1,0.9
	c0,0,0,0-0.1,0.1c0,0,2.4-2,3.6-0.3s-0.7,2.9-1.7,2.9L14.8,13.9z"/>
</svg>
