<?xml version="1.0" encoding="utf-8"?>
<!-- Generator: Adobe Illustrator 24.0.0, SVG Export Plug-In . SVG Version: 6.00 Build 0)  -->
<svg version="1.1" id="Layer_1" xmlns="http://www.w3.org/2000/svg" xmlns:xlink="http://www.w3.org/1999/xlink" x="0px" y="0px"
	 viewBox="0 0 88 88" style="enable-background:new 0 0 88 88;" xml:space="preserve">
<style type="text/css">
	.st0{fill:#23B2E7;}
	.st1{clip-path:url(#SVGID_2_);}
	.st2{fill:#1B75BC;}
	.st3{fill:#828282;}
	.st4{fill:#7D7D7D;}
	.st5{fill:#FFCC2C;}
	.st6{fill:#B21E49;}
	.st7{fill:#F8F8EC;}
	.st8{fill:#218993;}
	.st9{fill:#F9F39F;}
	.st10{fill:#FAD87B;}
	.st11{fill:#F7941D;}
	.st12{fill:#802043;}
	.st13{fill:#B0B8B4;}
	.st14{fill:#1E6B77;}
	.st15{fill:#649BB3;}
	.st16{fill:#B3B47E;}
	.st17{fill:#B1A166;}
	.st18{fill:#195C87;}
	.st19{clip-path:url(#SVGID_4_);}
	.st20{fill:#FAC0B4;}
	.st21{fill:#0E2436;}
	.st22{clip-path:url(#SVGID_6_);}
	.st23{fill:#F8AFA5;}
	.st24{fill:#83D1F5;}
	.st25{fill:none;stroke:#62BBD8;stroke-width:1.04;stroke-miterlimit:10;}
	.st26{fill:#F8AEB0;}
	.st27{fill:#0C0C0D;}
	.st28{fill:#FFFFFF;}
	.st29{fill:#113D5F;}
	.st30{fill:none;stroke:#0C0C0D;stroke-width:0.77;stroke-miterlimit:10;}
	.st31{fill:#492914;}
	.st32{fill:none;stroke:#492914;stroke-width:0.74;stroke-linecap:round;stroke-linejoin:round;}
	.st33{fill:none;stroke:#492914;stroke-width:0.25;stroke-linecap:round;stroke-linejoin:round;}
</style>
<title>Artboard 17</title>
<rect class="st0" width="88" height="88"/>
<g>
	<defs>
		<rect id="SVGID_1_" width="88" height="88"/>
	</defs>
	<clipPath id="SVGID_2_">
		<use xlink:href="#SVGID_1_"  style="overflow:visible;"/>
	</clipPath>
	<g class="st1">
		<circle class="st2" cx="44" cy="83.6" r="44.2"/>
	</g>
</g>
<g>
	<g>
		<path class="st3" d="M49.4,11.1c0.1-0.4,0.1-0.8,0.1-1.1C49.5,10.4,49.5,10.7,49.4,11.1L49.4,11.1 M49.5,10L49.5,10 M49.5,10
			L49.5,10 M49.5,10L49.5,10 M49.5,10L49.5,10"/>
		<path class="st4" d="M40.6,16.7L40.6,16.7 M39.1,15.4L39.1,15.4 M39.1,15.4L39.1,15.4 M39.1,15.4L39.1,15.4 M39.1,15.4L39.1,15.4
			 M39.1,15.4L39.1,15.4 M39.1,15.4L39.1,15.4 M39.1,15.4L39.1,15.4"/>
		<path class="st3" d="M54.1,11.4L54.1,11.4 M54.1,11.4L54.1,11.4 M54.1,11.4L54.1,11.4 M54.1,11.4L54.1,11.4 M54.1,11.4L54.1,11.4
			 M54.1,11.4L54.1,11.4 M54.1,11.4L54.1,11.4 M54.1,11.4L54.1,11.4 M54.1,11.4L54.1,11.4 M54.1,11.4L54.1,11.4 M54.1,11.4
			L54.1,11.4 M54.1,11.4L54.1,11.4 M54.1,11.4L54.1,11.4 M54.1,11.4L54.1,11.4 M54.1,11.4L54.1,11.4 M54.1,11.4L54.1,11.4
			 M54.1,11.4L54.1,11.4 M54.1,11.4c0-0.2,0-0.5,0-0.8C54.1,10.9,54.1,11.1,54.1,11.4 M54.1,10.6L54.1,10.6 M54.1,10.6L54.1,10.6
			 M54.1,10.6L54.1,10.6 M54.1,10.6L54.1,10.6 M54.1,10.6L54.1,10.6 M54.1,10.6L54.1,10.6 M54.1,10.6L54.1,10.6 M54.1,10.6
			L54.1,10.6 M54.1,10.6L54.1,10.6 M54.1,10.6L54.1,10.6 M54.1,10.6L54.1,10.6 M54.1,10.6L54.1,10.6"/>
		<path class="st4" d="M48.9,17.1c-1.2,0-2.6-0.4-2.7-0.9l0,0C46.3,16.7,47.7,17.1,48.9,17.1c0.4,0,0.7,0,1.1-0.1
			c0.5-0.1,1.6-0.5,1.8-1l0,0c-0.2,0.5-1.3,0.9-1.8,1C49.7,17.1,49.3,17.1,48.9,17.1 M46.3,16.2L46.3,16.2 M46.3,16.2L46.3,16.2
			 M46.3,16.2L46.3,16.2 M46.3,16.2L46.3,16.2 M46.3,16.2L46.3,16.2 M46.3,16.2L46.3,16.2 M46.3,16.2L46.3,16.2 M46.3,16.2
			L46.3,16.2 M46.3,16.2L46.3,16.2 M46.3,16.2L46.3,16.2 M46.3,16.2L46.3,16.2 M46.3,16.2L46.3,16.2 M46.3,16.2L46.3,16.2
			 M46.3,16.2L46.3,16.2 M46.3,16.2L46.3,16.2 M46.3,16.2L46.3,16.2 M46.3,16.2L46.3,16.2 M46.3,16.2L46.3,16.2 M46.3,16.2
			L46.3,16.2 M46.3,16.2L46.3,16.2 M46.3,16.2L46.3,16.2 M51.8,16L51.8,16 M51.8,16L51.8,16"/>
	</g>
</g>
<path class="st5" d="M73.3,72.7c-0.6,1.5-2.3,2.3-3.8,1.7L22.5,56.6c-1.5-0.6-2.3-2.3-1.7-3.8l10.5-27.6c0.6-1.5,2.2-2.2,3.7-1.7
	l47.1,17.8c1.5,0.6,2.3,2.3,1.7,3.8L73.3,72.7"/>
<polyline class="st6" points="81.8,50.4 29.2,30.5 29.5,29.7 82.1,49.6 81.8,50.4 "/>
<polyline class="st7" points="81.5,51.2 28.9,31.3 29.2,30.5 81.8,50.4 81.5,51.2 "/>
<path class="st8" d="M63.9,62.1c0.1,0.2,0.3,0.1,0.5-0.2c0.2-0.3,0.4-0.6,0.4-1c0-0.2-0.2-0.2-0.5,0c-0.2,0.2-0.3,0.4-0.5,0.6
	C63.8,61.7,63.8,61.9,63.9,62.1L63.9,62.1z"/>
<path class="st8" d="M62.6,60.5c-0.1,0.2,0.1,0.3,0.3,0.3c0.2,0,0.5-0.1,0.6-0.3c0.1-0.2-0.1-0.3-0.3-0.3
	C62.9,60.1,62.7,60.3,62.6,60.5z"/>
<path class="st8" d="M32.1,38.3c0-0.1,0.5,0.1,1.1,0.4c0.7,0.4,1.3,0.9,1.7,1.6l0.7,1.1c0.3,0.4,0.5,0.8,0.6,1.2
	c0,0.1,0.1,0.2,0.2,0.2c0.2,0.1,0.3,0.2,0.5,0.3c0.3,0.4,0.6,0.8,0.9,1.2c0.3,0.6,0.5,1.2,0.3,1.4s-0.3,0.4-0.3,0.5s0.1,0.1,0.3,0.2
	c0.2,0,0.3,0.1,0.3,0.3c0,0.1,0,0.3,0,0.4c0,0.1,0,0.3,0,0.4c0,0.2,0.1,0.3,0.3,0.4c0.2,0.1,0.3,0.3,0.4,0.5c0.1,0.2,0.1,0.5,0,0.6
	C39,49,39,49.1,39,49.2c-0.1,0.3-0.3,0.6-0.5,0.9c-0.2,0.3-0.6,0.5-0.9,0.4c-0.4-0.4-0.8-0.9-1-1.4l-0.9-1.6
	c-0.3-0.7-0.6-1.4-0.7-2.1c-0.1-0.7-0.3-1.5-0.5-2.2v-0.1c-0.3-0.8-0.6-1.5-1-2.2l-0.8-1.4C32.4,39.1,32.3,38.7,32.1,38.3"/>
<path class="st8" d="M37.5,51.3c-0.2-0.1-0.2,0-0.1,0.2c0.1,0.2,0.3,0.4,0.6,0.5c0.2,0.1,0.3,0.2,0.3,0.3s0.4,0.4,1,0.8l4.7,2.8
	c0.4,0.3,0.9,0.5,1.3,0.7c0.1,0,0.3,0,0.3-0.1s0.2,0.1,0.5,0.4c0.2,0.3,0.4,0.5,0.7,0.6c0.2,0.1,0.3,0.2,0.5,0.3
	C47.4,58,47.7,58,48,58c0.6,0,1.2,0.2,1.7,0.4l2.4,0.8c0.6,0.2,1.2,0.4,1.8,0.5c0.3,0.1,0.8,0.1,0.9,0.2s0.2-0.1,0.2-0.2
	c-0.1-0.2-0.3-0.3-0.6-0.3c-0.6-0.1-1.1-0.3-1.6-0.5l-3.2-1.1c-0.4-0.2-0.8-0.3-1.3-0.4c-0.1,0,0,0.1,0.1,0.2s0.1,0.2,0,0.2
	c-0.3-0.1-0.5-0.3-0.7-0.5c-0.4-0.4-0.9-0.7-1.3-0.9c-0.4-0.2-0.7-0.3-1-0.6c-0.2-0.2-0.5-0.4-0.7-0.5c-0.3-0.2-0.5-0.4-0.5-0.5
	s0.3-0.1,0.6,0s0.6,0,0.5-0.1c-0.3-0.3-0.7-0.6-1.2-0.7l0,0c-0.5-0.2-0.9-0.4-1.4-0.7c-0.1-0.1-0.3-0.1-0.4-0.1
	c-0.3,0-0.6,0-0.9-0.2c-0.3-0.1-0.6-0.3-0.8-0.5c-0.1-0.2-0.3-0.3-0.5-0.5c-0.2-0.1-0.4-0.3-0.5-0.5c-0.2-0.2-0.4-0.4-0.7-0.5
	c-0.3-0.1-0.6-0.1-0.8,0.1C37.9,51.4,37.7,51.4,37.5,51.3"/>
<path class="st8" d="M43.4,49.9c0-0.4,0-0.9,0-1.3V47c0-0.5,0.1-1,0.3-1.5c0.1-0.1,0.3-0.2,0.5-0.3c0.1,0,0.2,0,0.3,0.2
	c0.2,0.1,0.4,0.2,0.7,0.3c0.3,0.1,0.6,0,0.8-0.2c0.2-0.2,0.5-0.2,0.8-0.2c0.5,0,1.1-0.1,1.5-0.3c0.5-0.2,1.1-0.4,1.6-0.4
	c0.4,0,0.7-0.1,1.1-0.3c0.3-0.1,0.8-0.3,1.2-0.5s0.8-0.2,0.9,0c0.1,0.2,0.2,0.4,0.2,0.7c0,0.2,0.1,0.5,0.3,0.7
	c0.2,0.2,0.4,0.5,0.5,0.7s0,0.3-0.3,0.2s-0.4,0-0.3,0.2s0,0.3-0.3,0.3c-0.2,0-0.4,0.1-0.6,0.2c-0.1,0.2-0.2,0.7-0.4,1.1
	c-0.1,0.4-0.1,0.9,0.1,1.3c0.2,0.2,0,0.5-0.4,0.5c-0.4,0-0.8,0.2-1.1,0.4c-0.3,0.3-0.6,0.5-1,0.7c-0.3,0.2-0.6,0.5-0.7,0.8
	c0,0.2-0.1,0.4-0.2,0.6c-0.1,0.1-0.2,0.3-0.3,0.4c-0.1,0.2-0.2,0.3-0.3,0.2c-0.3-0.1-0.5-0.1-0.8-0.1c-0.3,0-0.6-0.3-0.5-0.5
	s-0.4-0.7-1-1l-1.4-0.7C44.2,50.4,43.8,50.1,43.4,49.9"/>
<path class="st8" d="M50.9,55.7c-0.1,0-0.1-0.2,0-0.3s0.2-0.5,0.3-0.8c0.1-0.3,0.2-0.5,0.2-0.8c0-0.2-0.1-0.4-0.1-0.6
	c0-0.2,0.1-0.4,0.2-0.5c0.2-0.1,0.3-0.3,0.3-0.5c0.1-0.2,0.3-0.4,0.5-0.5c0.2-0.1,0.4-0.3,0.5-0.5c0.1-0.2,0.2-0.4,0.3-0.6
	c0.1-0.1,0.3-0.2,0.5-0.3c0.2-0.1,0.4-0.1,0.5-0.1c0.5,0.1,1,0.2,1.4,0.4l0.6,0.2c0.5,0.2,1.1,0.4,1.7,0.4c0.2,0,0.4,0,0.6,0
	c0.1,0,0.1,0.1,0,0.2c-0.2,0.2-0.4,0.3-0.6,0.3c-0.3,0.1-0.7,0.1-0.9,0.1c-0.5-0.1-1-0.3-1.5-0.5l-0.3-0.1c-0.4-0.3-0.9-0.4-1.4-0.4
	c-0.2,0.1-0.4,0.3-0.5,0.5c-0.1,0.2-0.2,0.4-0.1,0.5c0.1,0.1,0.1,0.3,0.1,0.4c0,0.1,0.1,0.2,0.2,0.2c0,0,0,0,0.1,0
	c0.2,0,0.4,0,0.6,0c0.4,0,0.8,0.1,1.2,0.2c0.4,0.1,0.8,0.2,0.7,0.3c-0.3,0.1-0.7,0.2-1,0.2c-0.3,0-0.7,0.1-1,0.2
	c-0.1,0.3-0.1,0.7,0,1c0.1,0.4,0.2,0.9,0.3,1.3c0.1,0.2,0.1,0.5,0.1,0.8c-0.1,0.2-0.2,0.3-0.4,0.4c-0.2,0-0.4-0.2-0.6-0.5
	c-0.2-0.4-0.3-0.7-0.4-1.1c-0.1-0.3-0.1-0.6,0-0.8c0.1-0.2,0-0.3-0.1-0.5c-0.1-0.1-0.3-0.2-0.3-0.2c-0.1,0.1-0.2,0.2-0.2,0.3
	c-0.1,0.2-0.2,0.5-0.3,0.7c-0.1,0.3-0.2,0.5-0.3,0.8c0,0.2-0.1,0.4-0.2,0.5c-0.1,0-0.3,0-0.4,0L50.9,55.7"/>
<path class="st8" d="M49.2,58.8c-0.1,0-0.2,0.1-0.2,0.3c0.1,0.2,0.2,0.4,0.4,0.5c0.2,0.1,0.3,0.3,0.4,0.5c0.1,0.2,0.3,0.3,0.5,0.2
	c0.2-0.1,0.3-0.2,0.3-0.4c-0.1-0.2-0.2-0.3-0.3-0.5c-0.2-0.2-0.4-0.3-0.6-0.4C49.6,58.9,49.4,58.8,49.2,58.8z"/>
<path class="st8" d="M52.2,61.6c-0.1-0.1-0.1-0.1-0.1-0.2c0-0.1,0.3-0.4,0.7-0.6c0.4-0.2,0.8-0.4,1.2-0.4c0.3,0,0.5,0,0.8-0.1
	c0.4,0,0.8,0,1.1,0.2c0.5,0.2,0.9,0.3,0.9,0.4s-0.5,0.2-1,0.3c-0.6,0-1.1,0.2-1.7,0.3c-0.3,0.1-0.7,0.2-1,0.2c-0.2,0-0.4,0-0.5,0
	C52.3,61.7,52.2,61.7,52.2,61.6L52.2,61.6z"/>
<path class="st8" d="M59.4,56.4c0.1-0.1,0.5,0,0.9,0.2c0.4,0.2,0.7,0.3,1,0.6c0.2,0.2,0.3,0.4,0.4,0.6c0.1,0.2,0.2,0.5,0.2,0.7
	s-0.1,0.1-0.4-0.3c-0.3-0.3-0.6-0.6-1-0.8l-0.8-0.3c-0.2-0.1-0.3-0.2-0.4-0.3C59.3,56.7,59.3,56.5,59.4,56.4L59.4,56.4z"/>
<path class="st8" d="M58.5,56.2c0.1,0.1,0.2,0.2,0.2,0.3c0,0.1-0.2,0.2-0.3,0.3c-0.2,0-0.4-0.1-0.5-0.2c-0.1-0.2-0.2-0.4-0.2-0.5
	s0.2-0.2,0.4-0.1C58.2,56,58.4,56.1,58.5,56.2z"/>
<path class="st8" d="M68.9,65.8c0.2,0.3,0.6,0,0.9-0.7l1.5-3.4c0.3-0.7,0.1-1.4-0.5-1.9L70,59.2c-0.4-0.4-0.9-0.6-1.5-0.7
	c-0.4,0-0.9-0.2-1.2-0.5c-0.4-0.3-0.6-0.2-0.4,0.1c0.1,0.4,0,0.8-0.4,0.9c-0.2,0.1-0.5,0.1-0.6-0.1c0-0.1-0.1-0.1-0.1-0.2
	c-0.1-0.3-0.1-0.7-0.1-1c0-0.2,0-0.5,0.1-0.7c0.1-0.2-0.2-0.6-0.5-0.9c-0.3-0.3-0.5-0.5-0.9-0.7c-0.2,0-0.4,0-0.6,0.1
	c-0.3,0.1-0.7,0-1-0.1c-0.4-0.2-0.5,0-0.3,0.3c0.2,0.4,0.4,0.7,0.6,1.1c0.1,0.3,0.3,0.5,0.5,0.7c0.2,0.1,0.1,0.1-0.2,0.1
	s-0.5,0-0.5,0.1c0.1,0.2,0.2,0.5,0.3,0.7c0.1,0.2,0.2,0.5,0.3,0.8c0,0.1,0,0.2,0.1,0.3c0.1,0,0.3-0.1,0.4-0.3s0.4-0.1,0.4,0.2
	c0.3,0.5,0.7,0.9,1.1,1.3l0.8,0.6c0.5,0.4,0.9,1,1.1,1.7c0.1,0.5-0.1,0.9-0.5,1.2c-0.3,0.1-0.4,0.4-0.2,0.5c0.3,0.2,0.6,0.4,1,0.5
	C68.2,65.3,68.6,65.5,68.9,65.8L68.9,65.8z"/>
<path class="st8" d="M61.4,61c0.2-0.2,0.3-0.2,0.3,0s0,0.3,0.1,0.3c0.1,0,0.1,0.1,0.1,0.2c-0.2,0.2-0.5,0.4-0.7,0.5
	c-0.3,0.2-0.6,0.2-0.9,0.1c-0.1-0.1-0.1-0.2,0-0.3c0.1,0,0.2-0.2,0.1-0.3c0,0,0,0,0,0c-0.1-0.1,0.1-0.2,0.3-0.2
	C61,61.3,61.2,61.2,61.4,61L61.4,61z"/>
<path class="st8" d="M60.1,53.3c-0.1,0,0-0.3,0.3-0.7c0.2-0.4,0.6-0.7,1-0.9c0.3-0.1,0.5,0,0.5,0.2c-0.1,0.2-0.2,0.2-0.4,0.2
	c0,0,0,0,0,0c-0.2-0.1-0.3,0-0.4,0.2c-0.1,0.2,0.1,0.3,0.2,0.2c0.2,0,0.3,0,0.5,0.1c0,0,0,0.2,0,0.3C61.6,53,61.4,53,61.3,53
	c-0.2,0-0.2,0.1-0.1,0.4s0.1,0.4,0,0.4s-0.2-0.2-0.3-0.3s-0.2,0-0.3,0.3s-0.2,0.5-0.2,0.4s-0.1-0.4-0.1-0.5S60.2,53.3,60.1,53.3"/>
<path class="st8" d="M39.2,47.9c-0.2-0.3-0.2-0.7,0-0.8c0.2-0.1,0.4-0.2,0.6,0c0.2,0.2,0.2,0.4,0.2,0.6c-0.1,0.2,0,0.5,0.2,0.6
	c0.2,0.1,0.2,0.3,0.1,0.4c-0.1,0.1-0.3,0.1-0.4,0C39.6,48.4,39.4,48.2,39.2,47.9"/>
<path class="st9" d="M38.2,34.5c0.2,0.2,0.4,0.4,0.5,0.7c0.1,0.2,0.1,0.4,0,0.4c-0.1,0-0.2,0.1-0.2,0.2C38.4,36,38.2,36,38.1,36
	c-0.2,0-0.4-0.3-0.4-0.7c0-0.3,0-0.6,0.1-0.9C37.7,34.3,38,34.3,38.2,34.5 M35.9,33.6c-0.2,0.2-0.4,0.5-0.6,0.7
	c-0.3,0.3-0.6,0.4-0.8,0.3c-0.1-0.1-0.2-0.3-0.2-0.4c0-0.1,0-0.2,0-0.3c0,0,0.1-0.2,0.3-0.3c0.3-0.1,0.6-0.2,0.8-0.2
	C35.7,33.5,35.9,33.6,35.9,33.6 M40.8,33.9c0.4-0.1,0.9-0.3,1.2-0.5c0.4-0.3,0.7-0.7,1-1.1c0.3-0.6,0.6-1.1,0.8-1.8
	c0.2-0.6,0.3-1.2,0.3-1.9c0-0.5-0.3-0.4-0.8,0c-0.4,0.4-0.9,0.8-1.5,0.9l-1,0.1c-0.1,0-0.3,0.1-0.4,0.2c-0.1,0.1-0.2,0.1-0.3,0.2
	c-0.1,0-0.3,0-0.4-0.1c-0.1-0.2-0.1-0.5-0.1-0.8c0-0.4,0.1-0.8,0.1-1c0-0.2,0-0.4,0.1-0.5l0.1-0.3c0-0.1,0-0.2-0.1-0.1
	c-0.1,0-0.3,0-0.4,0c-0.2-0.1-0.5-0.1-0.7,0c-0.2,0-0.4,0-0.7,0c-0.1,0-0.3,0-0.4,0.1c-0.1,0.1-0.1,0.2,0,0.2c0.2,0,0.4,0.1,0.5,0.1
	c0.1,0,0.2,0.1,0.1,0.1c-0.1,0-0.2,0-0.4,0c-0.1,0-0.2,0-0.2,0.1c0.1,0.1,0.2,0.2,0.3,0.2c0.1,0,0.3,0.1,0.3,0.2s-0.2,0.3-0.5,0.5
	s-0.6,0.4-0.7,0.4c-0.2-0.1-0.4-0.3-0.5-0.6c-0.2-0.3-0.5-0.6-0.8-0.9c-0.3-0.5-0.5-1.1-0.5-1.7c0-0.7-0.3-1-0.6-0.7
	c-0.4,0.4-0.7,0.9-1,1.3c-0.3,0.5-0.5,1-0.6,1.6c-0.1,0.6-0.1,1.1,0,1.7c0.2,0.5,0.4,1,0.8,1.5c0.3,0.3,0.6,0.6,1.1,0.7
	c0.3,0,0.4,0.2,0.3,0.3c-0.2,0.2-0.3,0.3-0.5,0.5c-0.1,0.2-0.3,0.4-0.5,0.5c-0.2,0.1-0.4,0.2-0.5,0.2c-0.1,0-0.2-0.1-0.2-0.2
	c-0.1-0.1-0.1-0.1-0.2-0.2c-0.1,0-0.3-0.3-0.4-0.6s-0.2-0.5-0.3-0.3s-0.2,0.2-0.3,0.2s-0.1,0.2,0,0.6s0.4,0.7,0.5,0.7s0.2,0,0.2,0.1
	c0,0.1,0,0.1,0,0.2c0,0,0,0.2,0,0.3c0.1,0.1,0.1,0.2,0.2,0.2c0.2,0.1,0.4,0.3,0.5,0.5c0.2,0.2,0.2,0.5,0,0.6s0,0.4,0.4,0.7
	c0.3,0.2,0.7,0.4,1.1,0.3c0.2-0.1,0.4,0,0.5,0.2c0,0,0,0,0,0c0.1,0.2,0.5,0.4,1,0.5s0.9,0,0.8-0.2s0.2-0.4,0.5-0.4
	c0.2,0,0.4,0,0.7,0c0.1,0,0.2,0,0.3,0c0.1,0,0.2-0.1,0.2-0.1s0.1-0.1,0.2-0.2c0.1,0,0.2,0,0.2,0.1c0,0.1,0.4,0,0.8-0.2
	s0.6-0.4,0.4-0.4c-0.1,0-0.2-0.2-0.2-0.3c0,0,0,0,0,0c0.1-0.1-0.1-0.1-0.5,0s-0.6,0.2-0.7,0.2c-0.1-0.1-0.2-0.1-0.3,0
	c-0.1,0-0.2,0-0.3,0c-0.1-0.1-0.2-0.2-0.2-0.3C39,35.2,38.9,35,39,34.8c0-0.2,0-0.6,0-0.9s0.2-0.4,0.5-0.2
	C39.9,33.9,40.3,34,40.8,33.9"/>
<path class="st10" d="M38.7,35.2c0.1,0.2,0.1,0.4,0,0.4c-0.1,0-0.2,0.1-0.2,0.2C38.4,36,38.2,36,38,36c-0.2,0-0.4-0.3-0.4-0.7
	c0-0.3,0-0.6,0.1-0.9c0-0.1,0.2-0.1,0.4,0.1C38.4,34.7,38.5,34.9,38.7,35.2 M39.6,33.7c0.4,0.2,0.8,0.3,1.2,0.3
	c0.4-0.1,0.9-0.3,1.2-0.5c0.4-0.3,0.7-0.7,1-1.1c0.3-0.6,0.6-1.1,0.8-1.8c0.2-0.6,0.3-1.2,0.3-1.9c0-0.5-0.3-0.4-0.8,0
	c-0.4,0.4-0.9,0.8-1.5,0.9l-1,0.1c-0.1,0-0.3,0.1-0.4,0.2c-0.1,0.1-0.2,0.1-0.3,0.2c-0.1,0-0.3,0-0.4-0.1c-0.1-0.2-0.1-0.5-0.1-0.8
	c0-0.4,0.1-0.8,0.1-1c0-0.2,0-0.4,0.1-0.5l0.1-0.3c0-0.1,0-0.2-0.1-0.1c-0.1,0-0.3,0-0.4,0c0,0-0.1,0-0.1,0l-3.5,9.3
	c0.1,0,0.1,0.1,0.1,0.2c0.1,0.2,0.5,0.4,1,0.5s0.9,0,0.8-0.2s0.2-0.4,0.5-0.4c0.2,0,0.4,0,0.7,0c0.1,0,0.2,0,0.3,0
	c0.1,0,0.2-0.1,0.2-0.1s0.1-0.1,0.2-0.2c0.1,0,0.2,0,0.2,0.1c0,0.1,0.4,0,0.8-0.2s0.6-0.4,0.4-0.4c-0.1,0-0.2-0.2-0.2-0.3
	c0,0,0,0,0,0c0.1-0.1-0.1-0.1-0.5,0s-0.6,0.2-0.7,0.2c-0.1-0.1-0.2-0.1-0.3,0c-0.1,0-0.2,0-0.3,0c-0.1-0.1-0.2-0.2-0.2-0.3
	C39,35.2,38.9,35,39,34.8c0-0.2,0-0.6,0-0.9S39.2,33.5,39.6,33.7"/>
<path class="st11" d="M29.7,59.3l-7.2-2.7c-1.5-0.6-2.3-2.3-1.7-3.8l8.1-21.5l3.4,1.3c0,0.1,0.1,0.3,0.1,0.4
	c0.2,0.4,0.3,0.7,0.5,0.7l0,0c0.1,0,0.2,0,0.2,0.1c0,0.1,0,0.1,0,0.2c0,0,0,0.2,0,0.3c0.1,0.1,0.1,0.2,0.2,0.2
	c0.2,0.1,0.4,0.3,0.5,0.5c0.2,0.2,0.2,0.5,0,0.6s0,0.4,0.4,0.7c0.3,0.2,0.6,0.3,1,0.4h0.2c0.1,0,0.1,0,0.2,0c0.1,0,0.1,0,0.2,0l0,0
	c0.1,0,0.1,0.1,0.1,0.2l0,0c0.1,0.2,0.5,0.4,1,0.5h0.4c0.3,0,0.5-0.1,0.5-0.2l0,0l0,0c0-0.2,0.2-0.3,0.5-0.3h0.3c0.1,0,0.2,0,0.3,0
	h0.3c0.1,0,0.2-0.1,0.2-0.1l0,0c0-0.1,0.1-0.1,0.2-0.2h0.1c0.1,0,0.1,0,0.2,0.1c0,0,0,0,0.1,0c0.2,0,0.5-0.1,0.7-0.2
	c0.2-0.1,0.3-0.2,0.5-0.3l33.6,12.7c-0.1,1.3-1.1,2.5-2.4,2.7l-11.2,2.1l-0.1-0.2C61,53.1,61.1,53,61.2,53h0.2c0.1,0,0.2,0,0.3-0.1
	c0.1-0.1,0.1-0.2,0-0.3c-0.1-0.1-0.2-0.1-0.4-0.1h-0.1c-0.2,0-0.3-0.1-0.2-0.2c0-0.1,0.2-0.2,0.3-0.2h0.1c0,0,0.1,0,0.1,0
	c0.1,0,0.2-0.1,0.3-0.2c0-0.1-0.1-0.2-0.2-0.2h-0.2c-0.4,0.2-0.8,0.5-1,0.9c-0.2,0.4-0.4,0.7-0.3,0.7l0,0c0.1,0,0.1,0.1,0.1,0.2v0.1
	l-6.1,1.1c0-0.2-0.1-0.3-0.1-0.5c-0.1-0.3-0.1-0.7,0-1c0.3-0.1,0.7-0.2,1-0.2c0.3,0,0.7,0,1-0.2c0.1-0.1-0.2-0.2-0.7-0.3
	c-0.4-0.1-0.8-0.2-1.2-0.2h-0.2c-0.1,0-0.3,0-0.4,0l0,0c-0.1,0-0.2-0.1-0.2-0.2c0,0,0,0,0,0c0-0.1,0-0.3-0.1-0.4
	c0-0.2,0-0.4,0.1-0.5c0.1-0.2,0.3-0.4,0.5-0.5H54c0.5,0.1,0.9,0.2,1.3,0.4l0.3,0.1c0.4,0.2,0.9,0.4,1.4,0.5l0,0
	c0.2,0,0.6-0.1,0.9-0.1c0.2,0,0.4-0.1,0.6-0.3c0-0.1,0-0.2,0-0.2c-0.2,0-0.3,0-0.5,0h-0.1c-0.6-0.1-1.1-0.2-1.7-0.4l-0.6-0.2
	c-0.5-0.2-0.9-0.3-1.4-0.4l0,0c-0.2,0-0.4,0.1-0.5,0.1c-0.2,0.1-0.3,0.2-0.5,0.3c-0.1,0.2-0.3,0.4-0.3,0.6c-0.1,0.2-0.3,0.4-0.5,0.5
	c-0.2,0.1-0.4,0.3-0.5,0.5c-0.1,0.2-0.2,0.4-0.3,0.5c-0.1,0.1-0.2,0.3-0.2,0.5c0,0.2,0,0.4,0.1,0.6c0,0.3-0.1,0.6-0.2,0.8
	c-0.1,0.3-0.3,0.7-0.3,0.8l0,0l-4.7,0.9c-0.3-0.1-0.5-0.3-0.8-0.5c-0.2-0.2-0.5-0.4-0.7-0.5c-0.3-0.2-0.5-0.4-0.5-0.5
	s0.1-0.1,0.3-0.1h0.3H45c0.2,0,0.3,0,0.3-0.1c-0.3-0.3-0.7-0.5-1.2-0.6l0,0c-0.5-0.2-0.9-0.4-1.4-0.7c-0.1-0.1-0.2-0.1-0.3-0.1
	c0,0-0.1,0-0.1,0c0,0-0.1,0-0.1,0c-0.3,0-0.5-0.1-0.8-0.2c-0.3-0.1-0.6-0.3-0.8-0.5c-0.1-0.2-0.3-0.3-0.5-0.5
	c-0.2-0.1-0.4-0.3-0.5-0.5c-0.2-0.2-0.4-0.4-0.7-0.5c-0.1,0-0.2-0.1-0.4-0.1c-0.2,0-0.3,0-0.5,0.1c-0.1,0.1-0.2,0.1-0.4,0.1
	c-0.1,0-0.2,0-0.2-0.1c0,0-0.1,0-0.1,0c-0.1,0-0.1,0.1,0,0.3c0.1,0.2,0.3,0.4,0.6,0.5c0.2,0.1,0.3,0.2,0.3,0.3s0.4,0.4,1,0.8
	l4.7,2.8c0.4,0.2,0.8,0.5,1,0.6L29.7,59.3 M44.2,45.2L44.2,45.2c-0.2,0.1-0.3,0.2-0.5,0.3c-0.2,0.5-0.3,1-0.3,1.5v1.5
	c0,0.4,0,0.9,0,1.3c0.4,0.2,0.8,0.5,1.2,0.6l1.4,0.7c0.6,0.3,1.1,0.7,1,1s0.2,0.5,0.5,0.5c0.3,0,0.5,0.1,0.8,0.1l0,0
	c0.1,0,0.2-0.1,0.2-0.2c0.1-0.2,0.2-0.3,0.3-0.4c0.1-0.2,0.2-0.4,0.2-0.6c0.1-0.3,0.3-0.6,0.7-0.8c0.4-0.2,0.7-0.4,1-0.7
	c0.3-0.3,0.7-0.4,1.2-0.4c0.4,0,0.6-0.2,0.4-0.5c-0.2-0.4-0.2-0.9-0.1-1.3c0.1-0.5,0.3-1,0.4-1.1s0.3-0.2,0.5-0.2h0.1
	c0.2,0,0.3-0.1,0.2-0.3s0-0.2,0.2-0.2h0.2H54c0.2,0,0.2-0.1,0.1-0.3s-0.4-0.5-0.5-0.7c-0.2-0.2-0.3-0.4-0.3-0.7
	c0-0.2-0.1-0.5-0.2-0.7c-0.1-0.1-0.2-0.1-0.3-0.1c-0.2,0-0.4,0.1-0.5,0.1c-0.4,0.2-0.9,0.4-1.2,0.5c-0.4,0.1-0.7,0.2-1.1,0.3
	c-0.6,0.1-1.1,0.2-1.6,0.4c-0.4,0.2-0.9,0.3-1.4,0.3h-0.3c-0.2,0-0.4,0.1-0.6,0.2c-0.2,0.1-0.4,0.2-0.6,0.2h-0.2
	c-0.2,0-0.5-0.1-0.7-0.3C44.4,45.3,44.3,45.2,44.2,45.2 M32.2,38.2L32.2,38.2c0.1,0.4,0.3,0.8,0.5,1.2l0.8,1.4
	c0.4,0.7,0.7,1.5,1,2.2v0.1c0.2,0.7,0.4,1.5,0.5,2.2c0.1,0.7,0.4,1.5,0.7,2.1l0.9,1.6c0.2,0.5,0.6,1,1,1.4c0.1,0,0.1,0.1,0.2,0.1
	c0.3,0,0.5-0.2,0.7-0.4c0.2-0.3,0.4-0.6,0.5-0.9c0-0.1,0.1-0.3,0.2-0.4c0.1-0.1,0-0.3,0-0.6c-0.1-0.2-0.2-0.4-0.4-0.5
	c-0.1-0.1-0.3-0.2-0.3-0.4c0-0.1,0-0.3,0-0.4c0-0.1,0-0.3,0-0.4c-0.1-0.1-0.2-0.2-0.3-0.3c-0.1,0-0.3-0.1-0.3-0.2s0.1-0.3,0.3-0.5
	s0-0.8-0.3-1.4c-0.3-0.5-0.6-0.9-1-1.2c-0.2-0.1-0.3-0.2-0.5-0.3c-0.1,0-0.2-0.2-0.2-0.2c-0.1-0.4-0.3-0.8-0.6-1.2l-0.6-1
	c-0.4-0.7-1-1.2-1.7-1.6C33,38.5,32.6,38.3,32.2,38.2 M39.6,46.9c-0.1,0-0.2,0-0.3,0.1c-0.2,0.1-0.2,0.5,0,0.8
	c0.2,0.3,0.4,0.6,0.6,0.8c0.1,0,0.2,0.1,0.2,0.1c0.1,0,0.1,0,0.2-0.1c0.1-0.1,0-0.3-0.1-0.4c-0.2-0.2-0.3-0.4-0.2-0.6
	c0.1-0.2,0-0.5-0.2-0.6C39.7,47,39.6,46.9,39.6,46.9 M51.9,55.2c0-0.3,0.1-0.5,0.3-0.7c0.1-0.2,0.2-0.4,0.3-0.7
	c0-0.1,0.1-0.2,0.2-0.3l0,0c0.1,0,0.2,0.1,0.3,0.2c0.1,0.1,0.1,0.3,0.1,0.5c-0.1,0.3-0.1,0.6,0,0.8l0,0L51.9,55.2 M60.6,53.6
	c0-0.1,0.1-0.2,0.2-0.2s0.1,0,0.1,0.1l0.1,0.1L60.6,53.6 M74.4,46.7L40.7,34h0.1c0.4-0.1,0.9-0.3,1.2-0.5c0.4-0.3,0.7-0.7,1-1.1
	c0.3-0.6,0.6-1.1,0.8-1.8c0.2-0.6,0.3-1.2,0.3-1.9l0,0c0-0.2-0.1-0.3-0.2-0.3c-0.2,0-0.4,0.2-0.5,0.4c-0.4,0.4-0.9,0.8-1.5,0.9
	l-1,0.1c-0.1,0-0.3,0.1-0.4,0.2c-0.1,0.1-0.2,0.1-0.3,0.2H40c-0.1,0-0.2,0-0.3-0.1c-0.1-0.1-0.1-0.3-0.1-0.4c0-0.1,0-0.2,0-0.3
	c0-0.4,0.1-0.8,0.1-1c0-0.2,0-0.4,0.1-0.5l0.1-0.3c0,0,0,0,0-0.1c0,0,0-0.1-0.1-0.1h-0.1c-0.1,0-0.2,0-0.3-0.1l0,0
	c-0.2-0.1-0.3-0.1-0.5-0.1h-0.3h-0.5H38c-0.1,0-0.3,0.1-0.4,0.1c-0.1,0.1-0.1,0.2,0,0.2c0.2,0,0.4,0.1,0.5,0.1
	c0.1,0,0.2,0.1,0.1,0.1h-0.1c-0.1,0-0.2,0-0.2,0h-0.1c-0.1,0-0.1,0-0.1,0.1c0.1,0.1,0.2,0.2,0.3,0.2c0.1,0,0.3,0.1,0.3,0.2
	s-0.2,0.3-0.5,0.5c-0.2,0.2-0.4,0.3-0.7,0.4l0,0c-0.2-0.1-0.4-0.3-0.5-0.6c-0.2-0.3-0.5-0.6-0.8-0.9c-0.3-0.5-0.5-1.1-0.5-1.7
	c0-0.5-0.2-0.8-0.4-0.8c-0.1,0-0.2,0.1-0.2,0.1c-0.4,0.4-0.7,0.9-1,1.3c-0.3,0.5-0.5,1-0.6,1.6c-0.1,0.6-0.1,1.1,0,1.7
	c0.2,0.5,0.4,1,0.8,1.5l0,0l-4.5-1.7l1.7-4.5c0.4-1.1,1.5-1.9,2.7-1.9c0.3,0,0.7,0.1,1,0.2l37.8,14.3L74.4,46.7 M40,35.8
	C40,35.8,39.9,35.8,40,35.8c-0.1,0-0.2-0.1-0.2-0.1h-0.1c-0.1,0-0.2,0-0.2,0h-0.1c-0.1-0.1-0.2-0.2-0.2-0.3c0-0.1-0.1-0.2-0.1-0.2
	l1.3,0.5C40.2,35.7,40.1,35.7,40,35.8 M34,33.5L34,33.5c-0.1,0-0.2-0.1-0.3-0.2c-0.1-0.1-0.1-0.1-0.2-0.2c-0.1,0-0.2-0.1-0.3-0.3
	l1.2,0.5C34.3,33.4,34.1,33.5,34,33.5"/>
<path class="st12" d="M74.7,47.7L39.1,34.2v-0.3c0-0.2,0.1-0.3,0.3-0.3c0.1,0,0.2,0,0.3,0.1c0.3,0.2,0.6,0.3,1,0.3h0.1l33.8,12.8
	L74.7,47.7 M35,32.7l-5.7-2.2l0,0l0.3-0.8l4.4,1.7c0.2,0.3,0.6,0.6,1,0.7c0.3,0,0.4,0.2,0.3,0.3L35,32.7"/>
<path class="st13" d="M74.8,48.7L41.2,36c0,0,0,0,0-0.1c0,0,0,0,0-0.1c-0.1,0-0.2-0.1-0.2-0.2c0,0,0-0.1,0-0.1l0,0c0,0,0,0-0.1,0
	c-0.1,0-0.3,0.1-0.4,0.1l-0.2,0.1L39,35.2c0-0.1,0-0.1,0-0.2c0,0,0-0.1,0-0.1c0-0.1,0-0.3,0-0.6l35.7,13.5l0.1,0.3
	C74.7,48.2,74.7,48.5,74.8,48.7 M34.3,33.4l-1.2-0.5c-0.1-0.1-0.1-0.2-0.1-0.3c-0.1-0.2-0.2-0.4-0.2-0.4s0,0,0,0
	c0,0.1-0.1,0.2-0.2,0.2h-0.1c-0.1,0-0.1,0.1-0.1,0.2l-3.4-1.3l0.3-0.8l0,0l5.8,2.2c-0.1,0.1-0.1,0.1-0.1,0.2
	C34.7,33.1,34.6,33.2,34.3,33.4L34.3,33.4"/>
<path class="st14" d="M37.8,50.6c-0.1,0-0.2,0-0.2-0.1c-0.4-0.4-0.8-0.9-1-1.4l-0.9-1.6c-0.3-0.7-0.6-1.4-0.7-2.1
	c-0.1-0.7-0.3-1.5-0.5-2.2v-0.1c-0.3-0.8-0.6-1.5-1-2.2l-0.8-1.4c-0.2-0.4-0.4-0.8-0.5-1.2l0,0c0.4,0.1,0.7,0.2,1.1,0.4
	c0.7,0.4,1.3,0.9,1.7,1.6l0.7,1.1c0.3,0.4,0.5,0.8,0.6,1.2c0,0.1,0.1,0.2,0.2,0.2c0.2,0.1,0.3,0.2,0.5,0.3c0.3,0.4,0.6,0.8,0.9,1.2
	c0.3,0.6,0.5,1.2,0.3,1.4s-0.3,0.4-0.3,0.5s0.1,0.1,0.3,0.2c0.2,0,0.3,0.1,0.3,0.3c0,0.1,0,0.3,0,0.4c0,0.1,0,0.3,0,0.4
	c0,0.2,0.1,0.3,0.3,0.4c0.2,0.1,0.3,0.3,0.4,0.5c0.1,0.2,0.1,0.5,0,0.6C39,49,39,49.1,38.9,49.3c-0.1,0.3-0.3,0.6-0.5,0.9
	C38.3,50.4,38,50.5,37.8,50.6"/>
<path class="st14" d="M45,56.5c-0.2-0.1-0.7-0.4-1-0.6l-4.7-2.8c-0.6-0.3-1-0.7-1-0.8s-0.1-0.2-0.3-0.3c-0.2-0.1-0.4-0.3-0.6-0.5
	c-0.1-0.2-0.1-0.3,0-0.3c0,0,0.1,0,0.1,0c0.1,0,0.1,0.1,0.2,0.1c0.1,0,0.3,0,0.4-0.1c0.1-0.1,0.3-0.2,0.5-0.1c0.1,0,0.3,0,0.4,0.1
	c0.3,0.1,0.5,0.2,0.7,0.5c0.1,0.2,0.3,0.4,0.5,0.5c0.2,0.1,0.4,0.3,0.5,0.5c0.2,0.2,0.5,0.4,0.8,0.5c0.2,0.1,0.5,0.2,0.8,0.2
	c0,0,0.1,0,0.1,0c0,0,0.1,0,0.1,0c0.1,0,0.2,0,0.3,0.1c0.4,0.3,0.9,0.5,1.4,0.7l0,0c0.4,0.1,0.8,0.4,1.2,0.7c0,0.1-0.1,0.1-0.3,0.1
	h-0.2h-0.3c-0.2,0-0.3,0-0.3,0.1s0.2,0.3,0.5,0.5c0.2,0.2,0.5,0.3,0.7,0.5c0.2,0.2,0.5,0.3,0.8,0.5L45,56.5"/>
<path class="st14" d="M48.5,52.8L48.5,52.8c-0.3-0.1-0.5-0.1-0.8-0.1c-0.3,0-0.6-0.3-0.5-0.5s-0.4-0.7-1-1l-1.4-0.7
	c-0.4-0.2-0.8-0.4-1.2-0.6c0-0.4,0-0.9,0-1.3V47c0-0.5,0.1-1,0.3-1.5c0.1-0.1,0.3-0.2,0.5-0.3l0,0c0.1,0,0.2,0.1,0.3,0.2
	c0.2,0.1,0.4,0.2,0.7,0.3h0.2c0.2,0,0.4,0,0.6-0.2c0.2-0.1,0.4-0.2,0.6-0.2h0.3c0.5,0,1-0.1,1.4-0.3c0.5-0.2,1.1-0.4,1.6-0.4
	c0.4,0,0.7-0.1,1-0.2c0.3-0.1,0.8-0.3,1.2-0.5c0.2-0.1,0.4-0.1,0.5-0.1c0.1,0,0.3,0,0.3,0.1c0.1,0.2,0.2,0.4,0.2,0.7
	c0,0.2,0.1,0.5,0.3,0.7c0.2,0.2,0.4,0.5,0.5,0.7S54.1,46,54,46h-0.2h-0.2c-0.2,0-0.2,0.1-0.2,0.2s0,0.3-0.2,0.3h-0.1
	c-0.2,0-0.5,0.1-0.5,0.2s-0.2,0.7-0.4,1.1c-0.1,0.4-0.1,0.9,0.1,1.3c0.2,0.2,0,0.5-0.4,0.5c-0.4,0-0.8,0.2-1.1,0.4
	c-0.3,0.3-0.6,0.5-1,0.7c-0.3,0.2-0.6,0.5-0.7,0.8c0,0.2-0.1,0.4-0.2,0.6c-0.1,0.1-0.2,0.3-0.3,0.4C48.6,52.7,48.5,52.8,48.5,52.8"
	/>
<path class="st14" d="M50.9,55.4L50.9,55.4c0-0.1,0.2-0.5,0.3-0.8c0.1-0.3,0.2-0.5,0.2-0.8c0-0.2-0.1-0.4-0.1-0.6
	c0-0.2,0.1-0.4,0.2-0.5c0.2-0.1,0.3-0.3,0.3-0.5c0.1-0.2,0.3-0.4,0.5-0.5c0.2-0.1,0.4-0.3,0.5-0.5c0.1-0.2,0.2-0.4,0.3-0.6
	c0.1-0.1,0.3-0.2,0.5-0.3c0.2-0.1,0.4-0.1,0.5-0.1l0,0c0.5,0.1,1,0.2,1.4,0.4l0.6,0.2c0.5,0.2,1.1,0.4,1.7,0.4H58c0.2,0,0.3,0,0.5,0
	c0.1,0,0.1,0.1,0,0.2c-0.2,0.2-0.4,0.3-0.6,0.3c-0.3,0.1-0.7,0.1-0.9,0.1l0,0c-0.5-0.1-1-0.3-1.4-0.5l-0.3-0.1
	c-0.4-0.2-0.9-0.4-1.3-0.4h-0.1c-0.2,0.1-0.4,0.3-0.5,0.5c-0.1,0.2-0.2,0.4-0.1,0.5c0.1,0.1,0.1,0.3,0.1,0.4c0,0.1,0.1,0.2,0.1,0.2
	c0,0,0,0,0,0l0,0c0.1,0,0.3,0,0.4,0h0.2c0.4,0,0.8,0.1,1.2,0.2c0.4,0.1,0.8,0.2,0.7,0.3c-0.3,0.1-0.7,0.2-1,0.2
	c-0.3,0-0.7,0.1-1,0.2c-0.1,0.3-0.1,0.7,0,1c0,0.2,0.1,0.3,0.1,0.5L53.1,55l0,0c-0.1-0.3-0.1-0.6,0-0.8c0.1-0.2,0-0.3-0.1-0.5
	c-0.1-0.1-0.2-0.1-0.3-0.2l0,0c-0.1,0.1-0.2,0.2-0.2,0.3c-0.1,0.2-0.2,0.5-0.3,0.7C52.1,54.7,52,55,52,55.2L50.9,55.4"/>
<path class="st14" d="M60.3,53.7L60.3,53.7c0-0.2-0.1-0.3-0.1-0.3l0,0c0,0,0.1-0.3,0.3-0.7c0.2-0.4,0.6-0.7,1-0.9h0.2
	c0.2,0,0.3,0.1,0.2,0.2c0,0.1-0.2,0.2-0.3,0.2c0,0-0.1,0-0.1,0h-0.1c-0.1,0-0.2,0.1-0.3,0.2c0,0.1,0,0.2,0.2,0.2h0.1
	c0.1,0,0.3,0,0.4,0.1c0,0,0,0.2,0,0.3C61.7,53,61.6,53,61.5,53h-0.2c-0.1,0-0.2,0.2-0.1,0.4l0.1,0.2l-0.3,0L61,53.5
	c0,0-0.1-0.1-0.1-0.1s-0.1,0.1-0.2,0.2L60.3,53.7"/>
<path class="st15" d="M34.7,34.7c-0.1,0-0.1,0-0.1,0c-0.1-0.1-0.2-0.3-0.2-0.4c0-0.1,0-0.2,0-0.3c0,0,0.1-0.2,0.3-0.3l0.2-0.1
	l0.8,0.3c-0.1,0.1-0.2,0.3-0.4,0.4C35.2,34.5,35,34.7,34.7,34.7"/>
<path class="st13" d="M35.7,33.9l-0.8-0.3c0.2-0.1,0.4-0.1,0.7-0.1l0,0c0.2,0,0.4,0.1,0.4,0.2C35.9,33.7,35.8,33.8,35.7,33.9"/>
<path class="st14" d="M40.1,48.8c-0.1,0-0.2,0-0.2-0.1c-0.3-0.2-0.5-0.5-0.6-0.8c-0.2-0.3-0.2-0.7,0-0.8c0.1-0.1,0.2-0.1,0.3-0.1
	c0.1,0,0.2,0,0.2,0.1c0.2,0.2,0.2,0.4,0.2,0.6c-0.1,0.2,0,0.5,0.2,0.6c0.2,0.1,0.2,0.3,0.1,0.4C40.3,48.7,40.2,48.8,40.1,48.8"/>
<path class="st16" d="M36,36.7L36,36.7 M35.9,36.6c-0.1,0-0.1,0-0.2,0c-0.1,0-0.1,0-0.2,0h-0.2c-0.4,0-0.7-0.2-1-0.4
	c-0.4-0.3-0.6-0.6-0.4-0.7s0.2-0.4,0-0.6c-0.1-0.2-0.3-0.3-0.5-0.5c-0.1,0-0.2-0.1-0.2-0.2c0-0.1-0.1-0.2,0-0.3c0-0.1,0-0.1,0-0.2
	c0-0.1-0.1-0.1-0.2-0.1l0,0c-0.1,0-0.3-0.3-0.5-0.7c-0.1-0.1-0.1-0.3-0.1-0.4c0-0.1,0-0.2,0.1-0.2h0.1c0.1,0,0.2-0.1,0.2-0.2l0,0
	c0,0,0.1,0.2,0.2,0.4c0,0.1,0.1,0.2,0.1,0.3c0.1,0.2,0.2,0.3,0.3,0.3c0.1,0,0.2,0.1,0.2,0.2c0,0.1,0.1,0.1,0.2,0.2h0
	c0.2,0,0.3-0.1,0.4-0.2l0,0c0.2-0.1,0.3-0.3,0.5-0.5c0-0.1,0.1-0.1,0.1-0.2l0.3-0.3c0.2-0.1,0-0.3-0.3-0.3c-0.4-0.1-0.8-0.3-1-0.6
	l0,0c-0.3-0.4-0.5-0.9-0.7-1.5c-0.1-0.6-0.1-1.1,0-1.7c0.1-0.6,0.3-1.1,0.6-1.6c0.3-0.5,0.6-0.9,1-1.3c0.1-0.1,0.1-0.1,0.2-0.1
	c0.2,0,0.3,0.3,0.4,0.8c0,0.6,0.2,1.2,0.5,1.7c0.3,0.3,0.5,0.5,0.8,0.9c0.1,0.2,0.3,0.4,0.5,0.6l0,0c0.3-0.1,0.5-0.2,0.7-0.4
	c0.3-0.2,0.5-0.5,0.5-0.5s-0.1-0.1-0.3-0.2c-0.1,0-0.2-0.1-0.3-0.2c0,0,0-0.1,0.1-0.1H38c0.1,0,0.2,0,0.2,0h0.1c0.1,0,0-0.1-0.1-0.1
	c-0.2-0.1-0.4-0.1-0.5-0.1c-0.2,0-0.2-0.1,0-0.2c0.1-0.1,0.2-0.1,0.4-0.1h0.2h0.5H39c0.2,0,0.3,0,0.5,0.1c0,0-0.1,0-0.1,0l-3.5,9.3
	 M34.9,33.7l-0.2,0.1c-0.2,0.1-0.4,0.2-0.3,0.3c0,0.1,0,0.2,0,0.3c0,0.2,0.1,0.3,0.2,0.4c0,0,0.1,0.1,0.1,0c0.2,0,0.5-0.2,0.6-0.4
	c0.1-0.2,0.3-0.3,0.4-0.4c0.1-0.1,0.1-0.2,0.2-0.3c0-0.1-0.1-0.2-0.4-0.2l0,0C35.3,33.6,35.1,33.6,34.9,33.7 M39.5,27.3L39.5,27.3"
	/>
<path class="st15" d="M38.2,36L38.2,36c-0.3,0-0.4-0.3-0.4-0.7v0c0-0.2,0-0.4,0-0.6l0.8,0.3c0,0.1,0.1,0.1,0.1,0.2
	c0,0.1,0.1,0.2,0.1,0.3c0,0.1,0,0.1,0,0.1c-0.1,0-0.2,0.1-0.2,0.2C38.5,35.9,38.3,36,38.2,36"/>
<path class="st13" d="M38.6,35l-0.8-0.3c0-0.1,0-0.2,0-0.3c0,0,0.1-0.1,0.1-0.1c0.1,0,0.2,0.1,0.3,0.2C38.3,34.6,38.4,34.8,38.6,35"
	/>
<path class="st17" d="M37.4,37.3H37c-0.5-0.1-1-0.3-1-0.5l0,0c0-0.1-0.1-0.1-0.1-0.2l0,0l3.5-9.3c0,0,0.1,0,0.1,0l0,0
	c0.1,0,0.2,0.1,0.3,0.1H40c0,0,0.1,0,0.1,0.1c0,0,0,0,0,0.1l-0.1,0.3c0,0.2-0.1,0.4-0.1,0.5c0,0.2-0.1,0.7-0.1,1c0,0.1,0,0.2,0,0.3
	c0,0.2,0,0.3,0.1,0.4c0.1,0.1,0.2,0.1,0.3,0.1h0.1c0.1,0,0.2-0.1,0.3-0.2c0.1-0.1,0.3-0.1,0.4-0.2l1-0.1c0.6-0.1,1.1-0.5,1.5-0.9
	c0.1-0.2,0.3-0.3,0.5-0.4c0.1,0,0.2,0.1,0.2,0.3l0,0c0,0.6-0.1,1.3-0.3,1.9c-0.2,0.6-0.4,1.2-0.8,1.8c-0.3,0.4-0.6,0.8-1,1.1
	c-0.4,0.2-0.8,0.4-1.2,0.5h-0.2c-0.4,0-0.7-0.1-1-0.3c-0.1-0.1-0.2-0.1-0.3-0.1c-0.2,0-0.3,0.1-0.3,0.3v0.3c0,0.2,0,0.5,0,0.6
	c0,0,0,0.1,0,0.1c0,0.2,0,0.3,0.1,0.5c0,0.1,0.1,0.2,0.2,0.3h0.1c0.1,0,0.2,0,0.2,0h0.1c0.1,0,0.1,0,0.2,0.1c0,0,0.1,0,0.1,0
	c0.2,0,0.4-0.1,0.6-0.2c0.1-0.1,0.3-0.1,0.4-0.1h0.1l0,0c0,0,0,0.1,0,0.1c0,0.1,0.1,0.2,0.2,0.2c0,0,0,0,0,0.1c0,0,0,0,0,0.1
	c-0.1,0.1-0.3,0.2-0.5,0.3c-0.2,0.1-0.4,0.2-0.7,0.2c0,0-0.1,0-0.1,0c0-0.1-0.1-0.1-0.2-0.1H40c-0.1,0-0.2,0.1-0.2,0.2l0,0
	c0,0-0.1,0.1-0.2,0.1H39c-0.1,0-0.2,0-0.3,0h-0.3c-0.3,0-0.5,0.2-0.5,0.3l0,0l0,0C37.8,37.1,37.7,37.2,37.4,37.3 M37.7,35.2
	L37.7,35.2c0,0.4,0.2,0.8,0.4,0.8h0.1c0.2,0,0.3-0.1,0.4-0.2c0-0.1,0.1-0.2,0.2-0.2c0,0,0,0,0-0.1c0-0.1,0-0.2-0.1-0.3
	c0-0.1-0.1-0.1-0.1-0.2c-0.1-0.2-0.2-0.4-0.4-0.5c-0.1-0.1-0.2-0.1-0.3-0.2c0,0-0.1,0-0.1,0.1c0,0.1,0,0.2,0,0.3
	C37.7,34.8,37.7,35,37.7,35.2"/>
<path class="st5" d="M65.4,44.5c0.4,1.6-0.6,3.1-2.2,3.5L14.1,59.1c-1.6,0.3-3.1-0.6-3.5-2.2L4.1,28.1c-0.4-1.6,0.6-3.1,2.2-3.5
	l49.1-11.2c1.6-0.4,3.1,0.6,3.5,2.2L65.4,44.5z"/>
<polygon class="st18" points="60.6,36.8 48.1,39.7 44.4,23.3 56.9,20.4 60.6,36.8 "/>
<g>
	<defs>
		<polyline id="SVGID_3_" points="60.6,36.8 48.1,39.7 44.4,23.3 56.9,20.4 60.6,36.8 		"/>
	</defs>
	<clipPath id="SVGID_4_">
		<use xlink:href="#SVGID_3_"  style="overflow:visible;"/>
	</clipPath>
	<g class="st19">
		<polygon class="st20" points="54.7,40.2 53.7,39.1 55.2,38.8 54.7,40.2 		"/>
	</g>
</g>
<polygon class="st11" points="58.8,39 50.7,40.8 50.5,40 58.6,38.1 58.8,39 "/>
<polygon class="st11" points="58.2,40.6 52,42 51.8,41.2 58,39.8 58.2,40.6 "/>
<path class="st21" d="M52.8,45.1c1.8-1.1,4.1-1.7,5.6-3.3c0.1,0,0.1-0.1,0-0.2c0,0-0.1-0.1-0.1,0c-0.7,0.2-1.3,0.4-2,0.7
	c-0.5,0.2-0.9,0.5-1.2,1c-0.2,0.4-0.1,0.9,0.2,1.2c0.4,0.3,1,0.3,1,1c0,0.2,0.2,0.2,0.2,0c0-0.4-0.2-0.7-0.5-0.8
	c-0.5-0.2-0.9-0.4-0.8-1s0.7-0.9,1.2-1.1c0.6-0.2,1.2-0.4,1.9-0.6c0-0.1-0.1-0.1-0.1-0.2c-1.5,1.6-3.8,2.2-5.6,3.3
	C52.6,45,52.7,45.2,52.8,45.1L52.8,45.1z"/>
<polygon class="st11" points="40.7,28.7 20.6,33.2 20.5,32.4 40.5,27.8 40.7,28.7 "/>
<polygon class="st11" points="34.5,31.9 21,35 20.8,34.1 34.3,31 34.5,31.9 "/>
<polygon class="st11" points="27.8,35.2 21.4,36.7 21.2,35.8 27.6,34.3 27.8,35.2 "/>
<polygon class="st11" points="27.6,37 21.8,38.3 21.6,37.5 27.5,36.2 27.6,37 "/>
<polygon class="st11" points="27,39 22.2,40 22,39.2 26.8,38.1 27,39 "/>
<polygon class="st11" points="32.1,39.6 22.6,41.8 22.4,40.9 31.9,38.7 32.1,39.6 "/>
<polygon class="st11" points="28.6,42.2 23,43.5 22.8,42.6 28.4,41.3 28.6,42.2 "/>
<polygon class="st11" points="26.6,44.4 23.4,45.2 23.2,44.3 26.4,43.6 26.6,44.4 "/>
<polygon class="st11" points="27.5,46 23.8,46.9 23.5,46 27.3,45.2 27.5,46 "/>
<polygon class="st11" points="33.6,46.4 24.1,48.6 23.9,47.7 33.5,45.5 33.6,46.4 "/>
<polygon class="st11" points="27.7,49.5 24.5,50.3 24.3,49.4 27.5,48.7 27.7,49.5 "/>
<polygon class="st11" points="29.7,50.9 24.9,52 24.7,51.1 29.5,50 29.7,50.9 "/>
<polygon class="st11" points="44.8,21.5 19.3,27.3 19.1,26.5 44.6,20.7 44.8,21.5 "/>
<polygon class="st11" points="12.9,25.4 13.1,26.2 13.1,26.2 13.3,27.1 50.1,18.7 49.9,17.9 49.9,17.9 49.7,17 12.9,25.4 "/>
<path class="st18" d="M18.6,28.9l0.4-0.1l0.3,1.3h0.2l-0.1-0.4c0,0,0-0.1,0-0.1c0,0,0,0,0.1,0 M19.5,29.7
	C19.5,29.7,19.5,29.7,19.5,29.7l0.1,0.5c0,0,0,0,0,0.1c0,0,0,0-0.1,0l-0.6,0.1c0,0-0.1,0-0.1,0c0,0,0,0,0-0.1c0,0,0-0.1,0-0.1
	c0,0,0,0,0.1,0l0.2-0.1l-0.2-1.1l-0.2,0.1h-0.1c0,0,0,0,0-0.1c0,0,0,0,0-0.1c0,0,0,0,0.1,0L19.5,29.7z"/>
<path class="st18" d="M20,28.6l0.6-0.1c0,0,0.1,0,0.1,0c0,0,0.1,0.1,0.1,0.1l0.1,0.5c0,0,0,0.1,0,0.1c0,0-0.1,0.1-0.1,0.1l-0.5,0.1
	l0.1,0.5l0.6-0.1H21c0,0,0,0,0,0.1c0,0,0,0,0,0.1c0,0,0,0-0.1,0L20.2,30l-0.1-0.6c0,0,0-0.1,0-0.1c0,0,0.1-0.1,0.1-0.1l0.5-0.1
	l-0.1-0.5L20,28.7c0,0,0,0-0.1,0c0,0,0,0,0.1,0C20,28.7,20,28.7,20,28.6C20,28.6,20,28.6,20,28.6L20,28.6z"/>
<path class="st18" d="M21.5,28.3l0.6-0.1c0,0,0.1,0,0.1,0c0,0,0.1,0.1,0.1,0.1l0.1,0.4c0,0,0,0.1,0,0.1v0.1l0.1,0.1c0,0,0,0.1,0,0.1
	l0.1,0.4c0,0,0,0.1,0,0.1c0,0-0.1,0.1-0.1,0.1l-0.6,0.1c0,0,0,0-0.1,0c0,0,0,0,0-0.1c0,0,0-0.1,0-0.1c0,0,0,0,0.1,0l0.6-0.1
	l-0.1-0.4c0,0,0,0,0-0.1c0,0,0,0-0.1,0l-0.3,0.1h-0.1c0,0,0,0,0-0.1c0,0,0,0,0-0.1c0,0,0,0,0.1,0l0.3-0.1c0,0,0,0,0,0c0,0,0,0,0-0.1
	l-0.1-0.4l-0.6,0.1c0,0-0.1,0-0.1,0c0,0,0,0,0-0.1c0,0,0,0,0-0.1c0,0,0,0,0.1,0L21.5,28.3z"/>
<path class="st18" d="M23.1,28l0.1,0.7l0.3-0.1l-0.1-0.5c0,0,0-0.1,0-0.1c0,0,0,0,0,0c0,0,0,0,0.1,0c0,0,0,0.1,0,0.1l0.1,0.5
	c0,0,0,0,0.1,0c0,0,0,0,0,0.1c0,0,0,0,0,0.1c0,0,0,0,0,0l0.1,0.4c0,0,0,0.1,0,0.1c0,0,0,0-0.1,0c0,0,0,0-0.1,0c0,0,0-0.1,0-0.1
	l-0.1-0.4l-0.5,0.1L22.9,28c0,0,0-0.1,0-0.1c0,0,0,0,0.1,0C23,27.9,23,27.9,23.1,28C23,28,23,28,23.1,28L23.1,28z"/>
<path class="st18" d="M24.5,27.6l0.6-0.1h0.1c0,0,0,0,0,0.1c0,0,0,0,0,0.1c0,0,0,0-0.1,0l-0.4,0.1l0.1,0.5l0.3-0.1c0,0,0.1,0,0.1,0
	c0,0,0.1,0.1,0.1,0.1l0.1,0.5c0,0,0,0.1,0,0.1c0,0-0.1,0.1-0.1,0.1L24.9,29h-0.1h-0.1h-0.1v0c0,0,0-0.1,0-0.1h0.1l0,0h0.1l0,0
	l0.4-0.1l-0.1-0.5l-0.5,0.1L24.5,27.6L24.5,27.6z"/>
<path class="st18" d="M26.1,28.2l0.1,0.3l0.5-0.1l-0.1-0.3L26.1,28.2z M25.8,27.2L25.8,27.2c0.1,0,0.1,0,0.1,0c0,0,0,0,0,0.1
	c0,0,0,0,0,0.1c0,0,0,0,0,0l0.1,0.6l0.5-0.1c0,0,0.1,0,0.1,0c0,0,0.1,0.1,0.1,0.1l0.1,0.2c0,0.1,0,0.1,0,0.2c0,0-0.1,0.1-0.1,0.1
	l-0.5,0.1c0,0-0.1,0-0.1,0c0,0-0.1-0.1-0.1-0.1L25.8,27.2C25.7,27.3,25.7,27.3,25.8,27.2C25.8,27.2,25.8,27.2,25.8,27.2L25.8,27.2z"
	/>
<path class="st18" d="M27.3,26.9l0.8-0.2l0.1,0.6l0,0c0,0,0,0,0,0l-0.2,0.4l0.1,0.4c0,0,0,0.1,0,0.1l0,0c0,0,0,0-0.1,0
	c0,0,0,0,0-0.1l-0.1-0.5c0,0,0,0,0,0c0,0,0,0,0,0l0.2-0.4L27.9,27l-0.5,0.1c0,0,0,0,0,0.1c0,0,0,0,0,0c0,0,0,0-0.1,0c0,0,0,0,0-0.1
	v-0.1C27.3,27,27.3,27,27.3,26.9C27.3,27,27.3,27,27.3,26.9L27.3,26.9z"/>
<path class="st18" d="M29,26.8l0.1,0.5h0.2l-0.1-0.5H29z M29,27.4l0.1,0.5l0.5-0.1l-0.1-0.5C29.5,27.3,29,27.4,29,27.4z M28.9,26.6
	l0.3-0.1c0,0,0,0,0.1,0c0,0,0,0,0,0.1l0.1,0.5c0,0,0.1,0,0.1,0c0,0,0.1,0.1,0.1,0.1l0.1,0.4c0,0.1,0,0.1,0,0.2
	c0,0.1-0.1,0.1-0.1,0.1L29.1,28c0,0-0.1,0-0.1,0c0,0-0.1-0.1-0.1-0.1l-0.1-0.4c0-0.1,0-0.1,0-0.2c0,0,0.1-0.1,0.1-0.1l-0.1-0.5
	C28.8,26.6,28.8,26.6,28.9,26.6C28.8,26.6,28.8,26.6,28.9,26.6L28.9,26.6z"/>
<path class="st18" d="M30.3,26.5l0.1,0.3l0.5-0.1l-0.1-0.3L30.3,26.5z M30.3,26.3l0.5-0.1c0,0,0.1,0,0.1,0c0,0,0.1,0.1,0.1,0.1
	l0.3,1.2c0,0,0,0.1,0,0.1c0,0,0,0,0,0h-0.1c0,0,0,0-0.1,0c0,0,0,0,0-0.1c0,0,0,0,0-0.1c0,0,0,0,0,0L31,26.9L30.5,27c0,0-0.1,0-0.1,0
	c0,0-0.1-0.1-0.1-0.1l-0.1-0.2c0-0.1,0-0.1,0-0.2C30.3,26.4,30.3,26.3,30.3,26.3L30.3,26.3z"/>
<path class="st18" d="M31.7,26.1l0.2,1.1l0.5-0.1L32.2,26L31.7,26.1L31.7,26.1z M31.7,25.9l0.5-0.1c0,0,0.1,0,0.2,0
	c0,0,0.1,0.1,0.1,0.1l0.2,1.1c0,0.1,0,0.1,0,0.2c0,0.1-0.1,0.1-0.1,0.1l-0.5,0.1c-0.1,0-0.1,0-0.2,0c0,0-0.1-0.1-0.1-0.1l-0.2-1.1
	c0-0.1,0-0.1,0-0.2C31.6,26,31.7,25.9,31.7,25.9L31.7,25.9z"/>
<path class="st18" d="M33.2,25.8l0.2,1.1l0.5-0.1l-0.2-1.1L33.2,25.8z M33.2,25.6l0.5-0.1c0,0,0.1,0,0.2,0c0,0,0.1,0.1,0.1,0.1
	l0.2,1.1c0,0.1,0,0.1,0,0.2c0,0.1-0.1,0.1-0.1,0.1l-0.5,0.1c0,0-0.1,0-0.2,0c0,0-0.1-0.1-0.1-0.1L33,25.9c0-0.1,0-0.1,0-0.2
	C33,25.6,33.1,25.6,33.2,25.6L33.2,25.6z"/>
<path class="st18" d="M34.6,25.5l0.2,1.1l0.5-0.1l-0.2-1.1L34.6,25.5z M34.6,25.3l0.5-0.1c0.1,0,0.1,0,0.2,0c0,0,0.1,0.1,0.1,0.1
	l0.2,1.1c0,0.1,0,0.1,0,0.2c0,0-0.1,0.1-0.1,0.1L35,26.7c0,0-0.1,0-0.2,0c0,0-0.1-0.1-0.1-0.1l-0.2-1.1c0-0.1,0-0.1,0-0.2
	C34.5,25.3,34.6,25.3,34.6,25.3L34.6,25.3z"/>
<path class="st18" d="M36.1,25.1l0.2,1.1l0.5-0.1L36.6,25L36.1,25.1L36.1,25.1z M36.1,24.9l0.5-0.1c0,0,0.1,0,0.2,0
	c0,0,0.1,0.1,0.1,0.1l0.2,1.1c0,0.1,0,0.1,0,0.2c0,0-0.1,0.1-0.1,0.1l-0.5,0.1c0,0-0.1,0-0.2,0c0,0-0.1-0.1-0.1-0.1l-0.2-1.1
	C35.9,25.1,35.9,25,36.1,24.9C36,25,36.1,25,36.1,24.9L36.1,24.9z"/>
<path class="st18" d="M37.5,24.8l0.2,1.1l0.5-0.1L38,24.7L37.5,24.8L37.5,24.8z M37.5,24.6l0.5-0.1c0,0,0.1,0,0.2,0
	c0,0,0.1,0.1,0.1,0.1l0.2,1.1c0,0.1,0,0.1,0,0.2c0,0-0.1,0.1-0.1,0.1l-0.5,0.1c0,0-0.1,0-0.2,0c0,0-0.1-0.1-0.1-0.1l-0.2-1.1
	c0-0.1,0-0.1,0-0.2C37.4,24.7,37.5,24.6,37.5,24.6L37.5,24.6z"/>
<path class="st18" d="M39,24.5l0.2,1.1l0.5-0.1l-0.2-1.1L39,24.5z M39,24.3l0.5-0.1c0,0,0.1,0,0.2,0c0,0,0.1,0.1,0.1,0.1l0.2,1.1
	c0,0.1,0,0.1,0,0.2c0,0-0.1,0.1-0.1,0.1l-0.5,0.1c0,0-0.1,0-0.2,0c0,0-0.1-0.1-0.1-0.1l-0.2-1.1c0-0.1,0-0.1,0-0.2
	C38.9,24.3,39,24.3,39,24.3L39,24.3z"/>
<path class="st18" d="M40.4,24.1l0.2,1.1l0.5-0.1L40.9,24L40.4,24.1L40.4,24.1z M40.4,24l0.5-0.1c0,0,0.1,0,0.2,0
	c0,0,0.1,0.1,0.1,0.1l0.2,1.1c0,0.1,0,0.1,0,0.2c0,0-0.1,0.1-0.1,0.1l-0.5,0.1c0,0-0.1,0-0.2,0c0,0-0.1-0.1-0.1-0.1l-0.2-1.1
	c0-0.1,0-0.1,0-0.2C40.4,24,40.4,24,40.4,24L40.4,24z"/>
<polygon class="st11" points="13.8,34.8 8.9,35.9 8.7,35.1 13.6,34 13.8,34.8 "/>
<polygon class="st11" points="16,36.1 9.2,37.6 9,36.8 15.8,35.2 16,36.1 "/>
<polygon class="st11" points="15.3,38 9.6,39.3 9.4,38.5 15.1,37.2 15.3,38 "/>
<polygon class="st11" points="15.2,39.8 10,41 9.8,40.2 15,39 15.2,39.8 "/>
<polygon class="st11" points="16.1,41.4 12.9,42.2 12.7,41.3 15.9,40.6 16.1,41.4 "/>
<polygon class="st11" points="17.4,42.9 13.3,43.9 13.1,43 17.2,42.1 17.4,42.9 "/>
<polygon class="st11" points="19.3,44.3 13.6,45.6 13.5,44.7 19.1,43.5 19.3,44.3 "/>
<polygon class="st11" points="16.5,46.7 11.6,47.8 11.4,47 16.3,45.9 16.5,46.7 "/>
<polygon class="st11" points="21.3,47.4 11.9,49.5 11.8,48.7 21.1,46.6 21.3,47.4 "/>
<polygon class="st11" points="18.5,49.8 12.3,51.2 12.1,50.4 18.3,49 18.5,49.8 "/>
<polygon class="st11" points="21.6,50.9 12.7,52.9 12.5,52.1 21.4,50.1 21.6,50.9 "/>
<polygon class="st11" points="20.6,52.9 13.1,54.7 12.9,53.8 20.4,52.1 20.6,52.9 "/>
<polygon class="st11" points="10.9,32.1 8.1,32.8 7.8,31.2 10.5,30.6 10.9,32.1 "/>
<polygon class="st18" points="60.6,36.8 48.1,39.7 44.4,23.3 56.9,20.4 60.6,36.8 "/>
<g>
	<defs>
		<polygon id="SVGID_5_" points="60.6,36.8 48.1,39.7 44.4,23.3 56.9,20.4 60.6,36.8 		"/>
	</defs>
	<clipPath id="SVGID_6_">
		<use xlink:href="#SVGID_5_"  style="overflow:visible;"/>
	</clipPath>
	<g class="st22">
		<path class="st23" d="M58.6,35l4.3,2.2c0.7,0.4,1,1.2,0.6,1.9l0,0c-0.3,0.7-1.2,1-1.9,0.7l-3.6-1.7L58.6,35z"/>
		<path class="st23" d="M62.5,31.6l-1.4,6.6c-0.1,0.7,0.3,1.4,1,1.5c0,0,0,0,0.1,0l0,0c0.7,0.1,1.4-0.4,1.5-1.1c0-0.1,0-0.1,0-0.2
			l0.2-6.9L62.5,31.6z"/>
		<path class="st23" d="M64.9,28.2c-0.1-0.1-0.2-0.1-0.3,0c0,0,0,0,0,0L64,29.5v-1.8c0-0.1-0.1-0.2-0.2-0.2c-0.1,0-0.1,0.1-0.2,0.2
			l-0.2,1.7l-0.2-2c0-0.1-0.1-0.2-0.2-0.2c-0.1,0-0.2,0.1-0.2,0.2v1.9l-0.3-1.6c0-0.1-0.1-0.2-0.3-0.2c0,0,0,0,0,0
			c-0.1,0-0.2,0.2-0.2,0.3l0.2,2.2l-0.3-0.6c-0.1-0.1-0.2-0.2-0.4-0.1c0,0,0,0,0,0c-0.1,0.1-0.1,0.2-0.1,0.3
			c0.1,0.8,0.4,1.5,0.8,2.1h1.5c0.4-0.5,0.6-1.1,0.6-1.8l0.5-1.4C65,28.4,65,28.3,64.9,28.2z"/>
		<path class="st24" d="M55.3,33.7c1.9,0,4.7,1.5,4.7,1.5l-0.8,3.4l-2.8-1.3L55.3,33.7z"/>
		<path class="st23" d="M52.6,46.9l-3.3-4.8l2.6-3.4l-2.9-1.2l-1.9,2.7c-0.8,1.1-1,2.2,0,3.1l4.5,4.6L52.6,46.9z"/>
		<path class="st23" d="M52.2,46.7c0,0,0.6-0.1,0.8,1.3s0.7,2.2-0.3,2.4s-2.6-0.5-1.6-1.7l0.3-1.2L52.2,46.7z"/>
		<path class="st24" d="M51.6,34.7c-1.4,0.6-3.5,3.5-3.5,3.5l2.1,2.7l2-2.4L51.6,34.7z"/>
		<path class="st24" d="M51.6,34.7c-0.6,0.4-1.1,1-1.5,1.5l3,7.1l5.1-1.5l-0.8-7.1c-0.1-0.4-0.4-0.7-0.8-0.8l-1.3-0.3
			C54.1,34.2,52.9,34.5,51.6,34.7z"/>
		<line class="st25" x1="51.5" y1="39.6" x2="50.9" y2="38.2"/>
		<line class="st25" x1="57.8" y1="38" x2="57.6" y2="36.5"/>
		<polygon class="st26" points="65.8,70.4 65.1,66.4 63.1,66.8 64.2,70.9 65.8,70.4 		"/>
		<path class="st27" d="M63.7,70.1c0,0,1.6,0.3,2-0.9l4,1.1l-6.1,1.4L63.7,70.1z"/>
		<rect x="63.6" y="71" transform="matrix(0.974 -0.2267 0.2267 0.974 -14.4177 16.9872)" class="st28" width="6.3" height="0.6"/>
		<polygon class="st27" points="63.5,68.2 65.4,68.2 65.3,67.7 		"/>
		<polygon class="st26" points="56.8,72.6 56.4,68.5 58.3,67.9 58.5,72.3 56.8,72.6 		"/>
		<path class="st27" d="M58.7,71.3c0,0-1.3,1-2.2,0.2l-3.1,2.8l6.1-1.5L58.7,71.3z"/>
		
			<rect x="53.4" y="73.5" transform="matrix(0.9709 -0.2396 0.2396 0.9709 -16.0168 15.6929)" class="st28" width="6.3" height="0.6"/>
		<polygon class="st27" points="56.5,69.7 58.4,69.9 58.4,69.3 		"/>
		<path class="st29" d="M53.1,43.3c-0.5,1.8-0.7,3.7-0.6,5.5c0.1,4.1,2.8,21,2.8,21l4.8-0.9l-2.5-19.1L62,68.5l4.6-1.1
			c0,0-3.5-22.7-8.5-25.5L53.1,43.3z"/>
		<line class="st30" x1="55.7" y1="49.3" x2="57.6" y2="49.9"/>
		<line class="st30" x1="61.5" y1="66.3" x2="66.3" y2="65.1"/>
		<line class="st30" x1="55" y1="67.9" x2="59.7" y2="66.7"/>
		<path class="st31" d="M56.7,29.6c-0.5-0.8-1-1.5-1.6-2.1c-0.4-0.5-0.8-1-1.4-1.3l0,0c-0.7-0.4-1.5-0.5-2.3-0.3
			c-0.8,0.2-1.4,0.6-1.9,1.3l0,0c-0.4,0.6-0.6,1.2-0.7,1.9c-0.2,0.9-0.4,1.7-0.5,2.6c0,1.2,0.9,2.3,2.2,2.3c0.1,0,0.2,0,0.3,0
			c-0.2-0.1-0.3-0.3-0.4-0.5c0.5,0.5,1.3,0.6,2,0.5l1.9-0.5c0.7-0.2,1.2-0.7,1.5-1.3c0,0.2,0,0.5-0.2,0.7c1.1-0.4,1.7-1.7,1.3-2.9
			C56.8,29.8,56.7,29.7,56.7,29.6z"/>
		<path class="st23" d="M52,32.4l0.5,1.8c0.1,0.6,0.5,0.4,1,0.3l0,0c0.5-0.1,0.9-0.3,0.8-0.8l-0.7-2.5L52,32.4z"/>
		<polygon class="st31" points="54.2,33 52,32.5 53.7,31.6 		"/>
		<path class="st23" d="M52.4,34.1l-1,0.7c0,0,2.5,0.6,4-1.1l-1.1-0.1L52.4,34.1z"/>
		<path class="st31" d="M54.7,28c0.4,1.4-0.4,3-1.8,3.4c-1.4,0.4-3-0.4-3.4-1.8c0-0.1-0.1-0.2-0.1-0.3c-0.3-1.5,0.7-2.9,2.2-3.2
			C53,25.9,54.3,26.7,54.7,28z"/>
		<path class="st23" d="M55.5,29.3c0.1,0.4-0.1,0.8-0.5,0.9c-0.4,0.1-0.8-0.1-0.9-0.5s0.1-0.8,0.5-0.9C55,28.6,55.4,28.9,55.5,29.3
			L55.5,29.3z"/>
		<path class="st32" d="M54.4,29.7c0-0.3,0.3-0.5,0.5-0.5"/>
		<circle class="st23" cx="49.9" cy="30.6" r="0.7"/>
		<path class="st32" d="M50.4,30.7c-0.2-0.2-0.5-0.3-0.7-0.2"/>
		<path class="st23" d="M54.3,28.2c0.2,0.8,0.3,1.5,0.3,2.3c0,0.6-0.3,1.1-0.7,1.5l-0.1,0.1c-0.5,0.5-1.2,0.6-1.8,0.4l0,0
			c-0.6-0.1-1.1-0.5-1.4-1c-0.3-0.7-0.6-1.4-0.8-2.2c-0.4-1.1,0.1-2.3,1.2-2.7c0.1-0.1,0.3-0.1,0.4-0.1c1.1-0.4,2.4,0.2,2.7,1.4
			C54.2,28,54.2,28.1,54.3,28.2z"/>
		<path class="st31" d="M53.1,26.4c0,0-0.1,2.8-3.6,3.3c0,0-0.3-2.6,1.3-3.2C50.8,26.5,52.3,25.9,53.1,26.4z"/>
		<path class="st31" d="M52.2,26.3c0.4,1.1,1.2,1.9,2.2,2.4v-0.9c-0.1-1-1-1.7-2-1.6C52.3,26.3,52.2,26.3,52.2,26.3z"/>
		<polygon class="st31" points="50.3,29.1 50.1,30.3 49.7,29.2 		"/>
		<polygon class="st31" points="53.8,28.2 54.4,29.1 54.3,28.1 		"/>
		<path class="st31" d="M51.4,29.9c0,0.1,0,0.2-0.2,0.3c0,0,0,0,0,0c-0.1,0-0.2-0.1-0.3-0.2c0-0.1,0-0.2,0.1-0.3c0,0,0,0,0,0
			C51.3,29.7,51.4,29.8,51.4,29.9C51.4,29.9,51.4,29.9,51.4,29.9z"/>
		<path class="st31" d="M53.5,29.4c0,0.1-0.1,0.2-0.2,0.3c-0.1,0-0.2,0-0.3-0.1c0,0,0,0,0,0c0-0.1,0-0.2,0.2-0.3c0,0,0,0,0,0
			C53.3,29.2,53.5,29.3,53.5,29.4z"/>
		<path class="st33" d="M52.3,30.1l0.1,0.3c0,0.1,0.1,0.1,0.1,0.1c0,0,0,0,0,0l0.2-0.1"/>
		<path class="st31" d="M51,29.1c0,0,0.4-0.2,0.5,0c0,0,0,0.1-0.3,0.3s-0.7,0.2-0.7,0.1S50.8,29.2,51,29.1z"/>
		<path class="st31" d="M53,28.6c0,0-0.5,0-0.5,0.2c0,0,0,0.1,0.5,0.1s0.7-0.1,0.7-0.3S53.3,28.5,53,28.6z"/>
		<path class="st28" d="M51.7,31.1l1.7-0.4c0,0,0,0.5-0.8,0.6C52.3,31.5,52,31.4,51.7,31.1z"/>
	</g>
</g>
</svg>
