<?xml version="1.0" encoding="utf-8"?>
<!-- Generator: Adobe Illustrator 24.0.0, SVG Export Plug-In . SVG Version: 6.00 Build 0)  -->
<svg version="1.1" id="Layer_1" xmlns="http://www.w3.org/2000/svg" xmlns:xlink="http://www.w3.org/1999/xlink" x="0px" y="0px"
	 viewBox="0 0 88 88" style="enable-background:new 0 0 88 88;" xml:space="preserve">
<style type="text/css">
	.st0{fill:#FFCC2C;}
	.st1{clip-path:url(#SVGID_4_);}
	.st2{fill:#F7941D;}
	.st3{fill:#E51B8D;}
	.st4{fill:#FFFFFF;}
	.st5{fill:#CBE9E9;}
	.st6{fill:#ACDDDB;}
	.st7{fill:#F09BC2;}
	.st8{fill:#DE96C1;}
	.st9{fill:#E6E9F6;}
	.st10{fill:#BDD9E2;}
	.st11{fill:#F8CCE0;}
	.st12{fill:#A5D0D4;}
	.st13{fill:#D3DBEF;}
	.st14{fill:#CF92C0;}
	.st15{fill:#DEF1F0;}
	.st16{fill:#CCEAE7;}
	.st17{fill:#EDF7F7;}
	.st18{fill:#E4F3F1;}
	.st19{fill:#CFD8EE;}
	.st20{fill:#90ACD9;}
	.st21{fill:#7C9ACF;}
	.st22{fill:#00AEEF;}
	.st23{fill:#00B9F2;}
	.st24{fill:#F3AFCD;}
	.st25{fill:#EAEDF7;}
	.st26{fill:#E3AACC;}
	.st27{clip-path:url(#SVGID_6_);}
</style>
<title>Artboard 22_1</title>
<g>
	<defs>
		<rect id="SVGID_1_" y="-99" width="88" height="88"/>
	</defs>
	<clipPath id="SVGID_2_">
		<use xlink:href="#SVGID_1_"  style="overflow:visible;"/>
	</clipPath>
</g>
<rect class="st0" width="88" height="88"/>
<g>
	<defs>
		<rect id="SVGID_3_" width="88" height="88"/>
	</defs>
	<clipPath id="SVGID_4_">
		<use xlink:href="#SVGID_3_"  style="overflow:visible;"/>
	</clipPath>
	<g class="st1">
		<circle class="st2" cx="44" cy="83.6" r="44.2"/>
	</g>
</g>
<path class="st3" d="M42.4,54.9c0.9,0.6,1.1,1.9,0.5,2.8c0,0,0,0.1-0.1,0.1L38,64.1c-0.7,0.9-1.9,1.2-2.9,0.5
	c-0.9-0.7-1.2-1.9-0.5-2.9c0,0,0.1-0.1,0.1-0.1l4.8-6.3C40.2,54.3,41.5,54.2,42.4,54.9C42.4,54.9,42.4,54.9,42.4,54.9"/>
<path class="st4" d="M42.4,54.9c-0.9-0.7-2.2-0.5-2.9,0.4c0,0,0,0,0,0l-2.4,3.1c0.6,1.3,1.8,2.3,3.2,2.6l2.5-3.2
	C43.5,56.9,43.4,55.6,42.4,54.9C42.5,54.9,42.4,54.9,42.4,54.9"/>
<path class="st3" d="M35.5,65.2c-0.8,0.8-2.1,0.9-2.9,0.1l-5.8-5.5c-0.9-0.7-0.9-2.1-0.2-2.9s2.1-0.9,2.9-0.2c0,0,0.1,0.1,0.1,0.1
	l5.8,5.4C36.2,63.1,36.3,64.4,35.5,65.2"/>
<path class="st3" d="M57.7,62.7c1,0.5,2.2,0.1,2.7-1c0,0,0,0,0,0l3.5-7.2c0.5-1,0.1-2.3-1-2.8s-2.3-0.1-2.8,1l-3.5,7.2
	C56.2,60.9,56.6,62.1,57.7,62.7C57.7,62.6,57.7,62.6,57.7,62.7"/>
<path class="st4" d="M57.7,62.7c-1-0.5-1.5-1.7-1-2.7c0,0,0,0,0,0l1.7-3.5c1.5-0.1,2.8,0.6,3.8,1.7l-1.7,3.6
	C59.9,62.7,58.7,63.2,57.7,62.7C57.7,62.7,57.7,62.7,57.7,62.7"/>
<path class="st3" d="M56.5,63.6c-1,0.5-2.3,0-2.7-1c0,0,0,0,0,0l-3.5-7.2c-0.6-0.9-0.4-2.2,0.6-2.9c0.9-0.6,2.2-0.4,2.9,0.6
	c0.1,0.2,0.2,0.3,0.2,0.5l3.5,7.2C57.9,61.8,57.5,63.1,56.5,63.6C56.5,63.6,56.5,63.6,56.5,63.6"/>
<path class="st4" d="M56.5,63.6c1-0.5,1.5-1.7,1-2.7c0,0,0,0,0,0l-1.7-3.5c-1.5-0.1-2.9,0.6-3.8,1.7l1.8,3.6
	C54.2,63.7,55.5,64.1,56.5,63.6C56.5,63.6,56.5,63.6,56.5,63.6"/>
<path class="st3" d="M49.4,62.1c-1,0.5-2.3,0-2.7-1c0,0,0,0,0,0L43.2,54c-0.5-1-0.1-2.3,0.9-2.8c1-0.5,2.3-0.1,2.8,0.9
	c0,0,0,0,0,0.1l3.5,7.2C50.8,60.4,50.4,61.6,49.4,62.1C49.4,62.1,49.4,62.1,49.4,62.1"/>
<path class="st4" d="M49.4,62.1c1-0.5,1.5-1.7,1-2.7c0,0,0,0,0,0l-1.7-3.5c-1.5-0.1-2.8,0.6-3.8,1.7l1.8,3.6
	C47.2,62.2,48.4,62.7,49.4,62.1C49.4,62.2,49.4,62.2,49.4,62.1"/>
<path class="st3" d="M31.8,59.1c-1.1,0.3-2.2-0.3-2.5-1.4L27.1,50c-0.3-1.1,0.3-2.2,1.4-2.6c1.1-0.3,2.2,0.3,2.6,1.4l2.1,7.7
	C33.5,57.6,32.9,58.8,31.8,59.1C31.8,59.1,31.8,59.1,31.8,59.1"/>
<path class="st4" d="M31.8,59.1c1.1-0.3,1.7-1.4,1.4-2.5c0,0,0,0,0,0l-1-3.8c-1.4-0.3-2.9,0.1-4,1l1.1,3.9
	C29.6,58.8,30.7,59.4,31.8,59.1"/>
<path class="st3" d="M29.4,65.2c-1.1,0.3-2.2-0.4-2.5-1.5l-2-7.7c-0.3-1.1,0.4-2.2,1.5-2.5c1.1-0.3,2.2,0.4,2.5,1.5l2,7.7
	C31.2,63.8,30.5,65,29.4,65.2"/>
<path class="st4" d="M29.4,65.2c1.1-0.3,1.8-1.4,1.5-2.5l-1-3.7c-1.4-0.3-2.9,0-4,0.9l1,3.9C27.2,64.9,28.3,65.6,29.4,65.2"/>
<path class="st3" d="M49.4,56.1c0.8,0.8,0.7,2.1-0.1,2.9l-5.8,5.4c-0.8,0.8-2.1,0.8-2.9,0c-0.8-0.8-0.8-2.1,0-2.9
	c0,0,0.1-0.1,0.1-0.1l5.8-5.4C47.3,55.2,48.6,55.3,49.4,56.1"/>
<path class="st4" d="M49.4,56.1c-0.8-0.8-2.1-0.9-2.9-0.1l-2.8,2.7c0.4,1.4,1.4,2.5,2.7,3.1l2.9-2.8C50.1,58.2,50.1,56.9,49.4,56.1"
	/>
<path class="st3" d="M43.9,59.7c-0.6,1-1.9,1.3-2.8,0.7c0,0,0,0,0,0l-6.8-4.2c-1-0.6-1.3-1.9-0.7-2.8c0.6-1,1.9-1.3,2.8-0.7l6.8,4.2
	C44.2,57.5,44.5,58.7,43.9,59.7"/>
<path class="st4" d="M43.9,59.7c0.6-1,0.3-2.2-0.7-2.8l-3.3-2c-1.3,0.7-2.1,2-2.3,3.5l3.4,2.1C42,61,43.3,60.7,43.9,59.7
	C43.9,59.8,43.9,59.8,43.9,59.7"/>
<path class="st3" d="M46.3,63.3c0.1,1.1-0.8,2.1-1.9,2.2l-7.9,0.6c-1.1,0-2-1-2-2.1c0-1,0.7-1.8,1.7-2l7.9-0.6
	C45.2,61.3,46.2,62.2,46.3,63.3"/>
<path class="st4" d="M46.3,63.3c-0.1-1.1-1.1-2-2.2-1.9l-3.9,0.3c-0.6,1.3-0.5,2.8,0.2,4.1l4-0.3C45.5,65.4,46.3,64.4,46.3,63.3"/>
<path class="st3" d="M55.5,54.5c1-0.6,2.2-0.3,2.8,0.7c0,0,0,0,0,0l4.1,6.8c0.5,1,0.1,2.3-0.9,2.8c-0.9,0.5-2.1,0.2-2.7-0.7
	l-4.1-6.8C54.2,56.4,54.6,55.1,55.5,54.5C55.5,54.5,55.5,54.5,55.5,54.5"/>
<path class="st4" d="M55.5,54.5c-1,0.6-1.3,1.9-0.7,2.8c0,0,0,0,0,0l2,3.3c1.4-0.1,2.8-0.8,3.6-2l-2.1-3.5
	C57.8,54.2,56.5,53.9,55.5,54.5C55.5,54.5,55.5,54.5,55.5,54.5"/>
<path class="st3" d="M61.5,64.1c-0.2,1.1-1.2,1.9-2.4,1.7l-7.8-1.3c-1.1-0.2-1.9-1.3-1.7-2.4s1.3-1.9,2.4-1.7l0,0l7.8,1.2
	C61,61.9,61.7,63,61.5,64.1"/>
<path class="st4" d="M61.5,64.1c0.2-1.1-0.6-2.2-1.7-2.4l-3.9-0.6c-0.9,1.2-1.2,2.7-0.8,4l4,0.6C60.3,66,61.3,65.2,61.5,64.1"/>
<path class="st3" d="M56.8,60.8c0.3,1.1-0.3,2.2-1.4,2.6l-7.6,2.2c-1.1,0.3-2.3-0.3-2.6-1.4c-0.3-1.1,0.3-2.3,1.4-2.6l7.6-2.2
	C55.3,59,56.4,59.7,56.8,60.8"/>
<path class="st4" d="M56.8,60.8c-0.3-1.1-1.5-1.7-2.5-1.4l-3.8,1.1c-0.3,1.4,0.1,2.9,1,4l3.9-1.1C56.4,63,57,61.9,56.8,60.8"/>
<path class="st3" d="M32.2,62c-1-0.5-1.4-1.7-0.9-2.8l3.5-7.1c0.5-1,1.7-1.4,2.8-0.9c1,0.5,1.4,1.7,0.9,2.8L35,61
	C34.5,62,33.3,62.4,32.2,62"/>
<path class="st4" d="M32.2,62c1,0.5,2.3,0.1,2.8-1c0,0,0,0,0,0l1.7-3.5c-0.8-1.2-2.2-1.9-3.6-1.9l-1.8,3.6
	C30.8,60.2,31.2,61.5,32.2,62C32.2,62,32.2,62,32.2,62"/>
<path class="st3" d="M46.1,36.2c-0.9,0.7-1.1,1.9-0.5,2.9c0,0,0,0,0,0l4.6,6.5c0.7,0.9,1.9,1.1,2.9,0.5s1.1-1.9,0.5-2.9l0,0L49,36.7
	C48.3,35.8,47.1,35.5,46.1,36.2"/>
<path class="st4" d="M46.1,36.2c0.9-0.7,2.2-0.4,2.9,0.5l2.3,3.2c-0.6,1.3-1.9,2.2-3.3,2.5l-2.3-3.3C44.9,38.1,45.1,36.9,46.1,36.2
	C46.1,36.2,46.1,36.2,46.1,36.2"/>
<path class="st3" d="M52.6,46.8c0.7,0.9,2.1,0.9,2.9,0.2c0,0,0,0,0,0l6-5.2c0.9-0.7,1-2,0.3-2.9c-0.7-0.9-2-1-2.9-0.3
	c0,0-0.1,0.1-0.1,0.1l-6,5.2C52,44.7,51.9,46,52.6,46.8C52.6,46.8,52.6,46.8,52.6,46.8"/>
<path class="st4" d="M52.6,46.8c-0.7-0.9-0.7-2.2,0.2-2.9c0,0,0,0,0,0l2.9-2.6c1.4,0.5,2.4,1.6,2.8,3l-3,2.7
	C54.7,47.7,53.4,47.7,52.6,46.8C52.7,46.8,52.7,46.8,52.6,46.8"/>
<path class="st3" d="M30.6,43.4c-1,0.5-2.3,0-2.7-1.1l-3.2-7.3c-0.5-1,0-2.3,1.1-2.7c1-0.5,2.3,0,2.7,1.1l3.2,7.3
	C32.1,41.8,31.6,43,30.6,43.4"/>
<path class="st4" d="M30.6,43.4c1-0.5,1.5-1.7,1.1-2.7l-1.6-3.6c-1.4-0.1-2.9,0.5-3.8,1.5l1.6,3.7C28.3,43.4,29.5,43.9,30.6,43.4"/>
<path class="st3" d="M31.7,44.4c1,0.5,2.3,0.1,2.8-0.9l3.7-7c0.5-1,0.1-2.3-0.9-2.8s-2.3-0.1-2.8,0.9l0,0l-3.7,7
	C30.3,42.6,30.7,43.8,31.7,44.4C31.7,44.4,31.7,44.4,31.7,44.4"/>
<path class="st4" d="M31.7,44.4c-1-0.5-1.4-1.8-0.9-2.8c0,0,0,0,0,0l1.8-3.5c1.5,0,2.8,0.7,3.7,1.8l-1.9,3.6
	C33.9,44.5,32.7,44.9,31.7,44.4"/>
<path class="st3" d="M38.8,43.2c1,0.5,2.3,0.1,2.8-0.9l3.7-7c0.5-1,0.1-2.3-0.9-2.8s-2.3-0.1-2.8,0.9l-3.7,7
	C37.5,41.4,37.8,42.7,38.8,43.2"/>
<path class="st4" d="M38.8,43.2c-1-0.5-1.4-1.8-0.8-2.8l1.8-3.4c1.5,0,2.8,0.7,3.7,1.8l-1.9,3.6C41.1,43.4,39.9,43.8,38.8,43.2"/>
<path class="st3" d="M56.5,40.8c1.1,0.3,2.2-0.3,2.6-1.3l2.4-7.6c0.3-1.1-0.3-2.2-1.3-2.6s-2.2,0.3-2.6,1.3l-2.4,7.6
	C54.9,39.3,55.5,40.5,56.5,40.8"/>
<path class="st4" d="M56.5,40.8c-1.1-0.3-1.7-1.5-1.3-2.6l1.2-3.7c1.4-0.3,2.9,0.1,4,1.1l-1.2,3.8C58.8,40.6,57.7,41.2,56.5,40.8"/>
<path class="st3" d="M58.7,47c1.1,0.3,2.2-0.3,2.6-1.4c0,0,0,0,0,0l2.3-7.6c0.3-1.1-0.3-2.3-1.4-2.6c-1.1-0.3-2.3,0.3-2.6,1.4l0,0
	l-2.3,7.6C56.9,45.5,57.6,46.7,58.7,47C58.7,47,58.7,47,58.7,47"/>
<path class="st4" d="M58.7,47c-1.1-0.3-1.7-1.5-1.4-2.6l1.1-3.7c1.4-0.3,2.9,0.1,4,1.1l-1.2,3.8C60.9,46.7,59.8,47.3,58.7,47
	C58.7,47,58.7,47,58.7,47"/>
<path class="st3" d="M39.1,37.2c-0.8,0.8-0.8,2.1,0,2.9l5.6,5.7c0.8,0.8,2.1,0.8,2.9,0c0.8-0.8,0.8-2.1,0-2.9L42,37.2
	C41.2,36.4,39.9,36.4,39.1,37.2"/>
<path class="st4" d="M39.1,37.2c0.8-0.8,2.1-0.8,2.9,0l2.8,2.8c-0.4,1.4-1.5,2.5-2.8,3l-2.8-2.9C38.3,39.3,38.3,38,39.1,37.2"/>
<path class="st3" d="M44.4,41c0.6,1,1.8,1.3,2.8,0.8c0,0,0,0,0,0l6.9-3.9c1-0.5,1.5-1.7,1-2.7s-1.7-1.5-2.7-1
	c-0.1,0-0.2,0.1-0.3,0.1l-6.9,3.9C44.2,38.7,43.9,40,44.4,41C44.4,41,44.4,41,44.4,41"/>
<path class="st4" d="M44.4,41c-0.6-1-0.2-2.2,0.8-2.8c0,0,0,0,0,0l3.4-1.9c1.2,0.8,2,2.1,2.1,3.5l-3.5,2C46.2,42.3,45,42,44.4,41
	C44.4,41,44.4,41,44.4,41"/>
<path class="st3" d="M41.9,44.5c-0.1,1.1,0.7,2.1,1.8,2.3l7.9,0.9c1.1,0.1,2.2-0.7,2.3-1.8c0.1-1.1-0.7-2.2-1.8-2.3l-7.9-0.9
	C43.1,42.5,42.1,43.3,41.9,44.5C41.9,44.5,41.9,44.5,41.9,44.5"/>
<path class="st4" d="M41.9,44.5c0.1-1.1,1.1-1.9,2.3-1.8c0,0,0,0,0,0l3.9,0.4c0.5,1.3,0.4,2.9-0.3,4.1l-4-0.4
	C42.6,46.6,41.8,45.6,41.9,44.5"/>
<path class="st3" d="M33,35.3c-1-0.6-2.2-0.3-2.9,0.6l-4.4,6.7c-0.6,1-0.2,2.3,0.8,2.8c0.9,0.5,2.1,0.3,2.7-0.6l4.3-6.7
	C34.2,37.2,34,36,33,35.3"/>
<path class="st4" d="M33,35.3c1,0.6,1.2,1.9,0.6,2.9l-2.1,3.3c-1.4-0.1-2.8-0.9-3.5-2.2l2.2-3.4C30.8,35,32,34.7,33,35.3"/>
<path class="st3" d="M26.7,44.7c0.1,1.1,1.2,1.9,2.3,1.8c0,0,0,0,0,0l7.9-1c1.1-0.1,1.9-1.2,1.8-2.3c-0.1-1.1-1.2-1.9-2.3-1.8
	l-7.9,1C27.4,42.6,26.6,43.6,26.7,44.7C26.7,44.7,26.7,44.7,26.7,44.7"/>
<path class="st4" d="M26.7,44.7c-0.1-1.1,0.7-2.2,1.8-2.3c0,0,0,0,0,0l3.9-0.4c0.8,1.2,1.1,2.6,0.7,4l-4,0.5
	C27.9,46.6,26.8,45.8,26.7,44.7C26.7,44.7,26.7,44.7,26.7,44.7"/>
<path class="st3" d="M31.5,41.6c-0.4,1.1,0.2,2.2,1.3,2.6c0,0,0,0,0,0l7.5,2.5c1.1,0.4,2.2-0.2,2.6-1.3c0.4-1.1-0.2-2.2-1.3-2.6
	l-7.5-2.5C33.1,39.9,31.9,40.5,31.5,41.6"/>
<path class="st4" d="M31.5,41.6c0.4-1.1,1.5-1.7,2.6-1.3l3.7,1.2c0.3,1.4-0.2,2.9-1.2,4l-3.8-1.3C31.8,43.9,31.2,42.7,31.5,41.6
	C31.5,41.6,31.5,41.6,31.5,41.6"/>
<path class="st3" d="M56,43.7c1-0.5,1.5-1.7,1-2.7l-3.3-7.2c-0.6-1-1.8-1.3-2.8-0.7c-0.8,0.5-1.2,1.5-0.9,2.4l3.3,7.2
	C53.8,43.7,55,44.1,56,43.7"/>
<path class="st4" d="M56,43.7c-1,0.5-2.2,0-2.7-1l-1.6-3.6c0.9-1.1,2.3-1.8,3.7-1.8l1.6,3.6C57.5,42,57,43.2,56,43.7"/>
<path class="st3" d="M35.2,71.8c-0.8,0.8-2.1,0.9-2.9,0.1l-5.8-5.4c-0.8-0.8-0.8-2.1,0-2.9c0.8-0.8,2-0.8,2.8-0.1l5.8,5.4
	C35.9,69.6,36,70.9,35.2,71.8"/>
<path class="st3" d="M57.3,69.2c1,0.5,2.3,0,2.8-1l3.5-7.2c0.5-1,0.1-2.3-1-2.8s-2.3-0.1-2.8,1l-3.5,7.2
	C55.9,67.4,56.3,68.7,57.3,69.2"/>
<path class="st4" d="M57.3,69.2c-1-0.5-1.5-1.7-1-2.8l1.7-3.5c1.4-0.1,2.8,0.5,3.8,1.7l-1.7,3.6C59.6,69.3,58.4,69.7,57.3,69.2"/>
<path class="st3" d="M56.2,70.1c-1,0.5-2.3,0-2.7-1c0,0,0,0,0,0L50,62c-0.5-1,0-2.3,1-2.7c1-0.5,2.2,0,2.7,0.9l3.5,7.2
	C57.6,68.4,57.2,69.6,56.2,70.1C56.2,70.1,56.2,70.1,56.2,70.1"/>
<path class="st4" d="M56.2,70.1c1-0.5,1.5-1.7,1-2.7c0,0,0,0,0,0l-1.7-3.5c-1.4-0.1-2.8,0.6-3.8,1.7l1.8,3.6
	C54,70.1,55.2,70.6,56.2,70.1C56.2,70.1,56.3,70.1,56.2,70.1"/>
<path class="st3" d="M49.1,68.7c-1,0.5-2.3,0-2.7-1c0,0,0,0,0,0l-3.5-7.2c-0.5-1-0.1-2.3,0.9-2.8c1-0.5,2.3-0.1,2.8,0.9
	c0,0,0,0,0,0.1l3.5,7.2C50.5,66.9,50.1,68.1,49.1,68.7C49.1,68.6,49.1,68.6,49.1,68.7"/>
<path class="st4" d="M49.1,68.7c1-0.5,1.5-1.7,1-2.7c0,0,0,0,0,0l-1.7-3.5c-1.5-0.1-2.8,0.6-3.8,1.7l1.8,3.6
	C46.9,68.7,48.1,69.2,49.1,68.7C49.1,68.7,49.1,68.7,49.1,68.7"/>
<path class="st3" d="M31.5,65.6c-1.1,0.3-2.2-0.3-2.5-1.4c0,0,0,0,0,0l-2.1-7.7c-0.3-1.1,0.3-2.2,1.5-2.5s2.2,0.3,2.5,1.5l2.1,7.7
	C33.3,64.2,32.6,65.3,31.5,65.6C31.5,65.6,31.5,65.6,31.5,65.6"/>
<path class="st3" d="M29.1,71.8c-1.1,0.3-2.2-0.4-2.5-1.5l-2-7.7c-0.3-1.1,0.4-2.2,1.5-2.5c1.1-0.3,2.2,0.4,2.5,1.5l2,7.7
	C30.9,70.3,30.2,71.5,29.1,71.8C29.1,71.8,29.1,71.8,29.1,71.8"/>
<path class="st4" d="M29.1,71.8c1.1-0.3,1.8-1.4,1.5-2.5c0,0,0,0,0,0l-1-3.8c-1.4-0.3-2.9,0-4,0.9l1,3.9
	C26.9,71.4,28,72.1,29.1,71.8"/>
<path class="st3" d="M49.1,62.6c0.8,0.8,0.8,2.1-0.1,2.9L43.2,71c-0.8,0.8-2.1,0.8-2.9,0c-0.8-0.8-0.8-2.1,0-2.9
	c0,0,0.1-0.1,0.1-0.1l5.8-5.4C47,61.8,48.3,61.8,49.1,62.6"/>
<path class="st4" d="M49.1,62.6c-0.8-0.8-2.1-0.9-2.9-0.1l-2.8,2.7c0.4,1.4,1.4,2.5,2.7,3.1l3-2.8C49.8,64.7,49.9,63.4,49.1,62.6"/>
<path class="st3" d="M46,69.8c0.1,1.1-0.8,2.1-1.9,2.2c0,0,0,0,0,0l-7.9,0.6c-1.1,0-2.1-0.9-2.1-2c0-1,0.8-1.9,1.8-2.1l7.9-0.6
	C44.9,67.8,45.9,68.6,46,69.8C46,69.8,46,69.8,46,69.8"/>
<path class="st4" d="M46,69.8c-0.1-1.1-1.1-2-2.2-1.9l-3.9,0.3c-0.6,1.3-0.6,2.8,0.1,4.1l4-0.3C45.1,72,46,71,46,69.8
	C46,69.9,46,69.8,46,69.8"/>
<path class="st3" d="M55.2,61c1-0.6,2.2-0.3,2.8,0.7l4.1,6.8c0.5,1,0.1,2.3-0.9,2.8c-0.9,0.5-2.1,0.2-2.7-0.7l-4.1-6.8
	C53.9,62.9,54.3,61.6,55.2,61C55.2,61,55.2,61,55.2,61"/>
<path class="st4" d="M55.2,61c-1,0.6-1.3,1.9-0.7,2.8c0,0,0,0,0,0l2,3.3c1.4-0.1,2.8-0.8,3.6-2l-2.1-3.5
	C57.5,60.7,56.2,60.4,55.2,61"/>
<path class="st3" d="M61.2,70.6c-0.2,1.1-1.2,1.9-2.4,1.7c0,0,0,0,0,0L51,71.1c-1.1-0.3-1.8-1.4-1.5-2.5c0.2-1,1.1-1.6,2.1-1.5
	l7.8,1.3C60.6,68.4,61.4,69.5,61.2,70.6"/>
<path class="st4" d="M61.2,70.6c0.2-1.1-0.6-2.2-1.7-2.4l-3.9-0.6c-0.9,1.2-1.2,2.7-0.8,4.1l4,0.6C60,72.5,61,71.7,61.2,70.6
	C61.2,70.6,61.2,70.6,61.2,70.6"/>
<path class="st3" d="M56.5,67.3c0.3,1.1-0.3,2.2-1.4,2.5c0,0,0,0,0,0L47.4,72c-1.1,0.3-2.3-0.3-2.6-1.4c-0.3-1.1,0.3-2.3,1.4-2.6
	l7.6-2.2C55,65.5,56.1,66.1,56.5,67.3C56.4,67.2,56.4,67.2,56.5,67.3"/>
<path class="st4" d="M56.5,67.3c-0.3-1.1-1.5-1.7-2.5-1.4c0,0,0,0,0,0L50.1,67c-0.3,1.4,0.1,2.9,1,4l3.9-1.2
	C56.1,69.5,56.7,68.4,56.5,67.3C56.4,67.3,56.4,67.3,56.5,67.3"/>
<path class="st5" d="M63.8,70.2l-1.4-0.2c0.1-0.5,0.1-1.1-0.2-1.6l-1.2-2l0.8-1.6h0c0.7-0.4,1.1-1.2,1-2.1l0.8-1.7
	c0-0.1,0.1-0.2,0.1-0.2h0.3v8.5l0,0C63.9,69.7,63.9,70,63.8,70.2 M24.3,70.3c-0.1-0.3-0.2-0.6-0.1-0.9v-8.5H25
	c-0.2,0.3-0.4,0.7-0.4,1.1l0,0c0,0.2,0,0.4,0.1,0.6l0,0l1.9,7.5C25.7,70.1,25,70.2,24.3,70.3"/>
<path class="st6" d="M57.7,73H30.4c-3.7,0-5.6-1.2-6.2-2.7c0.7-0.1,1.5-0.2,2.3-0.3l0.1,0.3l0,0c0.2,0.9,1.1,1.5,2,1.5l0,0
	c0.2,0,0.3,0,0.5-0.1l0,0c0.7-0.2,1.3-0.7,1.5-1.5l0.6,0.5l1.1,1l0,0l0,0l0,0c0.4,0.3,0.9,0.5,1.4,0.5l0,0c0.3,0,0.6-0.1,0.8-0.2
	l0,0l0.2-0.1c0.1,0.1,0.2,0.1,0.3,0.2l0,0c0.3,0.2,0.6,0.3,1,0.3h0.2l3.9-0.3l0,0l4-0.3c0.5,0,0.9-0.2,1.3-0.6
	c0.4,0.4,0.9,0.7,1.5,0.7c0.2,0,0.4,0,0.6-0.1l0,0l3.5-1H51l7.8,1.2l0,0c0.1,0,0.2,0,0.3,0l0,0c0.6,0,1.2-0.3,1.6-0.8
	c0.3,0,0.5-0.1,0.7-0.3c0.5-0.3,0.8-0.7,0.9-1.3l1.4,0.2C63.3,71.8,61.4,73,57.7,73L57.7,73"/>
<path class="st7" d="M61.7,64.8l0.1-0.3l0,0l0.8-1.6l0.1,0.2c0-0.1,0-0.3,0-0.4l0,0C62.9,63.6,62.5,64.4,61.7,64.8L61.7,64.8"/>
<path class="st8" d="M62.8,63.1l-0.1-0.2l0.1-0.2C62.8,62.9,62.8,63,62.8,63.1"/>
<path class="st5" d="M39.5,68.2l1.1-1.4l0.2,0.1l0.2,0.1c0.1,0.1,0.2,0.1,0.3,0.1l-0.9,0.8c-0.1,0.1-0.1,0.1-0.2,0.2h-0.3l0,0
	L39.5,68.2 M34.3,68.1L34.3,68.1c0.2-0.2,0.3-0.3,0.4-0.6l0.8-1.6C35.7,66,35.8,66,36,66L34.3,68.1L34.3,68.1 M40.3,61l0.2-0.2h0.9
	L41.2,61h-0.1h-0.2h-0.2C40.5,61,40.4,61,40.3,61"/>
<path class="st7" d="M39.5,61.3l-0.8-0.5h1l-0.1,0.2L39.5,61.3"/>
<path class="st8" d="M39.6,61.4L39.6,61.4l0-0.3l0.1-0.2H40c0.1,0.1,0.2,0.1,0.4,0.1l0.1-0.1l0,0L40.3,61
	C40.1,61.1,39.8,61.2,39.6,61.4"/>
<path class="st9" d="M40.3,61c-0.1,0-0.3-0.1-0.4-0.1h0.5L40.3,61"/>
<path class="st7" d="M42.3,61.5l-0.2-0.1l0,0l0.1,0c0.1-0.1,0.2-0.3,0-0.5H43l0.3,0.6L42.3,61.5 M41.6,61.1c-0.1,0-0.3-0.1-0.4-0.1
	l0.2-0.2h0.3C41.6,60.9,41.6,61,41.6,61.1"/>
<path class="st7" d="M35.6,65.8l0.8-1.6l0.7,0.4l-0.9,1.2L35.6,65.8 M42.3,61.5L42.3,61.5l1-0.1l0,0L42.3,61.5"/>
<path class="st4" d="M43.5,64L43.5,64C43.5,64,43.5,64,43.5,64L43.5,64v-0.1l0,0c0,0,0,0,0,0l0,0l0,0l0,0l-0.1-0.1l0,0
	c-0.1-0.1-0.2-0.2-0.4-0.3l0,0c0-0.1,0-0.2,0-0.3c0-0.6-0.2-1.1-0.6-1.5l1-0.1l0.9,1.8l-0.1,0.1c-0.1,0.1-0.2,0.2-0.3,0.3l-0.3,0.2"
	/>
<path class="st10" d="M35.9,66.1c-0.1,0-0.3-0.1-0.4-0.1l0,0C35.6,66,35.8,66,35.9,66.1L35.9,66.1"/>
<path class="st8" d="M35.9,66.1c-0.1,0-0.3-0.1-0.4-0.1l0.1-0.1h0.6L35.9,66.1"/>
<path class="st9" d="M43.8,64.7L43.8,64.7c0-0.1,0-0.1,0-0.1l0,0c0,0,0,0,0-0.1l0,0l0,0l0,0c0,0,0,0,0-0.1l0,0v-0.1l0,0l0,0l0,0
	v-0.1l0,0l0,0l0,0l0.3-0.2c0.1-0.1,0.2-0.2,0.3-0.3l0.1-0.1l0.3,0.7L44.1,65"/>
<path class="st5" d="M46.2,68.1l0.2-0.2c0,0,0.1,0.1,0.1,0.1L46.2,68.1L46.2,68.1 M50.3,66.9c0-0.2,0-0.4,0-0.6l0,0
	c0-0.2-0.1-0.3-0.2-0.4l0,0L49.6,65l1.6-0.4h0.1l0.9,1.8L50.3,66.9"/>
<polyline class="st9" points="47.8,61.2 47.6,60.8 49.1,60.8 47.8,61.2 "/>
<path class="st7" d="M51.3,64.6L51.3,64.6L51.3,64.6L51.3,64.6L51.3,64.6"/>
<path class="st8" d="M51.3,64.6L51.3,64.6L51.3,64.6L51.3,64.6"/>
<path class="st7" d="M49.5,64.6c0.1-0.2,0.1-0.4,0.1-0.6l0,0c0-0.5-0.2-1-0.6-1.4l0,0c-0.1-0.2-0.3-0.3-0.5-0.4
	c-0.1-0.1-0.2-0.1-0.4-0.2l0,0c0.1-0.2,0.1-0.4-0.1-0.5c0,0-0.1,0-0.1-0.1l-0.1-0.2l1.3-0.4h0.7c-0.1,0.4,0,0.8,0.2,1.1l0,0l1,2
	l-0.2,0.1C50.4,64.3,50,64.5,49.5,64.6"/>
<path class="st11" d="M48.2,62l-0.3-0.5c0.2,0,0.3,0.2,0.3,0.4C48.2,61.9,48.2,62,48.2,62"/>
<path class="st8" d="M49.6,65l-0.1-0.2c0,0,0-0.1,0-0.1c0.4-0.1,0.9-0.3,1.3-0.5L51,64l0.2,0.5h-0.1l0,0L49.6,65"/>
<path class="st7" d="M58.7,61.6l-0.9-0.1c-0.2-0.3-0.5-0.5-0.8-0.6h2.1L58.7,61.6"/>
<polyline class="st7" points="58.7,61.6 57.9,61.4 57.9,61.4 58.7,61.6 58.7,61.6 "/>
<path class="st4" d="M58.4,62.2l-0.3-0.5l0,0c-0.1-0.1-0.1-0.2-0.2-0.3l0.9,0.1L58.4,62.2"/>
<path class="st4" d="M54.5,61.7l-0.4-0.9h0.8v0.1c0,0.1-0.1,0.3-0.1,0.4C54.7,61.5,54.6,61.6,54.5,61.7"/>
<path class="st9" d="M54.5,61.8L54.5,61.8c0.1-0.1,0.2-0.2,0.2-0.4c0.1-0.1,0.1-0.3,0.1-0.4v-0.1h0.7c-0.1,0-0.2,0.1-0.3,0.2l0,0
	C54.9,61.2,54.7,61.5,54.5,61.8"/>
<path class="st7" d="M33.7,72.4L33.7,72.4 M33.7,72.4c-0.5,0-1-0.2-1.4-0.5C32.7,72.2,33.2,72.4,33.7,72.4 M32.3,71.9L32.3,71.9
	L32.3,71.9 M34.3,68.1L34.3,68.1L34.3,68.1L34.3,68.1L34.3,68.1 M30.1,67.6l-0.7-2.5c0.2,0.2,0.4,0.3,0.7,0.4l0,0
	c0.2,0.1,0.5,0.1,0.7,0.1H31l0,0c-0.1,0.3-0.2,0.6-0.2,0.9c0,0.1,0,0.2,0,0.3C30.6,67.2,30.3,67.4,30.1,67.6"/>
<path class="st12" d="M33.7,72.4L33.7,72.4 M33.7,72.4c0.3,0,0.5-0.1,0.8-0.2l0,0C34.2,72.4,33.9,72.4,33.7,72.4 M34.5,72.2
	L34.5,72.2 M32.3,71.9L32.3,71.9"/>
<path class="st8" d="M33.7,72.4L33.7,72.4c-0.5,0-1-0.2-1.4-0.5l0,0l0,0l0,0l-1.1-1l1.1,1c0.6,0.6,1.5,0.7,2.2,0.4
	C34.3,72.4,34,72.4,33.7,72.4L33.7,72.4"/>
<path class="st7" d="M61.4,64.2c-0.7-0.7-1.7-1.1-2.7-1.3l-0.4-0.7l0.3-0.7l0,0l0.3-0.7h0.5c0,0,0.1,0.1,0.1,0.1c0,0,0.1,0,0.2,0
	c0.1,0,0.2,0,0.2-0.1h3.2l-0.3,0.7c-0.2,0.4-0.4,0.8-0.6,1.2c-0.2,0.4-0.5,0.8-0.8,1.2L61.4,64.2"/>
<path class="st4" d="M60.9,66.5L60.9,66.5l0.9-1.9l0,0l-0.1,0.3L60.9,66.5 M60.4,65.6l-1.6-2.7c1,0.1,1.9,0.6,2.7,1.3l-0.5,0.7
	C60.8,65.1,60.6,65.4,60.4,65.6"/>
<path class="st11" d="M59.8,60.9c0,0-0.1,0-0.2,0c0,0-0.1,0-0.1-0.1h0.5C60,60.9,59.9,61,59.8,60.9"/>
<path class="st10" d="M62.7,62.7L62.7,62.7l0.8-1.7c0-0.1,0.1-0.2,0.1-0.2l0,0c0,0.1-0.1,0.2-0.1,0.2L62.7,62.7"/>
<path class="st8" d="M61.8,64.6c-0.1-0.1-0.3-0.3-0.4-0.4l0.2-0.3c0.3-0.4,0.5-0.8,0.8-1.2c0.2-0.4,0.4-0.8,0.6-1.2l0.3-0.7h0.4
	c0,0.1-0.1,0.2-0.1,0.2l-0.8,1.7l0,0l-0.1,0.2L61.8,64.6"/>
<path class="st9" d="M60.9,66.5l-0.5-0.9c0.2-0.2,0.3-0.4,0.5-0.7l0.5-0.7c0.1,0.1,0.3,0.2,0.4,0.4l0,0L60.9,66.5"/>
<path class="st7" d="M52.1,65.1l-0.2-0.3c-0.3-0.4-0.5-0.8-0.8-1.2c-0.2-0.4-0.4-0.8-0.6-1.2l-0.8-1.6h4.2l0.4,0.9l0,0
	c-0.2,0.3-0.3,0.7-0.3,1.1l0,0c0,0.4,0.1,0.7,0.3,1l0,0C53.6,64,52.8,64.4,52.1,65.1 M53.7,61c0,0-0.1,0-0.2,0
	c-0.2,0.1-0.3,0.3-0.2,0.5c0,0,0,0,0,0c0.1,0.1,0.2,0.2,0.3,0.2c0.1,0,0.1,0,0.2,0c0.2-0.1,0.2-0.3,0.2-0.5C54,61.1,53.9,61,53.7,61
	 M50,62c-0.2-0.3-0.2-0.7-0.2-1.1l0,0C49.8,61.3,49.8,61.7,50,62"/>
<path class="st4" d="M57,67.8l-0.4-0.1c0-0.2,0-0.3-0.1-0.5l0,0c-0.3-0.8-1-1.4-1.8-1.4h-0.3c-0.2,0-0.3,0-0.5,0.1l0,0l-1,0.3
	l-0.3-0.4l-0.5-0.7c0.7-0.6,1.5-1.1,2.4-1.2L57,67.8"/>
<path class="st11" d="M53.3,60.8L53.3,60.8"/>
<path class="st11" d="M53.7,61.8c-0.1,0-0.3-0.1-0.3-0.2c-0.1-0.2,0-0.4,0.2-0.5c0,0,0,0,0,0c0,0,0.1,0,0.2,0c0.1,0,0.3,0.1,0.3,0.2
	c0.1,0.2,0,0.4-0.2,0.5C53.8,61.8,53.8,61.8,53.7,61.8"/>
<path class="st8" d="M52.2,66.4l-0.9-1.9L51,64l-1-2l0,0c-0.2-0.3-0.2-0.7-0.2-1.1l0,0l0.8,1.6c0.2,0.4,0.4,0.8,0.6,1.2
	c0.2,0.4,0.5,0.8,0.8,1.2l0.2,0.3c-0.1,0.1-0.3,0.3-0.4,0.4L52.2,66.4L52.2,66.4"/>
<path class="st9" d="M52.2,66.4l-0.4-0.9c0.1-0.1,0.3-0.3,0.4-0.4l0.5,0.7l0.3,0.4L52.2,66.4"/>
<path class="st7" d="M46.5,68c0,0-0.1-0.1-0.1-0.1l0,0C46.5,67.9,46.5,68,46.5,68L46.5,68 M45,63.6l-0.2-0.2
	c-0.3-0.4-0.5-0.8-0.8-1.2c-0.2-0.4-0.4-0.8-0.6-1.2l-0.1-0.2h4.2l0.2,0.4l0.1,0.2l0.3,0.5l0,0.1C48,62,47.8,62,47.6,62l0,0
	c-0.2,0-0.4,0-0.6,0l0,0c-0.2,0-0.3,0.1-0.5,0.2l0,0c-0.1,0.1-0.2,0.2-0.4,0.3l0,0L45,63.6"/>
<path class="st4" d="M48.8,66.8h-0.1c-0.1,0-0.3,0-0.4-0.1c-0.1,0-0.2-0.1-0.3-0.1l1.2-1.1c0.2-0.2,0.4-0.5,0.5-0.8l0.1,0.2l0.4,0.9
	c0.1,0.1,0.1,0.3,0.2,0.4c-0.1,0.1-0.2,0.2-0.4,0.2c-0.2,0.1-0.5,0.2-0.8,0.2L48.8,66.8"/>
<path class="st10" d="M50.2,66.9c0,0,0-0.1,0-0.1c0-0.1,0-0.3,0-0.4l0,0C50.3,66.5,50.3,66.7,50.2,66.9L50.2,66.9"/>
<path class="st8" d="M44.6,64L43,60.8h0.4l0.1,0.2c0.2,0.4,0.4,0.8,0.6,1.2c0.2,0.4,0.5,0.8,0.8,1.2l0.2,0.2L44.6,64"/>
<path class="st9" d="M46.5,68c0,0-0.1-0.1-0.1-0.1l1.4-1.3c0.1,0.1,0.2,0.1,0.3,0.1c0.1,0,0.3,0.1,0.4,0.1h0.5
	c0.3,0,0.5-0.1,0.8-0.2c0.1-0.1,0.3-0.1,0.4-0.2c0,0.1,0,0.3,0,0.4c0,0,0,0.1,0,0.1h-0.1l0,0L46.5,68"/>
<path class="st7" d="M30.9,65.7L30.9,65.7 M30.9,65.7c-0.2,0-0.5,0-0.7-0.1l0,0C30.5,65.7,30.7,65.7,30.9,65.7 M30.2,65.6L30.2,65.6
	"/>
<path class="st8" d="M30.9,65.7L30.9,65.7 M30.9,65.7L30.9,65.7"/>
<path class="st8" d="M30.9,65.7L30.9,65.7c-0.2,0-0.5,0-0.7-0.1C30.5,65.7,30.7,65.7,30.9,65.7L30.9,65.7"/>
<path class="st7" d="M28.6,71.8L28.6,71.8 M28.6,71.8c-0.9,0-1.8-0.6-2-1.5C26.8,71.2,27.7,71.9,28.6,71.8 M29.1,71.8L29.1,71.8
	 M30.2,67.6l-0.6-2.2c-0.3-0.1-0.7-0.1-1-0.1c-0.9,0-1.8,0.3-2.5,0.8c0-0.1-0.1-0.2-0.1-0.3c-0.2-0.4-0.4-0.9-0.5-1.4
	c-0.1-0.4-0.2-0.8-0.3-1.2l-0.5-1.7c-0.1,0.2-0.1,0.3-0.1,0.5c0-0.4,0.2-0.8,0.4-1.1h1.2c0.1,0.1,0.2,0.2,0.3,0.2h0.2
	c0.5,0,0.9,0.3,1,0.8l0,0c0,0.2,0.2,0.3,0.3,0.3h0.1c0.1,0,0.2-0.1,0.2-0.1l0.1,0.5c0,0-0.1,0-0.1,0h-0.1c-0.2,0-0.3,0.2-0.3,0.4
	c0,0,0,0,0,0c0,0.1,0,0.1,0.1,0.1H28c-0.4,0-0.8,0.2-1.1,0.4c-0.1,0.1-0.1,0.4,0,0.5l0,0c0.1,0.1,0.2,0.1,0.3,0.1
	c0.1,0,0.2,0,0.2-0.1c0.2-0.2,0.4-0.3,0.7-0.3c0.3,0,0.6,0.1,0.8,0.3l0,0c0.1,0.1,0.1,0.1,0.2,0.1c0.1,0.4,0.3,0.7,0.6,0.9
	L30.2,67.6L30.2,67.6 M28.7,63.2l-0.1-0.1c0,0,0.1-0.1,0.1-0.1L28.7,63.2 M24.6,62.6L24.6,62.6 M24.6,62.6L24.6,62.6 M24.6,62.6
	L24.6,62.6 M24.5,62L24.5,62 M24.5,62L24.5,62 M24.5,62L24.5,62 M24.5,62L24.5,62"/>
<path class="st4" d="M29.1,71.8c0.7-0.2,1.3-0.7,1.5-1.5l0,0C30.4,71,29.9,71.6,29.1,71.8 M29.7,69.9h-0.2c-0.2,0-0.3,0-0.5-0.1
	c-0.1,0-0.3-0.1-0.4-0.2c-0.1-0.1-0.3-0.1-0.4-0.2c-0.2-0.1-0.3-0.3-0.5-0.4c-0.3-0.3-0.5-0.7-0.8-1.1c-0.2-0.3-0.4-0.7-0.5-1.1
	s-0.3-0.5-0.4-0.8c0.8-0.5,1.6-0.7,2.5-0.8c0.3,0,0.7,0,1,0.1l0.6,2.2c-0.3,0.4-0.6,0.9-0.8,1.5l0.8,0.8C30,69.9,29.8,70,29.7,69.9"
	/>
<path class="st10" d="M24.6,62.6L24.6,62.6 M24.6,62.6L24.6,62.6 M24.6,62.6c0-0.2-0.1-0.4-0.1-0.6C24.5,62.2,24.5,62.4,24.6,62.6
	 M24.5,62L24.5,62 M24.5,62L24.5,62 M24.5,62L24.5,62 M24.5,62L24.5,62"/>
<path class="st8" d="M28.6,71.8L28.6,71.8 M26.6,70.3l-2-7.7l0,0c0-0.2-0.1-0.4-0.1-0.6l0,0c0-0.2,0-0.3,0.1-0.5l0.5,1.7
	c0.1,0.4,0.2,0.8,0.3,1.2c0.1,0.5,0.3,0.9,0.5,1.4c0,0.1,0.1,0.2,0.1,0.3c-0.2,0.1-0.3,0.2-0.5,0.3L26.6,70.3"/>
<path class="st9" d="M28.6,71.8c-0.9,0-1.8-0.6-2-1.5l0,0l-1-3.9c0.2-0.1,0.3-0.2,0.5-0.3c0.1,0.3,0.2,0.5,0.4,0.8s0.4,0.7,0.5,1.1
	c0.2,0.4,0.5,0.7,0.8,1.1c0.2,0.2,0.3,0.3,0.5,0.4c0.1,0.1,0.2,0.2,0.4,0.2c0.1,0.1,0.3,0.1,0.4,0.2c0.2,0,0.3,0.1,0.5,0.1h0.2
	c0.2,0,0.3,0,0.5-0.1l0.4,0.4c-0.2,0.7-0.7,1.3-1.5,1.5l0,0C29,71.8,28.8,71.8,28.6,71.8L28.6,71.8"/>
<path class="st7" d="M45.2,68.4l-0.1-0.1c-0.3-0.2-0.6-0.3-0.9-0.4l0,0c-0.1,0-0.2,0-0.3,0h-0.2l-2.6,0.2l0,0C41.1,68,41,68,40.9,68
	c-0.1,0-0.2,0-0.2,0.1l-0.2,0.1h-0.3c0.1-0.1,0.1-0.2,0.2-0.2l0.9-0.8h0.1h0.2c-0.1,0-0.1,0-0.2,0.1c-0.1,0.1-0.1,0.4,0,0.5
	c0,0,0,0,0,0c0.1,0.1,0.4,0.1,0.5,0c0.1-0.1,0.1-0.4,0-0.5c0,0-0.1-0.1-0.1-0.1h0.2c0.5,0,1-0.2,1.4-0.6l0.2-0.2l0.1-0.2v-0.1l0,0
	l0,0c0.4,0.8,1.1,1.5,1.9,1.9l-0.2,0.3C45.3,68.3,45.3,68.3,45.2,68.4 M43.8,64.7L43.8,64.7l0.7-0.7l0.4-0.4l1.2-1.1l0,0L43.8,64.7
	 M48.6,62.2L48.6,62.2c-0.4-0.1-0.7-0.2-1-0.2c0.2,0,0.4,0,0.6,0.1C48.3,62.1,48.5,62.2,48.6,62.2 M47.6,62L47.6,62"/>
<path class="st4" d="M46.2,68.1l2.8-2.6l-1.1,1.1l-1.4,1.3L46.2,68.1L46.2,68.1 M45.5,68c-0.8-0.4-1.4-1.1-1.9-1.9l0,0l0,0
	c0.1-0.3,0.2-0.5,0.2-0.8l0,0v-0.1l0,0c0-0.1,0-0.1,0-0.2l0,0v-0.1c0,0,0,0,0-0.1l0,0c0,0,0,0,0-0.1l0,0l2.3-2.2l0,0
	c0.1-0.1,0.2-0.2,0.4-0.3c0.3,0.3,0.6,0.6,0.8,1c0.1,0.1,0.1,0.3,0.2,0.4c0,0.1,0,0.3,0.1,0.4c0,0.1,0,0.3,0,0.4
	c0,0.2-0.1,0.4-0.1,0.6c-0.2,0.4-0.3,0.8-0.6,1.2c-0.2,0.3-0.5,0.7-0.7,1l-0.5,0.7 M48.6,62.3c-0.3-0.1-0.6-0.2-0.9-0.2
	C47.4,62,47.2,62,47,62c0.2,0,0.4-0.1,0.5-0.1l0,0c0.3,0,0.6,0.1,0.9,0.2 M47,62L47,62"/>
<path class="st8" d="M49.1,62.6L49.1,62.6c-0.1-0.1-0.3-0.3-0.5-0.4C48.8,62.3,48.9,62.5,49.1,62.6"/>
<path class="st8" d="M46.5,62.2L46.5,62.2c0.1-0.1,0.3-0.2,0.5-0.2C46.8,62,46.7,62.1,46.5,62.2 M47,62L47,62"/>
<path class="st8" d="M45.4,68.6c-0.1-0.1-0.1-0.1-0.2-0.2c0,0,0.1-0.1,0.1-0.1l0.2-0.3l0.4,0.2C45.7,68.3,45.6,68.4,45.4,68.6
	 M49.1,62.6L49.1,62.6 M49.1,62.6c-0.2-0.2-0.4-0.3-0.6-0.4h0.1C48.8,62.2,48.9,62.4,49.1,62.6"/>
<path class="st9" d="M45.9,68.2L45.5,68l0.5-0.7c0.2-0.3,0.5-0.7,0.7-1c0.2-0.4,0.4-0.8,0.6-1.2c0.1-0.2,0.1-0.4,0.1-0.6
	c0-0.1,0-0.3,0-0.4c0-0.1,0-0.3-0.1-0.4c0-0.2-0.1-0.3-0.2-0.4c-0.2-0.4-0.4-0.7-0.8-1c0.2-0.1,0.3-0.1,0.5-0.2l0,0
	c0.2,0,0.4-0.1,0.5-0.1c0.3,0,0.6,0.1,0.9,0.2c0.2,0.1,0.4,0.2,0.6,0.4l0,0c0.4,0.4,0.6,0.9,0.6,1.4c0,0.6-0.2,1.1-0.6,1.5l0,0
	l-2.7,2.6C46.2,68.1,46,68.2,45.9,68.2"/>
<path class="st7" d="M35,72.3c-0.1-0.1-0.2-0.1-0.3-0.2c0.2-0.1,0.4-0.2,0.5-0.4c0.1-0.1,0.2-0.3,0.3-0.4c0.2,0,0.3,0.1,0.5,0.1
	c0.6,0,1.2-0.3,1.6-0.8l0,0v-0.1l1.8-2.3h0.4c-0.5,1.1-0.5,2.4,0,3.6l-0.3,0.1c-0.5,0.1-1,0.2-1.4,0.2c-0.4,0-0.9,0.1-1.3,0.1
	L35,72.3 M45.4,68.6c-0.1-0.1-0.1-0.1-0.2-0.2l0,0l-0.1-0.1l0.1,0.1C45.3,68.5,45.4,68.5,45.4,68.6L45.4,68.6 M44.2,67.9
	c-0.1,0-0.2,0-0.3,0C44,67.9,44.2,67.9,44.2,67.9L44.2,67.9 M43.8,67.9L43.8,67.9 M43.9,67.9L43.9,67.9"/>
<path class="st4" d="M40,72.3L40,72.3l4-0.3L40,72.3 M39.8,71.8c-0.5-1.1-0.5-2.4,0-3.6l0,0h0.3h0.3c-0.6,0.6-0.6,1.6-0.1,2.3
	c0.1,0.1,0.2,0.1,0.3,0.1c0.1,0,0.2,0,0.2-0.1l0,0c0.1-0.1,0.1-0.4,0-0.5c-0.3-0.4-0.3-1.1,0.1-1.4c0,0,0.1-0.1,0.1-0.1l0,0
	c0.1-0.1,0.2-0.3,0.1-0.4l2.6-0.2h0.2c0.1,0,0.2,0,0.3,0c0,0.1,0.1,0.3,0.1,0.4c0,0.3,0,0.5-0.1,0.8c0,0.1-0.1,0.3-0.2,0.4
	c-0.1,0.1-0.1,0.3-0.2,0.4c-0.1,0.1-0.2,0.2-0.3,0.3c-0.2,0.2-0.3,0.3-0.5,0.4c-0.4,0.2-0.8,0.4-1.2,0.6c-0.4,0.1-0.8,0.3-1.2,0.3
	L39.8,71.8 M45.4,68.5c-0.1-0.1-0.1-0.1-0.2-0.2C45.3,68.4,45.3,68.5,45.4,68.5L45.4,68.5 M45.2,68.4L45.2,68.4 M45.2,68.4
	L45.2,68.4"/>
<path class="st12" d="M36,72.6c-0.4,0-0.7-0.1-1-0.3l0,0C35.3,72.5,35.6,72.6,36,72.6h0.2l3.9-0.3l0,0l-3.9,0.3H36"/>
<path class="st8" d="M45.1,68.3c-0.3-0.2-0.6-0.3-0.9-0.4l0,0C44.5,68,44.9,68.1,45.1,68.3"/>
<path class="st8" d="M36,72.6c-0.4,0-0.7-0.1-1-0.3l1.8-0.1c0.4,0,0.9-0.1,1.3-0.1c0.5,0,1-0.1,1.4-0.2l0.3-0.1
	c0.1,0.2,0.1,0.3,0.2,0.5l-3.9,0.3H36 M45.3,68.4L45.3,68.4 M45.3,68.4L45.3,68.4 M45.3,68.4c-0.3-0.2-0.6-0.4-1-0.5l0,0
	C44.6,68,44.9,68.1,45.3,68.4L45.3,68.4"/>
<path class="st9" d="M40,72.3L40,72.3c-0.1-0.2-0.2-0.4-0.2-0.5l0.9-0.2c0.4-0.1,0.8-0.2,1.2-0.3c0.4-0.1,0.8-0.3,1.2-0.6
	c0.2-0.1,0.4-0.2,0.5-0.4c0.1-0.1,0.2-0.2,0.3-0.3c0.1-0.1,0.2-0.2,0.2-0.4c0.1-0.1,0.1-0.3,0.2-0.4c0.1-0.3,0.1-0.5,0.1-0.8
	c0-0.1,0-0.3-0.1-0.4c0.4,0.1,0.7,0.2,1,0.5l0,0c0.1,0,0.1,0.1,0.2,0.2c-0.8,0.8-0.9,2.1-0.1,2.9C44.9,71.8,44.5,72,44,72l0,0
	L40,72.3"/>
<path class="st7" d="M60.8,71.6c0.1-0.1,0.2-0.3,0.3-0.4l0,0c0.2-0.1,0.2-0.3,0.2-0.5l0,0c0,0,0,0,0-0.1l0,0l0,0
	c0.1-0.5,0-1.1-0.3-1.5l0,0c-0.3-0.5-0.8-0.8-1.4-0.8l0,0L57,67.8l-2.4-4l0,0l2,3.3l0,0c1.2-0.1,2.4-0.6,3.2-1.6l0.2,0.2
	c0.3,0.4,0.6,0.8,0.8,1.2c0.2,0.4,0.5,0.7,0.7,1.1l0.9,1.5c0-0.4-0.1-0.8-0.3-1.2l-4.1-6.8l0,0l0.3,0.5l0.4,0.7l1.6,2.7l0.5,0.9l0,0
	l1.2,2c0.6,1,0.3,2.2-0.7,2.8C61.3,71.4,61,71.5,60.8,71.6 M58.1,61.7c-0.2-0.4-0.6-0.7-1-0.9l0,0c0.3,0.1,0.6,0.3,0.8,0.6l0,0
	C58,61.5,58,61.6,58.1,61.7"/>
<path class="st4" d="M56.6,67.2L56.6,67.2l-2-3.3c-0.2-0.3-0.3-0.6-0.3-1c0,0.2,0,0.4,0.1,0.6c0.1-0.1,0.2-0.2,0.3-0.3
	c0.2-0.1,0.5-0.2,0.7-0.3c0.2,0,0.3-0.1,0.5-0.1l0,0c0.1,0,0.3,0,0.4,0c0.1,0,0.3,0.1,0.4,0.1c0.2,0.1,0.4,0.2,0.6,0.3
	c0.4,0.2,0.7,0.5,1,0.8c0.3,0.3,0.6,0.6,0.8,0.9l0.6,0.7C59,66.5,57.8,67.1,56.6,67.2 M54.2,62.8L54.2,62.8"/>
<path class="st11" d="M61,71.2c0.1-0.2,0.1-0.3,0.2-0.5l0,0C61.3,70.9,61.2,71.1,61,71.2L61,71.2"/>
<path class="st13" d="M54.5,61.8L54.5,61.8c0.2-0.3,0.4-0.6,0.7-0.8C54.9,61.2,54.7,61.4,54.5,61.8"/>
<path class="st8" d="M54.2,62.8c0-0.4,0.1-0.8,0.3-1.1l0,0C54.3,62.1,54.2,62.4,54.2,62.8L54.2,62.8"/>
<path class="st8" d="M62.5,69.7l-0.9-1.5c-0.2-0.4-0.4-0.8-0.7-1.1c-0.3-0.4-0.5-0.8-0.8-1.2l-0.2-0.2c0.1-0.1,0.2-0.3,0.4-0.4
	l-2.1-3.5l4.1,6.8C62.4,68.9,62.5,69.3,62.5,69.7"/>
<path class="st9" d="M59.8,65.6l-0.6-0.7c-0.3-0.3-0.5-0.6-0.8-0.9c-0.3-0.3-0.6-0.6-1-0.8C57.2,63.1,57,63,56.8,63
	c-0.1,0-0.3-0.1-0.4-0.1c-0.1,0-0.3,0-0.4,0l0,0c-0.2,0-0.3,0-0.5,0.1c-0.3,0-0.5,0.1-0.7,0.3c-0.1,0.1-0.2,0.2-0.3,0.3
	c-0.1-0.2-0.1-0.4-0.1-0.6l0,0v-0.1c0-0.7,0.4-1.4,1-1.8l0,0c0.1-0.1,0.2-0.1,0.3-0.2H57c0.4,0.2,0.8,0.5,1,0.9l0,0l2.1,3.5
	C60,65.4,59.9,65.5,59.8,65.6"/>
<path class="st7" d="M59.2,72.3L59.2,72.3 M59.2,72.3c-0.1,0-0.2,0-0.3,0C58.9,72.4,59.1,72.4,59.2,72.3 M54.6,71.1h-0.2
	c-0.5,0-1-0.1-1.4-0.1c-0.4,0-0.9-0.1-1.3-0.2h-0.1l3.1-0.9c0,0.4,0,0.8,0,1.2L54.6,71.1 M51,71.1L51,71.1 M51,71.1L51,71.1
	 M51,71.1L51,71.1 M51,71.1L51,71.1 M51,71.1L51,71.1 M51,71.1L51,71.1 M51,71.1L51,71.1 M51,71.1L51,71.1 M61.3,70.7L61.3,70.7"/>
<path class="st4" d="M54.8,71.1c0-0.4,0-0.8,0-1.2l0.3-0.1c0.9-0.3,1.5-1.1,1.5-2l0,0v-0.1l0.4,0.1l2.5,0.4c0.5,0.1,1,0.4,1.4,0.8
	c-0.2-0.3-0.6-0.6-0.9-0.7c0,0.1,0,0.3,0,0.4c0,0.3-0.1,0.5-0.2,0.7c-0.1,0.1-0.2,0.3-0.2,0.4s-0.2,0.2-0.3,0.3
	c-0.1,0.1-0.2,0.2-0.4,0.2c-0.2,0.1-0.4,0.2-0.6,0.3c-0.4,0.1-0.9,0.2-1.3,0.3c-0.4,0-0.8,0-1.2,0.1L54.8,71.1 M60.9,69.1L60.9,69.1
	"/>
<path class="st12" d="M51,71.1L51,71.1 M51,71.1L51,71.1 M51,71.1L51,71.1 M51,71.1L51,71.1 M51,71.1L51,71.1 M51,71.1L51,71.1
	 M51,71.1L51,71.1"/>
<path class="st8" d="M61.2,70.6L61.2,70.6L61.2,70.6c0-0.1,0-0.2,0-0.3c0-0.4-0.1-0.8-0.4-1.2C61.1,69.6,61.3,70.1,61.2,70.6
	L61.2,70.6 M60.8,69.1L60.8,69.1"/>
<path class="st8" d="M59.2,72.3L59.2,72.3 M58.8,72.3L51,71.1h-0.1l0.3-0.1l0,0l0.5-0.1h0.1c0.4,0.1,0.8,0.2,1.3,0.2
	c0.5,0.1,1,0.1,1.5,0.1h0.3c0,0.2,0,0.4,0.1,0.6L58.8,72.3"/>
<path class="st9" d="M59.2,72.3c-0.1,0-0.2,0-0.3,0l0,0l-4-0.6c0-0.2-0.1-0.4-0.1-0.6h0.9c0.4,0,0.8,0,1.2-0.1
	c0.4,0,0.9-0.1,1.3-0.3c0.2-0.1,0.4-0.2,0.6-0.3c0.1-0.1,0.3-0.2,0.4-0.2c0.1-0.1,0.2-0.2,0.3-0.3s0.2-0.3,0.2-0.4
	c0.1-0.2,0.2-0.5,0.2-0.7c0-0.1,0-0.3,0-0.4c0.4,0.2,0.7,0.4,0.9,0.7l0,0c0.2,0.3,0.4,0.8,0.4,1.2c0,0.1,0,0.2,0,0.3l0,0
	C61,71.6,60.2,72.4,59.2,72.3L59.2,72.3"/>
<path class="st7" d="M46.8,72.1c-0.6,0-1.1-0.2-1.5-0.7l0,0c-0.8-0.8-0.7-2.1,0.1-2.9l0,0c0.2-0.1,0.3-0.2,0.5-0.3
	c0.1-0.1,0.2-0.1,0.3-0.1l0,0l0.3-0.1l0,0l3.6-1c-0.3,1.2,0,2.5,0.7,3.5l-0.3,0.1c-0.4,0.2-0.9,0.4-1.3,0.5
	c-0.4,0.1-0.8,0.2-1.2,0.4l-1.7,0.5C46.4,72.1,46.6,72.2,46.8,72.1c0.2,0,0.4,0,0.6-0.1C47.2,72.1,47,72.1,46.8,72.1 M46.5,68.2
	L46.5,68.2c-1,0.2-1.6,1.1-1.4,2c0,0.2,0.2,0.3,0.3,0.3h0.1c0.2,0,0.3-0.2,0.3-0.4c-0.1-0.5,0.2-1.1,0.8-1.2c0,0,0,0,0,0l0,0
	c0.2,0,0.3-0.2,0.3-0.4C46.8,68.3,46.7,68.2,46.5,68.2 M47.5,67.9L47.5,67.9c-0.3,0.1-0.4,0.3-0.3,0.4c0,0.2,0.2,0.3,0.3,0.3h0.1
	c0.2-0.1,0.3-0.2,0.2-0.4c0,0,0,0,0,0C47.8,68,47.7,67.9,47.5,67.9 M56.5,67.8c0-0.2,0-0.4-0.1-0.6l0,0
	C56.5,67.4,56.5,67.6,56.5,67.8L56.5,67.8 M56.4,67.2c-0.3-0.8-1-1.4-1.8-1.4l0,0C55.5,65.8,56.2,66.4,56.4,67.2"/>
<path class="st4" d="M51.2,71L51.2,71l3.8-1.2l-0.3,0.1l-3.1,0.9L51.2,71 M50.8,70.5c-0.7-1-1-2.3-0.7-3.5l0,0h0.1l0,0l1.9-0.6l0,0
	l0.8-0.2l1-0.3l0,0c0.1,0,0.3-0.1,0.5-0.1c0.1,0.1,0.1,0.3,0.2,0.4c0.1,0.4,0.1,0.8,0,1.2c0,0.1-0.1,0.3-0.1,0.4
	c-0.1,0.1-0.1,0.3-0.2,0.4c-0.1,0.2-0.3,0.3-0.4,0.5c-0.3,0.3-0.6,0.6-1,0.8c-0.3,0.2-0.7,0.4-1.1,0.6L50.8,70.5 M56.5,67.9
	c0-0.2,0-0.4-0.1-0.6c-0.2-0.8-1-1.4-1.8-1.5c0.8,0.1,1.5,0.6,1.8,1.4l0,0C56.5,67.5,56.5,67.7,56.5,67.9L56.5,67.9"/>
<path class="st5" d="M63.9,40.7h-1.1l0.8-2.6l0,0c0.1-0.4,0.1-0.8,0-1.2l0,0c-0.2-0.7-0.7-1.2-1.4-1.4c-0.2-0.1-0.4-0.1-0.6-0.1
	c-0.5,0-0.9,0.2-1.3,0.5l0.1-0.2l0,0l1.2-3.7l0,0c0.1-0.4,0.1-0.8,0-1.2l0,0c-0.2-0.7-0.7-1.2-1.4-1.4c-0.2-0.1-0.4-0.1-0.6-0.1
	c-0.9,0-1.7,0.6-2,1.4l-2.2,6.8l-0.1-0.2l0,0l-0.3-0.6c0.3-1-0.1-2.1-1.1-2.5l-0.2-0.5l0,0c-0.2-0.4-0.4-0.7-0.8-0.9l0,0
	c-0.3-0.2-0.7-0.3-1.1-0.3c-0.3,0-0.6,0.1-0.8,0.2c-1,0.4-1.5,1.6-1,2.6c0,0,0,0.1,0,0.1v0.1l-1.4,0.8l0,0l0,0
	c-0.4-0.3-0.8-0.5-1.3-0.5l0,0c-0.4,0-0.8,0.1-1.2,0.4l0,0c-0.5,0.4-0.9,1-0.9,1.7l0,0c0,0.1,0,0.2,0,0.3l0,0
	c-0.5,0.3-0.9,0.7-1,1.3l-0.7-0.7l1.8-3.4c0.2-0.4,0.3-0.8,0.2-1.2l0,0c-0.1-0.7-0.5-1.3-1.1-1.6c-0.3-0.2-0.7-0.2-1-0.2
	c-0.8,0-1.5,0.4-1.8,1.1L40,36.6c-0.3,0.1-0.6,0.3-0.9,0.5l0,0l0,0l0,0c-0.4,0.4-0.6,0.9-0.6,1.5l0,0c0,0.2,0,0.4,0.1,0.7L38,40.4
	c0,0.1-0.1,0.2-0.1,0.2H36l2.2-4.2l0,0c0.2-0.4,0.3-0.8,0.2-1.2l0,0c-0.1-0.7-0.5-1.3-1.1-1.6c-0.3-0.2-0.7-0.2-1-0.2
	c-0.8,0-1.5,0.4-1.8,1.1l-0.8,1.6c-0.2-0.3-0.4-0.6-0.7-0.8l0,0c-0.3-0.2-0.7-0.3-1.1-0.3l0,0c-0.7,0-1.3,0.3-1.7,0.9l0,0l0,0l0,0
	l-0.4,0.5l-1.3-3c-0.3-0.7-1.1-1.2-1.9-1.2c-0.3,0-0.6,0.1-0.8,0.2c-1,0.4-1.5,1.6-1.1,2.7l0,0l0,0l0,0l2.4,5.5l0,0h-3v-5.8
	c0-7.5,3.8-6.8,5.3-7.3l0,0c0-0.1,0-0.1,0-0.2v-2.5c0-0.3,0.1-0.6,0.2-0.8h28.9c0.2,0.2,0.2,0.5,0.2,0.8v2.5c0,0.1,0,0.1,0,0.2l0,0
	c1.3-0.1,2.6,0.4,3.5,1.3c1.8,1.8,1.6,4.8,1.6,6l0,0L63.9,40.7 M52.4,40.7h-0.6l-0.7-1l0.7-0.4L52.4,40.7"/>
<path class="st7" d="M51.8,40.7h-1c0.2-0.2,0.4-0.5,0.5-0.8l-0.2-0.2l0,0L51.8,40.7 M46.1,36.2c0.3-0.2,0.8-0.4,1.2-0.4
	C46.9,35.8,46.4,35.9,46.1,36.2 M47.3,35.8L47.3,35.8"/>
<path class="st4" d="M50.7,40.7h-1.5l1.8-1l0.2,0.2C51.1,40.2,50.9,40.4,50.7,40.7 M45.2,37.9L45.2,37.9c0-0.7,0.3-1.3,0.9-1.7l0,0
	c0.3-0.2,0.8-0.4,1.2-0.4l0,0c0.5,0,0.9,0.2,1.3,0.5l0,0c-0.7-0.6-1.7-0.6-2.5-0.1C45.5,36.6,45.2,37.2,45.2,37.9"/>
<path class="st9" d="M45.2,38.2c0-0.1,0-0.2,0-0.3c0-0.7,0.3-1.3,0.9-1.7c0.8-0.5,1.8-0.5,2.5,0.1L45.2,38.2"/>
<path class="st7" d="M58.5,40.7h-0.3c0.1-0.1,0.2-0.2,0.3-0.2L58.5,40.7"/>
<path class="st7" d="M26.7,38.3L26.5,38c-0.3-0.4-0.5-0.8-0.7-1.3c-0.2-0.4-0.4-0.8-0.5-1.2l-0.7-1.7c-0.1,0.4,0,0.8,0.1,1.1
	c-0.4-1,0.1-2.2,1.1-2.7c0.3-0.1,0.5-0.2,0.8-0.2c0.8,0,1.6,0.5,1.9,1.2l1.3,3l-0.4,0.7C28.4,37.2,27.4,37.6,26.7,38.3 M28.4,34.3
	c0,0-0.1,0-0.1,0c-0.2,0.1-0.3,0.3-0.2,0.5c0.1,0.1,0.2,0.2,0.3,0.2c0,0,0.1,0,0.1,0c0.2-0.1,0.3-0.3,0.2-0.5
	C28.7,34.4,28.6,34.3,28.4,34.3 M26.7,33.1c0.4,0,0.9,0.3,1,0.7l0,0c0.1,0.1,0.2,0.2,0.3,0.2h0.1c0.2-0.1,0.3-0.3,0.2-0.5
	c-0.2-0.7-0.9-1.2-1.6-1.2c-0.2,0-0.4,0-0.5,0.1c-0.2,0.1-0.3,0.2-0.2,0.4c0,0,0,0,0,0l0,0c0.1,0.1,0.2,0.2,0.3,0.2c0,0,0.1,0,0.1,0
	C26.5,33.2,26.6,33.1,26.7,33.1 M24.7,35L24.7,35 M24.7,35L24.7,35 M24.7,35L24.7,35 M24.7,35L24.7,35"/>
<path class="st4" d="M27.6,39.7c-0.2-0.2-0.3-0.5-0.5-0.7l-0.5-0.7c0.8-0.7,1.7-1.1,2.7-1.2l-1.4,2.2l0,0L27.6,39.7"/>
<path class="st11" d="M28,34.1c-0.1,0-0.3-0.1-0.3-0.2l0,0c-0.1-0.4-0.6-0.7-1-0.7c-0.1,0-0.2,0-0.3,0c0,0-0.1,0-0.1,0
	c-0.1,0-0.3-0.1-0.3-0.2l0,0c-0.1-0.2,0-0.4,0.2-0.4c0,0,0,0,0,0c0.2-0.1,0.4-0.1,0.5-0.1c0.7,0,1.4,0.5,1.6,1.2
	C28.4,33.8,28.3,34,28,34.1L28,34.1"/>
<path class="st11" d="M28.4,35.1c-0.1,0-0.3-0.1-0.3-0.2c-0.1-0.2,0-0.4,0.2-0.5c0,0,0.1,0,0.1,0c0.2,0,0.4,0.2,0.4,0.4
	c0,0.1-0.1,0.3-0.2,0.3C28.5,35.1,28.5,35.1,28.4,35.1"/>
<path class="st10" d="M24.7,35.1L24.7,35.1 M24.7,35.1L24.7,35.1 M24.7,35.1L24.7,35.1 M24.7,35.1L24.7,35.1"/>
<path class="st8" d="M27.1,40.6l-2.4-5.5l0,0l0,0l0,0c-0.1-0.4-0.2-0.7-0.1-1.1l0.7,1.7c0.2,0.4,0.3,0.8,0.5,1.2
	c0.2,0.4,0.4,0.9,0.7,1.3l0.2,0.3c-0.1,0.1-0.3,0.2-0.4,0.4L27.1,40.6L27.1,40.6"/>
<path class="st9" d="M27.1,40.6l-0.8-1.9c0.1-0.1,0.3-0.3,0.4-0.4l0.5,0.7c0.1,0.2,0.3,0.5,0.5,0.7L27.1,40.6"/>
<path class="st7" d="M35.9,39.5c-0.6-0.6-1.2-1-2-1.2v-0.8c0-0.1,0-0.3,0-0.4c0-0.3-0.1-0.7-0.2-1l0.8-1.6c0.4-0.7,1.1-1.1,1.8-1.1
	c0.3,0,0.7,0.1,1,0.2c0.6,0.3,1,0.9,1.1,1.6l-0.8,1.6c-0.2,0.4-0.4,0.8-0.6,1.1c-0.2,0.4-0.5,0.8-0.8,1.2L35.9,39.5 M34.5,35.5
	c-0.2,0-0.4,0.2-0.4,0.4c0,0.1,0.1,0.3,0.2,0.3c0.1,0,0.1,0,0.2,0c0.2,0,0.4-0.2,0.4-0.4c0-0.1-0.1-0.3-0.2-0.3
	C34.6,35.5,34.6,35.5,34.5,35.5 M36.3,33.7c-0.7,0-1.3,0.4-1.6,1c-0.1,0.2,0,0.4,0.2,0.5H35c0.1,0,0.3-0.1,0.3-0.2l0,0
	c0.2-0.4,0.5-0.6,0.9-0.6c0.1,0,0.3,0,0.4,0.1c0,0,0.1,0,0.1,0c0.1,0,0.3-0.1,0.3-0.2l0,0c0.1-0.2,0-0.4-0.2-0.5c0,0,0,0,0,0
	C36.7,33.7,36.5,33.6,36.3,33.7 M38.2,36.4L38.2,36.4"/>
<path class="st4" d="M35.1,40.6l-1-0.3l0,0l-0.2-0.1v-1.9c0.8,0.3,1.4,0.7,2,1.2l-0.5,0.7L35.1,40.6"/>
<path class="st11" d="M35,35.2h-0.1c-0.2-0.1-0.3-0.3-0.2-0.5c0.3-0.6,0.9-1,1.6-1c0.2,0,0.5,0.1,0.7,0.1c0.2,0.1,0.3,0.3,0.2,0.5
	c0,0,0,0,0,0l0,0c-0.1,0.1-0.2,0.2-0.3,0.2c0,0-0.1,0-0.1,0c-0.1-0.1-0.3-0.1-0.4-0.1c-0.4,0-0.8,0.2-0.9,0.6l0,0
	C35.3,35.2,35.2,35.3,35,35.2"/>
<path class="st11" d="M34.5,36.2c-0.1,0-0.1,0-0.2,0c-0.2-0.1-0.2-0.3-0.2-0.5c0.1-0.1,0.2-0.2,0.3-0.2c0.1,0,0.1,0,0.2,0
	c0.2,0.1,0.2,0.3,0.2,0.5C34.7,36.1,34.6,36.2,34.5,36.2"/>
<path class="st10" d="M38.2,36.5c0.2-0.4,0.3-0.8,0.2-1.2l0,0C38.4,35.7,38.4,36.1,38.2,36.5"/>
<path class="st8" d="M36,40.7L36,40.7l0.4-0.7c-0.1-0.1-0.3-0.3-0.4-0.4l0.2-0.3c0.3-0.4,0.6-0.8,0.8-1.2c0.2-0.4,0.4-0.8,0.6-1.1
	l0.8-1.6c0,0.4,0,0.8-0.2,1.2l0,0L36,40.7"/>
<path class="st9" d="M36,40.7h-0.7l-0.2-0.1l0.3-0.3l0.5-0.7c0.1,0.1,0.3,0.3,0.4,0.4L36,40.7"/>
<path class="st7" d="M43.1,38.3L42,37.2l0,0c-0.4-0.4-0.9-0.6-1.4-0.6l0,0c-0.2,0-0.4,0-0.5,0.1l1.7-3.2c0.4-0.7,1.1-1.1,1.8-1.1
	c0.3,0,0.7,0.1,1,0.2c0.6,0.3,1,0.9,1.1,1.6l-0.8,1.6c-0.2,0.4-0.4,0.8-0.6,1.1c-0.2,0.4-0.5,0.8-0.8,1.2L43.1,38.3 M41.7,34.4
	c-0.2,0-0.4,0.2-0.4,0.4c0,0.1,0.1,0.3,0.2,0.3c0.1,0,0.1,0,0.2,0c0.1,0,0.3-0.1,0.3-0.2c0.1-0.2,0-0.4-0.1-0.5c0,0,0,0,0,0
	C41.8,34.3,41.8,34.3,41.7,34.4 M43.5,32.6c-0.7,0-1.3,0.4-1.6,1c-0.1,0.2,0,0.4,0.2,0.5c0,0,0,0,0,0c0,0,0.1,0,0.1,0
	c0.1,0,0.3-0.1,0.3-0.2l0,0c0.2-0.4,0.5-0.6,0.9-0.6c0.1,0,0.3,0,0.4,0.1c0.2,0.1,0.4,0,0.5-0.2l0,0c0.1-0.2,0-0.4-0.2-0.5
	C43.9,32.6,43.7,32.5,43.5,32.6"/>
<path class="st4" d="M39.6,40.7h-1.8c0-0.1,0.1-0.2,0.1-0.2l0,0l0.6-1.1c0.1,0.3,0.3,0.6,0.5,0.8L39.6,40.7"/>
<path class="st11" d="M42.1,34.1c0,0-0.1,0-0.1,0c-0.2-0.1-0.3-0.3-0.2-0.5c0,0,0,0,0,0c0.3-0.6,0.9-1,1.6-1c0.2,0,0.5,0,0.7,0.1
	c0.2,0.1,0.3,0.3,0.2,0.5l0,0c-0.1,0.2-0.3,0.2-0.5,0.2c-0.1-0.1-0.3-0.1-0.4-0.1c-0.4,0-0.8,0.2-0.9,0.6l0,0
	C42.4,34.1,42.3,34.1,42.1,34.1"/>
<path class="st11" d="M41.6,35c-0.1,0-0.1,0-0.2,0c-0.2-0.1-0.2-0.3-0.2-0.5c0.1-0.1,0.2-0.2,0.3-0.2c0.1,0,0.1,0,0.2,0
	c0.2,0.1,0.2,0.3,0.2,0.5c0,0,0,0,0,0C41.9,35,41.8,35.1,41.6,35"/>
<path class="st10" d="M43.5,38.7L43.5,38.7l1.8-3.4c0.2-0.4,0.3-0.8,0.2-1.2l0,0c0,0.4,0,0.8-0.2,1.2L43.5,38.7"/>
<path class="st8" d="M43.5,38.7l-0.4-0.4l0.2-0.2c0.3-0.4,0.6-0.8,0.8-1.2c0.2-0.4,0.4-0.8,0.6-1.1l0.8-1.6c0,0.4,0,0.8-0.2,1.2
	L43.5,38.7"/>
<path class="st7" d="M58.2,40.7L58.2,40.7c0.1-0.1,0.2-0.2,0.3-0.2l0,0C58.4,40.5,58.3,40.6,58.2,40.7 M55.5,37.5L55.5,37.5l2.2-6.8
	c0.3-0.9,1.1-1.4,2-1.4c0.2,0,0.4,0,0.6,0.1c0.7,0.2,1.2,0.7,1.4,1.4L61,32.4c-0.1,0.4-0.2,0.8-0.4,1.2c-0.2,0.5-0.3,0.9-0.5,1.3
	c0,0.1-0.1,0.2-0.1,0.3c-0.8-0.6-1.7-0.9-2.7-0.9c-0.3,0-0.5,0-0.8,0.1L55.5,37.5 M57.8,31.6c-0.2,0-0.3,0.1-0.3,0.3
	c-0.1,0.2,0,0.4,0.2,0.4c0,0,0,0,0,0h0.1c0.2,0,0.3-0.1,0.3-0.3c0.1-0.2,0-0.4-0.2-0.4c0,0,0,0,0,0H57.8 M59.4,29.6
	c-0.8,0-1.5,0.6-1.7,1.3c0,0.2,0.1,0.4,0.3,0.4h0.1c0.2,0,0.3-0.1,0.3-0.3l0,0c0.1-0.5,0.5-0.8,1-0.8c0.1,0,0.2,0,0.2,0h0.1
	c0.2,0,0.3-0.1,0.3-0.3l0,0c0-0.2-0.1-0.4-0.3-0.4C59.7,29.6,59.6,29.6,59.4,29.6 M61.6,32L61.6,32"/>
<path class="st4" d="M56.2,39L56.2,39l-0.7-1.5l0.9-3c0.3-0.1,0.5-0.1,0.8-0.1c1,0,1.9,0.3,2.7,0.9c-0.1,0.3-0.3,0.5-0.4,0.8
	c-0.2,0.3-0.4,0.7-0.6,1c-0.2,0.4-0.5,0.7-0.8,1c-0.2,0.2-0.3,0.3-0.5,0.4c-0.1,0.1-0.2,0.1-0.4,0.2l-0.4,0.1c-0.2,0-0.3,0-0.5,0
	h-0.1 M60.3,35.8l0.1-0.2l0,0L60.3,35.8L60.3,35.8"/>
<path class="st11" d="M58.1,31.3H58c-0.2,0-0.3-0.2-0.3-0.4c0.2-0.9,1.1-1.5,2.1-1.3c0.2,0,0.3,0.2,0.3,0.4l0,0
	c0,0.2-0.2,0.3-0.3,0.3h-0.1c-0.1,0-0.2,0-0.2,0c-0.5,0-0.9,0.3-1,0.8l0,0C58.4,31.2,58.2,31.3,58.1,31.3"/>
<path class="st11" d="M57.8,32.3h-0.1c-0.2-0.1-0.3-0.3-0.2-0.4c0,0,0,0,0,0c0-0.2,0.2-0.3,0.3-0.3h0.1c0.2,0.1,0.3,0.3,0.2,0.4
	c0,0,0,0,0,0C58.1,32.2,58,32.3,57.8,32.3"/>
<path class="st10" d="M61.5,31.9c0.1-0.4,0.1-0.8,0-1.2l0,0C61.7,31.1,61.7,31.5,61.5,31.9"/>
<path class="st8" d="M60.4,35.6c-0.1-0.1-0.3-0.2-0.5-0.3c0-0.1,0.1-0.2,0.1-0.3c0.2-0.4,0.4-0.9,0.6-1.3c0.2-0.4,0.3-0.8,0.4-1.2
	l0.5-1.7c0.1,0.4,0.1,0.8,0,1.2l0,0L60.4,35.6"/>
<path class="st9" d="M58.2,40.7h-1.3L56.1,39h0.2c0.2,0,0.3,0,0.5,0l0.4-0.1c0.1-0.1,0.3-0.1,0.4-0.2c0.2-0.1,0.4-0.2,0.5-0.4
	c0.3-0.3,0.6-0.6,0.8-1c0.2-0.3,0.4-0.7,0.6-1c0.1-0.3,0.3-0.5,0.4-0.8c0.2,0.1,0.3,0.2,0.5,0.3l0,0L60.3,36c-0.3,0.3-0.6,0.6-0.7,1
	l-1.1,3.4C58.4,40.5,58.3,40.6,58.2,40.7"/>
<path class="st7" d="M62.3,40.7h-2.6h-0.4c-0.1,0-0.3,0-0.4,0h-0.4l0.1-0.2l0,0l1.1-3.5c0.1-0.4,0.4-0.7,0.7-1l0,0
	c0.4-0.3,0.8-0.5,1.3-0.5c0.2,0,0.4,0,0.6,0.1c0.7,0.2,1.2,0.7,1.4,1.4L63,38.6c-0.1,0.4-0.2,0.8-0.4,1.2S62.4,40.4,62.3,40.7
	 M59.8,37.8c-0.2,0-0.4,0.2-0.3,0.4c0,0.1,0.1,0.3,0.2,0.3h0.1c0.2,0,0.4-0.1,0.4-0.3c0-0.2-0.1-0.3-0.3-0.4L59.8,37.8 M61.4,35.7
	c-0.8,0-1.5,0.6-1.7,1.4c0,0.2,0.1,0.4,0.3,0.4c0,0,0,0,0,0h0.1c0.2,0,0.3-0.1,0.3-0.3l0,0c0.1-0.5,0.5-0.8,1-0.8c0.1,0,0.1,0,0.2,0
	h0.1c0.2,0,0.3-0.1,0.3-0.3l0,0c0-0.2-0.1-0.4-0.3-0.4c0,0,0,0,0,0C61.7,35.7,61.6,35.7,61.4,35.7 M63.6,38.1L63.6,38.1 M63.6,38.1
	L63.6,38.1"/>
<path class="st4" d="M59.7,40.7h-0.9c0.1,0,0.3,0,0.4,0H59.7"/>
<path class="st11" d="M60.1,37.5H60c-0.2,0-0.3-0.2-0.3-0.4c0,0,0,0,0,0c0.2-0.8,0.9-1.4,1.7-1.4c0.1,0,0.2,0,0.4,0
	c0.2,0,0.3,0.2,0.3,0.4c0,0,0,0,0,0l0,0c0,0.2-0.2,0.3-0.3,0.3h-0.1c-0.1,0-0.1,0-0.2,0c-0.5,0-0.9,0.3-1,0.8l0,0
	C60.4,37.3,60.2,37.5,60.1,37.5"/>
<path class="st11" d="M59.8,38.5L59.8,38.5c-0.3-0.1-0.4-0.3-0.3-0.5c0-0.1,0.2-0.2,0.3-0.2h0.1c0.2,0,0.3,0.2,0.3,0.4
	C60.1,38.4,60,38.5,59.8,38.5"/>
<path class="st10" d="M63.6,38L63.6,38 M63.6,38c0.1-0.4,0.1-0.8,0-1.2l0,0C63.7,37.3,63.7,37.7,63.6,38"/>
<path class="st8" d="M62.8,40.7h-0.4c0.1-0.3,0.2-0.5,0.3-0.8s0.2-0.8,0.4-1.2l0.5-1.7c0.1,0.4,0.1,0.8,0,1.2l0,0L62.8,40.7"/>
<path class="st7" d="M44.2,39.4L42,37.2l0,0l1.1,1.2l0.4,0.4L44.2,39.4L44.2,39.4 M38.5,38.6c0-0.6,0.2-1.1,0.6-1.5l0,0
	C38.7,37.5,38.5,38.1,38.5,38.6 M42,37.2L42,37.2 M39.1,37.2L39.1,37.2 M39.1,37.2c0.4-0.4,0.9-0.6,1.4-0.6
	C40,36.6,39.5,36.8,39.1,37.2 M40.5,36.6L40.5,36.6"/>
<path class="st4" d="M44.3,40.7h-3.2c-0.2-0.3-0.3-0.6-0.4-0.9c-0.1-0.2-0.1-0.4-0.1-0.6c0-0.1,0-0.3,0-0.4c0-0.1,0-0.3,0.1-0.4
	c0-0.2,0.1-0.3,0.2-0.4c0.1-0.2,0.3-0.4,0.5-0.6c0.1-0.1,0.2-0.2,0.3-0.3c-0.3-0.2-0.7-0.3-1.1-0.3c-1.1,0-2,0.8-2.1,1.9
	c0,0,0,0.1,0,0.1l0,0c0-0.6,0.2-1.1,0.6-1.5l0,0l0,0l0,0c0.4-0.4,0.9-0.6,1.4-0.6l0,0c0.5,0,1.1,0.2,1.4,0.6l0,0l2.2,2.3
	c0,0.2-0.1,0.4-0.1,0.5C44.1,40.2,44.1,40.4,44.3,40.7"/>
<polyline class="st8" points="39.6,40.7 39.6,40.7 39.1,40.1 39.6,40.7 "/>
<path class="st9" d="M41.1,40.7h-1.5l-0.6-0.6c-0.4-0.4-0.6-0.9-0.6-1.5c0-1.1,0.8-2,1.9-2.1c0,0,0.1,0,0.1,0c0.4,0,0.8,0.1,1.1,0.3
	c-0.1,0.1-0.2,0.2-0.3,0.3c-0.2,0.2-0.3,0.4-0.5,0.6c-0.1,0.1-0.1,0.3-0.2,0.4c0,0.1-0.1,0.3-0.1,0.4c0,0.1,0,0.3,0,0.4
	c0,0.2,0.1,0.4,0.1,0.6C40.8,40,41,40.4,41.1,40.7"/>
<path class="st7" d="M50.7,39.2c-0.2-1.2-0.9-2.3-2-3l1.3-0.8l1.5,3.4l-0.6,0.2L50.7,39.2 M55.1,36.7l-0.6-1.3
	c0.1-0.1,0.1-0.3,0-0.4c-0.1-0.1-0.2-0.3-0.3-0.4L54,34.2C55,34.6,55.4,35.7,55.1,36.7"/>
<path class="st4" d="M44.3,40.7L44.3,40.7c-0.1-0.2-0.1-0.4-0.1-0.7c0-0.7,0.4-1.4,1-1.8l0,0l3.3-1.9l0,0l0,0l0,0
	c1.1,0.7,1.8,1.8,2,3l-0.8,0.3c-0.4,0.1-0.8,0.3-1.2,0.4c-0.4,0.1-0.9,0.2-1.3,0.2h-0.1c-0.2,0-0.4,0-0.6,0c-0.1,0-0.3-0.1-0.4-0.1
	c-0.1,0-0.3-0.1-0.4-0.2c-0.1-0.1-0.3-0.2-0.4-0.3c-0.2-0.2-0.4-0.4-0.5-0.6c-0.1-0.1-0.1-0.3-0.2-0.4c-0.6,0.6-0.8,1.4-0.6,2.2"/>
<path class="st11" d="M54.5,35.3l-0.3-0.8c0.1,0.1,0.2,0.2,0.3,0.4C54.6,35.1,54.6,35.2,54.5,35.3"/>
<path class="st8" d="M49.2,40.7L49.2,40.7l1.5-0.9c0-0.2-0.1-0.4-0.1-0.5l0.3-0.1l0.6-0.2l0.2,0.4L49.2,40.7"/>
<path class="st9" d="M49.2,40.7h-5c-0.3-0.8-0.1-1.6,0.6-2.2c0,0.1,0.1,0.3,0.2,0.4c0.1,0.2,0.3,0.4,0.5,0.6
	c0.1,0.1,0.2,0.2,0.4,0.3c0.1,0.1,0.3,0.1,0.4,0.2c0.1,0.1,0.3,0.1,0.4,0.1c0.2,0,0.4,0,0.6,0h0.1c0.4,0,0.9-0.1,1.3-0.2
	c0.4-0.1,0.8-0.2,1.2-0.4l0.8-0.3c0,0.2,0.1,0.4,0.1,0.5L49.2,40.7"/>
<path class="st7" d="M29.2,40.7h-1.7c0.2-0.2,0.4-0.4,0.5-0.7l0.2-0.2C28.6,40.1,28.9,40.4,29.2,40.7 M33.9,37.1
	c0-0.7-0.3-1.3-0.9-1.7l0,0l0,0c0.3,0.2,0.5,0.5,0.7,0.8C33.9,36.4,33.9,36.8,33.9,37.1 M30.1,36L30.1,36 M30.1,36
	c0.4-0.6,1-0.9,1.7-0.9C31.2,35.1,30.5,35.4,30.1,36 M31.9,35.1L31.9,35.1"/>
<path class="st4" d="M29.7,40.7h-0.5c-0.3-0.3-0.7-0.6-1-0.9c0.2-0.2,0.4-0.4,0.6-0.7s0.5-0.5,0.8-0.8V40.7 M27.9,39.3L27.9,39.3
	l1.4-2.2l0.4-0.7l0.4-0.5l0,0l0,0l0,0c0.4-0.6,1-0.9,1.7-0.9l0,0c0.4,0,0.8,0.1,1.1,0.3l0,0c0.6,0.4,0.9,1,0.9,1.7
	c0,0.1,0,0.3,0,0.4l0,0c0.2-0.8-0.2-1.7-0.9-2.1c-0.3-0.2-0.7-0.3-1.1-0.4c-0.7,0-1.3,0.4-1.7,0.9L27.9,39.3"/>
<path class="st8" d="M27.5,40.7h-0.5l0.9-1.3c0.1,0.2,0.2,0.3,0.4,0.5L28.1,40C27.9,40.2,27.7,40.4,27.5,40.7"/>
<path class="st9" d="M28.3,39.8c-0.1-0.1-0.2-0.3-0.4-0.5l2.2-3.4c0.4-0.6,1-0.9,1.7-0.9c0.4,0,0.8,0.1,1.1,0.3
	c0.7,0.5,1.1,1.3,0.9,2.1V37c0-0.7-0.5-1.2-1.2-1.2h-1.8c-0.7,0-1.2,0.5-1.2,1.2v1.3c-0.3,0.3-0.5,0.5-0.8,0.8
	C28.7,39.3,28.5,39.5,28.3,39.8"/>
<path class="st4" d="M35.3,40.7h-1.4v-0.5l0.2,0.1l0,0l1,0.3L35.3,40.7"/>
<path class="st7" d="M52.4,40.7L52.4,40.7l-0.6-1.4l-0.2-0.4L50,35.5v-0.1c-0.5-1-0.1-2.2,0.9-2.7c0,0,0.1,0,0.1,0
	c0.3-0.1,0.6-0.2,0.8-0.2c0.4,0,0.8,0.1,1.1,0.3l0.7,1.6c0.2,0.4,0.4,0.8,0.5,1.2c0.2,0.5,0.4,0.9,0.5,1.4c0,0.1,0,0.2,0.1,0.3
	c-1.2,0.1-2.4,0.8-3.1,1.8L52.4,40.7 M51,35.9h-0.2c-0.2,0.1-0.3,0.3-0.2,0.5c0.1,0.1,0.2,0.2,0.3,0.2h0.2c0.2-0.1,0.3-0.3,0.2-0.5
	C51.3,36,51.1,35.9,51,35.9 M51.1,33c-0.1,0-0.1,0-0.2,0c-0.8,0.5-1.1,1.5-0.7,2.3c0,0,0,0,0,0c0.1,0.1,0.2,0.2,0.3,0.2
	c0.1,0,0.1,0,0.2,0c0.2-0.1,0.2-0.3,0.2-0.5l0,0c-0.3-0.5-0.1-1.1,0.4-1.4c0,0,0,0,0,0c0.2-0.1,0.2-0.3,0.1-0.5l0,0
	C51.4,33.1,51.2,33.1,51.1,33"/>
<path class="st4" d="M56.9,40.7L56.9,40.7l-1.5-3.4l0,0l0.1,0.2l0,0l0.7,1.5L56.9,40.7 M55.4,40.7h-3l-0.7-1.6
	c0.8-1,1.9-1.6,3.1-1.8c0.1,0.3,0.1,0.6,0.2,0.9c0.1,0.4,0.2,0.8,0.2,1.2C55.3,39.8,55.4,40.3,55.4,40.7"/>
<path class="st11" d="M50.5,35.6c-0.1,0-0.3-0.1-0.3-0.2c-0.5-0.8-0.2-1.9,0.7-2.3c0,0,0,0,0,0c0.2-0.1,0.4,0,0.5,0.1l0,0
	c0.1,0.2,0,0.4-0.1,0.5c-0.5,0.3-0.7,0.9-0.4,1.4c0,0,0,0,0,0l0,0c0.1,0.2,0,0.4-0.2,0.5C50.6,35.6,50.6,35.6,50.5,35.6"/>
<path class="st11" d="M51,36.6c-0.1,0-0.3-0.1-0.3-0.2c-0.1-0.2,0-0.4,0.2-0.5H51c0.1,0,0.3,0.1,0.3,0.2c0.1,0.2,0,0.4-0.2,0.5H51"
	/>
<path class="st10" d="M53.8,33.7c-0.2-0.4-0.4-0.7-0.8-0.9l0,0C53.3,33,53.6,33.3,53.8,33.7"/>
<path class="st8" d="M54.8,37.3c0-0.1,0-0.2-0.1-0.3c-0.1-0.5-0.3-0.9-0.5-1.4c-0.2-0.4-0.3-0.8-0.5-1.2L53,32.8
	c0.3,0.2,0.6,0.5,0.8,0.9l0,0l1.6,3.6C55.2,37.3,55,37.3,54.8,37.3"/>
<path class="st9" d="M56.9,40.7h-1.5c0-0.4,0-0.9-0.1-1.3c-0.1-0.4-0.2-0.8-0.3-1.2c-0.1-0.3-0.1-0.6-0.2-0.9c0.2,0,0.4,0,0.6,0
	L56.9,40.7"/>
<path class="st11" d="M45.5,70.5c-0.2,0-0.3-0.1-0.3-0.3c-0.2-0.9,0.4-1.8,1.3-2h0.1c0.2,0,0.3,0.1,0.3,0.3c0,0.2-0.1,0.4-0.3,0.4
	l0,0c-0.5,0.1-0.9,0.6-0.8,1.2c0,0,0,0,0,0c0,0.2-0.1,0.4-0.3,0.4L45.5,70.5"/>
<path class="st11" d="M47.5,68.7c-0.2,0-0.3-0.1-0.3-0.3c-0.1-0.2,0.1-0.4,0.2-0.4h0.1c0.2,0,0.3,0.1,0.3,0.3c0.1,0.2,0,0.4-0.2,0.4
	C47.7,68.6,47.7,68.6,47.5,68.7L47.5,68.7"/>
<path class="st9" d="M54.7,65.8L54.7,65.8"/>
<polyline class="st14" points="50.9,71 50.9,71 51.2,71 51.2,71 50.9,71 "/>
<path class="st8" d="M46.8,72.1c-0.2,0-0.4,0-0.6-0.1l1.7-0.5c0.4-0.1,0.8-0.2,1.2-0.4c0.5-0.1,0.9-0.3,1.3-0.5l0.3-0.1
	c0.1,0.2,0.2,0.3,0.3,0.5L50.9,71l0,0l-3.5,1l0,0C47.2,72.1,47,72.1,46.8,72.1 M54.7,65.8L54.7,65.8 M54.5,65.8L54.5,65.8"/>
<path class="st9" d="M51.2,71L51.2,71c-0.1-0.2-0.2-0.3-0.3-0.5l0.8-0.4c0.4-0.2,0.7-0.4,1.1-0.6c0.4-0.2,0.7-0.5,1-0.8
	c0.2-0.1,0.3-0.3,0.4-0.5c0.1-0.1,0.2-0.2,0.2-0.4c0.1-0.1,0.1-0.3,0.1-0.4c0.1-0.4,0.1-0.8,0-1.2c0-0.1-0.1-0.3-0.2-0.4h0.3
	c0.8,0.1,1.6,0.7,1.8,1.5c0.1,0.2,0.1,0.4,0.1,0.6c0,0.9-0.6,1.7-1.5,2l0,0L51.2,71"/>
<path class="st15" d="M23,70.4V34.3c0.1-7.6,3.9-7,5.4-7.5c0-0.1,0-0.2,0-0.2V24h1.2c-0.2,0.2-0.2,0.5-0.2,0.8v2.5l0,0
	c0,0.1,0,0.1,0,0.2c-1.5,0.5-5.3-0.4-5.3,7.3v5.8H23v20.2h1.1v8.5l0,0c0,0.3,0,0.6,0.1,0.9L23,70.4 M65,70.4l-1.2-0.2
	c0.1-0.3,0.1-0.6,0.1-0.9l0,0v-8.5H65V70.4"/>
<path class="st16" d="M58.6,74.7h-29c-4.9,0-6.6-1.7-6.6-3.8v-0.4l1.2-0.2c0.5,1.6,2.3,2.8,6.2,2.8h27.3c3.7,0,5.6-1.2,6.1-2.7
	l1.2,0.2v0.4C65,73,62.9,74.7,58.6,74.7"/>
<path class="st15" d="M65,40.7h-1.1v-5.8l0,0c0-1.2,0.2-4.2-1.6-6c-0.9-0.9-2.2-1.4-3.5-1.3l0,0c0-0.1,0-0.1,0-0.2v-2.5l0,0
	c0-0.3-0.1-0.6-0.2-0.8h1.2v2.6c0,0.1,0,0.2,0,0.2l0,0c5.3,0,5.3,5.7,5.3,7.5V40.7"/>
<path class="st17" d="M63.8,70.2L63.8,70.2c0.1-0.3,0.1-0.6,0.1-0.9C63.9,69.6,63.9,69.9,63.8,70.2"/>
<path class="st18" d="M57.7,73c3.7,0,5.6-1.2,6.1-2.7l0,0C63.3,71.8,61.4,73,57.7,73"/>
<path class="st17" d="M24.1,69.3L24.1,69.3L24.1,69.3 M24.1,40.7L24.1,40.7v-5.8c0-7.7,3.8-6.8,5.3-7.3l0,0
	c-1.5,0.5-5.3-0.2-5.3,7.3V40.7 M63.9,34.9c0-1.1,0.1-4.2-1.6-6C64.1,30.6,63.9,33.7,63.9,34.9 M58.7,27.6L58.7,27.6 M29.4,27.4
	L29.4,27.4v-2.6c0-0.3,0.1-0.6,0.2-0.8l0,0c-0.2,0.2-0.2,0.5-0.2,0.8V27.4 M58.8,24.8c0-0.3-0.1-0.6-0.2-0.8l0,0
	C58.7,24.3,58.8,24.5,58.8,24.8L58.8,24.8"/>
<path class="st4" d="M62.7,22.9c0,0.6-0.6,1.1-1.2,1.1H26.6c-0.6,0-1.2-0.5-1.2-1.1v-8.5c0-0.6,0.6-1.1,1.2-1.1h34.8
	c0.6,0,1.2,0.5,1.2,1.1V22.9"/>
<path class="st19" d="M61.5,24c0.7-0.1,1.2-0.6,1.2-1.2h-5.5v-9.4h4.2c0.6,0,1.2,0.5,1.2,1.1v8.5C62.6,23.6,62.1,24,61.5,24"/>
<path class="st20" d="M57.2,24H26.6c-0.7-0.1-1.2-0.6-1.2-1.2h31.8V24"/>
<path class="st21" d="M61.5,24h-4.2v-1.2h5.5C62.6,23.4,62.1,23.9,61.5,24L61.5,24"/>
<polyline class="st22" points="65,60.8 23,60.8 23,40.7 65,40.7 65,60.8 "/>
<polyline class="st4" points="60.9,58.8 27.1,58.8 27.1,42.9 60.9,42.9 60.9,58.8 "/>
<path class="st23" d="M33.2,60.2l-0.6-0.5c-0.2,0-0.4,0.1-0.5,0.2l-0.2-0.5c-0.3-0.1-0.6-0.1-1-0.1c-0.4,0-0.8,0.1-1.2,0.2v-0.6h4.2
	v0.5c-0.2,0.2-0.4,0.4-0.6,0.6C33.2,60,33.2,60.1,33.2,60.2"/>
<path class="st24" d="M33.9,38.3l-0.3-0.1l0,0c0.1-0.2,0.2-0.5,0.3-0.8L33.9,38.3"/>
<path class="st4" d="M32.2,40.7H32l1.6-2.4l0.3,0.1v1.9h-0.2h-0.2C33,40.2,32.5,40.4,32.2,40.7"/>
<polyline class="st24" points="32,40.7 32,40.7 33.6,38.2 33.6,38.2 32,40.7 "/>
<path class="st4" d="M32,40.7h-2.3v-2.3l0.1-0.1c0.3-0.3,0.7-0.6,1.1-0.8c0.2-0.1,0.4-0.2,0.6-0.2c0.1,0,0.3-0.1,0.4-0.1h0.4h0.1
	c0.2,0,0.3,0,0.5,0.1c0.3,0.1,0.5,0.2,0.7,0.3c0.1,0.1,0.2,0.2,0.3,0.3c0-0.1,0.1-0.2,0.1-0.3l0,0c-0.1,0.3-0.2,0.5-0.3,0.8l0,0
	L32,40.7"/>
<path class="st25" d="M29.7,38.3V37c0-0.7,0.5-1.2,1.2-1.2h1.8c0.7,0,1.2,0.5,1.2,1.2v0.4c0,0.1-0.1,0.2-0.1,0.3
	c-0.1-0.1-0.2-0.2-0.3-0.3c-0.2-0.1-0.5-0.2-0.7-0.3c-0.2,0-0.3-0.1-0.5-0.1h-0.1h-0.4c-0.1,0-0.3,0-0.4,0.1
	c-0.2,0.1-0.4,0.1-0.6,0.2c-0.4,0.2-0.7,0.5-1.1,0.8L29.7,38.3"/>
<path class="st4" d="M33.9,40.7h-0.4c0,0,0,0,0-0.1c0-0.1,0.1-0.3,0.2-0.4h0.2L33.9,40.7"/>
<path class="st25" d="M32.2,40.7L32.2,40.7c0.4-0.3,0.8-0.5,1.3-0.5l0,0C33,40.2,32.5,40.3,32.2,40.7"/>
<path class="st26" d="M32.2,40.7L32.2,40.7c0.4-0.3,0.8-0.5,1.3-0.5C33,40.2,32.5,40.3,32.2,40.7 M33.5,40.2L33.5,40.2"/>
<path class="st25" d="M33.5,40.7h-1.3c0.4-0.3,0.8-0.5,1.3-0.5h0.2C33.6,40.3,33.5,40.4,33.5,40.7C33.5,40.6,33.5,40.6,33.5,40.7"/>
<polyline class="st23" points="33.9,42.9 29.7,42.9 29.7,40.7 32,40.7 32,40.7 32.2,40.7 32.2,40.7 32.2,40.7 33.5,40.7 33.9,40.7 
	33.9,42.9 "/>
<path class="st4" d="M33.9,58.8h-4.2V42.9h4.2V58.8 M30.1,57.8c-0.1,0-0.2,0-0.3,0.1c-0.1,0.1-0.1,0.4,0,0.5c0,0,0,0,0,0
	c0.1,0.1,0.2,0.1,0.2,0.1c0.1,0,0.2,0,0.3-0.1c0.1-0.1,0.1-0.4,0-0.5C30.3,57.8,30.2,57.8,30.1,57.8 M30.6,56.4L30.6,56.4
	c-0.3,0.1-0.4,0.3-0.4,0.5c0.1,0.2,0.2,0.3,0.4,0.3h0.1c0.2,0,0.3-0.2,0.3-0.4C30.9,56.5,30.7,56.4,30.6,56.4"/>
<g>
	<defs>
		<path id="SVGID_5_" d="M32.3,71.8l-2.9-2.8c0.3-0.8,0.8-1.5,1.5-2.1v-0.3c0-0.3,0.1-0.6,0.2-0.9l0,0c-1,0-1.8-0.6-2-1.5
			c-0.1,0-0.1,0-0.2-0.1l0,0c-0.3-0.4-1-0.5-1.4-0.2c0,0-0.1,0-0.1,0.1c-0.1,0.1-0.4,0.1-0.5,0l0,0c-0.1-0.1-0.1-0.4,0-0.5
			c0.3-0.3,0.8-0.4,1.2-0.4c0,0-0.1-0.1-0.1-0.1c0-0.2,0.1-0.4,0.3-0.4c0.1,0,0.2,0,0.2,0L28.3,62c-0.1,0.1-0.1,0.1-0.2,0.1
			c-0.2,0-0.4-0.1-0.4-0.3l0,0c-0.1-0.5-0.6-0.9-1.1-0.9c0,0,0,0-0.1,0c-0.2,0-0.4-0.1-0.4-0.3l0,0c0-0.2,0.1-0.4,0.3-0.4
			c0.3-0.1,0.7,0,1,0.1l-0.6-0.6c-0.3-0.3-0.5-0.6-0.6-1l1.3,1.2l0.4,0.4l0-0.2c1.1-0.9,2.6-1.3,4-1l0.2,0.5
			c0.2-0.1,0.4-0.2,0.5-0.2l0.6,0.5c0-0.1,0.1-0.2,0.2-0.3c0.2-0.4,0.6-0.7,1-0.8l0.2-0.5c0.2-0.3,0.4-0.6,0.7-0.8l0,0h0l0,0l0,0
			l0,0c1-0.6,2.3-0.2,2.8,0.8c0.3,0.6,0.4,1.3,0.1,1.9v0.1l1.4,0.9c0.3-0.2,0.6-0.4,1-0.4h0.2h0.2c0.2,0,0.3,0.1,0.5,0.1
			c0-0.1,0-0.2,0.1-0.3c0.1-0.1,0.4-0.1,0.5,0c0.1,0.1,0.1,0.4,0,0.5l-0.1,0l0,0c0.5,0.4,0.8,1,0.9,1.6c0,0.1,0,0.2,0,0.3l0,0
			c0.1,0.1,0.2,0.2,0.4,0.3l0.1,0.1l0,0l0,0l0,0l0,0.1l0,0v0.1l0,0v0.1l0,0l0,0l0,0v0l0,0l0,0l0,0V64l0,0c0,0,0,0,0,0.1l0,0l0,0l0,0
			v0.1l0,0c0,0,0,0,0,0.1l0,0c0,0,0,0,0,0.1l0,0c0,0,0,0,0,0.1l0,0c0,0,0,0,0,0.1l0,0V65l0,0c0,0.1,0,0.1,0,0.2l0,0v0.1
			c0,0.3-0.1,0.6-0.2,0.8l0,0c0,0,0,0,0,0.1l0,0c0,0,0,0,0,0.1l-0.1,0.2c0,0.1-0.1,0.1-0.2,0.2c-0.4,0.4-0.9,0.6-1.4,0.6h-0.2
			c0.1,0,0.1,0,0.1,0.1c0.1,0.1,0.1,0.4,0,0.5c-0.1,0.1-0.4,0.1-0.5,0c-0.1-0.1-0.1-0.4,0-0.5c0,0,0,0,0,0c0.1,0,0.1-0.1,0.2-0.1
			c-0.1,0-0.1,0-0.2,0c-0.2,0-0.3-0.1-0.4-0.2l-0.2-0.1l-0.2-0.1l-2.9,3.8v0.1l0,0c-0.5,0.6-1.3,0.9-2.1,0.7
			c-0.1,0.2-0.2,0.3-0.3,0.4c-0.4,0.4-0.9,0.6-1.5,0.6c-0.5,0-1-0.2-1.4-0.6 M34.3,67.6c-0.1,0.2-0.2,0.4-0.4,0.6l0,0v-0.1l3.1-3.4
			l-0.7-0.4l-1.6,3.3 M28.5,63.2l0.1,0.1v-0.2C28.6,63.1,28.6,63.1,28.5,63.2 M40.4,70.4c-0.6-0.7-0.5-1.8,0.2-2.4
			c0.1-0.1,0.4-0.1,0.5,0s0.1,0.4,0,0.5c0,0,0,0-0.1,0l0,0c-0.4,0.3-0.5,1-0.2,1.4c0,0,0,0,0,0.1c0.1,0.1,0.1,0.4,0,0.5l0,0
			c-0.1,0-0.1,0.1-0.2,0.1C40.5,70.6,40.4,70.5,40.4,70.4 M29.8,58.4c-0.1-0.1-0.1-0.4,0-0.5c0,0,0,0,0,0c0.1-0.1,0.4-0.1,0.5,0
			c0.1,0.1,0.1,0.4,0,0.5c-0.1,0.1-0.2,0.1-0.3,0.1C30,58.5,29.9,58.4,29.8,58.4 M29.1,57.6L29.1,57.6c-0.4-0.4-1-0.5-1.4-0.1
			c0,0,0,0,0,0c-0.1,0.1-0.4,0.1-0.5,0l0,0c-0.1-0.1-0.1-0.4,0-0.5c0,0,0,0,0,0c0.7-0.6,1.8-0.6,2.4,0.1c0,0,0,0,0,0
			c0.1,0.1,0.1,0.4,0,0.5c-0.1,0.1-0.2,0.1-0.2,0.1C29.2,57.7,29.1,57.7,29.1,57.6 M30.2,56.8c0-0.2,0.1-0.4,0.3-0.5
			c0.2-0.1,0.4,0.1,0.4,0.3c0.1,0.2-0.1,0.4-0.3,0.4l0,0h-0.1C30.4,57.1,30.3,57,30.2,56.8"/>
	</defs>
	<clipPath id="SVGID_6_">
		<use xlink:href="#SVGID_5_"  style="overflow:visible;"/>
	</clipPath>
	<g class="st27">
		
			<image style="overflow:visible;enable-background:new    ;" width="144" height="132" xlink:href="3B2D262134D4F444.png"  transform="matrix(0.128 0 0 0.128 26.0418 56.09)">
		</image>
	</g>
</g>
</svg>
