<?xml version="1.0" encoding="utf-8"?>
<!-- Generator: Adobe Illustrator 24.0.0, SVG Export Plug-In . SVG Version: 6.00 Build 0)  -->
<svg version="1.1" id="Layer_1" xmlns="http://www.w3.org/2000/svg" xmlns:xlink="http://www.w3.org/1999/xlink" x="0px" y="0px"
	 viewBox="0 0 88 88" style="enable-background:new 0 0 88 88;" xml:space="preserve">
<style type="text/css">
	.st0{fill:#009B57;}
	.st1{clip-path:url(#SVGID_4_);}
	.st2{fill:#006838;}
	.st3{fill:#816557;}
	.st4{fill:#804137;}
	.st5{fill:#9A5A4C;}
	.st6{fill:#BD6F50;}
	.st7{fill:#A85B3F;}
	.st8{fill:#9C4C37;}
	.st9{fill:#AB5E43;}
	.st10{fill:#A1543B;}
	.st11{fill:#454F53;}
	.st12{fill:#F8F8F8;}
	.st13{fill:#CA356D;}
	.st14{fill:#8FA5B6;}
	.st15{fill:#A2B5C7;}
	.st16{fill:#667898;}
	.st17{fill:#8396AC;}
	.st18{fill:#CED5DD;}
	.st19{fill:#526483;}
	.st20{fill:#FFFFFF;}
	.st21{fill:#8DA1B4;}
	.st22{fill:#DFE2E8;}
	.st23{fill:#5A6B8A;}
	.st24{fill:#5E708B;}
	.st25{fill:#F0C6A7;}
	.st26{fill:#E2AF8D;}
	.st27{fill:#CF6A28;}
	.st28{fill:#E5403C;}
	.st29{fill:#CD2628;}
	.st30{fill:#141D37;}
	.st31{fill:#FBC4B7;}
	.st32{fill:#20294F;}
	.st33{fill:#FCC398;}
	.st34{fill:#EDA16E;}
	.st35{fill:#F05151;}
	.st36{fill:#F7A973;}
	.st37{fill:#332E2F;}
	.st38{fill:#915329;}
	.st39{fill:#EA833C;}
	.st40{fill:#DC762E;}
	.st41{fill:#E7965E;}
	.st42{fill:#EDA354;}
	.st43{fill:#F6B569;}
	.st44{fill:#383434;}
	.st45{fill:#D4894B;}
	.st46{fill:#DB9559;}
	.st47{fill:#6FAC86;}
	.st48{fill:#539167;}
	.st49{fill:#56916A;}
	.st50{fill:#48845B;}
	.st51{fill:#DAB8A0;}
	.st52{fill:#EDD5C5;}
	.st53{fill:#833929;}
	.st54{fill:#D6AD35;}
	.st55{fill:#D38D37;}
</style>
<title>Artboard 13</title>
<g>
	<defs>
		<rect id="SVGID_1_" y="-99" width="88" height="88"/>
	</defs>
	<clipPath id="SVGID_2_">
		<use xlink:href="#SVGID_1_"  style="overflow:visible;"/>
	</clipPath>
</g>
<rect class="st0" width="88" height="88"/>
<g>
	<defs>
		<rect id="SVGID_3_" width="88" height="88"/>
	</defs>
	<clipPath id="SVGID_4_">
		<use xlink:href="#SVGID_3_"  style="overflow:visible;"/>
	</clipPath>
	<g class="st1">
		<circle class="st2" cx="44" cy="83.6" r="44.2"/>
	</g>
</g>
<path class="st3" d="M5.6,78c3.2-0.1,6.4-0.1,9.6-0.2l9.6-0.1c3.2,0,6.4,0,9.6,0H44h9.6c3.2,0,6.4,0,9.6,0l9.6,0.1
	c3.2,0,6.4,0.1,9.6,0.2v0.3c-3.2,0.1-6.4,0.1-9.6,0.2l-9.6,0.1c-3.2,0-6.4,0-9.6,0H44h-9.6c-3.2,0-6.4,0-9.6,0l-9.6-0.1
	c-3.2-0.1-6.4-0.1-9.6-0.2L5.6,78"/>
<path class="st4" d="M26.8,77.9l-1.2-0.1l-0.9-8l-0.2-2.2h1.5l0.2,2.2L26.8,77.9"/>
<path class="st4" d="M57.6,77.9l1.2-0.1l0.9-8l0.2-2.2h-1.4l-0.2,2.2L57.6,77.9L57.6,77.9z"/>
<polyline class="st5" points="19.6,77.8 16.5,50.6 18.5,50.8 20.8,77.9 19.6,77.8 "/>
<polygon class="st5" points="65.7,77.8 68.8,50.6 66.9,50.8 64.5,77.9 65.7,77.8 "/>
<path class="st6" d="M70.8,54.2c-8.8,0.6-18,0.9-27.8,1c-7.1,0.1-14,0-20.7-0.2c-2.8-0.1-5.6-0.2-8.3-0.3c0.1-0.8,0.2-1.6,0.3-2.4
	c2.3,0.1,4.6,0.2,7,0.3c6.7,0.2,13.6,0.3,20.7,0.3c9.9,0,19.4-0.2,28.6-0.6C70.7,52.9,70.7,53.6,70.8,54.2"/>
<path class="st6" d="M70.9,56.2c0,0.5,0,1-0.1,1.6c-8.6,0.7-17.8,1.2-27.5,1.3c-6.5,0.1-12.7,0-18.8-0.2c-3.5-0.1-7-0.3-10.3-0.5
	c0.1-0.5,0.2-1,0.2-1.5c2.9,0,5.8,0.1,8.8,0.1c6.5,0.1,13.2,0.1,19.9,0C52.7,56.9,61.9,56.6,70.9,56.2"/>
<path class="st6" d="M70.9,60.1c0,0.5,0,1-0.1,1.6c-8.6,0.7-17.8,1.2-27.5,1.3c-5.1,0.1-10.1,0-15-0.1c-4.9-0.1-9.6-0.3-14.1-0.6
	c0.1-0.5,0.2-1,0.2-1.5c3.9,0.1,7.7,0.1,11.7,0.1c5.6,0,11.3,0,17.1-0.1C52.7,60.7,61.9,60.4,70.9,60.1"/>
<path class="st7" d="M76.7,66.4c0,0.6-0.1,1.2-0.1,1.7c-6.3,0.6-13,1-19.8,1.3c-4.4,0.2-8.8,0.3-13.4,0.4
	c-5.9,0.1-11.7,0.1-17.2-0.1h-1.4c-4.6-0.1-9.1-0.3-13.4-0.5c0.1-0.7,0.1-1.3,0.1-2c4.3,0.2,8.6,0.3,13.1,0.4h1.5
	c4.9,0.1,9.9,0.1,15,0.1h2.3C54.9,67.6,66.1,67.2,76.7,66.4"/>
<path class="st7" d="M75.9,65.3c-10.6,0.6-21.6,1-32.9,1.2l-6.9,0.1c-8.3,0-16.4-0.1-24.3-0.3v-2c6.2,0.1,12.5,0.2,18.9,0.2
	c4,0,8,0,12.1,0c11.2-0.1,22.1-0.4,32.7-0.8C75.7,64.2,75.8,64.8,75.9,65.3"/>
<polyline class="st5" points="19.4,71.3 65.7,71.1 65.6,72.2 19.4,72.7 19.4,71.3 "/>
<path class="st8" d="M76.7,66.4c0,0.6-0.1,1.2-0.1,1.7c-10.4,0.9-21.5,1.5-33.2,1.7c-5.9,0.1-11.7,0.1-17.2-0.1h-1.4
	c-4.6-0.1-9.1-0.3-13.4-0.5l0.1-0.8c4.3,0.2,8.8,0.4,13.4,0.5h1.4c5.6,0.1,11.3,0.2,17.2,0.1c11.8-0.2,22.9-0.8,33.2-1.7
	C76.6,67.1,76.6,66.7,76.7,66.4L76.7,66.4"/>
<path class="st8" d="M75.9,65.3c-10.6,0.6-21.6,1-32.9,1.2c-10.7,0.1-21.1,0.1-31.1-0.2c0-0.3,0-0.6,0-0.8c10,0.3,20.4,0.4,31.1,0.2
	c11.3-0.2,22.3-0.6,32.8-1.2C75.8,64.8,75.8,65.1,75.9,65.3"/>
<path class="st7" d="M70.8,54.2c-8.8,0.6-18,0.9-27.8,1c-10.2,0.1-19.8-0.1-29-0.6c0-0.2,0.1-0.5,0.1-0.7c9.1,0.4,18.8,0.7,28.9,0.6
	c9.7-0.1,18.9-0.5,27.7-1C70.7,53.8,70.7,54,70.8,54.2"/>
<path class="st7" d="M70.9,56.2c0,0.5,0,1-0.1,1.6c-8.6,0.7-17.8,1.2-27.5,1.3c-10.3,0.1-20-0.1-29.1-0.7c0-0.2,0.1-0.5,0.1-0.7
	c9,0.5,18.7,0.8,29,0.7c9.7-0.1,18.9-0.6,27.5-1.3C70.9,56.8,70.9,56.5,70.9,56.2L70.9,56.2"/>
<path class="st7" d="M70.9,60.1c0,0.5,0,1-0.1,1.6c-8.6,0.7-17.8,1.2-27.5,1.3c-10.3,0.1-20-0.1-29.1-0.7c0-0.2,0.1-0.4,0.1-0.7
	c9,0.5,18.7,0.8,29,0.7c9.7-0.1,18.9-0.6,27.5-1.3C70.9,60.7,70.9,60.4,70.9,60.1L70.9,60.1"/>
<path class="st9" d="M22,54.4c-2.7-0.1-5.3-0.2-7.9-0.3c0,0.1,0,0.2,0,0.3c0.1-0.7,0.2-1.3,0.3-2c2.3,0.1,4.6,0.2,7,0.3
	C21.6,53.1,21.8,53.7,22,54.4"/>
<path class="st10" d="M22.3,55c-2.8-0.1-5.6-0.2-8.3-0.3l0.1-0.4c0-0.1,0-0.2,0-0.3c2.6,0.1,5.2,0.2,7.9,0.3L22.3,55"/>
<path class="st9" d="M24.1,58.2c-3.3-0.1-6.5-0.3-9.7-0.5c0-0.3,0.1-0.6,0.1-0.9c2.9,0,5.8,0.1,8.8,0.1
	C23.6,57.4,23.8,57.8,24.1,58.2"/>
<path class="st10" d="M24.6,58.9c-3.5-0.1-7-0.3-10.3-0.5c0-0.2,0.1-0.5,0.1-0.7c3.2,0.2,6.4,0.3,9.7,0.5
	C24.3,58.4,24.4,58.7,24.6,58.9"/>
<path class="st9" d="M23,62.7c-1.2,0-2.4-0.1-3.5-0.2l-1.6-0.1l-3.5-0.2C17.2,62.4,20.1,62.6,23,62.7 M27.6,62.1
	c-4.5-0.1-8.9-0.3-13.2-0.5c0-0.3,0.1-0.6,0.1-0.9c3.8,0.1,7.7,0.1,11.7,0.1c0.3,0.4,0.7,0.7,1.1,1.1L27.6,62.1"/>
<path class="st10" d="M28.4,62.8c-1.8,0-3.6-0.1-5.4-0.2l0,0c-2.9-0.1-5.8-0.2-8.6-0.4h-0.1c0-0.2,0.1-0.4,0.1-0.7
	c4.2,0.3,8.6,0.4,13.1,0.5C27.8,62.4,28.1,62.6,28.4,62.8"/>
<path class="st10" d="M33,66.6L33,66.6 M32.8,65.7c-7.2,0-14.2-0.1-21-0.3v0.1v-1.3c6.2,0.1,12.5,0.2,18.9,0.2
	c0.8,0.5,1.6,0.9,2.5,1.2v0.1L32.8,65.7"/>
<path class="st8" d="M32.8,66.6h-3.7c-5.9,0-11.7-0.1-17.3-0.3v-0.8c6.8,0.2,13.8,0.3,21,0.3h0.4l0.2,0.8L32.8,66.6"/>
<path class="st10" d="M11.3,69.2L11.3,69.2c0.1-0.7,0.1-1.3,0.1-2c4.3,0.2,8.6,0.3,13,0.4h1.5c2.5,0,5.1,0.1,7.7,0.1l0.2,0.7
	c1.6,0,3.3,0,5.1-0.1c1.5,0,3-0.1,4.5-0.2c1.7,0.3,3.6,0.6,5.7,0.8c-1.9,0.1-3.8,0.1-5.8,0.1c-2.4,0-4.7,0-7,0
	c-3.5,0-6.9,0-10.2-0.1h-1.4c-4.6-0.1-9.1-0.3-13.4-0.5L11.3,69.2"/>
<path class="st8" d="M36.3,69.9c-3.5,0-6.9,0-10.2-0.1h-1.4h-1.5l-0.1-0.5l-1.7,0.4c-3.4-0.1-6.8-0.3-10-0.4l0,0l0.1-0.8
	c4.3,0.2,8.8,0.4,13.4,0.5h1.4c3.4,0.1,6.8,0.1,10.2,0.1c2.3,0,4.6,0,7,0c1.9,0,3.8-0.1,5.8-0.1l1.6,0.2l-0.1,0.6
	c-2.4,0.1-4.8,0.1-7.3,0.2C41,70,38.6,70,36.3,69.9 M54.3,69.6c0-0.1,0.1-0.1,0.2-0.2l2.3,0.1L54.3,69.6"/>
<path class="st11" d="M72.4,70.9L71.7,71l0,0c0-0.1,0-0.2,0.1-0.3c0.1-0.1,0.2-0.2,0.3-0.3l0.1,0.1L72.4,70.9"/>
<path class="st12" d="M72.2,70.5c-0.1,0-0.1,0.1-0.2,0.1c-0.1,0.1-0.2,0.2-0.3,0.4l0,0c0-0.1,0-0.2,0.1-0.3c0.1-0.1,0.2-0.2,0.3-0.3
	L72.2,70.5"/>
<path class="st13" d="M74.5,77.3c0,0.2,0,0.5,0,0.7h0.1v-0.7L74.5,77.3L74.5,77.3z"/>
<polygon class="st13" points="74.6,77.9 74.2,77.9 74.2,77.9 74.6,77.9 74.6,77.9 "/>
<polygon class="st13" points="74.6,77.9 74.3,78.1 74.4,78.1 74.7,77.9 74.6,77.9 "/>
<polygon class="st13" points="74.6,77.9 74.8,78.1 74.8,78.1 74.7,77.9 74.6,77.9 "/>
<polygon class="st13" points="74.7,77.9 74.9,77.9 74.9,77.9 74.6,77.9 74.7,77.9 "/>
<path class="st13" d="M75.2,77.4c0,0.2,0,0.5,0,0.7h0.1v-0.7L75.2,77.4L75.2,77.4z"/>
<polygon class="st13" points="75.3,78 74.9,78 74.9,78.1 75.3,78.1 75.3,78 "/>
<polygon class="st13" points="75.3,78 75.1,78.2 75.1,78.2 75.4,78 75.3,78 "/>
<polygon class="st13" points="75.3,78 75.5,78.2 75.5,78.2 75.4,78 75.3,78 "/>
<polygon class="st13" points="75.3,78 75.6,78 75.6,78 75.3,78 75.3,78 "/>
<path class="st14" d="M74,76c0.1,0.1,0.1,0.4,0.2,0.6c0.2,0.6,0.3,0.8,0.4,0.8s0.5-0.2,0.6-0.4c0.1-0.3,0.1-0.6,0-0.9L74,76"/>
<path class="st15" d="M80.9,76.3c0,0.2-0.9,0-2.3,0.2c-0.7,0.1-1.2,0.2-1.2,0.2c-0.4,0-0.7,0.1-1.1,0.1c-0.2,0-0.4,0-0.6,0
	c-1-0.1-2.7-0.6-3.2-1.8c0-0.1-0.1-0.3-0.1-0.4l0,0c0-0.2,0-0.4,0-0.5v-0.1c0-0.6,0-1.2,0.2-1.8c0.1-0.3,0.1-0.5,0-0.8
	c-0.2-0.2-0.3-0.2-0.5-0.4c-0.1-0.2-0.1-0.3,0-0.5l0,0c0.3-0.3,0.7-0.5,1.1-0.3c0.2,0.1,0.4,0.3,0.5,0.6c0.1,0.3,0.2,0.7,0.2,1
	c0,0,0.1,0.2,0.2,0.6c0.2,0.4,0.4,0.7,0.7,0.9c0.5,0.5,1.1,0.9,1.7,1.2c0.6,0.3,1.2,0.6,1.8,0.8c0.2,0.1,0.3,0.1,0.8,0.4l1,0.5
	C80.7,76.2,80.8,76.2,80.9,76.3L80.9,76.3"/>
<path class="st16" d="M74.9,73.1h-0.1c-0.1,0-0.1,0-0.2,0c-0.1,0.1,0,0.2-0.1,0.3s-0.1,0-0.2-0.1s-0.1-0.1-0.2-0.1s0,0.3,0,0.3
	s-0.1,0-0.1-0.1s-0.1-0.1-0.2-0.1s-0.1,0.3-0.2,0.3s-0.1,0-0.1-0.1s-0.1-0.1-0.2-0.1s-0.1,0.3-0.2,0.3s-0.1,0-0.1-0.1
	s-0.1-0.1-0.1-0.1s-0.1,0.2-0.2,0.2s-0.1-0.2-0.2-0.2s-0.2,0.2-0.3,0.2c0-0.6,0-1.2,0.2-1.8c0.1-0.3,0.1-0.5,0-0.8
	c-0.1-0.2-0.3-0.2-0.5-0.4c-0.1-0.2-0.1-0.4,0-0.5c0.3-0.3,0.7-0.4,1.1-0.2c0.2,0.1,0.4,0.3,0.5,0.6c0.1,0.3,0.2,0.7,0.2,1
	c0.1,0.2,0.1,0.4,0.2,0.6C74.3,72.5,74.6,72.8,74.9,73.1"/>
<path class="st15" d="M74.7,76.2c0,0.2,0.1,0.4,0.2,0.6c0.2,0.6,0.2,0.8,0.4,0.8s0.5-0.2,0.6-0.4c0.1-0.3,0.1-0.6,0-0.9L74.7,76.2"
	/>
<path class="st17" d="M76,76.8c0-0.2,0-0.3-0.1-0.5h0.2h0.3c0.4,0,0.7,0,1.1-0.1l0.5-0.1c0.5-0.1,0.7-0.1,1.1-0.1c0.2,0,0.6,0,1-0.1
	c0.5,0.2,0.6,0.3,0.7,0.4l0,0c0,0.2-0.9,0-2.3,0.2c-0.7,0.1-1.2,0.2-1.2,0.2c-0.4,0-0.7,0.1-1.1,0.1C76.2,76.7,76.1,76.7,76,76.8"/>
<path class="st18" d="M72.5,74.6L72.5,74.6L72.5,74.6c0-0.2,0-0.4,0-0.5l0,0C72.5,74.2,72.5,74.4,72.5,74.6L72.5,74.6L72.5,74.6"/>
<path class="st17" d="M74.9,76.7c-1-0.2-1.8-0.8-2.3-1.7l0,0c0-0.1-0.1-0.3-0.1-0.4l0,0l0,0c0-0.2,0-0.4,0-0.5v-0.4
	c0-0.5,0.1-1.1,0.2-1.6c0-0.1,0.1-0.3,0.1-0.4c0-0.1,0-0.3-0.1-0.4c-0.2-0.2-0.3-0.2-0.5-0.4c0-0.1-0.1-0.1-0.1-0.2v-0.1
	c0,0.1,0,0.2,0.1,0.3c0.1,0.2,0.3,0.2,0.5,0.4c0.1,0.3,0.1,0.5,0,0.8c-0.1,0.6-0.2,1.2-0.2,1.8c0.1,0,0.2-0.2,0.2-0.2l0,0
	c0,0.4,0.1,0.8,0.3,1.2c0.4,0.6,0.9,1,1.6,1.1c0.2,0.1,0.4,0.1,0.6,0.2h-0.5L74.9,76.7"/>
<path class="st19" d="M72.4,73.9c0-0.6,0-1.2,0.2-1.8c0.1-0.3,0.1-0.5,0-0.8c-0.1-0.2-0.3-0.2-0.5-0.4c0-0.1-0.1-0.2-0.1-0.3
	c0-0.1,0-0.1,0-0.2c0.3,0.1,0.6,0.4,0.8,0.7c0.1,0.2,0.1,0.3,0,1.1c-0.1,0.9-0.1,1-0.1,1.2v0.3l0,0C72.6,73.7,72.5,73.9,72.4,73.9"
	/>
<path class="st17" d="M76,76.8h-0.2c-0.3,0-0.6-0.1-0.9-0.1l0,0l-0.2-0.5h0.5c0.2,0.1,0.5,0.1,0.7,0.1C76,76.4,76,76.6,76,76.8
	L76,76.8"/>
<path class="st20" d="M72.6,70.7h-0.3c0,0,0-0.1,0-0.1c0-0.1,0-0.1,0-0.2c0-0.1,0-0.2,0.1-0.2c0.1,0,0.2,0,0.2,0
	c0,0,0.1,0.1,0.1,0.1C72.7,70.4,72.7,70.5,72.6,70.7L72.6,70.7z"/>
<path class="st11" d="M72.6,70.7h-0.3c0,0,0-0.1,0-0.1c0-0.1,0-0.2,0.1-0.3c0.1,0,0.2,0,0.2,0C72.7,70.4,72.7,70.6,72.6,70.7
	L72.6,70.7z"/>
<path class="st20" d="M72.6,70.4c0,0-0.1,0-0.1,0c0,0,0,0.1,0.1,0.1S72.6,70.6,72.6,70.4L72.6,70.4z"/>
<path class="st16" d="M78,75.2c-0.5,0.1-0.9,0.2-1.4,0.2c-0.2,0-2.5,0.1-3.2-1.1c-0.1-0.2-0.2-0.5-0.2-0.8c0,0,0-0.1,0-0.1
	c0.1-0.2,0.2-0.4,0.4-0.5c0.1-0.1,0.4-0.2,1.2,0.1c0.8,0.4,1.6,0.9,2.3,1.5l0.1,0.1l0.4,0.3h-0.2L78,75.2"/>
<path class="st21" d="M76.8,75.4L76.8,75.4 M77,75.4L77,75.4 M77.1,75.4L77.1,75.4 M77.1,75.4L77.1,75.4 M77.1,75.4
	c0.3,0,0.6-0.1,0.9-0.2l0,0C77.7,75.3,77.4,75.4,77.1,75.4"/>
<path class="st22" d="M77.7,74.8L77.7,74.8l-0.2-0.1L77.7,74.8"/>
<path class="st21" d="M77.9,75l-0.2-0.2l0,0L77.9,75"/>
<path class="st23" d="M76.4,75.4c-0.7,0-2.3-0.1-2.9-1.1c-0.1-0.2-0.2-0.4-0.2-0.6c0-0.1,0-0.1,0-0.2c0,0,0-0.1,0-0.1
	c0,0.1,0.1,0.3,0.1,0.4c0.1,0.1,0.1,0.3,0.2,0.4c0.3,0.3,0.7,0.6,1.2,0.8c0.5,0.1,1,0.2,1.5,0.2c0.5,0,0.8-0.1,0.8-0.2
	s0-0.1-0.2-0.2c0.1-0.1,0.3-0.1,0.4-0.1h0.1l0.2,0.1l0.2,0.2h-0.2l0.3,0.2c-0.3,0.1-0.6,0.2-0.9,0.2H77h-0.1h-0.5"/>
<path class="st24" d="M75,73.3c0.1,0.1,0.1,0.3,0,0.4c-0.1,0.1-0.2,0.2-0.3,0.2l0,0v-0.1c0,0.1,0,0.3-0.1,0.4
	c-0.1,0.1-0.2,0.1-0.4,0.1c0.1,0,0.2,0,0.3-0.1c0.1-0.1,0.1-0.2,0-0.3v-0.1h0.1c0.1,0,0.2-0.1,0.3-0.2C75,73.5,75,73.4,75,73.3
	L75,73.3z"/>
<path class="st24" d="M75.6,73.7c0.1,0.1,0.1,0.3,0,0.4c-0.1,0.1-0.2,0.2-0.3,0.2l0,0v-0.1c0.1,0.1,0,0.3-0.1,0.4
	c-0.1,0.1-0.2,0.1-0.4,0.1c0.1,0,0.3,0,0.3-0.1c0.1-0.1,0.1-0.2,0-0.3v-0.1h0.1c0.1,0,0.2-0.1,0.3-0.2
	C75.6,73.9,75.6,73.8,75.6,73.7L75.6,73.7z"/>
<path class="st24" d="M76.3,73.9c0.1,0.1,0.1,0.3,0,0.4c-0.1,0.1-0.2,0.2-0.3,0.2l0,0v-0.1c0.1,0.1,0,0.3-0.1,0.4
	c-0.1,0.1-0.2,0.1-0.4,0.1c0.1,0,0.2,0,0.3-0.1c0.1-0.1,0.1-0.2,0-0.3v-0.1H76c0.1,0,0.2-0.1,0.3-0.2C76.3,74.1,76.3,74,76.3,73.9
	L76.3,73.9z"/>
<path class="st25" d="M71.4,70.1l-4.3-4.4l-12-0.4l-4.2,2.5c-0.2,1.5-0.3,3-0.5,4.5l2.8-1.3l2.9-3.4l6.7,1l1.8,1.4l3.5-0.4
	L71.4,70.1"/>
<polygon class="st26" points="51.4,68.2 51,71.3 52.9,70.4 55.1,67.6 52.5,70.1 51.7,70.2 51.4,68.2 "/>
<path class="st26" d="M63.1,67.9l1.5,1.6l3.1-0.4l2.7,0.7L66.9,66l1,2.1L65,68.6L63.1,67.9L63.1,67.9z"/>
<path class="st27" d="M54.6,66.5c-0.7-1.9-0.6-4,0.2-5.9c0.2-0.5,0.5-0.9,0.9-1.4c1.5-1.3,3.7-1.7,5.5-0.9c2.3,1.1,3.5,4.5,2,7.4
	L54.6,66.5"/>
<path class="st28" d="M55.5,66.5c-0.3,0.7-1.3,0.9-2.2,0.9l-2.6,0.3l-1.9,0.2c-1.2,0.1-2.9,0.2-4.9,0.3c-1.7,0.1-3.4,0.2-5,0.2
	c-1.8,0.1-3.5,0.1-5.1,0.1c-0.8-3.9-1.6-7.8-2.5-11.7c1.3-1,2.9-1.6,4.6-1.6c0.8,0,2.1,0.1,3.6,0.2c2,0.2,2.9,0.5,3.9,0.5
	c1.8,0.2,3.7,0.2,5.5,0c2.1-0.2,3.4-0.4,4.6,0.6c0.7,0.6,1.3,1.4,1.5,2.4c0.5,2-0.8,2.9-0.2,5.2C55.2,65.3,55.8,65.9,55.5,66.5"/>
<path class="st29" d="M48.5,63.8c-0.1,1.3,0.1,2.7,0.4,4c-1.2,0.1-2.9,0.2-4.9,0.3c-1.7,0.1-3.4,0.2-5,0.2c0.1-1.7,0.2-3.4,0.3-5.2
	l6.2,0.7c1-2.6,2.7-5,4.8-6.8C49.3,59.1,48.6,61.4,48.5,63.8L48.5,63.8z"/>
<path class="st30" d="M29.3,63.2c-0.7-2.3,0-4.8,1.8-6.3c2.4-1.8,5.6-0.7,7.4,0.7c1.7,1.4,2.7,3.6,2.7,5.8
	C41.2,63.4,29.3,63.2,29.3,63.2z"/>
<path class="st31" d="M17.8,63.4c-0.1,0-0.2,0-0.3,0c-0.1,0-0.1,0.2-0.1,0.3c0,0,0,0.1,0,0.1c0,0.3-0.1,0.6-0.2,0.8
	c-0.1,0.2-0.1,0.3,0,0.4s0.3,0.1,0.5,0.1c0.7,0,1,0.1,1.2,0c0.7,0,0.6-0.1,1.1-0.1s0.5,0,0.7,0h0.1c0.2-0.1,0.3-0.2,0.5-0.4h0
	c0.2-0.2,0.2-0.2,0.2-0.2l0,0c-0.1-0.2-0.4-0.3-0.5-0.3c-0.3-0.1-0.6-0.1-0.9-0.1c-0.4,0-0.9-0.2-1.3-0.3
	C18.5,63.6,18.2,63.5,17.8,63.4L17.8,63.4z"/>
<path class="st31" d="M25,65.2l-4.6-0.1l-0.1-0.8l5.1-1.3L25,65.2z"/>
<path class="st32" d="M40.8,64.3c-0.3,0.3-0.6,0.5-1,0.7c-0.5,0.2-0.9,0.4-1.4,0.6c-0.9,0.2-1.9,0.2-2.8,0.1h-1.3
	c-1.4,0-1.2,0-3.2-0.1c-1.3-0.1-3.7-0.2-4.8-0.2c-0.5,0-1,0-1.4,0h-0.5v-0.2l-0.1-1.9v-0.2c1.1-0.3,2.2-0.5,3.2-0.8
	c1.5-0.3,3.1-0.6,3.8-0.8c2.7-0.4,5.4-0.3,8.1,0.2c0.2,0,1.8,0.6,2,1.5C41.4,63.7,41.2,64.1,40.8,64.3L40.8,64.3z"/>
<path class="st30" d="M39.8,65c0.3,0.3,0.5,0.6,0.8,0.9c-2.4,3.5-12.7,1.4-15,0.9l-0.4-0.1c-0.1-0.2-0.1-0.4-0.2-0.6l-0.1-0.4
	c0-0.1-0.1-0.2-0.1-0.3s0-0.1,0-0.2l0,0H25l15.8-0.8C40.5,64.6,40.2,64.9,39.8,65L39.8,65z"/>
<path class="st31" d="M18.1,67.5c-0.1,0-0.2,0-0.3,0c-0.1-0.1-0.1-0.2-0.1-0.4c0,0,0-0.1,0-0.2c0-0.3-0.1-0.6-0.2-0.8
	c0-0.2-0.1-0.3,0-0.4s0.3-0.1,0.5-0.1c0.7,0,1,0,1.2,0c0.7,0,0.6,0.1,1.1,0.1c0.2,0,0.4,0,0.7,0h0.1c0.2,0.1,0.2,0.2,0.5,0.4h0
	c0.1,0.2,0.2,0.2,0.2,0.2l0,0c-0.1,0.2-0.4,0.3-0.5,0.3c-0.3,0.1-0.6,0.1-0.9,0.1c-0.4,0-0.9,0.1-1.3,0.3c-0.3,0.2-0.7,0.3-1,0.3
	L18.1,67.5z"/>
<path class="st31" d="M25.5,66.1L20.8,66l0.1,0.7l4.9,1.3C25.7,67.4,25.6,66.7,25.5,66.1L25.5,66.1z"/>
<path class="st32" d="M41.3,68c-0.6,1.5-4.4,1.3-7.6,1.3c-3.1,0-6.2-0.4-9.3-1.2c0-0.1,0-0.2,0-0.4l0.2-1.7c0-0.1,0-0.3,0-0.4h0.2
	c1.8,0.1,3.6,0.2,5.7,0.1c1.3,0,2.5-0.1,3.7-0.2c2-0.2,3.8-0.4,5.5-0.7l0.1,0.1c0.3,0.3,0.5,0.6,0.8,0.9
	C41.1,66.4,41.3,67.2,41.3,68L41.3,68z"/>
<path class="st33" d="M62.2,66.8c0,0-0.1,0.1-0.2,0.1c-1.1,0.4-2.2,0.4-3.3,0c-0.4-0.3-0.9-0.4-1.3-0.3L57,66.8
	c-0.2,0.1-0.5,0.1-0.7,0.2C55.7,67,55,67.2,54,67.4c-0.2-0.5-0.3-1.1-0.4-1.6c1.1,0,2.1,0,3.2-0.2h0.1c0.3-0.1,0.7-0.1,1-0.1h0.3
	c0.3,0.1,0.7,0.2,0.9,0.4C60.3,66.8,62.2,66.6,62.2,66.8L62.2,66.8z"/>
<path class="st34" d="M58,66c0,0-0.2,0.4-0.1,0.6s0.1,0.1,0.2,0.1c0.2,0.1,0.3,0.1,0.5,0.2c-0.8,0.2-1.7,0.3-2.6,0.5l-2.3,0.4
	l0.1-0.4c1.2-0.2,2.4-0.5,3.6-0.8c0.1-0.1,0.2-0.1,0.3-0.2C57.9,66.1,58,66,58,66z"/>
<path class="st35" d="M48.1,67.8c-0.5-0.1-1-0.4-1.3-0.8c-1-1.2-0.6-3.5,0.8-5.8l0,0c1.2-2.1,2.5-4,2.7-4.2s0.5-1.1,1-1.2
	c0.8-0.1,1.6,0.3,2,1c0.4,0.8-0.1,1.8-0.6,2.9c-0.8,1.6-1.4,3-1.9,4.1c-0.2,0.5-0.3,0.9-0.5,1.3c0,0,0,0.1,0,0.1
	c-0.1,0.2-0.1,0.3-0.2,0.5c-0.4,1.1-0.8,2-1.5,2.1C48.5,67.9,48.3,67.9,48.1,67.8L48.1,67.8z"/>
<path class="st35" d="M48.5,67.9L48.5,67.9l-0.3-0.1l-0.3-0.1c-0.3-0.1-0.5-0.3-0.7-0.4c-0.1-0.1-0.2-0.3-0.3-0.5
	c-0.1-0.3-0.1-0.6,0-0.8c0.1-0.3,0.5-0.5,1.1-0.6H48c0.4-0.1,0.8-0.1,1.3-0.1h1.2l0,0c0.3,0,0.6,0,0.9,0h0.2H52
	c1.5,0.1,2.9,0.3,3.3,0.4l0,0l0.1,0.1c0.1,0.2,0.2,0.5,0.2,0.8c0,0.1,0,0.3,0,0.4c0,0,0,0.1,0,0.1c0,0.1,0,0.2-0.1,0.2
	c0,0.1,0,0.1-0.1,0.2c-0.1,0.1-0.1,0.2-0.2,0.3C52.6,68.1,50.1,68.3,48.5,67.9L48.5,67.9z"/>
<path class="st34" d="M62.2,66.8c0,0-0.1,0.1-0.2,0.1c-0.9,0.1-1.7,0-2.5-0.4c-0.1,0-0.5-0.2-1-0.5c-0.3-0.2-0.6-0.3-0.8-0.5H58
	c0.3,0.1,0.7,0.2,0.9,0.4C60.2,66.8,62.1,66.6,62.2,66.8L62.2,66.8z"/>
<path class="st33" d="M53.7,64.4c-0.1-0.1-0.1-0.1-0.1-0.2c0.2-0.9,0.6-1.7,1-2.5c0.1-0.1,0.2-0.2,0.3-0.5l0.4-0.6
	c0,0.1,0.1,0.2,0.1,0.3c0.1,0.1,0.2,0.2,0.3,0.3c0.2,0.1,0.5,0.2,0.7,0.2c0.3,0,0.6,0.1,0.8,0.1c0.4,0,0.7,0,1.1,0l-1,3l0,0
	c-0.5-0.1-1-0.1-1.5,0c-0.1,0-0.2,0.1-0.3,0.2c-0.1,0.1-0.1,0.2-0.2,0.3C54.7,65,54.1,64.8,53.7,64.4L53.7,64.4z"/>
<path class="st34" d="M57.3,64.6h-0.6c0-0.3,0-0.8,0-1.4c0-0.3,0-0.6-0.1-0.9c0-0.2-0.1-0.5-0.2-0.7c0.3,0,0.6,0.1,0.8,0.1
	c0.4,0,0.7,0,1.1,0L57.3,64.6L57.3,64.6z"/>
<path class="st33" d="M61.9,66.8c-1.2,0-2.4-0.3-3.5-0.9l-0.3-0.2c-0.6-0.5-1-1.2-1.1-2c0-0.1,0-0.2,0-0.2c0-0.8,0.2-1.7,0.7-2.3
	c1.1-1.4,2.8-2.2,4.6-2c0.2,0,0.4,0,0.6,0.1l0.3,0.1c1.9,0.4,3.2,2.1,3.3,4c0.1,0.9-0.1,1.7-0.5,2.5c-0.3,0.4-0.7,0.8-1.2,1
	C63.8,66.9,62.8,66.9,61.9,66.8"/>
<path class="st36" d="M60.9,63.5c-0.1,0-0.1-0.1-0.2-0.2c-0.1-0.4-0.1-0.9,0-1.3c0.1-0.1,0.1-0.2,0.2-0.2l0,0c0.1,0,0.1,0.1,0.1,0.1
	c0,0.2,0,0.5,0,0.7C61,63,61,63.2,60.9,63.5C60.9,63.5,60.8,63.5,60.9,63.5"/>
<path class="st36" d="M60.7,65.9c0,0-0.1-0.1-0.1-0.2c0-0.3,0-0.5,0-0.8c0-0.2,0-0.4,0.1-0.5c0-0.1,0.1-0.2,0.2-0.2l0,0
	c0,0,0.1,0,0.1,0.1c0,0.2,0,0.5,0,0.7C60.9,65.3,60.9,65.6,60.7,65.9C60.8,65.9,60.7,65.9,60.7,65.9"/>
<path class="st37" d="M61.9,62.6c-0.2-0.2-0.5-0.2-0.8-0.1c-0.7,0.3,0.6,0.8,0.9,0.4C62.1,62.8,62,62.6,61.9,62.6z"/>
<path class="st37" d="M61.7,65c-0.2-0.2-0.5-0.2-0.8-0.1c-0.8,0.3,0.6,0.8,0.9,0.4C61.8,65.2,61.8,65,61.7,65z"/>
<path class="st34" d="M59.4,64.1c0-0.1,0.1-0.2,0.1-0.3c0-0.1,0.1-0.2,0.1-0.3c0-0.2,0-0.4,0-0.6c0,0,0,0,0-0.1h0
	c0.1,0.2,0.1,0.4,0,0.7c0,0.1-0.1,0.2-0.1,0.3C59.5,64,59.4,64.1,59.4,64.1c-0.1,0.1-0.1,0.1-0.1,0c0,0,0,0,0-0.1L59.4,64.1z"/>
<path class="st38" d="M62.3,61.7c0-0.2,0.4-0.2,0.4,0.3c0,0.3,0,0.6,0,0.8c0.1,0.2,0,0.5-0.2,0.6c-0.3,0.2-0.3-0.3-0.3-0.5
	C62.2,62.6,62.3,62.1,62.3,61.7L62.3,61.7z"/>
<path class="st38" d="M61.8,66.2c-0.1,0.2,0.3,0.3,0.5-0.2c0.1-0.3,0.2-0.5,0.2-0.8c0.1-0.2,0.1-0.5,0-0.7c-0.2-0.3-0.4,0.2-0.4,0.4
	C62,65.3,62,65.8,61.8,66.2L61.8,66.2z"/>
<path class="st34" d="M60.5,64.4L60.5,64.4c0.1-0.1,0.2-0.2,0.3-0.3l0.2-0.1h0.2c0.4,0,0.7,0.1,1,0.3l0,0c-0.3-0.2-0.6-0.3-1-0.3
	c-0.1,0-0.2,0-0.3,0l-0.3,0.1C60.7,64.1,60.5,64.2,60.5,64.4c-0.1-0.1-0.2-0.2-0.2-0.3c0-0.1,0.1-0.2,0.2-0.3l0,0l0,0h-0.2
	c-0.1,0-0.2,0.2-0.2,0.4s0.1,0.4,0.2,0.4c0,0,0,0,0.1,0L60.5,64.4z"/>
<path class="st33" d="M61.7,59.3c0.2-0.3,0.2-0.6,0-0.9c-0.4-0.4-1-0.4-1.5-0.1c-0.5,0.3-0.8,1-0.7,1.2s0.3,0,1.1-0.1
	c0.2,0,0.4,0,0.5,0S61.6,59.4,61.7,59.3"/>
<path class="st34" d="M61.4,58.9c-0.1,0.2-0.3,0.3-0.5,0.4c-0.2,0.1-0.4,0.1-0.6,0.1c0,0-0.1,0-0.1-0.1c0,0,0-0.1,0.1-0.1
	c0,0,0,0,0,0l0,0C60.6,59.3,61,59.1,61.4,58.9"/>
<path class="st39" d="M65.5,65.2c-0.8-0.2-1.6-0.7-2-1.4c-0.6-1.2-0.1-2.2-0.5-2.9c-0.3-0.6-1.2-1-3.4-0.9c-1.7,0.1-3.4,0.3-5.1,0.7
	c0-0.1,0.1-0.2,0.1-0.3l-0.4-0.5l0.8-0.7l-1-0.6c1.7-1.2,3.7-1.8,5.8-1.8c0.5,0,1.1,0.1,1.6,0.3h0.1c1.1,0.3,2,0.9,2.8,1.6l0,0
	c0.9,0.7,1.6,1.7,2,2.8c0.2,0.7,0.2,1.5-0.1,2.3c-0.1,0.3-0.3,0.6-0.4,0.9C65.8,64.7,65.6,64.9,65.5,65.2"/>
<path class="st39" d="M65.4,63.8c-0.1,0.6-0.3,1.1-0.6,1.6c-0.6,0.8-1.5,1.3-2.5,1.4c0.6,0.3,1.3,0.4,1.9,0.3
	c1.4-0.4,2.3-1.7,2.4-3.1c0-0.5,0-1-0.2-1.5L65.4,63.8L65.4,63.8z"/>
<path class="st34" d="M59.8,61.9c0.3,0.1,0.7-0.1,0.9-0.4c0.2-0.3,0.1-0.7-0.2-0.9c-0.5-0.2-1,0-1.2,0.5c0,0,0,0.1,0,0.1
	C59.3,61.6,59.5,61.8,59.8,61.9z"/>
<path class="st39" d="M64.9,64.4c-0.2,0.4-0.6,0.7-1.1,0.9c-0.1,0-0.3,0.1-0.4,0.1c0.2,0.1,0.4,0.2,0.6,0.2c0.7,0.1,1.4-0.3,1.4-0.6
	C65.4,64.8,65.3,64.6,64.9,64.4z"/>
<path class="st39" d="M63.1,61c-0.2-0.2-0.5-0.4-0.8-0.5c-0.5-0.1-1-0.1-1.5,0.1c0.6-0.5,1.4-0.8,2.2-0.9C63,60.1,63.1,60.5,63.1,61
	L63.1,61z"/>
<path class="st39" d="M64,61.4c-0.2-0.2-0.5-0.4-0.8-0.5c-0.5-0.1-1-0.1-1.5,0.1c0.2-0.1,0.4-0.2,0.5-0.4c0.5-0.3,1.1-0.5,1.6-0.5
	C63.9,60.6,63.9,61,64,61.4z"/>
<path class="st39" d="M65.6,61.5c0.4-0.7,0.4-1.5,0.1-2.3c-0.2-0.3-0.4-0.6-0.7-0.8c0.1,0.3,0.2,0.7,0.2,1.1c0,0.5-0.1,0.9-0.4,1.3
	C64.9,60.8,65.6,61.5,65.6,61.5z"/>
<path class="st39" d="M63,58.6c-0.4-0.6-0.9-1.2-1.5-1.6l-0.3-0.2c-0.2-0.1-0.5-0.3-0.8-0.3l0,0c-0.3-0.1-0.7-0.2-1-0.2
	c0.5-0.1,1.1-0.1,1.6,0c0.2,0,0.3,0.1,0.5,0.1c1.2,0.4,2.3,1.2,3,2.2l0,0l0,0L63,58.6"/>
<path class="st40" d="M60.4,56.5L60.4,56.5c-0.3-0.1-0.7-0.2-1-0.2c0.2,0,0.5,0,0.7,0c0.3,0,0.6,0,0.9,0.1
	C60.8,56.4,60.6,56.4,60.4,56.5"/>
<path class="st27" d="M57.7,60.1l1.1-0.1l0,0C58.4,60,58.1,60.1,57.7,60.1"/>
<path class="st41" d="M58.8,60L58.8,60h0.4h0.1H58.8"/>
<path class="st40" d="M54.5,60.6c0-0.1,0.1-0.2,0.1-0.3l0,0l-0.4-0.5l0.8-0.7l0,0l-1-0.6c1.6-1.1,3.4-1.7,5.3-1.8h0.5L57.5,58
	l1.8-0.2l-2.8,1.4c0.8-0.1,1.5-0.2,2.3-0.2h1c0.8,0,1.7,0.1,2.5,0.2h-0.2c-1.2,0-2.4,0.1-3.5,0.2c-0.2,0-1.7,0.2-1.7,0.4
	c0.7,0.2,1.4,0.2,2.2,0.2h-0.4l-1.1,0.1l-0.8,0.1C56,60.3,55.2,60.5,54.5,60.6L54.5,60.6"/>
<path class="st27" d="M64.2,60.7c-0.1,0.5-0.1,1,0.1,1.5c0.2,0.5,0.6,1,1.1,1.3c-0.4-0.3-0.7-0.8-0.9-1.2
	C64.3,61.7,64.2,61.2,64.2,60.7z"/>
<path class="st35" d="M38.3,56.1c1.4,0,2.8,0.2,4.2,0.4c1.2,0.2,1.7,0.3,2.8,0.4c1.2,0.1,2.4,0.1,3.7-0.1c-0.6,0.3-1,0.7-1.5,1.2
	c-0.5,0.6-0.7,1.2-1,1.2s-0.2-0.7-0.7-1.1c-0.6-0.5-1.5-0.6-2.2-0.4C42.5,57.7,40.8,57.5,38.3,56.1L38.3,56.1z"/>
<path class="st29" d="M49,65.4l0.3-0.2c0.3-0.2,0.6-0.4,0.9-0.7c0.2-0.2,0.5-0.5,0.7-0.7c-0.2,0.5-0.3,0.9-0.5,1.2c0,0,0,0.1,0,0.1
	l0,0c0.3,0,0.6,0,0.9,0h0.2c-0.3,0.2-0.6,0.3-1,0.4h-0.3C49.8,65.6,49.4,65.5,49,65.4z"/>
<path class="st42" d="M22.8,77.9h-2.1h-8.3c0.1-1.8,0.2-3.7,0.3-5.6H16l4.8-0.1h1.6L22.8,77.9"/>
<polyline class="st43" points="22.3,72.3 22.3,74.1 22.3,77.7 20.8,77.7 18,77.7 12.7,77.8 12.7,75.7 12.7,72.4 15.9,72.4 
	20.7,72.3 22.3,72.3 "/>
<path class="st42" d="M16,72.6c0.1,0.8-0.5,1-1.1,1.3c-0.3,0.2-0.6,0.4-0.8,0.7c-0.1,0.2-0.2,0.4-0.4,0.4h-0.2
	c-0.2,0-0.3,0.2-0.4,0.4c-0.1,0.1-0.2,0.2-0.4,0.2v-3.3h3.2C16,72.5,16,72.5,16,72.6L16,72.6z"/>
<path class="st42" d="M22.3,74.1v3.6H18c0-0.1,0-0.2,0-0.2c0-0.3,0.1-0.5,0.3-0.8c0-0.1,0.1-0.2,0.2-0.3c0.1-0.1,0.4-0.1,0.5-0.2
	c0.3-0.2,0.3-0.7,0.6-0.9s0.8-0.2,1.1-0.5s0.1-0.8,0.5-1C21.6,73.7,22,73.8,22.3,74.1"/>
<polygon class="st44" points="15.3,74.2 15.3,75 14.7,75 14.6,74.2 14.2,74.2 14.4,76.3 14.8,76.3 14.7,75.3 15.3,75.2 15.4,76.3 
	15.8,76.3 15.6,74.2 15.3,74.2 "/>
<polygon class="st44" points="16.6,74.4 17.3,74.3 17.3,74.1 16.4,74.1 16.2,74.1 16.4,76.2 16.7,76.2 16.7,76.2 17.5,76.2 17.5,76 
	16.7,75.9 16.6,75.2 17.5,75.1 17.5,74.9 16.6,74.9 16.6,74.4 "/>
<path class="st44" d="M19.6,74.8v-0.5l0.6-0.1l0.1,0.6L19.6,74.8L19.6,74.8z M20.5,74.9v-1h-0.2l0,0h-0.9h-0.2l0.2,1.8v0.3h0.4
	l-0.1-0.8v-0.2L20.5,74.9L20.5,74.9L20.5,74.9L20.5,74.9z"/>
<polygon class="st44" points="18.1,74.1 17.7,74.1 18,76.2 18.3,76.2 18.3,76.2 19,76.1 19,75.9 18.3,75.9 18.1,74.1 "/>
<path class="st45" d="M20.8,77.9v-0.3h1.6v-3.8l0.2,0.5l0.3,3.5L20.8,77.9"/>
<path class="st46" d="M20.8,77.7L20.8,77.7 M22.3,77.7v-3.6c-0.3-0.2-0.6-0.2-0.9-0.3c-0.1,0-0.2,0-0.2,0c-0.4,0.2-0.3,0.7-0.5,1
	l0,0c-0.1-0.7-0.1-1.3-0.2-2h0.4l-0.2-0.4h1l0.5,1.4l0,0.2L22.3,77.7L22.3,77.7"/>
<path class="st45" d="M20.8,77.7L20.8,77.7l0.2-0.1c-0.1-0.9-0.2-1.9-0.2-2.8c0.2-0.3,0.1-0.8,0.5-1c0.1,0,0.2,0,0.2,0
	c0.3,0,0.6,0.1,0.9,0.3v3.6L20.8,77.7"/>
<polyline class="st47" points="24.7,75.2 23.8,75.4 22.9,75.6 22.3,73.8 20.9,69.8 23,69.2 23.2,69.8 24.3,73.8 24.7,75.2 "/>
<path class="st48" d="M23.2,75l-1.8-5l1.3-0.3c0.4,1.5,0.9,3,1.3,4.5C23.7,74.5,23.4,74.7,23.2,75"/>
<path class="st49" d="M22.9,75.6l-0.6-1.7l0-0.2l0.2-0.8l0,0l0.7,2c0.2-0.3,0.5-0.6,0.8-0.8c-0.3-1.1-0.6-2.3-1-3.4l0,0l0.2-1l1.1,4
	l-0.5,1.6L22.9,75.6"/>
<path class="st50" d="M23.2,75l-0.7-2l0,0l0.5-2.2c0.3,1.1,0.6,2.3,1,3.4C23.7,74.5,23.5,74.8,23.2,75"/>
<polygon class="st47" points="23.9,76.8 25.8,71 23.7,70.2 22.2,76.2 23.9,76.8 "/>
<path class="st48" d="M22.8,75.9c0.4-1.7,0.8-3.4,1.2-5.2l1.3,0.4c-0.5,1.5-0.9,3-1.4,4.5L22.8,75.9z"/>
<path class="st51" d="M21.5,72.8l0.4,5h3.2c0.1-1.6,0.2-3.3,0.4-4.9L21.5,72.8L21.5,72.8z"/>
<path class="st51" d="M25,75.7c0.4,0.2,0.8,0.1,1.2-0.2c0.2-0.2,0.3-0.5,0.2-0.8c0-0.3-0.2-0.6-0.5-0.8c-0.2-0.1-0.4-0.1-0.6-0.1
	L25,75.7z M25.5,76.2c-0.3,0-0.6-0.1-0.8-0.2l-0.1,0l0.4-2.4H25c0.4-0.1,0.8-0.1,1.1,0.1c0.4,0.2,0.6,0.6,0.7,1.1
	c0.1,0.7-0.3,1.4-1,1.5C25.7,76.3,25.6,76.3,25.5,76.2L25.5,76.2z"/>
<polygon class="st51" points="21.8,78 21.8,77.6 25.4,77.6 25.4,78 21.8,78 "/>
<path class="st52" d="M24.5,76.8l0.5-3.6h-1.3c0.1,1.2,0.2,2.3,0.3,3.5L24.5,76.8z"/>
<path class="st8" d="M70,78.1C70,78.1,70,78.1,70,78.1c-0.2,0-0.6,0-0.6-0.1s0-0.1,0.1-0.1h0.1C69.8,77.8,70,78,70,78.1L70,78.1z"/>
<path class="st53" d="M69.9,78.1c-0.2,0-0.5,0-0.5-0.1s0-0.1,0.1-0.1c0,0,0,0,0.1,0c0.1,0,0.1,0,0.2,0h-0.1c0.1,0,0.1,0,0.2,0
	c0,0,0.1,0,0.1,0l0,0l0,0L69.9,78.1z"/>
<path class="st53" d="M69.9,78h-0.1c-0.1,0-0.1,0-0.2,0h0.2H69.9z"/>
<path class="st54" d="M70.4,78.3L70.4,78.3c0,0-0.3,0-0.3-0.1s0-0.1,0-0.1l0,0C70.2,78.1,70.3,78.2,70.4,78.3L70.4,78.3z"/>
<path class="st55" d="M70.3,78.3c-0.1,0-0.3,0-0.3-0.1s0-0.1,0-0.1l0,0c0,0,0.1,0,0.1,0l0,0c0,0,0.1,0,0.1,0c0,0,0.1,0,0.1,0l0,0
	l0,0L70.3,78.3z"/>
<path class="st55" d="M70.3,78.2L70.3,78.2c-0.1,0-0.2,0-0.2,0C70.1,78.2,70.1,78.2,70.3,78.2C70.2,78.2,70.3,78.2,70.3,78.2z"/>
<path class="st54" d="M69.2,78.2L69.2,78.2c-0.1,0-0.3,0-0.3,0c0,0,0-0.1,0.1-0.1l0,0C69,78,69.1,78.1,69.2,78.2
	C69.2,78.2,69.2,78.2,69.2,78.2L69.2,78.2z"/>
<path class="st55" d="M69.2,78.2c-0.1,0-0.3,0-0.3,0c0,0,0-0.1,0.1-0.1l0,0c0,0,0.1,0,0.1,0l0,0c0,0,0.1,0,0.1,0c0,0,0.1,0,0.1,0
	l0,0l0,0L69.2,78.2z"/>
<path class="st55" d="M69.1,78.1C69.1,78.1,69.1,78.1,69.1,78.1c-0.1,0-0.2,0-0.2,0H69.1C69.1,78.1,69.1,78.1,69.1,78.1z"/>
</svg>
