<?xml version="1.0" encoding="utf-8"?>
<!-- Generator: Adobe Illustrator 24.0.0, SVG Export Plug-In . SVG Version: 6.00 Build 0)  -->
<svg version="1.1" id="Layer_1" xmlns="http://www.w3.org/2000/svg" xmlns:xlink="http://www.w3.org/1999/xlink" x="0px" y="0px"
	 viewBox="0 0 88 88" style="enable-background:new 0 0 88 88;" xml:space="preserve">
<style type="text/css">
	.st0{fill:#23B2E7;}
	.st1{clip-path:url(#SVGID_2_);}
	.st2{fill:#1B75BC;}
	.st3{fill:#D6A461;}
	.st4{fill:#FFCC2C;}
	.st5{fill:#F8981D;}
	.st6{fill:#F1C250;}
	.st7{fill:#C1873F;}
	.st8{fill:#E5B254;}
	.st9{fill:#835D40;}
	.st10{fill:#F0C04F;}
	.st11{fill:#825C3F;}
	.st12{fill:#845C42;}
	.st13{fill:#845D3C;}
	.st14{fill:#DCAA27;}
	.st15{fill:#DACDA1;}
	.st16{fill:#E8BE35;}
</style>
<title>Artboard 35</title>
<rect class="st0" width="88" height="88"/>
<g>
	<defs>
		<rect id="SVGID_1_" width="88" height="88"/>
	</defs>
	<clipPath id="SVGID_2_">
		<use xlink:href="#SVGID_1_"  style="overflow:visible;"/>
	</clipPath>
	<g class="st1">
		<circle class="st2" cx="44" cy="83.6" r="44.2"/>
	</g>
</g>
<g>
	<defs>
		<rect id="SVGID_3_" y="-99" width="88" height="88"/>
	</defs>
	<clipPath id="SVGID_4_">
		<use xlink:href="#SVGID_3_"  style="overflow:visible;"/>
	</clipPath>
</g>
<g id="ATEZ3n">
	<path class="st3" d="M24.4,80.1c-0.8-0.9-1.5-1.8-2.2-2.9c-0.2-0.4-0.4-0.8-0.6-1.3c-0.1-0.5-0.4-1-0.8-1.4
		c-0.5-0.4-0.4-1.1-0.5-1.7c-0.6-3.5-0.3-7.1,0.7-10.5c0.1-0.2,0.1-0.5,0-0.8c-0.2-0.6,0.2-1.2,0.8-1.3c0.3-0.1,0.2-0.4,0.3-0.5
		s0-0.2-0.1-0.3c-0.4-0.3-0.4-0.8-0.1-1.2C22,58.1,22,58,22.1,58c0.2-0.1,0.4-0.4,0.4-0.7c0.2-1,0.6-1.9,1.2-2.7
		c0.4-0.6,1-1,1.7-1.2c0.1-0.2,0.4-0.2,0.6-0.2c0.4,0.1,0.9,0.2,1.3,0.4c0.1,0.2,0.1,0.3,0,0.5c-0.5,1.8-0.9,3.6-1.3,5.4
		c-0.6,2.3-1.1,4.6-1.7,7c-0.4,1.3-0.7,2.7-1,4c-0.1,0.3-0.1,0.6,0.1,0.9c0.5,1.5,1,3,1.5,4.5c0.2,0.5,0.2,0.5,0.7,0.5
		s1.1-0.1,1.7-0.1c0.4,0,0.9-0.2,1.2-0.4c1.6-1,3.1-2.2,4.4-3.5c0.8,0.2,1.4,0.7,1.6,1.4c0,0.2,0,0.4-0.2,0.4c0,0.1-0.1,0.2-0.2,0.2
		c-0.4,0-0.8,0.2-1.2,0.4c-0.5,0.3-0.6,0.9-0.4,1.4c0.2,0.5,0.7,0.9,1.2,0.8c0.3,0,0.7,0,1-0.2c0.2,0,0.3-0.1,0.5,0
		c0.1,0.1,0.1,0.4,0,0.5c-0.2,0.2-0.1,0.3,0.1,0.5c0.2,0.1,0.3,0.4,0.3,0.6c0.1,0.7,0.1,1.5,0.1,2.2c0,0.5-0.3,0.9-0.7,1.1
		c-0.4,0.2-0.9,0.3-1.3,0.3c-0.2,0-0.4,0-0.7,0H33c-0.1,0-0.2-0.1-0.4,0c-1.1,0.3-2.2,0.4-3.3,0.4c-0.5-0.1-1.1,0-1.5,0.3
		c-0.5,0.2-1.1,0.3-1.6,0.1c-0.3-0.3-0.5-0.8-0.5-1.3c0-0.2,0-0.3-0.1-0.4l0,0c-0.2-0.1-0.3-0.2-0.4-0.3l-0.3-0.3
		C24.7,80.5,24.6,80.2,24.4,80.1z"/>
	<path class="st4" d="M26,51.5c-0.8-0.6-1.5-1.3-2-2.1c-0.4-1.1-0.7-2.2-0.8-3.3c-0.2-1.3-0.3-2.7-0.3-4c0.1-2.1,0.5-4.2,1.3-6.2
		c1.1-2.6,2.6-4.9,4.6-6.8c0.1-0.1,0.4-0.1,0.4-0.4c0.2-0.2,0.4-0.4,0.6-0.5c0.5-0.3,0.8-0.7,1.3-1c0.9-0.6,1.8-1.1,2.7-1.7
		c2.3-1.4,4.4-3.2,6.1-5.4c2-2.5,3.6-5.3,4.9-8.2c0.6-1.3,1-2.6,1.5-4c0.2-0.4,0.3-0.7,0.4-1.1c0.1-0.3,0.2-0.6,0.3-0.8
		s0.2-0.2,0.2,0c0.1,0.3,0.2,0.7,0.1,1c0.1,2.1-0.3,4.2-1.1,6.2c-1.1,2.7-2.5,5.3-4.2,7.7c-0.5,0.6-0.9,1.3-1.5,1.9
		c-0.1,0.1-0.1,0.2-0.1,0.2c0,0.1-0.1,0.2-0.2,0.3c-0.8,0.8-1.4,1.7-2.1,2.5c-1,1.2-2.1,2.4-3.2,3.5c-0.9,1-1.9,2-2.8,2.9
		c-1.2,1.2-2.4,2.3-3.5,3.6c-2,2.1-3.2,4.9-3.4,7.8c-0.1,1.1,0.1,2.2,0.5,3.3c0.4,1.1,1.1,2,2.1,2.5c0.7,0.4,1.6,0.5,2.4,0.2
		c0.9-0.3,1.7-0.8,2.3-1.6c0.2-0.2,0.3-0.5,0.7-0.5c0.4,0.7,0.3,1.6-0.1,2.3c-0.6,0.9-1.4,1.7-2.4,2.1c-0.7,0.3-1.5,0.5-2.3,0.5
		c-0.1,0-0.2,0-0.4,0c-0.5-0.2-1-0.3-1.4-0.4c-0.2,0-0.3-0.1-0.4-0.2C26.1,51.6,26.1,51.5,26,51.5z"/>
	<path class="st5" d="M46.5,6.7c0.2,0.1,0.1,0.2,0.1,0.3c-0.7,1.7-1.1,3.5-1.9,5.2c-0.7,1.5-1.5,3-2.4,4.5c-0.9,1.4-1.8,2.7-2.9,4
		c-1.2,1.4-2.5,2.7-4,3.7c-1.1,0.8-2.4,1.5-3.5,2.2c-0.7,0.4-1.3,0.9-1.8,1.4c-0.1,0.1-0.2,0.1-0.3,0.1s-0.1-0.2-0.1-0.4
		c0-0.4-0.3-0.6-0.7-0.6c-0.3,0-0.5,0.2-0.6,0.4c-0.1,0.3,0,0.6,0.3,0.8c0.1,0.1,0.3,0.1,0.4,0.3l0.2,0.1c-0.8,0.6-1.4,1.2-2,2
		c-1,1.2-1.9,2.5-2.5,3.9c-0.9,2-1.5,4.1-1.7,6.3c-0.1,1.4-0.1,2.9,0.1,4.3c0.1,1.4,0.4,2.7,0.9,4c0,0,0,0.1,0,0.1
		c-0.8-1.2-1.5-2.5-1.8-3.9c-0.8-3-0.7-6.2,0.4-9.2c0.4-1.2,1-2.3,1.6-3.3c0.1-0.1,0.1-0.2,0.2-0.3c0.9-1.4,2-2.8,3.1-4.1
		c0.1-0.2,0.2-0.3,0.1-0.5c-0.3-0.4-0.2-0.9,0.2-1.2c0.1-0.1,0.3-0.1,0.4-0.2c0.3-0.1,0.5-0.2,0.4-0.6c-0.1-0.6,0-0.7,0.6-0.7
		c0.2,0,0.2-0.1,0.2-0.3c0.1-0.3,0.1-0.6,0.1-0.9c0-0.3,0.2-0.5,0.5-0.6c0.3,0,0.4-0.2,0.3-0.5s0-0.5,0.3-0.5s0.4-0.1,0.3-0.4
		c-0.2-0.4,0.1-0.9,0.5-1.1c0.1,0,0.2-0.1,0.3-0.1c0.3,0,0.4-0.2,0.5-0.5s0.2-0.6,0.6-0.5s0.4-0.1,0.4-0.4c0-1,0.3-1.4,1.3-1.4
		c0.4,0,0.3-0.2,0.3-0.4c-0.1-0.4,0-0.6,0.5-0.7c2.1-0.5,4.1-1.4,5.7-2.9c2.3-2,4.1-4.6,5.3-7.4L46.5,6.7z"/>
	<path class="st6" d="M40.3,22.9c-0.1-0.1,0-0.1,0-0.2c1.1-1.3,2-2.7,2.9-4.1c0.6-1,1.2-2,1.7-3c1-1.9,1.6-3.9,2-6
		c0.2-1,0.2-2.1,0.1-3.1c0-0.2,0.1-0.4,0-0.6c0.5,1,0.8,2.1,0.9,3.3c0,0.1,0,0.3,0,0.4c0.1,0.4,0.1,0.9,0,1.3
		c-0.2,2-0.8,3.9-1.6,5.7c-0.5,1.3-1.1,2.5-1.7,3.7c-0.4,0.7-0.9,1.4-1.4,2.1c-0.1,0.2-0.2,0.4-0.2,0.6c-0.1,1.2-0.7,2.3-1.6,3
		c-0.9,0.8-1.8,1.5-2.8,2.1c-0.1,0-0.2,0.1-0.2,0.2c-1,0.8-2,1.5-3,2.3c-1.7,1.4-3.2,3-4.6,4.7c-1.3,1.6-2.4,3.4-3.4,5.2
		c-0.5,1-0.9,2.2-1,3.3c-0.2,1.4,0.5,2.7,1.7,3.4c0.5,0.3,1,0.4,1.6,0.5c0.8-0.2,1.5-0.6,2.1-1c0.6-0.3,0.8-0.3,1.1,0.2
		c0.2,0.1,0.2,0.3,0.1,0.5c-0.2,0.2-0.4,0.4-0.6,0.6c-0.8,1-2,1.6-3.2,1.7c-1.3,0-2.4-0.6-3.1-1.7c-0.8-1.3-1.3-2.8-1.2-4.3
		c0-1.3,0.3-2.6,0.8-3.8c0.6-1.5,1.5-2.9,2.5-4.1c0.6-0.7,1.2-1.3,1.8-1.9c1.1-1.2,2.3-2.3,3.4-3.5c0.9-0.9,1.8-1.9,2.7-2.8
		c0.7-0.7,1.4-1.6,2.1-2.3c0.6-0.8,1.2-1.5,1.9-2.2c0.1,0.1,0.1,0.2,0.1,0.4c0.1,0.3,0.4,0.6,0.7,0.5c0.3-0.1,0.6-0.4,0.5-0.7
		c-0.1-0.3-0.4-0.6-0.8-0.5C40.6,22.8,40.4,23,40.3,22.9z"/>
	<path class="st7" d="M27.9,52.2l0.3,0.1c0.3,0,0.5,0.1,0.7,0.2c0.4,0.4,0.5,1.1,0.1,1.5c0,0,0,0,0,0c-0.2,0.2-0.2,0.5-0.1,0.7
		c0.7,1.5,0.8,3.3,0.1,4.9c-0.1,0.1-0.1,0.3,0,0.4c0.1,0.4,0.1,0.8-0.1,1.1c-0.1,0.2-0.3,0.3-0.5,0.3h-0.1c-0.1,0-0.2,0-0.3,0
		c-0.2,0.1-0.3,0.2-0.1,0.4l0.2,0.2c0.4,0.3,0.6,0.8,0.3,1.2c0,0.1-0.1,0.2-0.2,0.2c-0.3,0.3-0.4,0.6-0.5,1c-0.1,0.5-0.2,1-0.3,1.4
		c-0.1,0.7-0.2,1.4-0.2,2.1c0,0.2,0.2,0.4,0.1,0.7c0,0.2-0.1,0.4-0.2,0.6c0,0.2-0.2,0.3-0.1,0.5c0,0.1-0.1,0.2-0.1,0.3
		c-0.2,0.3-0.2,0.7,0,1c0.5,1.6,2.2,2.4,3.8,1.9c0.1,0,0.2-0.1,0.2-0.1c0.5-0.2,1-0.3,1.5-0.5c0.2-0.1,0.3-0.1,0.5-0.1
		c0,0.1,0,0.2-0.1,0.3c-1.3,1.3-2.8,2.5-4.5,3.5c-0.2,0.1-0.4,0.2-0.7,0.2c-0.8,0-1.7,0.1-2.5,0.2c-0.2,0-0.3-0.1-0.3-0.2
		c-0.5-1.5-0.9-3-1.5-4.5c-0.3-0.8-0.3-1.7,0.1-2.5c0.4-1.7,0.9-3.5,1.3-5.2c0.3-1.4,0.6-2.8,1-4.1c0.4-1.8,0.9-3.5,1.3-5.3
		c0.1-0.4,0.2-0.7,0.3-1.1c-0.1-0.5,0-1,0.3-1.4C27.7,52.2,27.8,52.2,27.9,52.2C27.9,52.2,27.9,52.2,27.9,52.2z"/>
	<path class="st7" d="M27.9,52.2c-0.3,0.2-0.3,0.5-0.3,0.7s-0.1,0.5-0.2,0.8c-0.3,0-0.7-0.1-1-0.2c-0.3-0.1-0.6-0.1-0.9,0
		c0-0.1,0-0.1-0.1-0.2c-0.4-0.4-0.3-1,0.1-1.4c0.1-0.1,0.3-0.2,0.4-0.2l0.1-0.1 M26.1,51.6c0.5,0.3,1.2,0.4,1.8,0.6L26.1,51.6z"/>
	<path class="st7" d="M26.1,51.6H26v-0.1c0-0.1,0.1-0.1,0.2,0S26.2,51.5,26.1,51.6z"/>
	<path class="st8" d="M24.4,32.6c0,0.1,0,0.3-0.2,0.3c0,0,0,0,0,0C24.2,32.8,24.3,32.7,24.4,32.6z"/>
	<path class="st9" d="M29.2,28.6c-0.1,0-0.2-0.1-0.4-0.1c-0.4-0.1-0.6-0.5-0.5-0.9c0,0,0-0.1,0-0.1c0.1-0.4,0.5-0.6,0.9-0.5
		c0.4,0.1,0.6,0.5,0.6,0.9c0,0.1,0,0.2-0.1,0.2C29.7,28.4,29.5,28.6,29.2,28.6z"/>
	<path class="st9" d="M40.3,22.9c0.4-0.3,0.8-0.3,1.1,0c0.3,0.2,0.3,0.6,0.2,1c-0.2,0.4-0.7,0.5-1,0.3c-0.2-0.1-0.4-0.4-0.4-0.7
		c0-0.1,0-0.2,0-0.3L40.3,22.9z"/>
	<path class="st10" d="M30.5,51.7c-0.5,0.4-1.1,0.7-1.7,0.9l-0.6-0.3c0-0.1,0.1-0.1,0.2-0.1C29.1,52.1,29.9,52,30.5,51.7z"/>
	<path class="st9" d="M34.5,19.2c0.4-0.1,0.9,0.1,1,0.5c0.1,0.4-0.1,0.8-0.5,1c-0.4,0.2-0.9,0-1-0.4s0-0.9,0.4-1
		C34.5,19.3,34.5,19.3,34.5,19.2L34.5,19.2z"/>
	<path class="st11" d="M33.3,22.2c0.2,0.4,0,0.8-0.4,1c-0.4,0.2-0.8,0-1-0.4c0,0,0-0.1-0.1-0.2c-0.1-0.4,0.1-0.8,0.5-1
		C32.7,21.6,33.2,21.8,33.3,22.2C33.3,22.2,33.3,22.2,33.3,22.2z"/>
	<path class="st12" d="M30.5,24.1c0.3-0.2,0.7-0.1,0.9,0.2c0.2,0.2,0.3,0.6,0.1,0.9c-0.2,0.3-0.5,0.5-0.9,0.4
		C30.2,25.2,30.1,24.6,30.5,24.1C30.5,24.2,30.5,24.2,30.5,24.1z"/>
	<path class="st13" d="M30.5,24.1c0,0.2,0,0.4-0.1,0.5c-0.1,0.2-0.1,0.4,0.2,0.5s0,0.3,0.1,0.4c-0.4-0.1-0.6-0.4-0.6-0.7
		C30,24.5,30.2,24.2,30.5,24.1z"/>
	<ellipse transform="matrix(0.9468 -0.3218 0.3218 0.9468 -13.6277 9.6954)" class="st14" cx="22.5" cy="46.1" rx="0" ry="0.8"/>
	<path class="st15" d="M38.4,27.9c0,0.1,0,0.2-0.2,0.1C38.3,28,38.3,28,38.4,27.9z"/>
	<path class="st13" d="M30.6,25c-0.1,0-0.1,0-0.1-0.1s0-0.1,0-0.1S30.6,24.8,30.6,25C30.6,25,30.6,25,30.6,25z"/>
</g>
<g id="ATEZ3n-2">
	<path class="st3" d="M63.5,7.9c0.8,0.9,1.5,1.8,2.2,2.8c0.3,0.4,0.5,0.8,0.6,1.3c0.1,0.5,0.4,1,0.8,1.4c0.5,0.4,0.4,1.1,0.5,1.7
		c0.6,3.5,0.4,7.1-0.6,10.5c-0.1,0.2-0.1,0.5,0,0.8c0.2,0.6-0.2,1.2-0.7,1.3c0,0,0,0,0,0c-0.3,0.1-0.2,0.4-0.3,0.5s0,0.2,0.1,0.3
		c0.4,0.3,0.5,0.8,0.2,1.2c-0.1,0.1-0.2,0.2-0.3,0.2c-0.2,0.1-0.4,0.4-0.4,0.6c-0.2,1-0.6,1.9-1.2,2.7c-0.4,0.6-1,1-1.7,1.2
		c-0.1,0.2-0.4,0.2-0.6,0.2c-0.4-0.1-0.9-0.2-1.3-0.4c-0.1-0.2-0.1-0.3,0-0.5c0.5-1.8,0.8-3.6,1.3-5.4c0.6-2.3,1.1-4.6,1.7-7
		c0.3-1.3,0.6-2.7,1-4c0.1-0.3,0-0.6-0.1-0.9C64,15,63.5,13.5,63,12c-0.2-0.5-0.2-0.5-0.7-0.5s-1.1,0.1-1.7,0.1
		c-0.4,0-0.9,0.2-1.2,0.4c-1.6,1-3,2.2-4.3,3.6c-0.8-0.2-1.4-0.7-1.6-1.4c0-0.2,0-0.4,0.2-0.4c0-0.1,0.1-0.1,0.2-0.2
		c0.4,0,0.8-0.2,1.2-0.4c0.5-0.3,0.6-0.9,0.4-1.4c-0.2-0.5-0.7-0.8-1.3-0.8c-0.3,0-0.7,0.1-1,0.2c-0.2,0.1-0.3,0.1-0.5,0
		c-0.1-0.2-0.1-0.4,0-0.5c0.2-0.2,0.1-0.4-0.1-0.5c-0.2-0.1-0.3-0.3-0.3-0.6c-0.1-0.7-0.2-1.5-0.1-2.2c0-0.5,0.3-0.9,0.7-1.1
		C53.2,5.9,53.7,6,54.1,6c0.2,0,0.4,0,0.7,0h0.2C55,5.9,55.2,6,55.3,5.9c1.1-0.3,2.2-0.4,3.3-0.4c0.5,0,1-0.1,1.5-0.3
		c0.5-0.3,1.1-0.3,1.6-0.1c0.3,0.3,0.5,0.8,0.5,1.2c0,0.2,0,0.3,0.2,0.5l0,0c0.2,0.1,0.3,0.2,0.4,0.3L63,7.4
		C63.2,7.5,63.3,7.8,63.5,7.9z"/>
	<path class="st4" d="M62.2,36.5c0.8,0.6,1.5,1.3,2,2.1c0.4,1.1,0.7,2.2,0.8,3.3c0.2,1.3,0.3,2.7,0.3,4c-0.1,2.1-0.5,4.2-1.2,6.2
		c-1,2.6-2.5,4.9-4.5,6.8c-0.1,0.2-0.4,0.1-0.4,0.4c-0.2,0.2-0.4,0.4-0.6,0.5c-0.5,0.3-0.8,0.7-1.3,1c-0.8,0.6-1.8,1.2-2.7,1.7
		c-2.3,1.5-4.3,3.3-6,5.5c-2,2.5-3.6,5.3-4.8,8.3c-0.5,1.3-1,2.6-1.4,4c-0.2,0.3-0.3,0.7-0.4,1.1c-0.1,0.3-0.2,0.6-0.3,0.8
		s-0.2,0.2-0.2,0c-0.1-0.3-0.2-0.7-0.1-1c-0.1-2.1,0.3-4.2,1-6.2c1-2.7,2.4-5.3,4.1-7.7c0.5-0.7,0.9-1.3,1.4-1.9
		c0.1-0.1,0.1-0.2,0.1-0.3c0-0.1,0.1-0.2,0.2-0.3c0.8-0.8,1.3-1.7,2.1-2.5c1-1.2,2.1-2.4,3.2-3.5c0.9-1,1.8-2,2.8-2.9
		c1.2-1.2,2.4-2.3,3.4-3.6c2-2.1,3.2-4.9,3.4-7.8c0.1-1.1-0.1-2.2-0.5-3.2c-0.4-1.1-1.1-2-2.1-2.5c-0.7-0.4-1.6-0.5-2.3-0.2
		c-0.9,0.3-1.7,0.9-2.3,1.6c-0.2,0.2-0.3,0.5-0.7,0.5c-0.4-0.7-0.3-1.6,0.1-2.3c0.6-0.9,1.4-1.7,2.3-2.1c0.7-0.3,1.5-0.5,2.3-0.6
		c0.1,0,0.2,0,0.4,0c0.5,0.1,1,0.2,1.4,0.4c0.1,0,0.3,0.1,0.4,0.2C62.1,36.4,62,36.5,62.2,36.5z"/>
	<path class="st5" d="M42,81.5c-0.2-0.1-0.1-0.2-0.1-0.3c0.6-1.7,1.1-3.5,1.9-5.2c0.7-1.5,1.5-3.1,2.3-4.5c0.8-1.4,1.8-2.7,2.8-4
		c1.2-1.4,2.5-2.7,3.9-3.8c1.1-0.8,2.3-1.5,3.5-2.2c0.7-0.4,1.3-0.9,1.9-1.4c0.1-0.1,0.2-0.1,0.3-0.1s0.1,0.2,0.1,0.4
		c0,0.3,0.3,0.5,0.5,0.6c0.3,0,0.6-0.1,0.7-0.4c0.1-0.3,0-0.6-0.3-0.7c-0.1-0.1-0.3-0.1-0.4-0.3L59,59.3c0.8-0.6,1.4-1.2,2-2
		c1-1.2,1.8-2.5,2.5-3.9c0.9-2,1.5-4.1,1.7-6.3c0.1-1.4,0.1-2.9-0.1-4.3c-0.2-1.4-0.5-2.7-0.9-4c0,0,0-0.1,0-0.1
		c0.8,1.2,1.4,2.5,1.8,3.8c0.9,3,0.8,6.2-0.3,9.2c-0.4,1.2-0.9,2.3-1.6,3.4C64,55.1,64,55.2,64,55.4c-0.9,1.5-1.9,2.8-3.1,4.1
		c-0.1,0.2-0.2,0.2-0.1,0.5c0.3,0.4,0.2,0.9-0.2,1.2c-0.1,0.1-0.2,0.1-0.4,0.2c-0.3,0.1-0.5,0.2-0.4,0.6c0.1,0.6,0,0.7-0.6,0.7
		c-0.2,0-0.2,0.1-0.2,0.3c0,0.3-0.1,0.6-0.1,0.9c0,0.3-0.2,0.5-0.5,0.6c-0.3,0-0.4,0.2-0.3,0.5s0,0.5-0.3,0.5s-0.3,0.1-0.3,0.4
		c0.2,0.4,0,0.9-0.5,1.1c-0.1,0-0.2,0.1-0.3,0.1c-0.3,0-0.4,0.2-0.5,0.5s-0.2,0.6-0.6,0.5s-0.4,0.1-0.4,0.4c0,1-0.3,1.4-1.3,1.4
		c-0.4,0-0.3,0.2-0.3,0.4c0.1,0.4,0,0.6-0.5,0.7c-2.1,0.5-4.1,1.5-5.7,2.9c-2.3,2.1-4.1,4.6-5.2,7.5C42.1,81.2,42.1,81.4,42,81.5z"
		/>
	<path class="st6" d="M48.2,65.2c0.1,0,0,0.1,0,0.2c-1.1,1.3-2,2.7-2.9,4.1c-0.6,1-1.2,2-1.7,3c-1,1.9-1.6,3.9-1.9,6
		c-0.2,1.1-0.2,2.1-0.1,3.2c0,0.2-0.1,0.4,0,0.6c-0.5-1-0.9-2.1-0.9-3.3c0-0.1,0-0.3,0-0.4c-0.1-0.4-0.1-0.8,0-1.3
		c0.2-2,0.8-3.9,1.5-5.8c0.5-1.3,1.1-2.5,1.7-3.7c0.4-0.7,0.9-1.4,1.4-2.1c0.1-0.2,0.2-0.4,0.2-0.6c0.1-1.2,0.6-2.3,1.6-3
		c0.9-0.8,1.9-1.5,2.9-2.1c0.1,0,0.2-0.1,0.2-0.2c1-0.8,2-1.5,2.9-2.3c1.6-1.5,3.1-3.1,4.5-4.9c1.3-1.6,2.4-3.4,3.3-5.3
		c0.5-1,0.9-2.2,0.9-3.4c0.1-1.4-0.5-2.7-1.7-3.4c-0.5-0.3-1-0.4-1.6-0.5c-0.8,0.2-1.5,0.5-2.1,1c-0.6,0.3-0.8,0.3-1.1-0.2
		c-0.2-0.1-0.2-0.3-0.1-0.5c0.2-0.2,0.4-0.4,0.6-0.6c0.8-1,2-1.5,3.2-1.7c1.3,0,2.4,0.6,3.1,1.7c0.8,1.3,1.3,2.8,1.2,4.3
		c0,1.3-0.3,2.6-0.7,3.8c-0.6,1.5-1.4,2.9-2.5,4.2c-0.5,0.6-1.1,1.3-1.7,1.8c-1.1,1.2-2.3,2.3-3.4,3.5c-0.9,0.9-1.8,1.9-2.7,2.8
		c-0.7,0.7-1.3,1.6-2.1,2.3c-0.6,0.8-1.2,1.5-1.9,2.2c-0.1-0.1-0.1-0.2-0.1-0.4c-0.1-0.3-0.4-0.6-0.7-0.5c-0.3,0.1-0.6,0.4-0.5,0.7
		c0.1,0.3,0.4,0.6,0.8,0.5C47.9,65.3,48,65.2,48.2,65.2z"/>
	<path class="st7" d="M60.2,35.8l-0.3-0.1c-0.3,0-0.5-0.1-0.7-0.2c-0.4-0.4-0.4-1.1,0-1.5c0,0,0,0,0,0c0.2-0.2,0.2-0.5,0.1-0.7
		c-0.8-1.5-0.8-3.3-0.1-4.9c0.1-0.1,0.1-0.3,0-0.4c-0.1-0.4-0.1-0.8,0.1-1.1c0.1-0.2,0.3-0.3,0.5-0.3h0.1c0.1,0,0.2,0,0.3,0
		c0.2-0.1,0.3-0.2,0.1-0.4L60,25.9c-0.4-0.3-0.6-0.8-0.3-1.2c0-0.1,0.1-0.2,0.2-0.2c0.3-0.3,0.4-0.6,0.5-1c0-0.5,0.1-1,0.2-1.5
		c0.1-0.7,0.1-1.4,0.1-2.1c0-0.2-0.2-0.5-0.1-0.7c0-0.2,0.1-0.4,0.2-0.5c0-0.2,0.2-0.3,0.1-0.5c0-0.1,0.1-0.2,0.1-0.3
		c0.2-0.3,0.2-0.7,0-1.1c-0.5-1.6-2.2-2.4-3.8-1.9c-0.1,0-0.2,0.1-0.3,0.1c-0.5,0.2-1,0.4-1.5,0.5c-0.2,0.1-0.3,0.1-0.5,0.1
		c0-0.1,0-0.2,0.1-0.3c1.3-1.4,2.8-2.5,4.4-3.5c0.2-0.1,0.4-0.2,0.7-0.2c0.8,0,1.7-0.1,2.5-0.2c0.1,0,0.2,0,0.3,0.2
		c0.5,1.5,0.9,3,1.6,4.5c0.3,0.8,0.3,1.7,0,2.5c-0.4,1.8-0.8,3.5-1.2,5.2c-0.3,1.4-0.6,2.8-1,4.1L61,33.1c-0.1,0.4-0.2,0.7-0.3,1.1
		c0.1,0.5,0,1-0.3,1.4C60.4,35.8,60.4,35.8,60.2,35.8C60.2,35.8,60.2,35.8,60.2,35.8z"/>
	<path class="st7" d="M60.2,35.8c0.3-0.2,0.3-0.5,0.3-0.7s0.1-0.5,0.2-0.8c0.3,0,0.7,0.1,1,0.2c0.3,0.1,0.6,0.1,0.8,0
		c0,0,0,0.1,0.1,0.1c0.4,0.4,0.4,1,0,1.4c-0.1,0.1-0.3,0.2-0.4,0.2l-0.1,0.1 M62,36.4c-0.5-0.3-1.2-0.3-1.8-0.6L62,36.4z"/>
	<path class="st16" d="M62,36.4L62,36.4l0.1,0.1c0,0.1-0.1,0.1-0.2,0S62,36.4,62,36.4z"/>
	<path class="st8" d="M64,55.3c0-0.1,0-0.3,0.1-0.3c0,0,0,0,0,0C64.1,55.2,64.1,55.3,64,55.3z"/>
	<path class="st9" d="M59.2,59.4c0.1,0,0.2,0.1,0.3,0.1c0.4,0.1,0.6,0.5,0.5,0.9c0,0,0,0.1,0,0.1c-0.1,0.4-0.5,0.6-1,0.5
		c-0.4-0.1-0.6-0.5-0.6-0.9c0-0.1,0-0.2,0-0.2C58.6,59.6,58.9,59.5,59.2,59.4z"/>
	<path class="st9" d="M48.2,65.2c-0.4,0.3-0.8,0.3-1.1,0c-0.3-0.2-0.4-0.7-0.2-1c0.2-0.3,0.5-0.5,0.9-0.4c0.3,0.1,0.6,0.4,0.6,0.7
		c0,0.1,0,0.2,0,0.3L48.2,65.2z"/>
	<path class="st10" d="M57.7,36.3c0.5-0.4,1.1-0.7,1.7-0.9l0.6,0.3c0,0.1-0.1,0.1-0.2,0.1C59,35.9,58.3,36,57.7,36.3z"/>
	<path class="st9" d="M53.9,68.8c-0.4,0.1-0.8-0.1-1-0.5c-0.1-0.4,0.1-0.8,0.5-1c0.4-0.1,0.9,0.1,1,0.5
		C54.5,68.2,54.3,68.7,53.9,68.8L53.9,68.8z"/>
	<path class="st11" d="M55.1,65.8c-0.2-0.4,0-0.8,0.4-1c0.4-0.2,0.8,0,1,0.4c0,0,0,0.1,0.1,0.2c0.1,0.4-0.1,0.9-0.5,1
		C55.7,66.5,55.2,66.2,55.1,65.8C55.1,65.8,55.1,65.8,55.1,65.8z"/>
	<path class="st12" d="M57.9,63.9c-0.4,0.2-0.8,0-1-0.4c-0.1-0.2-0.1-0.4,0-0.6c0.1-0.3,0.5-0.5,0.9-0.4
		C58.2,62.8,58.2,63.4,57.9,63.9C57.9,63.9,57.9,63.9,57.9,63.9z"/>
	<path class="st13" d="M57.9,63.9c0-0.2,0-0.4,0.1-0.5c0.1-0.2,0.1-0.4-0.2-0.5s0-0.3-0.1-0.4c0.4,0.1,0.6,0.4,0.6,0.7
		C58.4,63.5,58.2,63.8,57.9,63.9z"/>
	<ellipse transform="matrix(0.9439 -0.3302 0.3302 0.9439 -10.1493 24.0354)" class="st14" cx="65.7" cy="41.9" rx="0" ry="0.8"/>
	<path class="st15" d="M49.9,60.2c0-0.1,0-0.2,0.2-0.2C50.1,60.1,50,60.2,49.9,60.2z"/>
	<path class="st13" d="M57.8,63c0.1,0,0.1,0,0.1,0.1s0,0.1,0,0.1c0,0-0.1,0-0.1-0.1C57.8,63.1,57.8,63.1,57.8,63
		C57.8,63.1,57.8,63,57.8,63z"/>
</g>
</svg>
