<?xml version="1.0" encoding="utf-8"?>
<!-- Generator: Adobe Illustrator 24.0.0, SVG Export Plug-In . SVG Version: 6.00 Build 0)  -->
<svg version="1.1" id="Layer_1" xmlns="http://www.w3.org/2000/svg" xmlns:xlink="http://www.w3.org/1999/xlink" x="0px" y="0px"
	 viewBox="0 0 88 88" style="enable-background:new 0 0 88 88;" xml:space="preserve">
<style type="text/css">
	.st0{fill:#009B57;}
	.st1{clip-path:url(#SVGID_4_);}
	.st2{fill:#006838;}
	.st3{clip-path:url(#SVGID_6_);}
	.st4{fill:#722E21;}
	.st5{fill:#6C2D1F;}
	.st6{fill:#E4AA82;}
	.st7{fill:#DBA27F;}
	.st8{fill:#E6E6E6;}
	.st9{fill:#DFDEDE;}
	.st10{fill:#7D7D7D;}
	.st11{fill:#CA866F;}
	.st12{fill:#D47B7B;}
	.st13{fill:#C9676C;}
	.st14{fill:#F5FAF2;}
	.st15{fill:#F5F5F5;}
	.st16{fill:#828282;}
	.st17{fill:#9D816F;}
	.st18{fill:#A28471;}
	.st19{fill:#6E6E6E;}
	.st20{fill:#A3A3A3;}
	.st21{fill:#9F9E9E;}
	.st22{fill:#C17D47;}
	.st23{fill:#B9743E;}
	.st24{fill:#6D6D6D;}
	.st25{fill:#606161;}
	.st26{fill:#AAAAAA;}
	.st27{fill:#565656;}
	.st28{fill:#818181;}
	.st29{fill:#F7F8F8;}
	.st30{fill:#E0DFDF;}
	.st31{fill:#CBCBCA;}
	.st32{fill:#BD9C82;}
	.st33{fill:#DAD9D9;}
	.st34{fill:#D2D2D2;}
	.st35{fill:#4A494A;}
	.st36{fill:#696969;}
	.st37{fill:#BFC0C0;}
	.st38{fill:#AFAEAE;}
	.st39{fill:#A09F9F;}
	.st40{fill:#ABABAB;}
	.st41{fill:#454546;}
	.st42{fill:#4E4E4E;}
	.st43{fill:#717272;}
	.st44{fill:#6A6A6A;}
	.st45{fill:#686868;}
	.st46{fill:#6B8A4F;}
	.st47{fill:#4C6035;}
	.st48{fill:#5B7642;}
	.st49{fill:#AD6E42;}
	.st50{fill:#905B39;}
	.st51{fill:#A36940;}
	.st52{fill:#637E4A;}
	.st53{fill:#54673D;}
	.st54{fill:#CDCCCA;}
	.st55{fill:#B6B6B6;}
	.st56{fill:#D08443;}
	.st57{fill:#E49B58;}
	.st58{fill:#733629;}
</style>
<title>Artboard 11</title>
<g>
	<defs>
		<rect id="SVGID_1_" y="-99" width="88" height="88"/>
	</defs>
	<clipPath id="SVGID_2_">
		<use xlink:href="#SVGID_1_"  style="overflow:visible;"/>
	</clipPath>
</g>
<rect class="st0" width="88" height="88"/>
<g>
	<defs>
		<rect id="SVGID_3_" width="88" height="88"/>
	</defs>
	<clipPath id="SVGID_4_">
		<use xlink:href="#SVGID_3_"  style="overflow:visible;"/>
	</clipPath>
	<g class="st1">
		<circle class="st2" cx="44" cy="83.6" r="44.2"/>
	</g>
</g>
<g>
	<defs>
		<rect id="SVGID_5_" width="88" height="88"/>
	</defs>
	<clipPath id="SVGID_6_">
		<use xlink:href="#SVGID_5_"  style="overflow:visible;"/>
	</clipPath>
	<g class="st3">
		<path class="st4" d="M42.5,14.5c-1.5,0-3,0.6-4.1,1.6c-1.5,1.4-2.3,3.4-2.2,5.5c0,1.5,0.3,3,0.2,4.6c0,2.4-2.1,9.1,1.7,9.8
			c3.4,0.6,9-1.6,13.4,0.5s8.4-2.2,5.6-6.4s-5.8-4.8-7-8.4S46.9,14.5,42.5,14.5L42.5,14.5z"/>
		<path class="st5" d="M54.9,33.6c-1.9-0.5-5.2-1.3-5.2-1.3c-0.4-0.9-1-1.6-1.8-2.1l-0.1-0.5c0.8-1.1,1.1-2.6,0.8-3.9
			c0,0,0.9-0.4,0.4-1.7l-11.2,2.9c0.1,0.5,0.5,0.9,1,1.1c0,0,1.5,2.9,3.8,3.1v0.4c-0.9,0.3-1.5,1.2-1.5,2.2c0,0-3.2,0-4.5,1.3
			c0.4,0.6,1,1,1.7,1.1c3.4,0.6,9-1.6,13.4,0.5c1.9,1,4.2,0.6,5.6-1C56.6,34.6,55.8,34,54.9,33.6L54.9,33.6z"/>
		<path class="st6" d="M48.7,106.4c0-0.2,0-0.3,0-0.5c0-3.1-0.2-6.1-0.6-9.2c-0.2-2-0.7-3.9-1.4-5.7c-0.3-0.8-0.5-1.7-0.4-2.6
			L47,76.5c0,0-2.1,0-6.8,0.5c-0.2,3.7,1,9.3,1.6,11.5c0.1,0.6,0.2,1.2,0.1,1.7c-0.3,2.4,0,4.8,0.8,7.1c1.5,5,4.2,8.5,2.8,10.9
			c-1.6,2.2-3.3,4.3-5.1,6.3c0.4,0.4,1.1,0.6,1.7,0.5c1-0.2,6.6-4.9,7-6.1S48.9,108.1,48.7,106.4"/>
		<path class="st7" d="M48.7,106.4c0-0.2,0-0.3,0-0.5c0-3.1-0.2-6.1-0.6-9.2c-0.2-2-0.7-3.9-1.4-5.7c-0.3-0.8-0.5-1.7-0.4-2.6
			L47,76.5l-1.2,0.1c-0.4,4.1-1,12-0.9,12.9c0.2,1.2,3.7,9.9,3.1,16c0,0.6,0,1.1,0.2,1.7c0.1,0.3,0.2,0.7,0.2,1
			c-0.1,0.3-3.1,4.3-4.3,4.5c-0.2,0.1-0.3,0.1-0.5,0c-0.4-0.2-0.7-0.5-1-0.8c-1.3,1.5-2.4,2.8-2.4,2.8c0.4,0.4,1.1,0.6,1.7,0.5
			c1-0.2,6.6-4.9,7-6.1S48.9,108.1,48.7,106.4"/>
		<path class="st6" d="M52.3,88l0.7-11.6c0,0-6.5-4.2-6.8,0.5C46,80.8,47.5,87.1,48,89.1c0.1,0.4,0.1,0.9,0.1,1.3
			c-0.2,2.3,0,4.5,0.5,6.8c0.8,3.9,1.9,7.7,1.9,9.3c-0.1,1.5-0.5,3-1.2,4.4c-0.5,1.2-1.2,2.1,0.3,2.3s2.6-1.2,3.5-3.3
			c0.4-1.1,0.4-2.4-0.1-3.5c-0.4-1.3,2.1-10.9-0.3-16.5C52.4,89.2,52.3,88.6,52.3,88"/>
		<path class="st7" d="M52.7,89.8c-0.2-0.6-0.4-1.2-0.3-1.8l0.7-11.6c-0.6-0.4-1.2-0.7-1.8-1c0.1,3.4,0.2,8.6,0,12
			c-0.1,1.5,0,2.9,0.4,4.4c1.2,4.4,1.5,8.9,1,13.4c-0.1,0.8,0,1.5,0.2,2.3c0.2,0.6,0.2,1.2,0.1,1.7c-0.3,1.1-1.1,4.7-4.1,3.7
			c0.2,0.2,0.5,0.3,0.8,0.3c1.5,0.1,2.6-1.2,3.5-3.3c0.4-1.1,0.4-2.4-0.1-3.5C52.6,105.1,55.2,95.4,52.7,89.8"/>
		<path class="st8" d="M39.3,34.6c0,0-2.1,0.7-2.5,1.7c-1.1,2.6-1.8,8.5-2,11.4C32.4,50.2,29.9,58,29.9,58l2.4,1.5
			c0,0,4.5-7.8,5.5-10.8S39.3,34.6,39.3,34.6"/>
		<path class="st9" d="M36.8,41.8c0,0,0.3,2.6,0.6,4c0.1,1.2-0.2,2.4-0.8,3.5c-1,1.6-3.6,8.3-4.8,8.8c-0.7,0.2-1.4,0.1-2-0.3
			c0,0,0,0.1,0,0.1l2.3,1.5c0,0,4.5-7.8,5.5-10.8s1.5-14,1.5-14L39,34.8C37.5,36.9,36.8,39.4,36.8,41.8"/>
		<path class="st10" d="M38.3,58.4c0,0-4.2,6.8,0.4,25.1c0,0,10.4,3.2,16.2-0.6c0,0,4.1-19.2-1.1-24.8
			C53.7,58.1,43.7,60.1,38.3,58.4"/>
		<path class="st9" d="M42.5,31.7l5.2-0.8c0.5,0.7,1,1.4,1.4,2.2c0,1.8-1.8,5.7-1.8,5.7l-4.4-2.2C42.8,36.6,41.3,33.4,42.5,31.7
			L42.5,31.7z"/>
		<path class="st6" d="M42.7,29.3c0,0,0.8,3.7,0.5,4.2s-2.9,1.1-3.4,1.5l5.5,6.3l4.6-0.5v-7.7l-1.7-0.4c-0.4-0.1-0.8-0.4-0.9-0.8
			c-0.3-0.9-0.7-3.4-0.7-3.4L42.7,29.3L42.7,29.3z"/>
		<path class="st7" d="M43.5,33.6c0.2-0.5,0.2-1.1,0.5-1.5c0.3-0.3,0.7-0.5,1.2-0.7c0.6-0.2,1.1-0.6,1.5-1c-0.2-0.9-0.3-1.8-0.3-1.8
			l-3.7,0.7c0,0,0.8,3.7,0.5,4.2s-2.9,1.1-3.4,1.5l0.6,0.7C41.6,35.5,43,34.9,43.5,33.6z"/>
		<path class="st6" d="M39,18.2c-1.5,1.9-1.5,5.3-0.9,7.2c0.9,2.9,2.5,5.3,5.8,5.6c2.8,0.3,4.7-2.6,4.3-5.1
			c-0.3-2.2-0.4-5.6-1.9-7.4c-1.4-1.5-3.6-2.2-5.6-1.6C40.1,17.2,39.4,17.6,39,18.2z"/>
		<path class="st4" d="M45.8,24.1c0,0.3-0.2,0.5-0.5,0.5c-0.3,0-0.5-0.2-0.5-0.5c0-0.3,0.2-0.5,0.5-0.5
			C45.6,23.5,45.8,23.8,45.8,24.1L45.8,24.1z"/>
		<path class="st4" d="M41.3,25.2c0,0.3-0.2,0.5-0.5,0.5c0,0,0,0,0,0c-0.3,0-0.5-0.2-0.5-0.5c0,0,0,0,0,0c0-0.3,0.2-0.5,0.5-0.5
			S41.3,24.9,41.3,25.2L41.3,25.2z"/>
		<path class="st11" d="M43.4,25.8L43.4,25.8c-0.2-0.2-0.7,0.2-0.7,0.4c-0.1,0.5,0.9,0.8,0.8,0.3c0-0.2-0.1-0.4-0.1-0.5L43.4,25.8
			L43.4,25.8z"/>
		<path class="st12" d="M45.6,28.6c0.1,0,0.1-0.1,0.1-0.2c0,0,0,0,0,0c-0.4-0.7-1.2-1-2-0.8c-1,0.1-1.3,1.5-1,1.7
			C43.7,29.1,44.6,28.9,45.6,28.6z"/>
		<path class="st4" d="M43.9,22.5c0-0.1,0.2-0.1,0.3-0.1h0.4c0.4,0,0.9,0,1.3,0c0.2,0,0.4,0.1,0.5,0.2c0.1,0.1,0.2,0.3,0.2,0.5
			c0,0.1-0.1,0.1-0.1,0.1c0,0,0,0,0,0c-0.8-0.3-1.6-0.4-2.4-0.4c-0.1,0-0.2-0.1-0.2-0.1C43.9,22.6,43.9,22.5,43.9,22.5L43.9,22.5z"
			/>
		<path class="st4" d="M41.1,22.9c-0.1-0.1-0.2,0-0.3,0L40.4,23c-0.4,0.2-0.8,0.4-1.2,0.6c-0.2,0.1-0.3,0.2-0.4,0.4
			c-0.1,0.2-0.1,0.4,0,0.5c0,0,0.1,0.1,0.1,0c0,0,0,0,0,0c0.6-0.6,1.3-1.1,2-1.4C41.1,23.1,41.1,23,41.1,22.9
			C41.1,22.9,41.1,22.8,41.1,22.9L41.1,22.9z"/>
		<path class="st13" d="M44,28.6c-0.5-0.1-1,0.2-1.3,0.6c0.9-0.1,1.8-0.3,2.7-0.6C45,28.4,44.5,28.4,44,28.6z"/>
		<path class="st14" d="M43.6,27.6c-0.4,0.1-0.8,0.3-1,0.8c0.8,0,1.7-0.2,2.4-0.5C44.6,27.5,44.1,27.5,43.6,27.6L43.6,27.6z"/>
		<path class="st8" d="M51.8,45.1c0-0.4,0-0.7,0.1-1.1c0.1-1.7,0.2-1.6,0.4-3.3c0.2-2.3,0.2-4.6,0.2-6.8l-3.8-1
			c-1,0.7-2,1.6-2.9,2.5c-0.6,0.8-0.5,3.8-0.5,3.8c0,0-0.1,0-0.1,0c-0.1-1-0.2-3.5-0.7-3.7c-0.9-0.2-2.3-1.8-2.3-1.8l-3.1,1
			c-0.9,2.1-1.4,4.3-1.5,6.6c0.1,1.6,0.4,3.3,1.1,4.8c1.2,4.6-0.6,12.7-0.6,12.7c4.8,3.5,16.1-0.2,16.1-0.2c-0.7-1.9-1.3-4-1.6-6
			c-0.2-1.2-0.4-2.3-0.6-3.4C51.8,47.7,51.7,46.4,51.8,45.1"/>
		<path class="st9" d="M52.5,52.5c-0.2-1.2-0.4-2.3-0.6-3.4c-0.2-1.3-0.2-2.6-0.2-3.9c0-0.4,0-0.7,0.1-1.1c0.1-1.7,0.2-1.6,0.4-3.3
			c0.2-2.3,0.2-4.6,0.2-6.8l-3.8-1c0,0-0.2,0.3-0.3,0.3c1.1,0.2,2.1,0.5,3.1,1c0,0,0.4,0.1,0.3,0.9s0.3,8.3-1,9.8s-4.1,1-4.8,0.6
			c-0.7-0.6-1.7-0.6-2.5-0.1c-1.3,0.7-2.3,0.8-4.5-0.2c0,0-0.6,0.2,0.3,1c1.5,1,3.3,1.4,5.2,1.3c2-0.1,3.8,4.1,1.5,12.5
			c2.7-0.3,5.4-0.8,8-1.6C53.4,56.5,52.9,54.5,52.5,52.5"/>
		<path class="st9" d="M48.8,33.1c-1.1,0.7-2.1,1.4-3,2.2c-0.2,0.3-0.3,0.5-0.3,0.8l1.7,1.6C47.2,37.8,49.4,34.6,48.8,33.1z"/>
		<path class="st15" d="M47.6,30.9c0.1,1.5-1.8,4.5-1.8,4.5s0.8,1,1.3,1.8c0,0,2-2.5,2-4.1C48.8,32.2,48.3,31.5,47.6,30.9L47.6,30.9
			z"/>
		<path class="st9" d="M42,36c0.5,0.9,1.2,1.6,2,2.1l0.9-1.6c-0.1-0.6-0.2-1-0.4-1.1c-1-0.4-1.8-1-2.5-1.7
			C41.6,34.4,41.6,35.3,42,36z"/>
		<path class="st15" d="M42.5,31.7c-0.1,0.8,0.1,1.6,0.6,2.2c0.3,0.7,0.8,1.2,1.5,1.6c-0.3,0.7-0.6,1.4-0.6,2.2c0,0-2.5-1.8-2.5-3.3
			C41.4,33.4,41.8,32.4,42.5,31.7z"/>
		<path class="st16" d="M47,84.8h-0.6l0,0H47L47,84.8"/>
		<path class="st17" d="M46.4,84.8c-0.4,0-0.8,0-1.2-0.1C45.6,84.7,46,84.7,46.4,84.8L46.4,84.8"/>
		<path class="st18" d="M47.2,84.8L47.2,84.8c1.4,0,2.7-0.1,4.1-0.4C50,84.6,48.6,84.8,47.2,84.8"/>
		<path class="st17" d="M45.2,84.7L45.2,84.7 M45.2,84.7L45.2,84.7"/>
		<path class="st18" d="M45.1,84.7L45.1,84.7"/>
		<polyline class="st17" points="45.1,84.7 45.1,84.7 45.1,84.7 45.1,84.7 		"/>
		<path class="st18" d="M45,84.7L45,84.7 M45,84.7L45,84.7 M45,84.7L45,84.7 M45,84.7L45,84.7 M45,84.7L45,84.7 M45,84.7L45,84.7
			 M45,84.7L45,84.7 M45,84.7L45,84.7 M45,84.7L45,84.7"/>
		<polyline class="st17" points="51.3,84.3 51.3,84.3 51.3,84.3 		"/>
		<path class="st16" d="M52.9,83.9L52.9,83.9 M52.9,83.9c0.7-0.3,1.3-0.6,1.9-1C54.2,83.3,53.6,83.6,52.9,83.9"/>
		<path class="st19" d="M47.2,84.8H47h-0.6l0,0c-0.4,0-0.8,0-1.2-0.1h-0.3c-1.7-0.2-3.5-0.4-5.2-0.9c0.6-5.7,7.4-4.4,11.2-7.1
			C55,74,54,62.4,53.8,61.2c-0.2-0.9-1.1-1-1.5-1h-0.2c-1.4,0.3-2.7,0.5-4.1,0.7v-1c2.1-0.3,4.1-0.8,6.1-1.4
			c1.7,2.3,2.3,6.2,2.3,10.3c-0.1,4.7-0.6,9.4-1.5,14.1l0,0c-0.6,0.4-1.2,0.7-1.9,1l0,0c-0.5,0.2-1,0.3-1.5,0.5l0,0
			C50,84.7,48.6,84.8,47.2,84.8"/>
		<path class="st20" d="M48,59.9L48,59.9c2.1-0.3,4.1-0.8,6.1-1.4l0,0C52.1,59.2,50.1,59.6,48,59.9"/>
		<path class="st21" d="M48,59.9v-1c1.9-0.2,3.8-0.5,5.7-0.8c0.1,0.1,0.3,0.3,0.4,0.5C52.1,59.2,50,59.6,48,59.9"/>
		<polyline class="st22" points="32.7,51.3 48.3,52.2 47.9,61.8 32.7,61.4 32.7,51.3 		"/>
		<polyline class="st23" points="23,53 32.7,51.3 32.7,61.4 22.9,64.1 23,53 		"/>
		<polyline class="st24" points="24.3,45.2 24.7,60.5 33.5,57.7 33.2,43.5 24.3,45.2 		"/>
		<polyline class="st10" points="26.2,45.2 26.6,60.6 33.5,57.7 33.2,43.5 26.2,45.2 		"/>
		<polygon class="st25" points="24.3,45.2 26.2,45.2 26.6,60.6 24.7,60.5 24.3,45.2 		"/>
		<polygon class="st26" points="26,53.1 25,53 24.8,47 25.7,47.1 26,53.1 		"/>
		<polyline class="st27" points="26.8,59.8 26.7,46.7 30.2,46.3 27.1,46.7 27,59.3 26.8,59.8 		"/>
		<polyline class="st24" points="27.1,46.7 26.9,62.1 35.9,59.5 36.1,45.4 27.1,46.7 		"/>
		<polyline class="st10" points="29,46.8 28.8,62.2 35.9,59.5 36.1,45.4 29,46.8 		"/>
		<polygon class="st25" points="27.1,46.7 29,46.8 28.8,62.2 26.9,62.1 27.1,46.7 		"/>
		<polygon class="st26" points="28.5,54.7 27.6,54.6 27.6,48.6 28.5,48.7 28.5,54.7 		"/>
		<polyline class="st28" points="36.1,46.3 36.1,46.2 36.2,46.2 36.1,46.3 36.1,46.3 		"/>
		<polyline class="st27" points="29,59.9 29.8,46.8 36.1,46.2 36.1,46.3 30.2,46.8 29.3,59.2 29,59.9 		"/>
		<polyline class="st24" points="30.2,46.8 29.1,62.1 38.2,60.1 39.2,46 30.2,46.8 		"/>
		<polyline class="st10" points="32.1,47 31,62.3 38.2,60.1 39.2,46 32.1,47 		"/>
		<polygon class="st25" points="30.2,46.8 32.1,47 31,62.3 29.1,62.1 30.2,46.8 		"/>
		<polygon class="st26" points="31.1,54.8 30.2,54.7 30.5,48.7 31.4,48.8 31.1,54.8 		"/>
		<path class="st29" d="M46,53.9c-0.7,2.4-3.2,3.8-5.6,3.1c-2.4-0.7-3.8-3.2-3.1-5.6c0.7-2.4,3.2-3.8,5.6-3.1c0,0,0,0,0,0
			C45.3,49,46.7,51.5,46,53.9"/>
		<path class="st30" d="M45,53.6c-0.5,1.9-2.5,3-4.4,2.4s-3-2.5-2.4-4.4c0.5-1.9,2.5-3,4.4-2.4c0,0,0,0,0,0
			C44.4,49.8,45.5,51.7,45,53.6"/>
		<path class="st31" d="M41.8,50.7C41.7,50.7,41.7,50.7,41.8,50.7c-0.1-0.1-0.1-0.1-0.1-0.2l0.2-0.6h-0.1c0,0-0.1,0-0.1,0
			c0,0,0-0.1,0-0.1v-0.1c0,0,0,0,0.1,0H42c0,0,0.1,0,0.1,0.1c0,0,0,0.1,0,0.1l-0.2,0.8C41.9,50.7,41.8,50.7,41.8,50.7
			C41.8,50.8,41.7,50.8,41.8,50.7L41.8,50.7z"/>
		<path class="st31" d="M41.8,50.7L41.8,50.7L41.8,50.7l0.2-0.7h-0.1l0,0 M41.8,49.9L41.8,49.9L41.8,49.9H42l0,0c0,0,0,0,0,0
			l-0.2,0.8l0,0L41.8,49.9z"/>
		<path class="st31" d="M42.1,50.8C42,50.8,42,50.8,42.1,50.8C42,50.7,42,50.7,42,50.6c0,0,0-0.1,0-0.1l0.5-0.3l0.1,0l0,0
			c0,0,0,0,0-0.1l0,0h0l0,0h0v0c0,0,0,0.1-0.1,0.1c0,0-0.1,0-0.1,0c0,0-0.1,0-0.1-0.1c0,0,0-0.1,0-0.1c0-0.1,0-0.1,0.1-0.2
			c0,0,0.1-0.1,0.2-0.1h0.2c0.1,0,0.1,0,0.2,0.1c0,0,0.1,0.1,0.1,0.2c0,0.1,0,0.1,0,0.2c0,0,0,0.1,0,0.1l-0.1,0.1h-0.1l-0.2,0.2
			l0.2,0.1c0,0,0,0,0.1,0.1c0,0,0,0.1,0,0.1c0,0,0,0.1-0.1,0.1c0,0-0.1,0-0.1,0l-0.4-0.1L42.1,50.8z"/>
		<path class="st31" d="M42.1,50.7L42.1,50.7 M42.1,50.7L42.1,50.7l0.5-0.3l0.1-0.1c0,0,0,0,0-0.1c0,0,0-0.1,0-0.1c0,0,0,0,0-0.1
			c0,0,0,0-0.1,0h-0.1c0,0,0,0-0.1,0c0,0,0,0.1,0,0.1l0,0l0,0l0,0c0,0,0,0,0,0c0,0,0-0.1,0.1-0.1c0,0,0.1-0.1,0.1-0.1
			c0,0,0.1,0,0.2,0c0,0,0.1,0,0.1,0.1c0,0,0.1,0.1,0.1,0.1c0,0.1,0,0.1,0,0.2c0,0,0,0,0,0.1l-0.1,0.1l-0.1,0l-0.4,0.2l0.3,0.1l0,0
			l0,0l0,0h0l-0.4-0.1L42.1,50.7z"/>
		<path class="st31" d="M40.8,55.2L40.8,55.2C40.7,55.2,40.7,55.2,40.8,55.2c0,0.1,0,0.1,0,0.1l0,0l0,0h0.1l0,0l0,0
			C40.8,55.3,40.8,55.3,40.8,55.2L40.8,55.2L40.8,55.2L40.8,55.2z M40.7,55.6c-0.1,0-0.1,0-0.2-0.1c0,0-0.1-0.1-0.1-0.2
			c0-0.1,0-0.1,0-0.2c0-0.1,0-0.1,0.1-0.2l0,0l0.4-0.4c0,0,0.1,0,0.1,0c0,0,0,0,0.1,0c0,0,0,0.1,0,0.1c0,0,0,0.1,0,0.1L41,55l0,0
			c0,0,0.1,0.1,0.1,0.2c0,0.1,0,0.1,0,0.2c0,0.1,0,0.1-0.1,0.2C40.9,55.6,40.8,55.6,40.7,55.6L40.7,55.6z"/>
		<path class="st31" d="M40.7,55.5L40.7,55.5h0.2c0,0,0-0.1,0-0.1c0,0,0-0.1,0-0.1c0,0,0-0.1,0-0.1h-0.1h-0.1h-0.1c0,0,0,0.1,0,0.1
			C40.7,55.3,40.7,55.4,40.7,55.5C40.7,55.4,40.7,55.4,40.7,55.5L40.7,55.5L40.7,55.5z M40.6,55.1l0.4-0.4c0,0,0,0,0.1,0l0,0l0,0
			l0,0l-0.2,0.2L40.6,55.1L40.6,55.1z M40.7,55.6c0,0-0.1,0-0.1-0.1c0,0-0.1-0.1-0.1-0.1c0,0,0-0.1,0-0.2c0-0.1,0-0.1,0.1-0.1
			c0,0,0.1-0.1,0.1-0.1c0,0,0.1,0,0.2,0c0.1,0,0.1,0,0.1,0.1c0,0,0.1,0.1,0.1,0.1c0,0.1,0,0.1,0,0.2c0,0,0,0.1-0.1,0.1
			c0,0-0.1,0.1-0.1,0.1C40.8,55.6,40.8,55.6,40.7,55.6z"/>
		<path class="st31" d="M43.8,53.9c-0.1,0-0.2-0.1-0.3-0.2c0-0.1,0-0.1,0-0.2c0,0,0-0.1,0.1-0.1c0,0,0.1,0,0.1,0c0,0,0.1,0,0.1,0.1
			c0,0,0,0.1,0,0.1c0,0,0,0,0,0.1l0,0h0.1H44c0,0,0,0,0-0.1c0,0,0,0,0-0.1s0,0,0,0h0c0,0-0.1,0-0.1-0.1c0,0,0-0.1,0-0.1
			c0,0,0-0.1,0.1-0.1c0,0,0.1,0,0.1,0l0,0l0,0l0,0l0,0c0,0,0,0,0,0c0,0,0,0-0.1,0H44l0,0c0,0,0,0.1,0,0.1c0,0-0.1,0-0.1,0
			c0,0-0.1,0-0.1-0.1c0,0,0-0.1,0-0.1c0-0.1,0.1-0.3,0.2-0.3c0.1,0,0.1,0,0.2,0c0.1,0,0.1,0,0.1,0.1c0,0,0.1,0.1,0.1,0.1
			c0,0.1,0,0.1,0,0.2c0,0,0,0.1-0.1,0.1h-0.1l0,0c0,0,0,0.1,0,0.1c0,0,0,0.1,0,0.1c0,0.1,0,0.1-0.1,0.2c0,0.1-0.1,0.2-0.2,0.2
			C43.9,54,43.9,54,43.8,53.9L43.8,53.9z"/>
		<path class="st31" d="M43.8,53.9c-0.1,0-0.1-0.1-0.1-0.1c0,0-0.1-0.1-0.1-0.1c0,0,0-0.1,0-0.2l0,0l0,0l0,0l0,0c0,0,0,0.1,0,0.1
			c0,0,0,0.1,0,0.1c0,0,0.1,0,0.1,0c0,0,0.1,0,0.1,0c0,0,0.1-0.1,0.1-0.1c0,0,0-0.1,0-0.1c0,0,0-0.1,0-0.1c0,0,0,0-0.1,0l0,0l0,0
			l0,0H44c0,0,0,0,0.1,0c0,0,0,0,0-0.1c0,0,0-0.1,0-0.1c0,0-0.1-0.1-0.1-0.1h0c0,0-0.1,0-0.1,0c0,0,0,0,0,0.1l0,0l0,0l0,0l0,0
			c0,0,0-0.1,0.1-0.1c0-0.1,0-0.1,0-0.1c0,0,0.1,0,0.2,0c0,0,0.1,0,0.1,0.1c0,0,0.1,0.1,0.1,0.1c0,0,0,0.1,0,0.1c0,0,0,0.1,0,0.1
			h-0.1h-0.1c0,0,0.1,0,0.1,0.1c0,0,0,0.1,0,0.1c0,0,0,0.1,0,0.1c0,0,0,0.1-0.1,0.1c0,0-0.1,0.1-0.1,0.1L43.8,53.9z"/>
		<path class="st31" d="M39.1,51.7L39.1,51.7L39.1,51.7L39.1,51.7C39,51.8,39,51.8,39,51.8l0,0h0h0.1l0,0
			C39.1,51.8,39.1,51.8,39.1,51.7C39.1,51.8,39.1,51.7,39.1,51.7L39.1,51.7L39.1,51.7 M38.8,52.5C38.8,52.5,38.7,52.5,38.8,52.5
			c-0.1-0.1-0.1-0.1-0.1-0.1c0,0,0-0.1,0-0.1l0.2-0.2l-0.1-0.1c0,0-0.1-0.1-0.1-0.2c0-0.1,0-0.1,0-0.2c0-0.1,0-0.1,0.1-0.2
			c0,0,0.1-0.1,0.2-0.1c0.1,0,0.1,0,0.2,0c0.1,0,0.1,0,0.2,0.1c0,0,0.1,0.1,0.1,0.2c0,0.1,0,0.3-0.1,0.3l0,0l-0.4,0.4
			C38.9,52.4,38.8,52.4,38.8,52.5"/>
		<path class="st31" d="M39.3,52l-0.4,0.4c0,0,0,0-0.1,0l0,0l0,0l0,0l0.2-0.3L39.3,52 M39.1,51.6H39c0,0-0.1,0-0.1,0
			c0,0,0,0.1,0,0.1c0,0,0,0.1,0,0.1c0,0,0,0.1,0,0.1L39,52h0.1c0,0,0,0,0.1,0c0,0,0-0.1,0-0.1c0,0,0-0.1,0-0.1c0,0,0,0,0-0.1
			C39.1,51.7,39.1,51.7,39.1,51.6 M39.1,51.6c0,0,0.1,0,0.1,0.1c0,0,0.1,0.1,0.1,0.1c0,0,0,0.1,0,0.2c0,0.1,0,0.1-0.1,0.1l-0.1,0.1
			c0,0-0.1,0-0.2,0c-0.1,0-0.1,0-0.1-0.1c0,0-0.1-0.1-0.1-0.1c0-0.1,0-0.1,0-0.2c0,0,0-0.1,0.1-0.1c0,0,0.1-0.1,0.1-0.1L39.1,51.6"
			/>
		<path class="st31" d="M42.5,53.2l-1.2-0.3c0,0-0.1-0.1-0.1-0.1c0,0,0,0,0,0c0,0,0.1-0.1,0.1-0.1c0,0,0,0,0,0l1.2,0.3
			c0,0,0.1,0.1,0.1,0.1C42.6,53.2,42.6,53.2,42.5,53.2C42.5,53.2,42.5,53.2,42.5,53.2z"/>
		<path class="st31" d="M41.9,51.5L41.5,53c0,0-0.1,0.1-0.1,0.1c0,0-0.1-0.1-0.1-0.1c0,0,0,0,0,0l0.4-1.4c0,0,0.1-0.1,0.1-0.1
			C41.8,51.4,41.8,51.4,41.9,51.5C41.9,51.5,41.9,51.5,41.9,51.5L41.9,51.5z"/>
		<path class="st32" d="M41.6,57.2L41.6,57.2 M41.6,57.2c2,0,3.7-1.3,4.3-3.2C45.3,55.9,43.6,57.2,41.6,57.2 M40.4,57L40.4,57
			 M40.4,57L40,56.9L40.4,57 M40,56.9L40,56.9 M40,56.9L40,56.9 M40,56.9L40,56.9 M40,56.9L40,56.9 M40,56.9L40,56.9 M40,56.9
			L40,56.9 M40,56.9L40,56.9 M40,56.9L40,56.9 M40,56.9L40,56.9 M40,56.9L40,56.9 M40,56.9L40,56.9 M40,56.9L40,56.9 M40,56.9
			L40,56.9 M40,56.9L40,56.9 M40,56.9L40,56.9 M40,56.9L40,56.9 M40,56.9L40,56.9 M40,56.9L40,56.9 M40,56.9L40,56.9 M40,56.9
			L40,56.9 M45.9,54L45.9,54 M45.9,54L45.9,54 M45.9,54L45.9,54L45.9,54L45.9,54 M45.9,54L45.9,54 M45.9,54L45.9,54 M45.9,54
			L45.9,54 M45.9,54L45.9,54 M45.9,54L45.9,54 M45.9,54L45.9,54 M45.9,54L45.9,54 M45.9,54L45.9,54 M45.9,54L45.9,54 M45.9,54
			L45.9,54 M45.9,54L45.9,54 M45.9,54L45.9,54 M45.9,54L45.9,54 M45.9,54L45.9,54 M45.9,54L45.9,54 M45.9,54L45.9,54 M45.9,54
			L45.9,54 M45.9,54L45.9,54 M45.9,54L45.9,54 M45.9,54L45.9,54"/>
		<path class="st33" d="M41.6,57.2L41.6,57.2c-0.4,0-0.8-0.1-1.2-0.2l0,0L40,56.9h-0.2c-0.5-0.2-0.9-0.5-1.2-0.8h0.4
			c0.8,0.6,1.7,1,2.7,1c1.5,0,3-0.8,3.8-2.1c1.5-2.5-0.2-4.8-1.1-5.8c1.5,1,2.2,2.8,1.8,4.6l0,0v0l0,0l0,0l0,0l0,0l0,0l0,0l0,0l0,0
			l0,0l0,0l0,0c-0.6,1.9-2.3,3.2-4.3,3.2l0,0"/>
		<path class="st34" d="M44.3,50.3c0.8,1.3,0.8,2.9,0,4.2c-0.7,1.2-2.6,2.1-4.9,0.9c0.4,0.3,0.8,0.5,1.2,0.6
			c1.9,0.5,3.8-0.6,4.4-2.4C45.3,52.5,45.1,51.2,44.3,50.3z"/>
		<path class="st35" d="M42.6,53.2l-1.2-0.3c-0.1,0-0.1-0.1-0.1-0.1c0,0,0.1-0.1,0.1-0.1c0,0,0,0,0,0l1.2,0.3c0,0,0.1,0.1,0.1,0.1
			c0,0,0,0,0,0C42.7,53.1,42.7,53.2,42.6,53.2z"/>
		<path class="st35" d="M42,51.5l-0.4,1.4c0,0-0.1,0.1-0.1,0.1c0,0,0,0,0,0c0,0-0.1-0.1-0.1-0.1c0,0,0,0,0,0l0.4-1.4
			c0,0,0.1-0.1,0.1-0.1c0,0,0,0,0,0C42,51.4,42,51.4,42,51.5z"/>
		<path class="st35" d="M41.8,50.7C41.8,50.7,41.8,50.6,41.8,50.7c-0.1-0.1-0.1-0.1-0.1-0.2l0.2-0.6h-0.1c0,0-0.1,0-0.1,0
			c0,0,0-0.1,0-0.1c0,0,0,0,0-0.1c0,0,0.1,0,0.1,0h0.2c0,0,0.1,0,0.1,0.1c0,0,0,0.1,0,0.1L42,50.7C42,50.7,41.9,50.7,41.8,50.7
			C41.9,50.8,41.8,50.8,41.8,50.7L41.8,50.7z"/>
		<path class="st35" d="M41.8,50.6L41.8,50.6L41.8,50.6l0.2-0.7h-0.1l0,0l0,0l0,0l0,0h0.2l0,0l0,0L41.8,50.6L41.8,50.6L41.8,50.6z"
			/>
		<path class="st35" d="M42.2,50.8C42.1,50.7,42.1,50.7,42.2,50.8c-0.1-0.1-0.1-0.1-0.1-0.2c0,0,0-0.1,0-0.1l0.5-0.3h0.1l0,0
			c0,0,0,0,0-0.1l0,0l0,0h0l0,0l0,0c0,0,0,0.1-0.1,0.1c0,0-0.1,0-0.1,0c0,0-0.1,0-0.1-0.1c0,0,0-0.1,0-0.1c0-0.1,0-0.1,0.1-0.2
			c0,0,0.1-0.1,0.2-0.1c0.1,0,0.1,0,0.2,0c0.1,0,0.1,0,0.2,0.1c0,0,0.1,0.1,0.1,0.2c0,0.1,0,0.1,0,0.2c0,0,0,0.1,0,0.1l-0.1,0.1
			l-0.1,0l-0.2,0.2l0.2,0.1c0,0,0.1,0,0.1,0.1c0,0,0,0.1,0,0.1c0,0,0,0.1-0.1,0.1c0,0-0.1,0-0.1,0l-0.4-0.1L42.2,50.8z"/>
		<path class="st35" d="M42.2,50.7L42.2,50.7L42.2,50.7L42.2,50.7l0.5-0.3l0.1-0.1c0,0,0,0,0-0.1c0,0,0-0.1,0-0.1c0,0,0,0,0-0.1
			c0,0,0,0-0.1,0h-0.1c0,0-0.1,0-0.1,0c0,0,0,0,0,0.1l0,0h0l0,0l0,0c0,0,0-0.1,0.1-0.1c0,0,0.1-0.1,0.1-0.1h0.2c0,0,0.1,0,0.1,0.1
			c0,0,0.1,0.1,0.1,0.1c0,0.1,0,0.1,0,0.2c0,0,0,0,0,0.1c0,0,0,0-0.1,0.1c0,0,0,0-0.1,0l-0.3,0.2l0.3,0.1l0,0l0,0l0,0l0,0l-0.4-0.1
			L42.2,50.7z"/>
		<path class="st35" d="M40.9,55.1L40.9,55.1L40.9,55.1C40.8,55.1,40.8,55.2,40.9,55.1c-0.1,0.1-0.1,0.1-0.1,0.1l0,0h0H41l0,0l0,0
			L40.9,55.1C41,55.2,41,55.2,40.9,55.1L40.9,55.1L40.9,55.1z M40.8,55.6c-0.1,0-0.1,0-0.2-0.1c0,0-0.1-0.1-0.1-0.2
			c0-0.1,0-0.1,0-0.2c0-0.1,0-0.1,0.1-0.2l0,0l0.4-0.4c0,0,0.1,0,0.1,0c0,0,0.1,0,0.1,0.1c0,0,0,0.1,0,0.1c0,0,0,0,0,0.1L41,55
			l0.1,0.1c0,0,0.1,0.1,0.1,0.2c0,0.1,0,0.1,0,0.2c0,0.1,0,0.1-0.1,0.2c0,0-0.1,0.1-0.2,0.1C40.9,55.6,40.8,55.6,40.8,55.6
			L40.8,55.6z"/>
		<path class="st35" d="M40.8,55.4C40.8,55.4,40.9,55.4,40.8,55.4c0.1,0,0.1,0,0.2,0c0,0,0-0.1,0-0.1c0,0,0-0.1,0-0.1
			c0,0,0-0.1,0-0.1h-0.1c0,0-0.1,0-0.1,0c0,0-0.1,0-0.1,0c0,0,0,0.1,0,0.1C40.7,55.3,40.7,55.3,40.8,55.4
			C40.7,55.4,40.7,55.4,40.8,55.4C40.7,55.4,40.8,55.4,40.8,55.4z M40.7,55l0.4-0.4c0,0,0,0,0.1,0l0,0l0,0l0,0l-0.2,0.2L40.7,55
			L40.7,55z M40.8,55.5c0,0-0.1,0-0.1-0.1c0,0-0.1-0.1-0.1-0.1c0,0,0-0.1,0-0.2c0-0.1,0-0.1,0.1-0.1c0,0,0.1,0,0.1,0
			c0.1,0,0.1,0,0.2,0c0,0,0.1,0,0.1,0.1c0,0,0.1,0.1,0.1,0.1c0,0.1,0,0.1,0,0.2c0,0,0,0.1-0.1,0.1c0,0-0.1,0.1-0.1,0.1L40.8,55.5z"
			/>
		<path class="st35" d="M43.9,53.9c-0.1,0-0.2-0.1-0.3-0.2c0-0.1,0-0.1,0-0.2c0,0,0-0.1,0.1-0.1c0,0,0.1,0,0.1,0c0,0,0.1,0,0.1,0.1
			c0,0,0,0.1,0,0.1c0,0,0,0,0,0.1c0,0,0,0,0,0h0.1H44c0,0,0,0,0-0.1v-0.1c0,0,0,0,0,0l0,0c0,0-0.1,0-0.1-0.1c0,0,0-0.1,0-0.1
			c0,0,0-0.1,0.1-0.1c0,0,0.1,0,0.1,0l0,0l0,0l0,0 M44.2,53.2C44.2,53.2,44.2,53.2,44.2,53.2H44l0,0c0,0,0,0.1,0,0.1
			c0,0-0.1,0-0.1,0c-0.1,0-0.1-0.1-0.1-0.1c0,0,0,0,0,0c0-0.1,0-0.1,0.1-0.1c0,0,0.1-0.1,0.2-0.1c0.1,0,0.1,0,0.2,0
			c0.1,0,0.1,0,0.1,0.1c0,0,0.1,0.1,0.1,0.1c0,0.1,0,0.1,0,0.2c0,0,0,0.1-0.1,0.1l-0.1,0l0,0c0,0,0,0.1,0,0.1c0,0,0,0.1,0,0.1
			c0,0.1,0,0.1-0.1,0.2c0,0-0.1,0.1-0.2,0.1c-0.1,0-0.1,0-0.2,0L44.2,53.2z"/>
		<path class="st35" d="M43.9,53.8c-0.1,0-0.1,0-0.1-0.1c0,0-0.1-0.1-0.1-0.1c0,0,0-0.1,0-0.2l0,0l0,0l0,0l0,0c0,0,0,0.1,0,0.1
			c0,0,0,0.1,0,0.1c0,0,0.1,0,0.1,0c0,0,0.1,0,0.1,0c0,0,0.1-0.1,0.1-0.1c0,0,0-0.1,0-0.1c0,0,0-0.1,0-0.1c0,0-0.1,0-0.1,0l0,0l0,0
			l0,0h0.1h0.1c0,0,0,0,0-0.1c0,0,0-0.1,0-0.1c0,0-0.1-0.1-0.1-0.1c0,0-0.1,0-0.1,0c0,0,0,0-0.1,0c0,0,0,0,0,0.1l0,0l0,0l0,0
			c0,0,0,0,0,0c0,0,0-0.1,0.1-0.1c0,0,0.1,0,0.1-0.1c0,0,0.1,0,0.2,0l0.1,0.1c0,0,0.1,0.1,0.1,0.1c0,0,0,0.1,0,0.1c0,0,0,0.1,0,0.1
			h-0.1h-0.1l0.1,0.1c0,0,0,0.1,0,0.1c0,0,0,0.1,0,0.1c0,0,0,0.1-0.1,0.1c0,0-0.1,0-0.1,0.1H43.9z"/>
		<path class="st35" d="M39.2,51.7L39.2,51.7h-0.1v0.1c0,0,0,0,0,0.1l0,0l0,0h0.1l0,0C39.1,51.8,39.1,51.7,39.2,51.7
			C39.1,51.7,39.1,51.7,39.2,51.7L39.2,51.7C39.1,51.6,39.1,51.6,39.2,51.7 M38.8,52.4C38.7,52.4,38.7,52.4,38.8,52.4
			C38.7,52.4,38.7,52.3,38.8,52.4c-0.1-0.1-0.1-0.1-0.1-0.2l0.2-0.2l0-0.1c0,0-0.1-0.1-0.1-0.2c0-0.1,0-0.1,0-0.2
			c0-0.1,0-0.1,0.1-0.2c0,0,0.1-0.1,0.2-0.1c0.1,0,0.1,0,0.2,0c0.1,0,0.1,0,0.2,0.1c0,0,0.1,0.1,0.1,0.2c0,0.1,0,0.3-0.1,0.3l0,0
			L39,52.4c0,0-0.1,0-0.1,0"/>
		<path class="st35" d="M39.3,52l-0.4,0.4c0,0,0,0-0.1,0l0,0l0,0l0,0l0.2-0.2L39.3,52 M39.2,51.7L39.2,51.7c-0.1,0-0.1,0-0.2,0
			c0,0,0,0.1,0,0.1c0,0,0,0.1,0,0.1c0,0,0,0.1,0,0.1c0,0,0,0,0.1,0h0.1c0,0,0.1,0,0.1,0c0,0,0-0.1,0-0.1
			C39.3,51.8,39.3,51.8,39.2,51.7C39.3,51.7,39.2,51.7,39.2,51.7 M39.2,51.6c0.1,0,0.1,0,0.1,0.1c0,0,0.1,0.1,0.1,0.1
			c0,0,0,0.1,0,0.2c0,0.1,0,0.1-0.1,0.1c0,0-0.1,0.1-0.1,0.1c0,0-0.1,0-0.2,0c-0.1,0-0.1,0-0.1-0.1c0,0-0.1-0.1-0.1-0.1
			c0-0.1,0-0.1,0-0.2c0-0.1,0-0.1,0.1-0.1c0,0,0.1-0.1,0.1-0.1C39.1,51.6,39.1,51.6,39.2,51.6"/>
		<path class="st27" d="M35.6,56.7c-0.2,0-0.4,0-0.6-0.1l0,0c0,0-0.1-0.1-0.1-0.1c0,0,0,0,0,0c0,0-0.1-0.1-0.1-0.1
			c-0.5-0.9-0.8-1.9-1.1-2.8h-0.1c-0.1,0-0.1,0-0.2-0.1c0,0,0-0.1,0-0.1v-0.1L33,51.9l0,0l0,0l0,0l0,0l0.3-0.1l0.5-0.1
			c-0.1-0.1-0.2-0.2-0.3-0.3l-0.3,0.2l0.1-0.1h0.1l0,0c-0.2-0.3-0.3-0.7-0.3-1.1L32.9,50l0.1,0.1h0.1c0-0.3,0.1-0.6,0.2-0.8L33,49.1
			l0.1,0.1h0.1l0,0l0,0c0,0,0,0,0.1-0.1c0.2-0.3,0.6-0.4,0.9-0.4h0.2c0.1-0.1,0.3-0.1,0.5-0.1h0.2l0,0h0.1l0,0l0,0l0,0l0,0l0,0l0,0
			l0,0l0-0.2l0,0.2c0.2-0.1,0.5-0.2,0.7-0.2H36c0.1,0,0.2,0.1,0.4,0.1l0,0l0,0l0,0l0,0l0,0l0.1-0.1l-0.2,0.2
			c0.3,0.1,0.5,0.2,0.7,0.4h-0.1h-0.1l0,0l0,0l0,0l0,0l0,0l0,0l0,0l-0.1-0.1l0.2,0.2c-0.2,0.1-0.3,0.3-0.4,0.6h-0.1l-0.1-0.1
			l0.1,0.2c-0.1,0.3-0.1,0.7,0,1h-0.1h-0.1h0.3c0,0.1,0.1,0.2,0.1,0.3L36,51h-0.3h0l0,0l0,0l0,0l0,1.2v0.1c0,0.1,0,0.2,0.1,0.2h0.1
			l0,0c-0.1,0.9-0.1,1.7,0,2.6c0,0,0,0.1,0,0.1l0,0c0,0,0,0.1,0,0.1l0,0c0.6,0.4,1.3,0.5,2,0.5h0.2c-0.2,0.1-0.5,0.2-0.8,0.3
			C36.7,56.4,36.1,56.6,35.6,56.7"/>
		<path class="st36" d="M38.2,55.9l0.2-0.1l0.1,0.1L38.2,55.9 M37.2,50.7c0.1-0.2,0.2-0.3,0.2-0.5v-0.1h0.3l0,0h-0.2h-0.2
			c0-0.4-0.1-0.7-0.2-1l0.3-0.2L37.2,49h-0.1l0,0l0,0c0,0-0.1,0-0.1,0c0.1-0.1,0.3-0.1,0.4-0.1c0.2,0,0.4,0,0.5,0.1h0.2
			c0.1,0,0.3,0,0.4,0.1h0.1l0,0l0,0l0.1-0.1l-0.1,0.2h0.1c-0.5,0.4-0.9,0.9-1.1,1.4L37.2,50.7"/>
		<path class="st37" d="M38.5,55.9L38.5,55.9L38.5,55.9L38.5,55.9L38.5,55.9 M38.8,55.9c-0.1-0.1-0.2-0.2-0.3-0.2l0,0
			c0-0.1,0-0.1,0-0.2l0,0c0,0,0-0.1,0-0.2v0v-0.1l0,0l0,0c-0.1-0.4-0.2-0.8-0.2-1.2c0.2,0.6,0.5,1,1,1.4v0.1l0,0l0,0v0.1l0,0v0.1
			l0,0c0,0.1,0,0.1-0.1,0.2l0,0c0,0-0.1,0-0.1,0H39 M38.2,52.8c0-0.1,0-0.1,0-0.2l0,0v-0.1l0,0v-0.1l0,0l0.1,0
			C38.3,52.5,38.3,52.7,38.2,52.8 M38.4,51.8L38,50.6c0,0,0-0.1-0.1-0.1l0,0l-0.3,0.1c0.3-0.6,0.7-1,1.1-1.4h0.2
			c0.2,0,0.4,0,0.5,0.1c0.1,0.1,0.2,0.1,0.2,0.2h0.1c0,0,0.1,0,0.1-0.1l-0.2,0.1c0,0,0.1,0.1,0.1,0.1c-0.7,0.5-1.3,1.2-1.5,2
			c0,0,0,0.1,0,0.1"/>
		<path class="st38" d="M39.2,55.3c-0.5-0.4-0.8-0.9-1-1.4c-0.1-0.4-0.2-0.7-0.2-1c0-0.2,0-0.3,0-0.5c0,0,0.1-0.1,0.1-0.1
			c0-0.1,0-0.1,0-0.2v-0.2c0,0,0-0.1,0-0.1c0.2-0.8,0.8-1.5,1.5-2c0.1,0.1,0.2,0.3,0.2,0.5H40h0.1l-0.3,0.1c0.1,0.3,0,0.6-0.1,0.9
			l0,0l0,0H40l0.1,0.1L39.8,51l0,0c-0.1,0.1-0.2,0.2-0.3,0.3l0.6,0.1c0,0,0.1,0,0.1,0.1c0,0,0,0,0,0l-0.3,1.2c0,0,0,0.1-0.1,0.1
			c0,0-0.1,0.1-0.2,0.1l0,0V53l0,0v0.1l0,0l0,0c-0.1,0.5-0.2,1.3-0.4,2.1 M39,51.4c0,0-0.1,0-0.1,0.1c0,0-0.1,0.1-0.1,0.2
			c0,0.1,0,0.1,0,0.2c0,0.1,0.1,0.1,0.1,0.2L39,52l-0.2,0.2c0,0,0,0.1,0,0.1c0,0,0,0.1,0,0.1c0,0,0,0,0.1,0l0,0c0,0,0.1,0,0.1,0l0,0
			h0.1l0.4-0.4l0,0c0.1-0.1,0.1-0.2,0.1-0.3c0-0.1,0-0.1-0.1-0.2c0-0.1-0.1-0.1-0.2-0.1L39,51.4c0,0,0,0.1,0,0.1 M39.2,51.9
			L39.2,51.9L39.2,51.9L39.2,51.9C39.2,51.8,39.2,51.8,39.2,51.9L39.2,51.9L39.2,51.9L39.2,51.9L39.2,51.9
			C39.2,51.8,39.2,51.8,39.2,51.9L39.2,51.9"/>
		<path class="st39" d="M38.8,52.5L38.8,52.5C38.8,52.5,38.8,52.5,38.8,52.5c-0.1-0.1-0.1-0.1-0.1-0.1c0,0,0-0.1,0-0.1l0.2-0.2
			l-0.1-0.1c0,0-0.1-0.1-0.1-0.2c0-0.1,0-0.1,0-0.2c0-0.1,0-0.1,0.1-0.2c0,0,0.1-0.1,0.1-0.1l0,0c0,0-0.1,0.1-0.1,0.1v0.1
			c0,0.1,0,0.1,0,0.2c0,0,0,0.1,0.1,0.1c0,0,0.1,0.1,0.1,0.1l-0.2,0.1c0,0,0,0.1,0,0.1l0,0l0,0l0,0l0,0H39c0,0-0.1,0-0.1,0
			 M39.2,51.7L39.2,51.7L39.2,51.7C39.3,51.7,39.3,51.6,39.2,51.7L39.2,51.7L39.2,51.7L39.2,51.7L39.2,51.7L39.2,51.7L39.2,51.7
			l0.1,0c0,0,0,0,0,0.1c0,0,0,0.1,0,0.1l0,0l0,0l0,0"/>
		<path class="st39" d="M38.8,52.4L38.8,52.4L38.8,52.4L38.8,52.4L38.8,52.4L38.8,52.4C38.8,52.5,38.8,52.5,38.8,52.4L38.8,52.4
			L38.8,52.4 M39,52.2c0,0-0.1,0-0.1-0.1c0,0-0.1-0.1-0.1-0.1c0-0.1,0-0.1,0-0.2v-0.1l0,0c0,0.1,0,0.1,0,0.2
			C38.8,52,38.8,52,39,52.2L39,52.2L39,52.2 M39.2,51.9C39.2,51.9,39.2,51.8,39.2,51.9c0-0.1,0-0.1,0-0.2l-0.1,0l0,0c0,0,0,0,0,0v0
			C39.2,51.8,39.2,51.8,39.2,51.9C39.2,51.8,39.2,51.8,39.2,51.9"/>
		<path class="st40" d="M38.5,55.9L38.5,55.9L38.5,55.9L38.5,55.9c0-0.1,0-0.1,0.1-0.2l0,0c0.1,0.1,0.2,0.2,0.3,0.2L38.5,55.9"/>
		<path class="st41" d="M38.9,52.5L38.9,52.5L38.9,52.5C38.8,52.4,38.8,52.4,38.9,52.5L38.9,52.5c-0.1-0.1-0.1-0.1-0.1-0.2l0.2-0.1
			l0,0L38.9,52c0,0-0.1-0.1-0.1-0.2c0-0.1,0-0.1,0-0.2l0,0c0-0.1,0-0.1,0.1-0.1l0,0c0,0,0.1-0.1,0.1-0.1h0.2c0.1,0,0.1,0,0.2,0.1
			c0,0,0.1,0.1,0.1,0.2c0,0.1,0,0.3-0.1,0.3l0,0L38.9,52.5L38.9,52.5L38.9,52.5 M39.1,52l-0.2,0.2l0,0l0,0l0,0l0,0h0l0.4-0.4l0,0
			c0,0,0.1-0.1,0.1-0.1c0,0,0-0.1,0-0.2c0,0,0-0.1-0.1-0.1c0,0-0.1-0.1-0.1-0.1H39c0,0-0.1,0-0.1,0.1c0,0-0.1,0.1-0.1,0.1
			c0,0.1,0,0.1,0,0.2c0,0,0,0.1,0.1,0.1C38.9,51.9,39,51.9,39.1,52L39.1,52 M39.1,51.8L39.1,51.8C39.1,51.9,39,51.9,39.1,51.8
			C39,51.9,39,51.8,39.1,51.8C39,51.8,39,51.8,39.1,51.8C39,51.7,39,51.7,39,51.6c0,0,0,0,0.1,0h0.1c0.1,0,0.1,0.1,0.1,0.1
			c0,0,0,0.1,0,0.1c0,0,0,0.1,0,0.1c0,0,0,0-0.1,0l0,0 M39.2,51.9L39.2,51.9L39.2,51.9L39.2,51.9C39.2,51.9,39.2,51.9,39.2,51.9
			c0-0.1,0-0.1,0-0.1v0c0,0,0,0,0,0h-0.1h0l0,0l0,0c0,0,0,0,0,0.1l0,0l0,0l0,0"/>
		<path class="st41" d="M38.9,52.4L38.9,52.4L38.9,52.4L38.9,52.4L38.9,52.4l0.2-0.2l0,0c-0.1,0-0.1,0-0.1-0.1c0,0-0.1-0.1-0.1-0.1
			c0-0.1,0-0.1,0-0.2c0-0.1,0-0.1,0.1-0.1c0,0,0.1-0.1,0.1-0.1h0.2c0.1,0,0.1,0,0.1,0.1c0,0,0.1,0.1,0.1,0.1c0,0,0,0.1,0,0.2
			c0,0.1,0,0.1-0.1,0.1l0,0L39,52.5L38.9,52.4 M39.2,51.7L39.2,51.7C39.2,51.7,39.2,51.7,39.2,51.7C39.2,51.7,39.2,51.7,39.2,51.7
			c-0.1,0.1-0.1,0.2-0.1,0.2c0,0,0,0.1,0,0.1c0,0,0,0,0.1,0h0.1c0,0,0.1,0,0.1,0c0,0,0-0.1,0-0.1c0,0,0-0.1,0-0.1
			C39.4,51.7,39.3,51.7,39.2,51.7L39.2,51.7"/>
		<path class="st42" d="M37.9,55.9c-0.7,0-1.4-0.1-2-0.5l0,0c0,0,0-0.1,0-0.1l0,0c0,0,0-0.1,0-0.1c-0.1-0.9-0.1-1.7,0-2.6l0,0h-0.1
			c-0.1,0-0.1-0.1-0.1-0.2v-0.1L35.7,51l0,0l0,0l0,0h0H36l0.5,0.1c-0.1-0.1-0.1-0.2-0.1-0.3h-0.3h0.1h0.1c-0.1-0.3-0.1-0.7,0-1
			l-0.1-0.2l0.1,0.1h0.1c0.1-0.2,0.2-0.4,0.4-0.6l-0.2-0.2l0.1,0.1l0,0l0,0l0,0l0,0l0,0l0,0l0,0h0.1l0.2,0c0,0,0.1,0.1,0.1,0.1l0,0
			l0,0h0.1l0.1-0.1L37,49.2c0.2,0.3,0.3,0.6,0.2,1h0.2h0.2h-0.3v0.1c0,0.2-0.1,0.3-0.2,0.5l0.4-0.1c-0.1,0.2-0.2,0.5-0.3,0.8
			c-0.4,1.6,0,3.3,1.1,4.4L38.1,56L37.9,55.9"/>
		<path class="st43" d="M38.4,55.8c-1.1-1.2-1.6-2.9-1.1-4.4c0.1-0.3,0.2-0.5,0.3-0.8l0.3-0.1l0,0c0,0,0.1,0,0.1,0.1l0.2,1.2
			c0,0.2-0.1,0.4-0.1,0.5l-0.1,0l0,0v0.1l0,0v0.1l0,0c0,0.1,0,0.1,0,0.2c0,0.3,0.1,0.7,0.2,1c0.1,0.4,0.2,0.8,0.2,1.2l0,0l0,0v0.1v0
			c0,0,0,0.1,0,0.2l0,0c0,0.1,0,0.1,0,0.2l0,0c-0.1-0.1-0.2-0.1-0.2-0.2c-0.2-0.2-0.5-0.4-0.7-0.6c0.2,0.4,0.5,0.7,0.8,1l0,0"/>
		<path class="st44" d="M38.3,53.8c-0.1-0.3-0.2-0.7-0.2-1C38.1,53.1,38.2,53.5,38.3,53.8 M38.1,52.3c0-0.2,0.1-0.4,0.1-0.5v0.2
			c0,0.1,0,0.1,0,0.2C38.1,52.3,38.1,52.3,38.1,52.3"/>
		<path class="st45" d="M38.4,55.8c-0.3-0.3-0.5-0.6-0.8-1c0.2,0.2,0.5,0.4,0.7,0.6c0.1,0.1,0.1,0.1,0.2,0.2l0,0
			C38.5,55.7,38.5,55.7,38.4,55.8L38.4,55.8L38.4,55.8"/>
		<path class="st46" d="M36.6,48.8c-0.4-0.3-1-0.3-1.5,0c-0.8,0.5-0.8,2.8,0.8,2.9c0,0,0.7,0.1,0.7-0.3
			C36.4,50.5,36.4,49.6,36.6,48.8L36.6,48.8z"/>
		<path class="st46" d="M36.7,48.7c0.4-0.2,0.9-0.2,1.3-0.1c0.7,0.4,1.1,1.2,0.8,2c-0.4,0.6-1.1,1-1.8,1c0.3-0.5,0.5-1,0.5-1.6
			C37.4,49.5,37.1,49.1,36.7,48.7L36.7,48.7z"/>
		<path class="st47" d="M35.4,49.9c0,1.1,0.5,1.5,0.9,1.7c0.2,0,0.4-0.1,0.3-0.3c-0.3-0.8-0.3-1.7,0-2.6c-0.1-0.1-0.2-0.1-0.3-0.2
			C35.8,48.7,35.4,49.3,35.4,49.9L35.4,49.9z"/>
		<path class="st47" d="M38.1,50.3c0.2-0.7-0.2-1.5-1-1.6c0,0,0,0,0,0c-0.1,0-0.2,0.1-0.3,0.1c0.4,0.3,0.7,0.8,0.8,1.3
			c0,0.6-0.2,1.2-0.5,1.6h0.1C37.7,51.4,38.1,50.9,38.1,50.3L38.1,50.3z"/>
		<path class="st48" d="M37,48.6c-0.2-0.1-0.4-0.1-0.7,0c-0.3,0.1-0.6,0.3-0.7,1.3c-0.1,0.7,0.2,1.4,0.8,1.8
			c0.6,0.2,1.1-0.2,1.2-0.8S37.8,49,37,48.6z"/>
		<path class="st22" d="M34.1,51h5.1c0,0,0.1,0,0.1,0.1l0,0l-0.1,1.4c0,0.2-0.1,0.3-0.3,0.3h-4.5c-0.1,0-0.3-0.1-0.3-0.2L34,51.2
			C34,51.1,34,51.1,34.1,51C34.1,51.1,34.1,51,34.1,51L34.1,51z"/>
		<path class="st49" d="M38.5,56.3c-1.1,0.4-2.4,0.4-3.6,0c-0.1,0-0.1-0.1-0.1-0.2c-0.3-1.2-0.4-2.3-0.5-3.5c3.1,0.6,4.5,0,4.5,0
			s0,1.9-0.2,3.4C38.7,56.1,38.7,56.2,38.5,56.3L38.5,56.3z"/>
		<path class="st50" d="M36.8,55.9c-1.5-0.3-1.2-1.7-0.8-2.4c0.3-0.5,2.2-0.5,3-0.4c0-0.3,0-0.5,0-0.5c-1.5,0.4-3,0.4-4.5,0
			c0,1.2,0.2,2.4,0.5,3.5c0,0.1,0.1,0.1,0.1,0.2c1.1,0.4,2.4,0.4,3.6,0c0.1,0,0.2-0.2,0.2-0.3c0-0.1,0-0.2,0-0.3
			C38.1,55.9,37.4,56,36.8,55.9L36.8,55.9z"/>
		<path class="st51" d="M34.4,51h-0.3c-0.1,0-0.1,0-0.1,0.1c0,0,0,0,0,0l0.1,1.5c0,0.1,0.1,0.3,0.3,0.2h4.5c0.2,0,0.3-0.1,0.3-0.3
			v-0.1C35.1,53.4,34.5,51.8,34.4,51L34.4,51z"/>
		<path class="st52" d="M37,48.8C37,48.8,37,48.8,37,48.8L37,48.8L37,48.8L37,48.8z"/>
		<path class="st53" d="M37,48.8L37,48.8L37,48.8L37,48.8z"/>
		<polygon class="st54" points="37,48.8 37,48.7 37,48.8 		"/>
		<polygon class="st54" points="37,48.8 37,48.8 37,48.8 		"/>
		<polygon class="st54" points="37,48.7 37,48.7 37,48.7 		"/>
		<polygon class="st54" points="37,48.8 37,48.8 37,48.8 		"/>
		<polygon class="st54" points="37,48.7 37,48.7 37,48.7 		"/>
		<polygon class="st54" points="37,48.7 37,48.7 37,48.7 		"/>
		<path class="st54" d="M37,48.7L37,48.7L37,48.7z"/>
		<polygon class="st54" points="37,48.8 37,48.8 37,48.8 		"/>
		<polygon class="st54" points="37,48.7 37,48.7 37,48.7 		"/>
		<path class="st54" d="M37.1,48.6L37.1,48.6z"/>
		<polygon class="st54" points="37,48.8 37,48.8 37,48.8 		"/>
		<path class="st54" d="M37.1,48.6L37.1,48.6z"/>
		<path class="st54" d="M37.1,48.6L37.1,48.6z"/>
		<path class="st54" d="M37.1,48.5L37.1,48.5z"/>
		<path class="st54" d="M37.1,48.5c-0.1,0.1-0.1,0.2-0.1,0.3l0,0l0.2-0.4L37.1,48.5L37.1,48.5z"/>
		<path class="st54" d="M37.1,48.6L37.1,48.6z"/>
		<polygon class="st55" points="37.1,48.6 37.1,48.6 37.1,48.6 		"/>
		<polygon class="st55" points="37,48.8 37,48.8 37,48.8 		"/>
		<polygon class="st55" points="37,48.7 37,48.7 37,48.7 		"/>
		<polygon class="st55" points="37.1,48.6 37.1,48.6 37.1,48.6 		"/>
		<polygon class="st55" points="37,48.7 37,48.7 37,48.7 		"/>
		<polygon class="st55" points="37.1,48.6 37.1,48.6 37.1,48.6 		"/>
		<polygon class="st55" points="37,48.7 37,48.7 37,48.7 		"/>
		<polygon class="st55" points="37,48.7 37,48.7 37,48.7 		"/>
		<polygon class="st55" points="37,48.8 37,48.8 37,48.8 		"/>
		<polygon class="st55" points="37.1,48.6 37.1,48.5 37.1,48.6 		"/>
		<polygon class="st55" points="37,48.8 37,48.8 37,48.8 		"/>
		<polygon class="st55" points="37.1,48.6 37.1,48.6 37.1,48.6 		"/>
		<polygon class="st55" points="37,48.7 37,48.7 37,48.7 		"/>
		<polygon class="st55" points="37,48.8 37,48.8 37,48.8 		"/>
		<path class="st55" d="M37,48.8c0-0.1,0.1-0.2,0.1-0.3l0,0l0,0l0,0l0,0l0,0l0,0l0,0l0,0H37V48.8z"/>
		<path class="st52" d="M38.2,48.9C38.2,48.9,38.2,48.9,38.2,48.9C38.2,49,38.2,49,38.2,48.9L38.2,48.9L38.2,48.9L38.2,48.9z"/>
		<path class="st53" d="M38.2,48.9L38.2,48.9L38.2,48.9L38.2,48.9L38.2,48.9z"/>
		<polygon class="st54" points="38.2,48.9 38.2,48.9 38.2,48.9 		"/>
		<polygon class="st54" points="38.2,48.9 38.2,48.9 38.2,48.9 		"/>
		<polygon class="st54" points="38.2,48.9 38.2,48.8 38.2,48.9 		"/>
		<polygon class="st54" points="38.2,48.9 38.2,48.9 38.2,48.9 		"/>
		<polygon class="st54" points="38.2,48.8 38.2,48.8 38.2,48.8 		"/>
		<polygon class="st54" points="38.2,48.8 38.2,48.8 38.2,48.8 		"/>
		<path class="st54" d="M38.3,48.8L38.3,48.8L38.3,48.8z"/>
		<polygon class="st54" points="38.2,48.9 38.2,48.9 38.2,48.9 		"/>
		<polygon class="st54" points="38.2,48.8 38.3,48.8 38.2,48.8 		"/>
		<path class="st54" d="M38.3,48.8L38.3,48.8z"/>
		<polygon class="st54" points="38.2,48.9 38.2,48.9 38.2,48.9 		"/>
		<path class="st54" d="M38.3,48.8L38.3,48.8z"/>
		<path class="st54" d="M38.3,48.8L38.3,48.8z"/>
		<path class="st54" d="M38.4,48.7L38.4,48.7z"/>
		<path class="st54" d="M38.4,48.7c-0.1,0.1-0.2,0.1-0.2,0.2l0,0l0.4-0.3L38.4,48.7L38.4,48.7z"/>
		<path class="st54" d="M38.3,48.8L38.3,48.8z"/>
		<polygon class="st55" points="38.3,48.8 38.3,48.8 38.3,48.8 		"/>
		<polygon class="st55" points="38.2,48.9 38.2,48.9 38.2,48.9 		"/>
		<polygon class="st55" points="38.2,48.8 38.2,48.8 38.2,48.8 		"/>
		<polygon class="st55" points="38.3,48.8 38.3,48.8 38.3,48.8 		"/>
		<polygon class="st55" points="38.3,48.8 38.3,48.8 38.3,48.8 		"/>
		<polygon class="st55" points="38.3,48.8 38.3,48.8 38.3,48.8 		"/>
		<polygon class="st55" points="38.2,48.8 38.2,48.8 38.2,48.8 		"/>
		<polygon class="st55" points="38.2,48.8 38.2,48.8 38.2,48.8 		"/>
		<polygon class="st55" points="38.2,48.9 38.2,48.9 38.2,48.9 		"/>
		<polygon class="st55" points="38.4,48.7 38.4,48.7 38.4,48.7 		"/>
		<polygon class="st55" points="38.2,48.9 38.2,48.9 38.2,48.9 		"/>
		<polygon class="st55" points="38.3,48.8 38.3,48.8 38.3,48.8 		"/>
		<polygon class="st55" points="38.2,48.9 38.2,48.9 38.2,48.9 		"/>
		<polygon class="st55" points="38.2,48.9 38.2,48.9 38.2,48.9 		"/>
		<path class="st55" d="M38.2,48.9c0.1-0.1,0.1-0.1,0.2-0.2h-0.1l0,0h-0.1l0,0L38.2,48.9z"/>
		<path class="st52" d="M38.7,49.5L38.7,49.5L38.7,49.5L38.7,49.5L38.7,49.5L38.7,49.5z"/>
		<path class="st53" d="M38.7,49.5L38.7,49.5L38.7,49.5L38.7,49.5L38.7,49.5z"/>
		<polygon class="st54" points="38.7,49.5 38.7,49.5 38.7,49.5 		"/>
		<polygon class="st54" points="38.7,49.5 38.7,49.5 38.7,49.5 		"/>
		<polygon class="st54" points="38.7,49.5 38.7,49.5 38.7,49.5 		"/>
		<polygon class="st54" points="38.7,49.5 38.7,49.5 38.7,49.5 		"/>
		<polygon class="st54" points="38.8,49.5 38.8,49.5 38.8,49.5 		"/>
		<polygon class="st54" points="38.7,49.5 38.8,49.5 38.7,49.5 		"/>
		<path class="st54" d="M38.8,49.5L38.8,49.5L38.8,49.5z"/>
		<polygon class="st54" points="38.7,49.5 38.7,49.5 38.7,49.5 		"/>
		<path class="st54" d="M38.8,49.5L38.8,49.5z"/>
		<path class="st54" d="M38.9,49.5L38.9,49.5z"/>
		<polygon class="st54" points="38.7,49.5 38.7,49.5 38.7,49.5 38.7,49.5 		"/>
		<path class="st54" d="M38.9,49.4L38.9,49.4z"/>
		<path class="st54" d="M38.9,49.5L38.9,49.5z"/>
		<path class="st54" d="M38.9,49.4L38.9,49.4z"/>
		<path class="st54" d="M38.9,49.4l-0.3,0.1l0,0l0.4-0.2L38.9,49.4L38.9,49.4z"/>
		<path class="st54" d="M38.8,49.5L38.8,49.5z"/>
		<polygon class="st55" points="38.7,49.5 38.7,49.5 38.7,49.5 		"/>
		<polygon class="st55" points="38.8,49.5 38.8,49.5 38.8,49.5 		"/>
		<polygon class="st55" points="38.9,49.5 38.9,49.5 38.9,49.5 		"/>
		<polygon class="st55" points="38.8,49.5 38.8,49.5 38.8,49.5 		"/>
		<polygon class="st55" points="38.9,49.5 38.9,49.5 38.9,49.5 		"/>
		<polygon class="st55" points="38.7,49.5 38.7,49.5 38.7,49.5 		"/>
		<polygon class="st55" points="38.8,49.5 38.8,49.5 38.8,49.5 		"/>
		<polygon class="st55" points="38.7,49.5 38.7,49.5 38.7,49.5 		"/>
		<polygon class="st55" points="38.9,49.4 38.9,49.4 38.9,49.4 		"/>
		<polygon class="st55" points="38.7,49.5 38.7,49.5 38.7,49.5 		"/>
		<polygon class="st55" points="38.9,49.5 38.9,49.4 38.9,49.5 		"/>
		<polygon class="st55" points="38.7,49.5 38.7,49.5 38.7,49.5 		"/>
		<polygon class="st55" points="38.7,49.5 38.7,49.5 38.7,49.5 		"/>
		<path class="st55" d="M38.7,49.5l0.3-0.1h-0.1l0,0h-0.2l0,0L38.7,49.5z"/>
		<path class="st52" d="M38.3,50L38.3,50L38.3,50L38.3,50L38.3,50L38.3,50z"/>
		<path class="st53" d="M38.3,50L38.3,50L38.3,50L38.3,50L38.3,50z"/>
		<polygon class="st54" points="38.3,49.9 38.3,49.9 38.3,49.9 		"/>
		<polygon class="st54" points="38.3,50 38.3,50 38.3,50 		"/>
		<polygon class="st54" points="38.3,49.9 38.4,49.9 38.3,49.9 		"/>
		<polygon class="st54" points="38.3,49.9 38.3,49.9 38.3,49.9 		"/>
		<polygon class="st54" points="38.4,49.9 38.4,49.9 38.4,49.9 		"/>
		<polygon class="st54" points="38.4,49.9 38.4,49.9 38.4,49.9 		"/>
		<path class="st54" d="M38.4,49.9L38.4,49.9L38.4,49.9z"/>
		<polygon class="st54" points="38.3,50 38.3,50 38.3,50 		"/>
		<polygon class="st54" points="38.4,49.9 38.4,49.9 38.4,49.9 		"/>
		<path class="st54" d="M38.5,49.8L38.5,49.8z"/>
		<polygon class="st54" points="38.3,50 38.3,50 38.3,50 		"/>
		<path class="st54" d="M38.5,49.8L38.5,49.8z"/>
		<polygon class="st54" points="38.5,49.8 38.5,49.8 38.5,49.8 		"/>
		<path class="st54" d="M38.5,49.8L38.5,49.8z"/>
		<path class="st54" d="M38.5,49.8c-0.1,0.1-0.2,0.1-0.2,0.2l0,0l0.3-0.3L38.5,49.8L38.5,49.8z"/>
		<path class="st54" d="M38.4,49.8L38.4,49.8z"/>
		<polygon class="st55" points="38.4,49.8 38.4,49.8 38.4,49.8 		"/>
		<polygon class="st55" points="38.3,50 38.3,50 38.3,50 		"/>
		<polygon class="st55" points="38.4,49.9 38.4,49.9 38.4,49.9 		"/>
		<polygon class="st55" points="38.5,49.8 38.5,49.8 38.5,49.8 		"/>
		<polygon class="st55" points="38.4,49.9 38.4,49.9 38.4,49.9 		"/>
		<polygon class="st55" points="38.5,49.8 38.5,49.8 38.5,49.8 		"/>
		<polygon class="st55" points="38.4,49.9 38.4,49.9 38.4,49.9 		"/>
		<polygon class="st55" points="38.4,49.9 38.4,49.9 38.4,49.9 		"/>
		<polygon class="st55" points="38.3,50 38.3,49.9 38.3,50 		"/>
		<polygon class="st55" points="38.5,49.8 38.5,49.8 38.5,49.8 		"/>
		<polygon class="st55" points="38.3,50 38.3,50 38.3,50 		"/>
		<polygon class="st55" points="38.5,49.8 38.5,49.8 38.5,49.8 		"/>
		<polygon class="st55" points="38.3,49.9 38.3,49.9 38.3,49.9 		"/>
		<polygon class="st55" points="38.3,49.9 38.3,49.9 38.3,49.9 		"/>
		<path class="st55" d="M38.3,50c0.1-0.1,0.1-0.1,0.2-0.2h-0.1l0,0h-0.1V50z"/>
		<path class="st52" d="M35.2,50.2C35.2,50.2,35.2,50.2,35.2,50.2C35.2,50.3,35.2,50.3,35.2,50.2C35.2,50.3,35.2,50.3,35.2,50.2
			L35.2,50.2L35.2,50.2z"/>
		<path class="st53" d="M35.2,50.2L35.2,50.2L35.2,50.2L35.2,50.2L35.2,50.2z"/>
		<polygon class="st54" points="35.2,50.2 35.2,50.2 35.2,50.2 		"/>
		<polygon class="st54" points="35.2,50.2 35.2,50.2 35.2,50.2 		"/>
		<polygon class="st54" points="35.2,50.2 35.2,50.2 35.2,50.2 		"/>
		<polygon class="st54" points="35.2,50.2 35.2,50.2 35.2,50.2 		"/>
		<polygon class="st54" points="35.1,50.1 35.1,50.1 35.1,50.1 		"/>
		<polygon class="st54" points="35.1,50.2 35.1,50.2 35.1,50.2 		"/>
		<path class="st54" d="M35.1,50.1L35.1,50.1L35.1,50.1z"/>
		<polygon class="st54" points="35.2,50.2 35.2,50.2 35.2,50.2 		"/>
		<polygon class="st54" points="35.1,50.1 35.1,50.1 35.1,50.1 		"/>
		<path class="st54" d="M35,50.1L35,50.1z"/>
		<polygon class="st54" points="35.2,50.2 35.2,50.2 35.2,50.2 35.2,50.2 		"/>
		<path class="st54" d="M35,50L35,50z"/>
		<polygon class="st54" points="35,50.1 35,50 35,50.1 		"/>
		<path class="st54" d="M35,50L35,50z"/>
		<path class="st54" d="M35,50c0.1,0.1,0.2,0.1,0.2,0.2l0,0l-0.3-0.3L35,50z"/>
		<path class="st54" d="M35.1,50.1L35.1,50.1z"/>
		<polygon class="st55" points="35.1,50.1 35.1,50.1 35.1,50.1 		"/>
		<polygon class="st55" points="35.2,50.2 35.2,50.2 35.2,50.2 		"/>
		<polygon class="st55" points="35.1,50.2 35.1,50.1 35.1,50.2 		"/>
		<polygon class="st55" points="35,50.1 35,50.1 35,50.1 		"/>
		<polygon class="st55" points="35.1,50.1 35.1,50.1 35.1,50.1 		"/>
		<polygon class="st55" points="35,50.1 35,50.1 35,50.1 		"/>
		<polygon class="st55" points="35.2,50.2 35.1,50.2 35.2,50.2 		"/>
		<polygon class="st55" points="35.1,50.1 35.1,50.1 35.1,50.1 		"/>
		<polygon class="st55" points="35.2,50.2 35.2,50.2 35.2,50.2 		"/>
		<polygon class="st55" points="35,50 35,50 35,50 		"/>
		<polygon class="st55" points="35.2,50.2 35.2,50.2 35.2,50.2 		"/>
		<polygon class="st55" points="35,50 35,50 35,50 		"/>
		<polygon class="st55" points="35.2,50.2 35.2,50.2 35.2,50.2 		"/>
		<polygon class="st55" points="35.2,50.2 35.2,50.2 35.2,50.2 		"/>
		<path class="st55" d="M35.2,50.2c-0.1-0.1-0.1-0.2-0.2-0.2h0.1l0,0h0.1L35.2,50.2z"/>
		<path class="st52" d="M35.3,49.4C35.3,49.4,35.3,49.4,35.3,49.4L35.3,49.4L35.3,49.4L35.3,49.4L35.3,49.4z"/>
		<path class="st53" d="M35.3,49.4L35.3,49.4L35.3,49.4L35.3,49.4z"/>
		<polygon class="st54" points="35.3,49.3 35.3,49.3 35.3,49.3 		"/>
		<polygon class="st54" points="35.3,49.3 35.3,49.3 35.3,49.3 		"/>
		<polygon class="st54" points="35.3,49.3 35.2,49.3 35.3,49.3 		"/>
		<polygon class="st54" points="35.3,49.3 35.3,49.3 35.3,49.3 		"/>
		<polygon class="st54" points="35.2,49.3 35.2,49.3 35.2,49.3 		"/>
		<polygon class="st54" points="35.2,49.3 35.2,49.3 35.2,49.3 		"/>
		<path class="st54" d="M35.2,49.2L35.2,49.2L35.2,49.2z"/>
		<polygon class="st54" points="35.3,49.4 35.3,49.4 35.3,49.4 		"/>
		<polygon class="st54" points="35.2,49.3 35.2,49.2 35.2,49.3 		"/>
		<path class="st54" d="M35.2,49.2L35.2,49.2z"/>
		<polygon class="st54" points="35.3,49.4 35.3,49.4 35.3,49.4 		"/>
		<path class="st54" d="M35.2,49.2L35.2,49.2z"/>
		<polygon class="st54" points="35.2,49.2 35.2,49.2 35.2,49.2 		"/>
		<path class="st54" d="M35.1,49.1L35.1,49.1z"/>
		<path class="st54" d="M35.1,49.1c0.1,0.1,0.1,0.2,0.2,0.3l0,0L35,49L35.1,49.1L35.1,49.1z"/>
		<path class="st54" d="M35.2,49.2L35.2,49.2z"/>
		<polygon class="st55" points="35.2,49.2 35.2,49.2 35.2,49.2 		"/>
		<polygon class="st55" points="35.3,49.4 35.3,49.4 35.3,49.4 		"/>
		<polygon class="st55" points="35.2,49.3 35.2,49.3 35.2,49.3 		"/>
		<polygon class="st55" points="35.2,49.2 35.2,49.2 35.2,49.2 		"/>
		<polygon class="st55" points="35.2,49.2 35.2,49.2 35.2,49.2 		"/>
		<polygon class="st55" points="35.2,49.2 35.2,49.2 35.2,49.2 		"/>
		<polygon class="st55" points="35.2,49.3 35.2,49.3 35.2,49.3 		"/>
		<polygon class="st55" points="35.2,49.3 35.2,49.3 35.2,49.3 		"/>
		<polygon class="st55" points="35.3,49.3 35.3,49.3 35.3,49.3 		"/>
		<polygon class="st55" points="35.1,49.2 35.1,49.1 35.1,49.2 		"/>
		<polygon class="st55" points="35.3,49.4 35.3,49.3 35.3,49.4 		"/>
		<polygon class="st55" points="35.2,49.2 35.2,49.2 35.2,49.2 		"/>
		<polygon class="st55" points="35.3,49.3 35.3,49.3 35.3,49.3 		"/>
		<polygon class="st55" points="35.3,49.3 35.3,49.3 35.3,49.3 		"/>
		<path class="st55" d="M35.3,49.4c0-0.1-0.1-0.2-0.2-0.3l0,0l0,0l0,0l0,0h0.1L35.3,49.4z"/>
		<path class="st52" d="M38.7,50.5C38.7,50.5,38.7,50.6,38.7,50.5S38.7,50.5,38.7,50.5L38.7,50.5L38.7,50.5z"/>
		<path class="st53" d="M38.7,50.5L38.7,50.5L38.7,50.5L38.7,50.5L38.7,50.5z"/>
		<polygon class="st54" points="38.8,50.5 38.8,50.5 38.8,50.5 		"/>
		<polygon class="st54" points="38.7,50.5 38.7,50.5 38.7,50.5 		"/>
		<polygon class="st54" points="38.8,50.5 38.8,50.5 38.8,50.5 		"/>
		<polygon class="st54" points="38.7,50.5 38.7,50.5 38.7,50.5 		"/>
		<polygon class="st54" points="38.8,50.5 38.8,50.5 38.8,50.5 		"/>
		<polygon class="st54" points="38.8,50.5 38.8,50.5 38.8,50.5 		"/>
		<path class="st54" d="M38.8,50.5L38.8,50.5z"/>
		<polygon class="st54" points="38.7,50.5 38.7,50.5 38.7,50.5 		"/>
		<path class="st54" d="M38.8,50.5L38.8,50.5z"/>
		<path class="st54" d="M38.9,50.6L38.9,50.6z"/>
		<polygon class="st54" points="38.7,50.5 38.7,50.5 38.7,50.5 		"/>
		<path class="st54" d="M38.9,50.6L38.9,50.6z"/>
		<path class="st54" d="M38.9,50.6L38.9,50.6z"/>
		<path class="st54" d="M39,50.6L39,50.6z"/>
		<path class="st54" d="M39,50.6l-0.3-0.1l0,0l0.4,0.1L39,50.6z"/>
		<path class="st54" d="M38.9,50.5L38.9,50.5z"/>
		<polygon class="st55" points="38.9,50.5 38.9,50.5 38.9,50.5 		"/>
		<polygon class="st55" points="38.7,50.5 38.7,50.5 38.7,50.5 		"/>
		<polygon class="st55" points="38.8,50.5 38.8,50.5 38.8,50.5 		"/>
		<polygon class="st55" points="38.9,50.6 38.9,50.6 38.9,50.6 		"/>
		<polygon class="st55" points="38.8,50.5 38.8,50.5 38.8,50.5 		"/>
		<polygon class="st55" points="38.9,50.6 38.9,50.6 38.9,50.6 		"/>
		<polygon class="st55" points="38.8,50.5 38.8,50.5 38.8,50.5 		"/>
		<polygon class="st55" points="38.8,50.5 38.8,50.5 38.8,50.5 		"/>
		<polygon class="st55" points="38.7,50.5 38.7,50.5 38.7,50.5 		"/>
		<polygon class="st55" points="39,50.6 39,50.6 39,50.6 		"/>
		<polygon class="st55" points="38.7,50.5 38.7,50.5 38.7,50.5 		"/>
		<polygon class="st55" points="38.9,50.6 38.9,50.6 38.9,50.6 		"/>
		<polygon class="st55" points="38.8,50.5 38.8,50.5 38.8,50.5 		"/>
		<polygon class="st55" points="38.7,50.5 38.8,50.5 38.7,50.5 		"/>
		<path class="st55" d="M38.7,50.5l0.3,0.1L38.7,50.5L38.7,50.5z"/>
		<path class="st52" d="M34.9,50.6L34.9,50.6C34.9,50.6,34.9,50.6,34.9,50.6L34.9,50.6C34.9,50.6,34.9,50.6,34.9,50.6z"/>
		<path class="st53" d="M34.9,50.6L34.9,50.6L34.9,50.6L34.9,50.6L34.9,50.6z"/>
		<polygon class="st54" points="34.8,50.6 34.8,50.6 34.8,50.6 		"/>
		<polygon class="st54" points="34.9,50.6 34.9,50.6 34.9,50.6 		"/>
		<polygon class="st54" points="34.8,50.6 34.8,50.6 34.8,50.6 		"/>
		<polygon class="st54" points="34.8,50.6 34.8,50.6 34.8,50.6 		"/>
		<polygon class="st54" points="34.8,50.7 34.8,50.7 34.8,50.7 		"/>
		<polygon class="st54" points="34.8,50.6 34.8,50.7 34.8,50.6 		"/>
		<path class="st54" d="M34.7,50.7L34.7,50.7z"/>
		<polygon class="st54" points="34.9,50.6 34.9,50.6 34.9,50.6 		"/>
		<path class="st54" d="M34.8,50.7L34.8,50.7z"/>
		<path class="st54" d="M34.7,50.7L34.7,50.7z"/>
		<polygon class="st54" points="34.9,50.6 34.9,50.6 34.9,50.6 		"/>
		<path class="st54" d="M34.6,50.7L34.6,50.7z"/>
		<path class="st54" d="M34.7,50.7L34.7,50.7z"/>
		<path class="st54" d="M34.6,50.7L34.6,50.7z"/>
		<path class="st54" d="M34.6,50.7c0.1,0,0.2-0.1,0.3-0.1l0,0l-0.4,0.1L34.6,50.7z"/>
		<path class="st54" d="M34.7,50.7L34.7,50.7z"/>
		<polygon class="st55" points="34.9,50.6 34.9,50.6 34.9,50.6 		"/>
		<polygon class="st55" points="34.8,50.7 34.8,50.7 34.8,50.7 		"/>
		<polygon class="st55" points="34.7,50.7 34.7,50.7 34.7,50.7 		"/>
		<polygon class="st55" points="34.8,50.7 34.7,50.7 34.8,50.7 		"/>
		<polygon class="st55" points="34.7,50.7 34.7,50.7 34.7,50.7 		"/>
		<polygon class="st55" points="34.8,50.6 34.8,50.6 34.8,50.6 		"/>
		<polygon class="st55" points="34.8,50.7 34.8,50.7 34.8,50.7 		"/>
		<polygon class="st55" points="34.9,50.6 34.8,50.6 34.9,50.6 		"/>
		<polygon class="st55" points="34.6,50.7 34.6,50.7 34.6,50.7 		"/>
		<polygon class="st55" points="34.9,50.6 34.9,50.6 34.9,50.6 		"/>
		<polygon class="st55" points="34.7,50.7 34.6,50.7 34.7,50.7 		"/>
		<polygon class="st55" points="34.8,50.6 34.8,50.6 34.8,50.6 		"/>
		<polygon class="st55" points="34.8,50.6 34.8,50.6 34.8,50.6 		"/>
		<path class="st55" d="M34.9,50.6c-0.1,0-0.2,0-0.3,0.1L34.9,50.6L34.9,50.6L34.9,50.6z"/>
		<path class="st52" d="M37.4,49.5L37.4,49.5L37.4,49.5C37.4,49.5,37.4,49.5,37.4,49.5C37.4,49.4,37.4,49.4,37.4,49.5L37.4,49.5z"/>
		<path class="st53" d="M37.4,49.5L37.4,49.5L37.4,49.5L37.4,49.5z"/>
		<polygon class="st54" points="37.4,49.4 37.4,49.4 37.4,49.4 		"/>
		<polygon class="st54" points="37.4,49.5 37.4,49.4 37.4,49.5 		"/>
		<polygon class="st54" points="37.4,49.4 37.4,49.4 37.4,49.4 		"/>
		<polygon class="st54" points="37.4,49.4 37.4,49.4 37.4,49.4 		"/>
		<polygon class="st54" points="37.4,49.4 37.4,49.4 37.4,49.4 		"/>
		<polygon class="st54" points="37.4,49.4 37.4,49.4 37.4,49.4 		"/>
		<path class="st54" d="M37.5,49.4L37.5,49.4L37.5,49.4z"/>
		<polygon class="st54" points="37.3,49.5 37.4,49.5 37.3,49.5 		"/>
		<polygon class="st54" points="37.4,49.4 37.5,49.4 37.4,49.4 		"/>
		<polygon class="st54" points="37.5,49.3 37.5,49.3 37.5,49.3 		"/>
		<polygon class="st54" points="37.3,49.5 37.3,49.5 37.3,49.5 		"/>
		<polygon class="st54" points="37.5,49.3 37.5,49.3 37.5,49.3 		"/>
		<polygon class="st54" points="37.5,49.3 37.5,49.3 37.5,49.3 		"/>
		<path class="st54" d="M37.5,49.3L37.5,49.3z"/>
		<path class="st54" d="M37.6,49.3c-0.1,0.1-0.2,0.1-0.2,0.2l0,0l0.3-0.3L37.6,49.3L37.6,49.3z"/>
		<path class="st54" d="M37.5,49.3L37.5,49.3z"/>
		<polygon class="st55" points="37.5,49.3 37.5,49.3 37.5,49.3 		"/>
		<polygon class="st55" points="37.3,49.5 37.3,49.5 37.3,49.5 		"/>
		<polygon class="st55" points="37.4,49.4 37.4,49.4 37.4,49.4 		"/>
		<polygon class="st55" points="37.5,49.3 37.5,49.3 37.5,49.3 		"/>
		<polygon class="st55" points="37.5,49.4 37.5,49.4 37.5,49.4 		"/>
		<polygon class="st55" points="37.5,49.3 37.5,49.3 37.5,49.3 		"/>
		<polygon class="st55" points="37.4,49.4 37.4,49.4 37.4,49.4 		"/>
		<polygon class="st55" points="37.4,49.4 37.4,49.4 37.4,49.4 		"/>
		<polygon class="st55" points="37.4,49.4 37.4,49.4 37.4,49.4 		"/>
		<polygon class="st55" points="37.5,49.3 37.5,49.3 37.5,49.3 		"/>
		<polygon class="st55" points="37.4,49.5 37.4,49.5 37.4,49.5 		"/>
		<polygon class="st55" points="37.5,49.3 37.5,49.3 37.5,49.3 		"/>
		<polygon class="st55" points="37.4,49.4 37.4,49.4 37.4,49.4 		"/>
		<polygon class="st55" points="37.4,49.4 37.4,49.4 37.4,49.4 		"/>
		<path class="st55" d="M37.3,49.5c0.1-0.1,0.1-0.2,0.2-0.2l0,0l0,0l0,0l0,0h-0.1l0,0L37.3,49.5z"/>
		<path class="st52" d="M34.8,49.6L34.8,49.6L34.8,49.6L34.8,49.6C34.8,49.6,34.8,49.6,34.8,49.6L34.8,49.6z"/>
		<path class="st53" d="M34.8,49.6L34.8,49.6L34.8,49.6L34.8,49.6L34.8,49.6z"/>
		<polygon class="st54" points="34.8,49.6 34.8,49.6 34.8,49.6 		"/>
		<polygon class="st54" points="34.8,49.6 34.8,49.6 34.8,49.6 		"/>
		<polygon class="st54" points="34.8,49.6 34.8,49.6 34.8,49.6 		"/>
		<polygon class="st54" points="34.8,49.6 34.8,49.6 34.8,49.6 		"/>
		<polygon class="st54" points="34.7,49.6 34.7,49.5 34.7,49.6 		"/>
		<polygon class="st54" points="34.7,49.6 34.7,49.6 34.7,49.6 		"/>
		<path class="st54" d="M34.7,49.5L34.7,49.5L34.7,49.5z"/>
		<polygon class="st54" points="34.8,49.6 34.8,49.6 34.8,49.6 		"/>
		<polygon class="st54" points="34.7,49.5 34.7,49.5 34.7,49.5 		"/>
		<path class="st54" d="M34.7,49.5L34.7,49.5z"/>
		<polygon class="st54" points="34.8,49.6 34.8,49.6 34.8,49.6 		"/>
		<path class="st54" d="M34.6,49.5L34.6,49.5z"/>
		<polygon class="st54" points="34.6,49.5 34.6,49.5 34.6,49.5 		"/>
		<path class="st54" d="M34.6,49.5L34.6,49.5z"/>
		<path class="st54" d="M34.6,49.4c0.1,0.1,0.2,0.1,0.2,0.2l0,0l-0.3-0.3L34.6,49.4L34.6,49.4z"/>
		<path class="st54" d="M34.7,49.5L34.7,49.5z"/>
		<polygon class="st55" points="34.7,49.5 34.7,49.5 34.7,49.5 		"/>
		<polygon class="st55" points="34.8,49.6 34.8,49.6 34.8,49.6 		"/>
		<polygon class="st55" points="34.7,49.6 34.7,49.6 34.7,49.6 		"/>
		<polygon class="st55" points="34.6,49.5 34.6,49.5 34.6,49.5 		"/>
		<polygon class="st55" points="34.7,49.5 34.7,49.5 34.7,49.5 		"/>
		<polygon class="st55" points="34.7,49.5 34.7,49.5 34.7,49.5 		"/>
		<polygon class="st55" points="34.8,49.6 34.7,49.6 34.8,49.6 		"/>
		<polygon class="st55" points="34.7,49.5 34.7,49.5 34.7,49.5 		"/>
		<polygon class="st55" points="34.8,49.6 34.8,49.6 34.8,49.6 		"/>
		<polygon class="st55" points="34.6,49.5 34.6,49.5 34.6,49.5 		"/>
		<polygon class="st55" points="34.8,49.6 34.8,49.6 34.8,49.6 		"/>
		<polygon class="st55" points="34.6,49.5 34.6,49.5 34.6,49.5 		"/>
		<polygon class="st55" points="34.8,49.6 34.8,49.6 34.8,49.6 		"/>
		<polygon class="st55" points="34.8,49.6 34.8,49.6 34.8,49.6 		"/>
		<path class="st55" d="M34.8,49.7c-0.1-0.1-0.1-0.1-0.2-0.2h0.1l0,0h0.1L34.8,49.7z"/>
		<path class="st52" d="M37,50.2L37,50.2C37,50.2,37,50.2,37,50.2C36.9,50.2,37,50.2,37,50.2L37,50.2L37,50.2z"/>
		<path class="st53" d="M37,50.2L37,50.2L37,50.2L37,50.2z"/>
		<polygon class="st54" points="37.1,50.2 37.1,50.2 37.1,50.2 		"/>
		<polygon class="st54" points="37,50.2 37,50.2 37,50.2 		"/>
		<polygon class="st54" points="37.1,50.2 37.1,50.2 37.1,50.2 		"/>
		<polygon class="st54" points="37,50.2 37.1,50.2 37,50.2 		"/>
		<polygon class="st54" points="37.1,50.2 37.1,50.1 37.1,50.2 		"/>
		<polygon class="st54" points="37.1,50.2 37.1,50.2 37.1,50.2 		"/>
		<path class="st54" d="M37.1,50.1L37.1,50.1L37.1,50.1z"/>
		<polygon class="st54" points="37,50.2 37,50.2 37,50.2 		"/>
		<polygon class="st54" points="37.1,50.1 37.1,50.1 37.1,50.1 		"/>
		<polygon class="st54" points="37.2,50.1 37.2,50.1 37.2,50.1 		"/>
		<polygon class="st54" points="37,50.2 37,50.2 37,50.2 		"/>
		<polygon class="st54" points="37.2,50 37.2,50 37.2,50 		"/>
		<polygon class="st54" points="37.2,50.1 37.2,50 37.2,50.1 		"/>
		<path class="st54" d="M37.2,50L37.2,50z"/>
		<path class="st54" d="M37.2,50c-0.1,0.1-0.2,0.1-0.2,0.2l0,0l0.3-0.3L37.2,50L37.2,50z"/>
		<path class="st54" d="M37.2,50.1L37.2,50.1z"/>
		<polygon class="st55" points="37.2,50.1 37.2,50.1 37.2,50.1 		"/>
		<polygon class="st55" points="37,50.2 37,50.2 37,50.2 		"/>
		<polygon class="st55" points="37.1,50.2 37.1,50.2 37.1,50.2 		"/>
		<polygon class="st55" points="37.2,50.1 37.2,50.1 37.2,50.1 		"/>
		<polygon class="st55" points="37.1,50.1 37.1,50.1 37.1,50.1 		"/>
		<polygon class="st55" points="37.2,50.1 37.2,50.1 37.2,50.1 		"/>
		<polygon class="st55" points="37.1,50.2 37.1,50.2 37.1,50.2 		"/>
		<polygon class="st55" points="37.1,50.1 37.1,50.1 37.1,50.1 		"/>
		<polygon class="st55" points="37,50.2 37,50.2 37,50.2 		"/>
		<polygon class="st55" points="37.2,50 37.2,50 37.2,50 		"/>
		<polygon class="st55" points="37,50.2 37,50.2 37,50.2 		"/>
		<polygon class="st55" points="37.2,50 37.2,50 37.2,50 		"/>
		<polygon class="st55" points="37.1,50.2 37.1,50.2 37.1,50.2 		"/>
		<polygon class="st55" points="37.1,50.2 37.1,50.2 37.1,50.2 		"/>
		<path class="st55" d="M37,50.2c0.1-0.1,0.1-0.2,0.2-0.2h-0.1l0,0H37l0,0V50.2z"/>
		<path class="st52" d="M37.3,50.7C37.4,50.7,37.4,50.7,37.3,50.7L37.3,50.7L37.3,50.7L37.3,50.7L37.3,50.7z"/>
		<path class="st53" d="M37.3,50.7L37.3,50.7L37.3,50.7L37.3,50.7L37.3,50.7z"/>
		<polygon class="st54" points="37.4,50.6 37.4,50.6 37.4,50.6 		"/>
		<polygon class="st54" points="37.4,50.7 37.4,50.7 37.4,50.7 		"/>
		<polygon class="st54" points="37.4,50.6 37.4,50.6 37.4,50.6 		"/>
		<polygon class="st54" points="37.4,50.6 37.4,50.6 37.4,50.6 		"/>
		<polygon class="st54" points="37.4,50.6 37.5,50.6 37.4,50.6 		"/>
		<polygon class="st54" points="37.4,50.6 37.4,50.6 37.4,50.6 		"/>
		<path class="st54" d="M37.5,50.6L37.5,50.6z"/>
		<polygon class="st54" points="37.3,50.7 37.3,50.7 37.3,50.7 		"/>
		<path class="st54" d="M37.5,50.6L37.5,50.6z"/>
		<path class="st54" d="M37.5,50.6L37.5,50.6z"/>
		<polygon class="st54" points="37.3,50.7 37.3,50.7 37.3,50.7 		"/>
		<path class="st54" d="M37.6,50.6L37.6,50.6z"/>
		<path class="st54" d="M37.6,50.6L37.6,50.6z"/>
		<path class="st54" d="M37.6,50.6L37.6,50.6z"/>
		<path class="st54" d="M37.6,50.6c-0.1,0-0.2,0-0.3,0.1l0,0l0.5-0.1L37.6,50.6L37.6,50.6z"/>
		<path class="st54" d="M37.5,50.6L37.5,50.6z"/>
		<polygon class="st55" points="37.5,50.6 37.5,50.6 37.5,50.6 		"/>
		<polygon class="st55" points="37.3,50.7 37.3,50.7 37.3,50.7 		"/>
		<polygon class="st55" points="37.4,50.6 37.4,50.6 37.4,50.6 		"/>
		<polygon class="st55" points="37.6,50.6 37.6,50.6 37.6,50.6 		"/>
		<polygon class="st55" points="37.5,50.6 37.5,50.6 37.5,50.6 		"/>
		<polygon class="st55" points="37.5,50.6 37.5,50.6 37.5,50.6 		"/>
		<polygon class="st55" points="37.4,50.6 37.4,50.6 37.4,50.6 		"/>
		<polygon class="st55" points="37.5,50.6 37.5,50.6 37.5,50.6 		"/>
		<polygon class="st55" points="37.4,50.7 37.4,50.6 37.4,50.7 		"/>
		<polygon class="st55" points="37.6,50.6 37.6,50.6 37.6,50.6 		"/>
		<polygon class="st55" points="37.3,50.7 37.4,50.7 37.3,50.7 		"/>
		<polygon class="st55" points="37.4,50.6 37.4,50.6 37.4,50.6 		"/>
		<polygon class="st55" points="37.4,50.6 37.4,50.6 37.4,50.6 		"/>
		<path class="st55" d="M37.3,50.7c0.1,0,0.2-0.1,0.3-0.1L37.3,50.7L37.3,50.7L37.3,50.7z"/>
		<path class="st52" d="M36.7,49.5L36.7,49.5C36.7,49.5,36.6,49.5,36.7,49.5L36.7,49.5L36.7,49.5z"/>
		<path class="st53" d="M36.7,49.5L36.7,49.5L36.7,49.5z"/>
		<polygon class="st54" points="36.7,49.5 36.7,49.5 36.7,49.5 		"/>
		<polygon class="st54" points="36.7,49.5 36.7,49.5 36.7,49.5 		"/>
		<polygon class="st54" points="36.7,49.5 36.7,49.5 36.7,49.5 		"/>
		<polygon class="st54" points="36.7,49.5 36.7,49.5 36.7,49.5 		"/>
		<polygon class="st54" points="36.7,49.4 36.7,49.4 36.7,49.4 		"/>
		<polygon class="st54" points="36.7,49.5 36.7,49.4 36.7,49.5 		"/>
		<path class="st54" d="M36.7,49.4L36.7,49.4z"/>
		<polygon class="st54" points="36.7,49.5 36.7,49.5 36.7,49.5 		"/>
		<path class="st54" d="M36.7,49.4L36.7,49.4z"/>
		<path class="st54" d="M36.7,49.3L36.7,49.3z"/>
		<polygon class="st54" points="36.7,49.5 36.7,49.5 36.7,49.5 		"/>
		<path class="st54" d="M36.7,49.3L36.7,49.3z"/>
		<path class="st54" d="M36.7,49.3L36.7,49.3z"/>
		<path class="st54" d="M36.7,49.3L36.7,49.3z"/>
		<path class="st54" d="M36.7,49.2c0,0.1,0,0.2,0,0.3l0,0l0.1-0.5C36.8,49.1,36.8,49.2,36.7,49.2L36.7,49.2z"/>
		<path class="st54" d="M36.7,49.3L36.7,49.3z"/>
		<polygon class="st55" points="36.7,49.3 36.7,49.3 36.7,49.3 		"/>
		<polygon class="st55" points="36.7,49.5 36.7,49.5 36.7,49.5 		"/>
		<polygon class="st55" points="36.7,49.4 36.7,49.4 36.7,49.4 		"/>
		<polygon class="st55" points="36.7,49.3 36.7,49.3 36.7,49.3 		"/>
		<polygon class="st55" points="36.7,49.4 36.7,49.4 36.7,49.4 		"/>
		<polygon class="st55" points="36.7,49.3 36.7,49.3 36.7,49.3 		"/>
		<polygon class="st55" points="36.7,49.5 36.7,49.5 36.7,49.5 		"/>
		<polygon class="st55" points="36.7,49.4 36.7,49.4 36.7,49.4 		"/>
		<polygon class="st55" points="36.7,49.5 36.7,49.5 36.7,49.5 		"/>
		<polygon class="st55" points="36.7,49.3 36.7,49.3 36.7,49.3 		"/>
		<polygon class="st55" points="36.7,49.5 36.7,49.5 36.7,49.5 		"/>
		<polygon class="st55" points="36.7,49.3 36.7,49.3 36.7,49.3 		"/>
		<polygon class="st55" points="36.7,49.5 36.7,49.5 36.7,49.5 		"/>
		<polygon class="st55" points="36.7,49.5 36.7,49.5 36.7,49.5 		"/>
		<path class="st55" d="M36.7,49.6c0-0.1,0-0.2,0-0.3l0,0l0,0l0,0l0,0l0,0l0,0l0,0l0,0l0,0l0,0l0,0l0,0l0,0V49.6z"/>
		<path class="st52" d="M36,49.6L36,49.6L36,49.6C36,49.6,36,49.6,36,49.6C36,49.5,36,49.6,36,49.6L36,49.6z"/>
		<path class="st53" d="M36,49.7L36,49.7L36,49.7L36,49.7z"/>
		<polygon class="st54" points="35.9,49.6 35.9,49.6 35.9,49.6 		"/>
		<polygon class="st54" points="36,49.6 36,49.6 36,49.6 		"/>
		<polygon class="st54" points="35.9,49.6 35.9,49.6 35.9,49.6 		"/>
		<polygon class="st54" points="35.9,49.6 35.9,49.6 35.9,49.6 		"/>
		<polygon class="st54" points="35.9,49.6 35.9,49.5 35.9,49.6 		"/>
		<polygon class="st54" points="35.9,49.6 35.9,49.6 35.9,49.6 		"/>
		<path class="st54" d="M35.9,49.5L35.9,49.5L35.9,49.5z"/>
		<polygon class="st54" points="36,49.6 36,49.6 36,49.6 		"/>
		<polygon class="st54" points="35.9,49.5 35.9,49.5 35.9,49.5 		"/>
		<polygon class="st54" points="35.8,49.5 35.8,49.5 35.8,49.5 		"/>
		<polygon class="st54" points="36,49.6 36,49.7 36,49.6 		"/>
		<polygon class="st54" points="35.8,49.5 35.8,49.4 35.8,49.5 		"/>
		<polygon class="st54" points="35.8,49.5 35.8,49.5 35.8,49.5 		"/>
		<polygon class="st54" points="35.8,49.4 35.8,49.4 35.8,49.4 		"/>
		<path class="st54" d="M35.8,49.4c0.1,0.1,0.1,0.2,0.2,0.2l0,0l-0.3-0.3L35.8,49.4L35.8,49.4z"/>
		<polygon class="st54" points="35.8,49.5 35.8,49.5 35.8,49.5 		"/>
		<polygon class="st55" points="35.8,49.5 35.8,49.5 35.8,49.5 		"/>
		<polygon class="st55" points="36,49.6 36,49.6 36,49.6 		"/>
		<polygon class="st55" points="35.9,49.6 35.9,49.6 35.9,49.6 		"/>
		<polygon class="st55" points="35.8,49.5 35.8,49.5 35.8,49.5 		"/>
		<polygon class="st55" points="35.9,49.5 35.9,49.5 35.9,49.5 		"/>
		<polygon class="st55" points="35.8,49.5 35.8,49.5 35.8,49.5 		"/>
		<polygon class="st55" points="35.9,49.6 35.9,49.6 35.9,49.6 		"/>
		<polygon class="st55" points="35.9,49.5 35.9,49.5 35.9,49.5 		"/>
		<polygon class="st55" points="36,49.6 35.9,49.6 36,49.6 		"/>
		<polygon class="st55" points="35.8,49.4 35.8,49.4 35.8,49.4 		"/>
		<polygon class="st55" points="36,49.6 36,49.6 36,49.6 		"/>
		<polygon class="st55" points="35.8,49.5 35.8,49.5 35.8,49.5 		"/>
		<polygon class="st55" points="35.9,49.6 35.9,49.6 35.9,49.6 		"/>
		<polygon class="st55" points="35.9,49.6 35.9,49.6 35.9,49.6 		"/>
		<path class="st55" d="M36,49.7c-0.1-0.1-0.1-0.2-0.2-0.2l0,0l0,0l0,0l0,0l0,0l0,0l0,0l0,0H36V49.7z"/>
		<path class="st52" d="M35.1,48.8L35.1,48.8L35.1,48.8C35.1,48.8,35.1,48.8,35.1,48.8L35.1,48.8L35.1,48.8z"/>
		<path class="st53" d="M35.1,48.8L35.1,48.8L35.1,48.8L35.1,48.8z"/>
		<polygon class="st54" points="35.1,48.8 35.1,48.8 35.1,48.8 		"/>
		<polygon class="st54" points="35.1,48.8 35.1,48.8 35.1,48.8 		"/>
		<polygon class="st54" points="35.1,48.8 35.1,48.8 35.1,48.8 		"/>
		<polygon class="st54" points="35.1,48.8 35.1,48.8 35.1,48.8 		"/>
		<polygon class="st54" points="35.1,48.8 35.1,48.8 35.1,48.8 		"/>
		<polygon class="st54" points="35.1,48.8 35.1,48.8 35.1,48.8 		"/>
		<path class="st54" d="M35,48.7L35,48.7L35,48.7z"/>
		<polygon class="st54" points="35.1,48.8 35.1,48.8 35.1,48.8 		"/>
		<polygon class="st54" points="35.1,48.8 35,48.7 35.1,48.8 		"/>
		<polygon class="st54" points="35,48.7 35,48.7 35,48.7 		"/>
		<polygon class="st54" points="35.1,48.8 35.2,48.9 35.2,48.9 35.1,48.8 		"/>
		<polygon class="st54" points="35,48.7 35,48.6 35,48.7 		"/>
		<polygon class="st54" points="35,48.7 35,48.7 35,48.7 		"/>
		<polygon class="st54" points="35,48.6 34.9,48.6 35,48.6 		"/>
		<path class="st54" d="M34.9,48.6c0.1,0.1,0.1,0.2,0.2,0.2l0,0l-0.3-0.3L34.9,48.6L34.9,48.6z"/>
		<polygon class="st54" points="35,48.7 35,48.7 35,48.7 		"/>
		<polygon class="st55" points="35,48.7 35,48.7 35,48.7 		"/>
		<polygon class="st55" points="34.9,48.6 34.9,48.6 34.9,48.6 		"/>
		<polygon class="st55" points="35.1,48.8 35.1,48.8 35.1,48.8 		"/>
		<polygon class="st55" points="35.1,48.8 35.1,48.8 35.1,48.8 		"/>
		<polygon class="st55" points="35,48.7 35,48.7 35,48.7 		"/>
		<polygon class="st55" points="35,48.7 35,48.7 35,48.7 		"/>
		<polygon class="st55" points="35,48.7 35,48.7 35,48.7 		"/>
		<polygon class="st55" points="35.1,48.8 35.1,48.8 35.1,48.8 		"/>
		<polygon class="st55" points="35.1,48.8 35.1,48.8 35.1,48.8 		"/>
		<polygon class="st55" points="35.1,48.8 35.1,48.8 35.1,48.8 		"/>
		<polygon class="st55" points="35,48.6 35,48.6 35,48.6 		"/>
		<polygon class="st55" points="35.1,48.8 35.1,48.8 35.1,48.8 		"/>
		<polygon class="st55" points="35,48.7 35,48.7 35,48.7 		"/>
		<polygon class="st55" points="35.1,48.8 35.1,48.8 35.1,48.8 		"/>
		<polygon class="st55" points="35.1,48.8 35.1,48.8 35.1,48.8 		"/>
		<path class="st55" d="M35.1,48.9c-0.1-0.1-0.1-0.2-0.2-0.2l0,0l0,0l0,0l0,0l0,0l0,0H35L35.1,48.9z"/>
		<path class="st52" d="M36.3,49C36.3,49,36.3,49,36.3,49C36.3,49.1,36.3,49,36.3,49C36.4,49,36.4,49,36.3,49L36.3,49L36.3,49z"/>
		<path class="st53" d="M36.3,49L36.3,49L36.3,49L36.3,49L36.3,49z"/>
		<polygon class="st54" points="36.3,49 36.3,49 36.3,49 		"/>
		<polygon class="st54" points="36.3,49 36.3,49 36.3,49 		"/>
		<polygon class="st54" points="36.3,49 36.3,48.9 36.3,49 		"/>
		<polygon class="st54" points="36.3,49 36.3,49 36.3,49 		"/>
		<polygon class="st54" points="36.3,48.9 36.3,48.9 36.3,48.9 		"/>
		<polygon class="st54" points="36.3,48.9 36.3,48.9 36.3,48.9 		"/>
		<path class="st54" d="M36.2,48.9L36.2,48.9L36.2,48.9z"/>
		<polygon class="st54" points="36.3,49 36.3,49 36.3,49 		"/>
		<polygon class="st54" points="36.3,48.9 36.2,48.9 36.3,48.9 		"/>
		<polygon class="st54" points="36.2,48.8 36.2,48.8 36.2,48.8 		"/>
		<polygon class="st54" points="36.3,49 36.3,49 36.3,49 		"/>
		<polygon class="st54" points="36.2,48.8 36.2,48.8 36.2,48.8 		"/>
		<polygon class="st54" points="36.2,48.8 36.2,48.8 36.2,48.8 		"/>
		<polygon class="st54" points="36.2,48.8 36.2,48.8 36.2,48.8 		"/>
		<path class="st54" d="M36.2,48.8c0.1,0.1,0.1,0.2,0.2,0.2l0,0L36,48.7L36.2,48.8L36.2,48.8z"/>
		<path class="st54" d="M36.2,48.9L36.2,48.9z"/>
		<polygon class="st55" points="36.2,48.9 36.2,48.9 36.2,48.9 		"/>
		<polygon class="st55" points="36.2,48.8 36.2,48.8 36.2,48.8 		"/>
		<polygon class="st55" points="36.3,49 36.3,49 36.3,49 		"/>
		<polygon class="st55" points="36.3,48.9 36.3,48.9 36.3,48.9 		"/>
		<polygon class="st55" points="36.2,48.8 36.2,48.8 36.2,48.8 		"/>
		<polygon class="st55" points="36.2,48.9 36.2,48.9 36.2,48.9 		"/>
		<polygon class="st55" points="36.2,48.8 36.2,48.8 36.2,48.8 		"/>
		<polygon class="st55" points="36.3,48.9 36.3,48.9 36.3,48.9 		"/>
		<polygon class="st55" points="36.3,48.9 36.3,48.9 36.3,48.9 		"/>
		<polygon class="st55" points="36.3,49 36.3,49 36.3,49 		"/>
		<polygon class="st55" points="36.2,48.8 36.2,48.8 36.2,48.8 		"/>
		<polygon class="st55" points="36.3,49 36.3,49 36.3,49 		"/>
		<polygon class="st55" points="36.2,48.8 36.2,48.8 36.2,48.8 		"/>
		<polygon class="st55" points="36.3,49 36.3,49 36.3,49 		"/>
		<polygon class="st55" points="36.3,49 36.3,49 36.3,49 		"/>
		<path class="st55" d="M36.3,49c-0.1-0.1-0.1-0.2-0.2-0.2l0,0l0,0l0,0l0,0l0,0l0,0h0.1L36.3,49z"/>
		<path class="st52" d="M36.5,50.1L36.5,50.1C36.5,50.1,36.5,50.1,36.5,50.1C36.6,50.1,36.5,50.1,36.5,50.1L36.5,50.1L36.5,50.1z"/>
		<path class="st53" d="M36.5,50.1L36.5,50.1L36.5,50.1L36.5,50.1z"/>
		<polygon class="st54" points="36.5,50 36.5,50 36.5,50 		"/>
		<polygon class="st54" points="36.5,50.1 36.5,50 36.5,50.1 		"/>
		<polygon class="st54" points="36.5,50 36.5,50 36.5,50 		"/>
		<polygon class="st54" points="36.5,50 36.5,50 36.5,50 		"/>
		<polygon class="st54" points="36.5,50 36.4,50 36.5,50 		"/>
		<polygon class="st54" points="36.5,50 36.5,50 36.5,50 		"/>
		<path class="st54" d="M36.4,50L36.4,50L36.4,50z"/>
		<polygon class="st54" points="36.5,50.1 36.5,50.1 36.5,50.1 		"/>
		<polygon class="st54" points="36.4,50 36.4,50 36.4,50 		"/>
		<polygon class="st54" points="36.4,49.9 36.4,49.9 36.4,49.9 		"/>
		<polygon class="st54" points="36.5,50.1 36.5,50.1 36.5,50.1 		"/>
		<polygon class="st54" points="36.4,49.9 36.3,49.9 36.4,49.9 		"/>
		<polygon class="st54" points="36.4,49.9 36.4,49.9 36.4,49.9 		"/>
		<polygon class="st54" points="36.3,49.9 36.3,49.8 36.3,49.9 		"/>
		<path class="st54" d="M36.3,49.8c0.1,0.1,0.1,0.2,0.2,0.2l0,0l-0.3-0.4L36.3,49.8z"/>
		<path class="st54" d="M36.4,49.9L36.4,49.9z"/>
		<polygon class="st55" points="36.4,49.9 36.4,49.9 36.4,49.9 		"/>
		<polygon class="st55" points="36.5,50.1 36.5,50.1 36.5,50.1 		"/>
		<polygon class="st55" points="36.5,50 36.5,50 36.5,50 		"/>
		<polygon class="st55" points="36.4,49.9 36.4,49.9 36.4,49.9 		"/>
		<polygon class="st55" points="36.4,50 36.4,50 36.4,50 		"/>
		<polygon class="st55" points="36.4,49.9 36.4,49.9 36.4,49.9 		"/>
		<polygon class="st55" points="36.5,50 36.5,50 36.5,50 		"/>
		<polygon class="st55" points="36.4,50 36.4,50 36.4,50 		"/>
		<polygon class="st55" points="36.5,50 36.5,50 36.5,50 		"/>
		<polygon class="st55" points="36.3,49.9 36.3,49.9 36.3,49.9 		"/>
		<polygon class="st55" points="36.5,50.1 36.5,50.1 36.5,50.1 		"/>
		<polygon class="st55" points="36.4,49.9 36.4,49.9 36.4,49.9 		"/>
		<polygon class="st55" points="36.5,50 36.5,50 36.5,50 		"/>
		<polygon class="st55" points="36.5,50 36.5,50 36.5,50 		"/>
		<path class="st55" d="M36.5,50.1c-0.1-0.1-0.1-0.2-0.2-0.2l0,0l0,0l0,0l0,0l0,0l0,0h0.1L36.5,50.1z"/>
		<path class="st52" d="M36.1,50.7C36.1,50.7,36.1,50.6,36.1,50.7S36.1,50.7,36.1,50.7L36.1,50.7L36.1,50.7z"/>
		<path class="st53" d="M36.1,50.7L36.1,50.7L36.1,50.7L36.1,50.7L36.1,50.7z"/>
		<polygon class="st54" points="36,50.7 36,50.7 36,50.7 		"/>
		<polygon class="st54" points="36.1,50.7 36,50.7 36.1,50.7 		"/>
		<polygon class="st54" points="36,50.7 36,50.7 36,50.7 		"/>
		<polygon class="st54" points="36,50.7 36,50.7 36,50.7 		"/>
		<polygon class="st54" points="36,50.7 36,50.7 36,50.7 		"/>
		<polygon class="st54" points="36,50.7 36,50.7 36,50.7 		"/>
		<path class="st54" d="M35.9,50.6L35.9,50.6z"/>
		<polygon class="st54" points="36.1,50.7 36.1,50.7 36.1,50.7 		"/>
		<path class="st54" d="M36,50.7L36,50.7z"/>
		<path class="st54" d="M35.9,50.6L35.9,50.6z"/>
		<polygon class="st54" points="36.1,50.7 36.1,50.7 36.1,50.7 		"/>
		<path class="st54" d="M35.8,50.6L35.8,50.6z"/>
		<path class="st54" d="M35.8,50.6L35.8,50.6z"/>
		<path class="st54" d="M35.8,50.6L35.8,50.6z"/>
		<path class="st54" d="M35.8,50.6l0.3,0.1l0,0l-0.5-0.1L35.8,50.6L35.8,50.6z"/>
		<path class="st54" d="M35.9,50.6L35.9,50.6z"/>
		<polygon class="st55" points="36.1,50.7 36.1,50.7 36.1,50.7 		"/>
		<polygon class="st55" points="36,50.7 36,50.7 36,50.7 		"/>
		<polygon class="st55" points="35.8,50.6 35.8,50.6 35.8,50.6 		"/>
		<polygon class="st55" points="35.9,50.7 35.9,50.7 35.9,50.7 		"/>
		<polygon class="st55" points="35.9,50.6 35.9,50.6 35.9,50.6 		"/>
		<polygon class="st55" points="36,50.7 36,50.7 36,50.7 		"/>
		<polygon class="st55" points="36,50.7 36,50.7 36,50.7 		"/>
		<polygon class="st55" points="36,50.7 36,50.7 36,50.7 		"/>
		<polygon class="st55" points="35.8,50.6 35.8,50.6 35.8,50.6 		"/>
		<polygon class="st55" points="36.1,50.7 36.1,50.7 36.1,50.7 		"/>
		<polygon class="st55" points="35.8,50.6 35.8,50.6 35.8,50.6 		"/>
		<polygon class="st55" points="36,50.7 36,50.7 36,50.7 		"/>
		<polygon class="st55" points="36,50.7 36,50.7 36,50.7 		"/>
		<path class="st55" d="M36.1,50.7l-0.3-0.1L36.1,50.7L36.1,50.7z"/>
		<polygon class="st56" points="48.3,52.2 40.3,54 40.3,65.3 47.7,63.7 48.3,52.2 		"/>
		<path class="st57" d="M23,53l17.3,1v11.4l-17.4-1.3L23,53z"/>
		<path class="st6" d="M49.8,58.3c-0.5,1-1,1.9-1.7,2.7c-0.4,0-0.8,0.1-1.1,0.3c-1,0.5-1.5,1.4-2.3,1.7c-0.1,0-0.2,0.1-0.2,0.2
			c-0.1,0.2,0,0.6,0.8,0.6c1.2,0,1.1-0.8,1.7-0.6c-0.5,0.3-0.9,0.6-1.3,0.9c-1,0-2.1,0.2-3,0.6c0,0,1.4,0.3,3.1,0.6h0.2
			c1-0.2,1.9-0.6,2.8-1.1c0,0,0.1,0,0.1-0.1c0.5-0.5,1-1.1,1.4-1.7c0.1-0.1,0.1-0.2,0.1-0.3c0.3-1.1,0.8-2.1,1.5-3
			C51.3,58.7,50.6,58.3,49.8,58.3L49.8,58.3z"/>
		<path class="st7" d="M51,58.7c-0.3,0.9-1.1,2.9-1.6,3c-0.6,0.1-1.1,0.4-1.3,0.9c-0.3,0.6,0.4,1.5-1.5,2.6c0.7-0.2,1.4-0.5,2-0.9
			c0,0,0.1,0,0.1-0.1c0.5-0.5,1-1.1,1.4-1.7c0.1-0.1,0.1-0.2,0.1-0.3c0.3-1.1,0.8-2.1,1.5-3C51.5,59.1,51.3,58.8,51,58.7L51,58.7z"
			/>
		<path class="st8" d="M55.7,35.7c-0.9-0.9-2-1.5-3.2-1.8c0,1.7-0.1,3.8-0.2,6.8c0.4,2.7,1,5.4,1.8,8.1c-0.8,1-1.6,2-2.2,3.1
			C51,53.5,49,59,48.2,60.8l2.2,1.4c0,0,6-9.1,6.8-12.7C57.9,46.1,56.9,37,55.7,35.7z"/>
		<path class="st9" d="M49.4,61.6l-0.1-0.1L49.4,61.6z"/>
		<path class="st9" d="M57.1,41.3l0.1,0.5L57.1,41.3z"/>
		<path class="st9" d="M48.3,60.6c0,0.1-0.1,0.1-0.1,0.2S48.2,60.7,48.3,60.6z"/>
		<path class="st9" d="M49.2,61.5l-0.2-0.1L49.2,61.5z"/>
		<path class="st9" d="M49.5,61.7l-0.2-0.1L49.5,61.7z"/>
		<path class="st9" d="M49.9,61.9L49.9,61.9L49.9,61.9z"/>
		<path class="st9" d="M49.7,61.7L49.7,61.7L49.7,61.7z"/>
		<path class="st9" d="M57.2,42.6c0,0.2,0,0.4,0,0.5C57.3,43,57.3,42.8,57.2,42.6z"/>
		<path class="st9" d="M57.3,43.7c0.1,0.9,0.1,1.8,0.1,2.6C57.4,45.5,57.4,44.6,57.3,43.7z"/>
		<path class="st9" d="M53.2,57.7c-0.1,0.1-0.2,0.2-0.2,0.4C53.1,58,53.1,57.8,53.2,57.7z"/>
		<path class="st9" d="M56.5,51.5c-0.3,0.7-0.7,1.5-1.1,2.3C55.8,53,56.2,52.2,56.5,51.5z"/>
		<path class="st9" d="M52.9,58.2l-0.2,0.2L52.9,58.2z"/>
		<path class="st9" d="M52.6,58.7l-0.1,0.2L52.6,58.7z"/>
		<path class="st9" d="M56.8,50.8c-0.1,0.2-0.2,0.5-0.3,0.7C56.6,51.3,56.7,51.1,56.8,50.8z"/>
		<path class="st9" d="M55.4,53.8l-0.3,0.5L55.4,53.8z"/>
		<path class="st9" d="M54.3,55.8l-0.2,0.4L54.3,55.8z"/>
		<path class="st9" d="M54.7,55.1c-0.1,0.2-0.2,0.4-0.4,0.7C54.5,55.6,54.6,55.3,54.7,55.1z"/>
		<path class="st9" d="M55.1,54.5l-0.4,0.7L55.1,54.5z"/>
		<path class="st9" d="M53.9,56.6L53.7,57L53.9,56.6z"/>
		<path class="st9" d="M53.5,57.2l-0.3,0.5L53.5,57.2z"/>
		<path class="st9" d="M52.1,59.6L52,59.8L52.1,59.6z"/>
		<path class="st9" d="M51.2,61.1l-0.1,0.2L51.2,61.1z"/>
		<path class="st9" d="M56.7,38.8l0.1,0.7L56.7,38.8z"/>
		<path class="st9" d="M56.3,37c0,0.2,0.1,0.4,0.2,0.5C56.4,37.4,56.3,37.2,56.3,37z"/>
		<path class="st9" d="M57.4,47.5c0-0.4,0-0.8,0-1.2C57.4,46.7,57.4,47.1,57.4,47.5z"/>
		<path class="st9" d="M51.8,60l-0.1,0.2L51.8,60z"/>
		<path class="st9" d="M56.8,50.8c0.2-0.4,0.3-0.9,0.4-1.4c0.1-0.6,0.2-1.3,0.2-2c0,0.7-0.1,1.3-0.2,2
			C57.1,49.9,56.9,50.4,56.8,50.8z"/>
		<path class="st9" d="M50.9,61.5l-0.1,0.1L50.9,61.5z"/>
		<path class="st9" d="M51.2,60.9l-0.1,0.2L51.2,60.9z"/>
		<path class="st9" d="M48.5,61L48.5,61L48.5,61z"/>
		<path class="st9" d="M48.2,60.8L48.2,60.8L48.2,60.8z"/>
		<path class="st9" d="M57.3,43.7c0-0.2,0-0.4,0-0.5s0-0.4,0-0.5s0-0.5-0.1-0.8l-0.1-0.5c-0.1-0.6-0.2-1.2-0.2-1.8l-0.1-0.7
			c-0.1-0.5-0.2-0.9-0.3-1.2c0-0.2-0.1-0.4-0.2-0.5c-0.1-0.5-0.3-0.9-0.6-1.3c-0.6-0.6-1.4-1.2-2.3-1.5c0.4,0.5,0.7,1,1,1.6
			c0.7,1.2,1.2,2.6,1.3,4c0.2,1.4,0.3,2.8,0.5,4.3c0.1,1.1,0.2,2.2,0.2,3.2c0.1,0.6,0.1,1.3,0,1.9c0,0-2.8,7.8-6.2,12
			c-0.7,0-1.4-0.2-2-0.6c0,0.1-0.1,0.1-0.1,0.2l0.1,0.1l0.1,0.1h0.1l0.6,0.4l0.2,0.1l0,0l0.1,0.1l0.2,0.1l0.1,0.1l0.2,0.1l0.1,0.1
			l0.5,0.3l0.4-0.6l0.1-0.1l0.2-0.3l0.1-0.2l0.1-0.2l0.5-0.7l0.1-0.2l0.1-0.2l0.1-0.2l0.4-0.7l0.1-0.2l0.1-0.2l0.2-0.2
			c0,0,0-0.1,0.1-0.1s0.2-0.2,0.2-0.4l0.3-0.5l0.2-0.3l0.2-0.4l0.2-0.4l0.2-0.4c0.1-0.2,0.2-0.4,0.4-0.7l0.4-0.7l0.1-0.1l0.3-0.5
			c0.4-0.8,0.8-1.5,1.1-2.3c0.1-0.2,0.2-0.5,0.3-0.7c0.2-0.4,0.3-0.9,0.4-1.4c0.1-0.6,0.2-1.3,0.2-2c0-0.4,0-0.8,0-1.2
			c0-0.8,0-1.7-0.1-2.6L57.3,43.7z"/>
		<path class="st6" d="M38.2,25.2c0,0-1.1,0.1-0.8,1s1,1.6,1.6,1.1C38.9,27.3,38.6,25.4,38.2,25.2L38.2,25.2z"/>
		<path class="st11" d="M38.5,26.8c0,0-0.6-1.4-0.8-1s-0.1,0.6,0.1,0.7s0.2-0.4,0.3-0.2S38.4,27,38.5,26.8L38.5,26.8z"/>
		<path class="st7" d="M42.7,16.7c0.2,1.4-0.4,2.7-1.5,3.5c-1.9,1.3-2.9,2.4-3,3.1c-0.1,0.6-0.1,1.2-0.1,1.9l-0.6-2l0.5-3.4l3.2-1.9
			L42.7,16.7L42.7,16.7z"/>
		<path class="st4" d="M42.7,15.4c0,0,1.1,3.1-2.7,5.3c-1.6,0.8-2.4,2.7-1.9,4.5C38.1,25.2,34.3,17.5,42.7,15.4L42.7,15.4z"/>
		<path class="st7" d="M42.7,16.8c0,0-0.1,2.3,1.2,3.3s3.3,0.9,4,3c0.3-0.3,0.4-0.7,0.3-1.1c-0.5-1.2-1.6-2.1-2.8-2.4
			c0,0-1.1-0.3-2.1-2.5L42.7,16.8L42.7,16.8z"/>
		<path class="st4" d="M42.3,15.4c0,0,0.6,3.4,2.5,4.6s2.7,0.8,3.2,3l0.2,0.9l0.5-0.7c0,0,0.1-4.9-3.5-7
			C44.3,15.8,43.3,15.5,42.3,15.4L42.3,15.4z"/>
		<path class="st6" d="M47.8,23.1c0,0,1-0.4,1.2,0.5s-0.1,1.9-0.9,1.8C48.1,25.4,47.5,23.5,47.8,23.1z"/>
		<path class="st11" d="M48.3,24.7c0,0-0.2-1.5,0.2-1.2s0.4,0.5,0.3,0.6s-0.4-0.3-0.4,0S48.5,24.9,48.3,24.7L48.3,24.7z"/>
		<path class="st58" d="M37.1,22c-0.1-1.6,2-2.5,2-2.5c2-0.8,2.4-3.6,2.4-4.8c-1.2,0.2-2.2,0.7-3.1,1.5c-1.5,1.4-2.3,3.4-2.2,5.5
			c0,0.6,0,1.3,0.1,2C36.9,23.3,37.2,22.6,37.1,22z"/>
	</g>
</g>
</svg>
