<?xml version="1.0" encoding="utf-8"?>
<!-- Generator: Adobe Illustrator 24.0.0, SVG Export Plug-In . SVG Version: 6.00 Build 0)  -->
<svg version="1.1" id="Layer_1" xmlns="http://www.w3.org/2000/svg" xmlns:xlink="http://www.w3.org/1999/xlink" x="0px" y="0px"
	 viewBox="0 0 88 88" style="enable-background:new 0 0 88 88;" xml:space="preserve">
<style type="text/css">
	.st0{fill:#FFCC2C;}
	.st1{clip-path:url(#SVGID_4_);}
	.st2{fill:#F7941D;}
	.st3{clip-path:url(#SVGID_6_);}
	.st4{clip-path:url(#SVGID_8_);}
	.st5{fill:#E8D2CD;}
	.st6{fill:#B2958D;}
	.st7{opacity:0.3;fill:#B2958D;enable-background:new    ;}
	.st8{fill:#C9AAA2;}
	.st9{fill:#EABA6E;}
	.st10{fill:#2B2F40;}
	.st11{fill:#5E6078;}
	.st12{fill:#6A6C85;}
	.st13{fill:#FFFFFF;}
	.st14{fill:#C5C9CE;}
	.st15{fill:#B4B9BF;}
	.st16{opacity:0.9;fill:#5E6078;enable-background:new    ;}
	.st17{opacity:0.2;fill:#B2958D;enable-background:new    ;}
	.st18{fill:#CFD2D8;}
</style>
<title>Artboard 10</title>
<g>
	<g id="Layer_1_1_">
		<g>
			<defs>
				<rect id="SVGID_1_" y="-99" width="88" height="88"/>
			</defs>
			<clipPath id="SVGID_2_">
				<use xlink:href="#SVGID_1_"  style="overflow:visible;"/>
			</clipPath>
		</g>
		<rect class="st0" width="88" height="88"/>
		<g>
			<defs>
				<rect id="SVGID_3_" width="88" height="88"/>
			</defs>
			<clipPath id="SVGID_4_">
				<use xlink:href="#SVGID_3_"  style="overflow:visible;"/>
			</clipPath>
			<g class="st1">
				<circle class="st2" cx="44" cy="83.6" r="44.2"/>
			</g>
		</g>
		<g>
			<defs>
				<rect id="SVGID_5_" width="88" height="88"/>
			</defs>
			<clipPath id="SVGID_6_">
				<use xlink:href="#SVGID_5_"  style="overflow:visible;"/>
			</clipPath>
			<g class="st3">
				<g>
					<defs>
						<rect id="SVGID_7_" x="-22" width="132" height="88"/>
					</defs>
					<clipPath id="SVGID_8_">
						<use xlink:href="#SVGID_7_"  style="overflow:visible;"/>
					</clipPath>
					<g class="st4">
						<rect x="-22" y="63.2" class="st5" width="132" height="2.7"/>
						<rect x="-22" y="67.7" class="st6" width="132" height="20.3"/>
						<rect x="-22" y="67.7" class="st7" width="132" height="1.2"/>
						<rect x="-22" y="65.9" class="st8" width="132" height="1.8"/>
						<rect x="-22" y="65" class="st9" width="132" height="0.3"/>
						<rect x="82.4" y="45.7" class="st10" width="1.6" height="17.5"/>
						<rect x="51.3" y="45.7" class="st10" width="1.6" height="17.5"/>
						<rect x="20.1" y="45.7" class="st10" width="1.6" height="17.5"/>
						<rect x="-22.5" y="59.5" class="st11" width="132.5" height="0.7"/>
						<rect x="-22.5" y="61.2" class="st11" width="132.5" height="0.7"/>
						<rect x="-22.5" y="46.2" class="st11" width="132.5" height="3.9"/>
						<rect x="-22.5" y="44.8" class="st12" width="132.5" height="1.4"/>
						<polygon class="st13" points="65.2,58.2 75.2,65.3 66.9,65.8 						"/>
						<polygon class="st13" points="-30.4,55.5 -30.4,69.8 -26.7,69.8 6.7,69.8 6.7,55.5 						"/>
						<path class="st13" d="M76,66.1c-1.4-1.7-5-3.2-5.5-3.5c-0.4-0.2-0.8-0.5-1.1-0.8l-1-1c-3.3-3.5-7.9-5.4-12.8-5.4H7.8v14.3
							h69.1C79.2,69.8,77.5,67.9,76,66.1z"/>
						<polygon class="st14" points="7.8,64.4 55,64.4 54.1,63.5 7.8,63.5 						"/>
						<polygon class="st14" points="55.8,65.3 7.8,65.3 7.8,69.8 59.9,69.8 						"/>
						<path class="st15" d="M7.8,69.8h69.1c1.7,0,1.2-1,0.3-2.2H7.8V69.8z"/>
						<path class="st13" d="M76.4,66.6H7.8v0.9h69.4L76.4,66.6z"/>
						<rect x="-30.4" y="63.5" class="st14" width="37.1" height="0.9"/>
						<rect x="-30.4" y="65.3" class="st14" width="37.1" height="1.3"/>
						<rect x="-30.4" y="67.5" class="st14" width="37.1" height="2.2"/>
						<rect x="-30.4" y="66.6" class="st13" width="37.1" height="0.9"/>
						<rect x="-30.4" y="67.5" class="st15" width="37.1" height="2.2"/>
						<rect x="6.7" y="56" class="st11" width="1.1" height="13.8"/>
						<rect x="9.1" y="58.9" class="st11" width="2.7" height="2.7"/>
						<polygon class="st11" points="25.6,57.2 30.6,62.6 32.1,62.6 27.2,57.2 						"/>
						<polygon class="st11" points="32.1,57.2 37,62.6 37.6,62.6 32.7,57.2 						"/>
						<polygon class="st11" points="32.7,57.2 37.6,62.6 38.8,62.6 33.8,57.2 						"/>
						<polygon class="st11" points="23.2,57.2 23.2,62.6 28.8,62.6 23.9,57.2 						"/>
						<polygon class="st11" points="23.9,57.2 28.8,62.6 29.5,62.6 24.5,57.2 						"/>
						<polygon class="st11" points="24.5,57.2 29.5,62.6 29.5,62.6 30.6,62.6 25.6,57.2 						"/>
						<polygon class="st11" points="29.5,57.2 27.2,57.2 32.1,62.6 37,62.6 32.1,57.2 						"/>
						<polygon class="st11" points="40.9,57.2 45.8,62.6 46.9,62.6 42,57.2 						"/>
						<polygon class="st11" points="53.3,62.6 48.4,57.2 43.5,57.2 48.5,62.6 						"/>
						<polygon class="st11" points="43.5,57.2 42,57.2 46.9,62.6 48.5,62.6 						"/>
						<polygon class="st11" points="35.9,57.2 35.3,57.2 40.3,62.6 42.9,62.6 45.2,62.6 40.2,57.2 						"/>
						<polygon class="st11" points="33.8,57.2 38.8,62.6 40.3,62.6 35.3,57.2 						"/>
						<polygon class="st11" points="40.2,57.2 45.2,62.6 45.8,62.6 40.9,57.2 						"/>
						<polygon class="st11" points="56.6,57.2 61.5,62.6 62.2,62.6 57.2,57.2 						"/>
						<polygon class="st11" points="57.2,57.2 62.2,62.6 63.3,62.6 58.3,57.2 						"/>
						<polygon class="st11" points="50.9,57.2 55.8,62.6 61.5,62.6 56.6,57.2 						"/>
						<path class="st11" d="M70.5,62.6c-0.4-0.2-0.7-0.4-1-0.8l-1-1c-1.4-1.5-3.1-2.7-4.9-3.6h-3.7l4.9,5.4L70.5,62.6z"/>
						<polygon class="st11" points="59.9,57.2 58.3,57.2 63.3,62.6 64.8,62.6 						"/>
						<polygon class="st11" points="-5.5,57.2 -0.5,62.6 0.6,62.6 -4.3,57.2 						"/>
						<polygon class="st11" points="5.7,59.3 3.8,57.2 2.7,57.2 5.7,60.5 						"/>
						<polygon class="st11" points="5.7,57.2 5.4,57.2 5.7,57.7 						"/>
						<polygon class="st11" points="5.7,57.7 5.4,57.2 3.8,57.2 5.7,59.3 						"/>
						<polygon class="st11" points="2.1,57.2 -2.3,57.2 -2.8,57.2 2.1,62.6 4.7,62.6 5.7,62.6 5.7,61.2 						"/>
						<polygon class="st11" points="-4.3,57.2 0.6,62.6 2.1,62.6 -2.8,57.2 						"/>
						<polygon class="st11" points="5.7,60.5 2.7,57.2 2.1,57.2 5.7,61.2 						"/>
						<polygon class="st11" points="68.2,62.6 71.4,62.6 65.8,58.5 						"/>
						<path class="st14" d="M15.9,57.3H19c1.4,0,2.5,1.1,2.5,2.5c0,0,0,0,0,0v10l0,0h-8.1l0,0v-10C13.4,58.4,14.5,57.3,15.9,57.3
							C15.9,57.3,15.9,57.3,15.9,57.3z"/>
						<rect x="14" y="57.8" class="st13" width="7" height="11.5"/>
						<polygon class="st11" points="14.6,58.5 14.6,62.6 18.1,62.6 15,58.5 						"/>
						<polygon class="st16" points="15,58.5 18.1,62.6 19.1,62.6 16,58.5 						"/>
						<polygon class="st11" points="20.4,62.6 20.4,58.5 17.2,58.5 20.2,62.6 						"/>
						<polygon class="st16" points="20.2,62.6 17.2,58.5 16.7,58.5 19.7,62.6 						"/>
						<polygon class="st11" points="16.7,58.5 16,58.5 19.1,62.6 19.7,62.6 						"/>
						<rect x="-22" y="69.8" class="st8" width="132" height="18.2"/>
						<rect x="-22" y="69.8" class="st5" width="132" height="9.3"/>
						<rect x="-22" y="70.8" class="st9" width="132" height="0.8"/>
						<rect x="-22" y="76.8" class="st9" width="132" height="1.1"/>
						<rect x="-22" y="82.9" class="st6" width="132" height="5"/>
						<rect x="-22" y="82.9" class="st17" width="132" height="1.1"/>
						<rect x="77.6" y="50" class="st18" width="0.4" height="1.7"/>
						<rect x="67.6" y="50" class="st18" width="0.4" height="1.7"/>
						<rect x="64.3" y="51.7" class="st11" width="16.6" height="4.5"/>
						<path class="st9" d="M64.7,52.1h15.9V56H64.7V52.1z M80.3,52.4H64.9v3.3h15.4V52.4z"/>
						<rect x="65.6" y="53.1" class="st9" width="4.9" height="0.8"/>
						<rect x="65.6" y="54.4" class="st9" width="14" height="0.8"/>
					</g>
				</g>
			</g>
		</g>
	</g>
</g>
</svg>
