<?xml version="1.0" encoding="utf-8"?>
<!-- Generator: Adobe Illustrator 24.0.0, SVG Export Plug-In . SVG Version: 6.00 Build 0)  -->
<svg version="1.1" id="Layer_1" xmlns="http://www.w3.org/2000/svg" xmlns:xlink="http://www.w3.org/1999/xlink" x="0px" y="0px"
	 viewBox="0 0 88 88" style="enable-background:new 0 0 88 88;" xml:space="preserve">
<style type="text/css">
	.st0{fill:#009B57;}
	.st1{clip-path:url(#SVGID_4_);}
	.st2{fill:#006838;}
	.st3{clip-path:url(#SVGID_6_);}
	.st4{fill:#393A3C;}
	.st5{fill:#323233;}
	.st6{fill:#353535;}
	.st7{fill:#4D4D4E;}
	.st8{fill:#3F4E66;}
	.st9{fill:#FFCC2C;}
</style>
<title>Artboard 41</title>
<g>
	<defs>
		<rect id="SVGID_1_" y="-99" width="88" height="88"/>
	</defs>
	<clipPath id="SVGID_2_">
		<use xlink:href="#SVGID_1_"  style="overflow:visible;"/>
	</clipPath>
</g>
<rect class="st0" width="88" height="88"/>
<g>
	<defs>
		<rect id="SVGID_3_" width="88" height="88"/>
	</defs>
	<clipPath id="SVGID_4_">
		<use xlink:href="#SVGID_3_"  style="overflow:visible;"/>
	</clipPath>
	<g class="st1">
		<circle class="st2" cx="44" cy="83.6" r="44.2"/>
	</g>
</g>
<g>
	<defs>
		<rect id="SVGID_5_" y="-99" width="88" height="88"/>
	</defs>
	<clipPath id="SVGID_6_">
		<use xlink:href="#SVGID_5_"  style="overflow:visible;"/>
	</clipPath>
	<g class="st3">
		<path class="st4" d="M65.2-5.3h3.7c0.9,0,1.6,0.7,1.6,1.6v22.9c0,0.9-0.7,1.6-1.6,1.6h-3.7c-0.9,0-1.6-0.7-1.6-1.6V-3.7
			C63.6-4.6,64.3-5.3,65.2-5.3z"/>
		<path class="st5" d="M65.9-5.3h2.3c0.9,0,1.6,0.7,1.6,1.6v17.7c0,0.9-0.7,1.6-1.6,1.6h-2.3c-0.9,0-1.6-0.7-1.6-1.6V-3.7
			C64.3-4.6,65-5.3,65.9-5.3z"/>
	</g>
</g>
<path class="st6" d="M56.7,42.1L27.6,56.5L32.8,67l0,0c0,0.1,0.1,0.3,0.2,0.4c1.7,3.5,9.6,3.1,17.7-0.9s13.2-10,11.5-13.5
	c-0.1-0.1-0.1-0.2-0.2-0.3l0,0L56.7,42.1z"/>
<path class="st7" d="M15.1,60.2l19.8-22c0.8-0.8,1.8-1.3,2.9-1.4l29.5-2.4c0.3,0,0.6,0.3,0.6,0.6c0,0.1,0,0.3-0.1,0.4L48,57.4
	c-0.8,0.8-1.8,1.3-2.9,1.4l-29.5,2.4c-0.4,0-0.7-0.2-0.7-0.6C14.9,60.5,15,60.3,15.1,60.2z"/>
<path class="st8" d="M42.8,47.2c0.2,0.4-0.3,1-1,1.4s-1.5,0.3-1.7,0s0.2-1,1-1.4S42.6,46.8,42.8,47.2L42.8,47.2z"/>
<path class="st9" d="M41.5,48.1c-0.2,0.1-0.5,0-0.6-0.2c0-0.1-0.1-0.1,0-0.2c0.2-5.5,4.5-9.6,7-11.6c1.9-1.4,3.9-2.8,6-4
	c1.8-1.1,3.7-2.2,5.4-3.5c3-2.2,6.6-5.9,7.2-10.6c0-0.3,0.3-0.4,0.5-0.4c0.3,0,0.5,0.3,0.4,0.5c0,0,0,0,0,0
	c-0.6,5.1-4.4,8.9-7.6,11.3c-1.7,1.3-3.6,2.4-5.4,3.5c-2,1.2-4,2.5-5.9,3.9c-2.4,1.9-6.4,5.8-6.7,10.9C41.7,47.8,41.6,48,41.5,48.1
	L41.5,48.1z"/>
<path class="st9" d="M65.3,16.3c-0.2-1.2-0.3-2.4-0.2-3.6c0-0.7,0-1.4,0-2.1c0-0.3,0.1-0.7,0.2-1C65.7,9,66,9.5,66.2,10
	c-0.1-0.2,0.3-0.7,0.5-0.7s0.6,0.5,1,0.4s1-0.7,1.2,0.1c0.3,1.5,0.3,3.1-0.1,4.6c-0.2,1.1-0.3,3.2-1.6,3.7c-0.5,0.2-1,0-1.3-0.4
	c-0.2-0.2-0.3-0.5-0.4-0.8C65.4,16.7,65.4,16.5,65.3,16.3L65.3,16.3z"/>
</svg>
