<?xml version="1.0" encoding="utf-8"?>
<!-- Generator: Adobe Illustrator 24.0.0, SVG Export Plug-In . SVG Version: 6.00 Build 0)  -->
<svg version="1.1" id="Layer_1" xmlns="http://www.w3.org/2000/svg" xmlns:xlink="http://www.w3.org/1999/xlink" x="0px" y="0px"
	 viewBox="0 0 88 88" style="enable-background:new 0 0 88 88;" xml:space="preserve">
<style type="text/css">
	.st0{fill:#23B2E7;}
	.st1{clip-path:url(#SVGID_2_);}
	.st2{fill:#1B75BC;}
	.st3{fill:#FBB040;}
	.st4{fill:#E0AB54;}
	.st5{fill:#F1B554;}
	.st6{fill:#D6A461;}
	.st7{fill:#C1873F;}
	.st8{fill:#DF8D26;}
	.st9{fill:#B7802F;}
	.st10{fill:#AA7029;}
	.st11{fill:#8C5723;}
</style>
<title>Artboard 34</title>
<rect class="st0" width="88" height="88"/>
<g>
	<defs>
		<rect id="SVGID_1_" width="88" height="88"/>
	</defs>
	<clipPath id="SVGID_2_">
		<use xlink:href="#SVGID_1_"  style="overflow:visible;"/>
	</clipPath>
	<g class="st1">
		<circle class="st2" cx="44" cy="83.6" r="44.2"/>
	</g>
</g>
<g>
	<defs>
		<rect id="SVGID_3_" y="-99" width="88" height="88"/>
	</defs>
	<clipPath id="SVGID_4_">
		<use xlink:href="#SVGID_3_"  style="overflow:visible;"/>
	</clipPath>
</g>
<g id="Efw79j.tif">
	<path class="st3" d="M54.4,16c0.2,0.7,0.3,1.5,0.2,2.2c0,0.3-0.3,0.4-0.6,0.4h-1.2c-0.5-0.1-1-0.1-1.5,0H18.8c-0.2,0-0.4,0-0.5,0
		c-1.5,0-1.4-0.2-1.3-1.4c0-0.4-0.1-0.9,0.2-1.2L54.4,16z"/>
	<path class="st4" d="M16.1,33c0.2-0.4,0.7-0.6,1.2-0.6c0.5,0,1,0,1.5,0h3.5c0.6,0.2,0.8,0.5,0.8,0.9s-0.4,0.5-0.8,0.6
		c-0.7,0-1.4,0-2.1,0h-1.5c-0.5,0-1,0-1.5,0c-0.5,0.1-0.9-0.2-1.1-0.5L16.1,33z"/>
	<path class="st3" d="M51.2,62H18.8c-0.3,0-0.7,0-1-0.1c-0.5-0.2-0.9-0.7-0.9-1.3c0-0.7,0-1.4,0-2.1c-0.1-0.8,0.5-1.4,1.2-1.5
		c0.1,0,0.2,0,0.3,0h34.3c0.4-0.1,0.8,0,1.2,0.2c0.4,0.2,0.7,0.7,0.7,1.2v2.1c0.1,0.8-0.5,1.5-1.2,1.5c-0.1,0-0.3,0-0.4,0H51.2z"/>
	<path class="st5" d="M20.2,57h-1.5V34.6c0-0.2,0-0.5,0-0.7h1.5c0,0.2,0,0.5,0,0.7L20.2,57z"/>
	<path class="st5" d="M51.2,18.7c0.5-0.1,1-0.1,1.5,0c0,6.7,0,13.4,0,20.1h-1.5V18.7z"/>
	<path class="st5" d="M52.7,57h-1.5c0-0.2,0-0.4,0-0.6c0-5.3,0-10.7,0-16h1.5c0,1.6,0,3.2,0,4.8C52.7,49.1,52.7,53.1,52.7,57z"/>
	<path class="st4" d="M52.7,40.3h-1.5c-1.3,0-2.6,0-3.8,0c0-0.5,0-1,0-1.6h7.1c0.5,0,0.9,0.3,0.9,0.8s-0.3,0.7-0.8,0.7L52.7,40.3z"
		/>
	<path class="st5" d="M51.2,62h1.5c0,0.9,0,1.8,0,2.7c0,0.6-0.3,0.9-0.8,0.9s-0.7-0.3-0.8-0.9C51.2,63.8,51.2,62.9,51.2,62z"/>
	<path class="st5" d="M18.8,62h1.5c0,0.9,0,1.8,0,2.7c0,0.4-0.3,0.8-0.7,0.8c0,0,0,0-0.1,0c-0.4,0-0.7-0.3-0.8-0.8L18.8,62L18.8,62z
		"/>
	<path class="st5" d="M40.4,32.4c0-4.6,0-9.2,0-13.8h1.5c0,4.5,0,9,0,13.5c0,0.2,0,0.4,0,0.6C41.5,32.5,40.9,32.3,40.4,32.4z"/>
	<path class="st5" d="M20.2,18.7c0,4.6,0,9.2,0,13.8h-1.5c0-4.1,0-8.2,0-12.3v-1.4H20.2z"/>
	<path class="st5" d="M29.6,32.4c0-4.1,0-8.2,0-12.4c0-0.5,0-0.9,0-1.4h1.5c0,4.6,0,9.2,0,13.7L29.6,32.4z"/>
	<path class="st6" d="M22.3,32.4v-6.7c0-0.8,0.1-0.9,0.9-0.9c0.2,0,0.4,0,0.5,0c0.2,0.2,0.2,0.5,0.2,0.7V41
		c-0.1,0.8,0.4,1.6,1.2,1.9c0.5,0.2,0.8,0.7,0.8,1.2c0,4.3,0,8.6,0,12.9h-3.6c0-7.7,0-15.3,0-23c0.3-0.1,0.7-0.2,0.8-0.6
		S22.9,32.6,22.3,32.4z"/>
	<path class="st6" d="M33.1,32.4v-6.7c0-0.9,0-0.9,1-0.9c0.1,0,0.3,0,0.4,0c0.2,0.2,0.2,0.5,0.2,0.7c0,5.1,0,10.3,0,15.4
		c-0.1,0.8,0.4,1.5,1.1,1.8c0.7,0.2,1.1,0.9,1,1.7c0,4.2,0,8.3,0,12.5h-3.7c0-7.7,0-15.3,0-23c0.3-0.1,0.7-0.2,0.8-0.7
		S33.6,32.5,33.1,32.4z"/>
	<path class="st6" d="M44.5,38.8v-6.6c0-0.9,0-1,1-1c0.2,0,0.4,0,0.5,0c0.1,0.2,0.2,0.5,0.2,0.8c0,4.1,0,8.2,0,12.4
		c0,0.5,0.2,1,0.6,1.3c0.4,0.2,0.6,0.6,0.5,1c0,3.4,0,6.8,0,10.2h-2.9c0-5.6,0-11.1,0-16.7c0.4-0.1,0.8-0.3,0.7-0.8
		S44.9,38.9,44.5,38.8z"/>
	<path class="st7" d="M36.3,34c0,2.3,0,4.7,0,7.1c-0.1,0.8,0.4,1.6,1.2,1.9c0.5,0.2,0.9,0.7,0.8,1.3c0,4.2,0,8.5,0,12.8h-1.6
		c0-4.2,0-8.3,0-12.5c0.1-0.7-0.3-1.4-1-1.7c-0.7-0.3-1.1-1.1-1-1.9c0-5.1,0-10.3,0-15.4c0-0.3,0-0.5-0.2-0.7h1.2
		c0.6,0,0.6,0.1,0.6,0.6c0,1.5,0,3,0,4.5c0,0.8,0,1.6,0,2.5C36.3,33,36.3,33.5,36.3,34z"/>
	<path class="st7" d="M25.5,34c0,2.4,0,4.7,0,7.1c-0.1,0.8,0.4,1.6,1.2,1.9c0.5,0.2,0.8,0.7,0.8,1.2c0,4.3,0,8.5,0,12.8h-1.6
		c0-4.3,0-8.6,0-12.9c0.1-0.5-0.3-1-0.8-1.2c-0.8-0.3-1.3-1.1-1.2-2V25.6c0-0.3,0-0.5-0.2-0.7h0.5c1.4,0,1.3-0.2,1.3,1.3V34z"/>
	<path class="st5" d="M31.1,34c0,5,0,10,0,14.9V57h-1.5c0-7.5,0-14.9,0-22.4c0-0.2,0-0.5,0-0.7L31.1,34z"/>
	<path class="st7" d="M47.4,40.3c0,1.3,0,2.7,0,4.1c-0.1,0.6,0.2,1.1,0.7,1.4c0.4,0.2,0.6,0.6,0.5,1.1c0,3.4,0,6.8,0,10.2h-1.3
		c0-3.4,0-6.8,0-10.2c0-0.4-0.2-0.8-0.5-1c-0.4-0.3-0.7-0.8-0.6-1.3c0-4.1,0-8.3,0-12.4c0-0.3,0-0.5-0.2-0.8
		c1.4-0.1,1.4-0.1,1.4,1.2c0,2.1,0,4.2,0,6.2C47.3,39.3,47.3,39.8,47.4,40.3z"/>
	<path class="st5" d="M41.9,40.3c0,4.3,0,8.7,0,13c0,1.2,0,2.4,0,3.6h-1.5V40.4c0-0.2,0-0.4,0-0.6C40.7,40.4,41.3,40.4,41.9,40.3z"
		/>
	<path class="st4" d="M36.3,34c0-0.5,0-1,0-1.5l4.1,0c0.5-0.1,1,0.1,1.5,0.4c0.1,0.3,0.1,0.5,0,0.8c-0.4,0.3-0.9,0.5-1.5,0.4
		C39,33.9,37.7,33.9,36.3,34z"/>
	<path class="st5" d="M40.4,34c0.5,0.1,1-0.1,1.5-0.4c0.1,1.2,0,2.4,0,3.6c0,0.5,0,1.1,0,1.6c-0.5-0.1-1.1,0-1.5,0.4L40.4,34z"/>
	<path class="st4" d="M40.4,39.2c0.4-0.3,0.9-0.5,1.5-0.4h2.6c0.4,0.1,0.7,0.3,0.7,0.7s-0.3,0.7-0.7,0.8h-2.6
		c-0.6,0-1.2,0.1-1.5-0.6C40.4,39.6,40.4,39.4,40.4,39.2z"/>
	<path class="st4" d="M31.1,34h-1.5c-1.4,0-2.7,0-4.1,0v-1.6c1.4,0,2.7,0,4.1,0h3.5c0.4,0.1,0.8,0.3,0.8,0.9s-0.4,0.6-0.8,0.7
		C32.4,33.9,31.8,33.9,31.1,34z"/>
</g>
<g id="Efw79j.tif-2">
	<path class="st8" d="M77.8,36.7c0.1,0.6,0,1.2-0.3,1.7c-0.1,0.2-0.3,0.2-0.6,0.2l-0.9-0.2c-0.3-0.2-0.7-0.3-1.1-0.3l-7.1-1.7
		l-1.2-0.3l-7.1-1.7l-1.2-0.3l-7.1-1.7l-1.1-0.3L49.9,32c-1.2-0.3-1-0.4-0.8-1.3c0.1-0.3,0.1-0.7,0.4-0.9L77.8,36.7z"/>
	<path class="st9" d="M45.6,42.5c0.3-0.3,0.7-0.3,1-0.2c0.4,0.1,0.8,0.2,1.1,0.3l1.1,0.3l1.6,0.4c0.4,0.3,0.5,0.5,0.4,0.8
		s-0.4,0.3-0.7,0.3c-0.5-0.2-1-0.3-1.6-0.4l-1.1-0.3c-0.4-0.1-0.8-0.2-1.2-0.3c-0.4,0-0.7-0.3-0.8-0.6L45.6,42.5z"/>
	<path class="st8" d="M67,71.1l-23.6-5.7l-1.2-0.3c-0.3,0-0.5-0.1-0.7-0.3c-0.4-0.3-0.5-0.7-0.4-1.1c0.1-0.5,0.3-1.1,0.4-1.6
		c0.1-0.6,0.6-1,1.2-1c0.1,0,0.2,0,0.3,0.1l0.3,0.1l1.2,0.3l1.6,0.4l2.7,0.7l1.2,0.3l1.6,0.4l1.2,0.3l1.6,0.4l2.7,0.7l1.2,0.3
		l1.6,0.4l1.2,0.3l2,0.5l2.2,0.5l1,0.2l2,0.5l1.2,0.3c0.3,0,0.6,0.2,0.9,0.4c0.3,0.3,0.4,0.6,0.3,1c-0.1,0.5-0.2,1-0.4,1.6
		c-0.1,0.6-0.6,1-1.2,1c-0.1,0-0.2,0-0.3-0.1h-0.2L67,71.1z"/>
	<path class="st9" d="M44.4,61.6l-1.2-0.3l4.1-17c0-0.2,0.1-0.3,0.1-0.5l1.1,0.3c0,0.2-0.1,0.4-0.1,0.5
		C47.1,50.3,45.7,55.9,44.4,61.6z"/>
	<path class="st9" d="M75,38.1c0.4,0,0.8,0.1,1.2,0.3c-1.3,5.1-2.5,10.2-3.8,15.3l-1.2-0.3L75,38.1z"/>
	<path class="st9" d="M69.1,67.5l-1.2-0.3c0-0.2,0.1-0.3,0.1-0.5c1-4.1,2-8.1,3-12.2l1.1,0.3l-0.9,3.7
		C70.5,61.5,69.8,64.5,69.1,67.5z"/>
	<path class="st9" d="M72.1,54.9L71,54.6c-1-0.3-1.9-0.5-2.9-0.7c0.1-0.4,0.2-0.8,0.3-1.2l2.9,0.7l1.2,0.3l1.3,0.3
		c0.3,0,0.6,0.4,0.5,0.7c0,0,0,0,0,0c-0.1,0.3-0.4,0.5-0.7,0.4c0,0,0,0,0,0L72.1,54.9z"/>
	<path class="st9" d="M67,71.1l1.2,0.3c-0.2,0.7-0.3,1.4-0.5,2c-0.1,0.4-0.4,0.6-0.7,0.5c-0.3-0.1-0.5-0.4-0.4-0.7c0,0,0,0,0-0.1
		L67,71.1z"/>
	<path class="st9" d="M42.3,65.1l1.2,0.3c-0.2,0.7-0.3,1.4-0.5,2.1c-0.1,0.3-0.4,0.5-0.7,0.4c-0.3-0.1-0.5-0.4-0.4-0.7l0,0
		c0-0.1,0-0.2,0.1-0.3C42,66.3,42.2,65.7,42.3,65.1z"/>
	<path class="st9" d="M64.2,46.6l2.5-10.5l1.2,0.3l-2.5,10.3c0,0.2-0.1,0.3-0.1,0.5C65,46.8,64.6,46.6,64.2,46.6z"/>
	<path class="st9" d="M51.4,32.4c-0.8,3.5-1.7,7-2.5,10.5l-1.1-0.3l2.2-9.4l0.3-1.1L51.4,32.4z"/>
	<path class="st9" d="M56,44.6c0.8-3.1,1.5-6.3,2.3-9.4c0.1-0.4,0.2-0.7,0.2-1.1l1.2,0.3c-0.9,3.5-1.7,7-2.5,10.5L56,44.6z"/>
	<path class="st10" d="M50.4,43.3c0.4-1.7,0.8-3.4,1.2-5.1c0.2-0.6,0.2-0.7,0.9-0.5c0.1,0,0.3,0.1,0.4,0.1c0.1,0.2,0.1,0.4,0,0.6
		c-0.9,3.9-1.9,7.8-2.8,11.7c-0.2,0.6,0,1.3,0.5,1.7c0.3,0.2,0.5,0.7,0.4,1c-0.8,3.2-1.6,6.5-2.4,9.8l-2.7-0.7l4.2-17.5
		c0.3,0,0.6,0,0.7-0.3S50.9,43.5,50.4,43.3z"/>
	<path class="st10" d="M58.7,45.2l1.2-5.1c0.2-0.7,0.2-0.7,0.9-0.5l0.3,0.1c0.1,0.2,0.1,0.4,0,0.6c-0.9,3.9-1.9,7.8-2.8,11.7
		c-0.2,0.6,0,1.2,0.5,1.6c0.5,0.3,0.6,0.9,0.4,1.4c-0.8,3.2-1.5,6.3-2.3,9.5l-2.7-0.7l4.2-17.5c0.3,0,0.6,0,0.7-0.4
		S59,45.4,58.7,45.2z"/>
	<path class="st10" d="M66.1,52.2c0.4-1.7,0.8-3.3,1.2-5c0.2-0.7,0.2-0.7,0.9-0.5c0.1,0,0.3,0.1,0.4,0.1c0.1,0.2,0.1,0.4,0,0.6
		c-0.8,3.1-1.5,6.3-2.3,9.4c-0.1,0.4,0,0.8,0.2,1.1c0.2,0.2,0.3,0.6,0.2,0.9c-0.6,2.6-1.2,5.2-1.9,7.8L62.8,66
		c1-4.2,2.1-8.4,3.1-12.7c0.3,0,0.6-0.1,0.7-0.5S66.4,52.3,66.1,52.2z"/>
	<path class="st11" d="M60.8,47c-0.4,1.8-0.9,3.6-1.3,5.4c-0.2,0.6,0,1.3,0.6,1.6c0.4,0.3,0.5,0.7,0.4,1.1c-0.8,3.2-1.6,6.5-2.4,9.7
		l-1.2-0.3c0.8-3.2,1.5-6.3,2.3-9.5c0.2-0.5,0-1.1-0.4-1.4c-0.5-0.4-0.7-1-0.5-1.6c0.9-3.9,1.9-7.8,2.8-11.7c0.1-0.2,0.1-0.4,0-0.6
		L62,40c0.4,0.1,0.5,0.2,0.4,0.6c-0.3,1.2-0.6,2.3-0.8,3.4c-0.2,0.6-0.3,1.2-0.4,1.9L60.8,47z"/>
	<path class="st11" d="M52.6,45c-0.4,1.8-0.9,3.6-1.3,5.4c-0.2,0.6,0,1.3,0.6,1.7c0.4,0.2,0.5,0.7,0.4,1.1c-0.8,3.2-1.6,6.5-2.4,9.8
		l-1.2-0.3c0.8-3.3,1.6-6.5,2.4-9.8c0.1-0.4,0-0.8-0.3-1c-0.5-0.4-0.8-1.1-0.5-1.7c0.9-3.9,1.9-7.8,2.8-11.7c0.1-0.2,0.1-0.4,0-0.6
		l0.4,0.1c1,0.2,1,0.1,0.8,1.2c-0.4,1.5-0.7,3-1.1,4.4l-0.1,0.4C52.8,44.2,52.7,44.6,52.6,45z"/>
	<path class="st9" d="M56.8,46c-0.9,3.8-1.8,7.6-2.7,11.3c-0.5,2-1,4.1-1.5,6.2l-1.2-0.3l4.1-17c0-0.2,0.1-0.3,0.1-0.5L56.8,46z"/>
	<path class="st11" d="M68.1,53.9L67.3,57c-0.1,0.4,0,0.9,0.3,1.2c0.2,0.2,0.3,0.6,0.2,0.9c-0.6,2.6-1.2,5.2-1.9,7.7l-1-0.2
		c0.6-2.6,1.2-5.2,1.9-7.8c0.1-0.3,0-0.7-0.2-0.9c-0.3-0.3-0.4-0.7-0.2-1.1c0.8-3.1,1.5-6.3,2.3-9.4c0.1-0.2,0.1-0.4,0-0.6
		c1.1,0.2,1.1,0.2,0.8,1.2l-1.1,4.7C68.2,53.1,68.1,53.5,68.1,53.9z"/>
	<path class="st9" d="M63.9,52.9c-0.8,3.3-1.6,6.6-2.4,9.9l-0.7,2.8l-1.2-0.3l3.1-12.7c0-0.2,0.1-0.3,0.1-0.4
		C63,52.7,63.4,52.8,63.9,52.9z"/>
	<path class="st9" d="M60.8,47l0.3-1.1l3.1,0.7c0.4,0.1,0.7,0.3,1,0.5c0,0.2,0,0.4-0.1,0.6c-0.4,0.2-0.8,0.2-1.2,0
		C62.9,47.5,61.9,47.2,60.8,47z"/>
	<path class="st9" d="M63.9,47.7c0.4,0.2,0.8,0.2,1.2,0c-0.2,0.9-0.4,1.8-0.6,2.7c-0.1,0.4-0.2,0.8-0.3,1.2c-0.4-0.2-0.8-0.2-1.2,0
		L63.9,47.7z"/>
	<path class="st9" d="M63,51.7c0.4-0.2,0.8-0.2,1.2,0l2,0.5c0.3,0.1,0.5,0.3,0.4,0.7s-0.4,0.5-0.7,0.5l-2-0.5
		c-0.4-0.1-0.9-0.2-1-0.7C62.9,52,62.9,51.9,63,51.7z"/>
	<path class="st9" d="M56.8,46l-1.1-0.3c-1-0.3-2.1-0.5-3.1-0.7c0.1-0.4,0.2-0.8,0.3-1.2c1,0.3,2.1,0.5,3.1,0.8l1.1,0.3l1.6,0.4
		c0.3,0.2,0.6,0.4,0.4,0.8s-0.4,0.3-0.7,0.4C57.9,46.2,57.4,46.1,56.8,46z"/>
</g>
</svg>
