<?xml version="1.0" encoding="utf-8"?>
<!-- Generator: Adobe Illustrator 24.0.0, SVG Export Plug-In . SVG Version: 6.00 Build 0)  -->
<svg version="1.1" id="Layer_1" xmlns="http://www.w3.org/2000/svg" xmlns:xlink="http://www.w3.org/1999/xlink" x="0px" y="0px"
	 viewBox="0 0 88 88" style="enable-background:new 0 0 88 88;" xml:space="preserve">
<style type="text/css">
	.st0{fill:#009B57;}
	.st1{clip-path:url(#SVGID_4_);}
	.st2{fill:#006838;}
	.st3{fill:#E0922D;}
	.st4{fill:#8D8674;}
	.st5{fill:#BDB39C;}
	.st6{fill:#6F0D30;}
	.st7{fill:#BB225C;}
	.st8{fill:#E5E1D7;}
</style>
<title>Artboard 43_1</title>
<g>
	<defs>
		<rect id="SVGID_1_" y="-99" width="88" height="88"/>
	</defs>
	<clipPath id="SVGID_2_">
		<use xlink:href="#SVGID_1_"  style="overflow:visible;"/>
	</clipPath>
</g>
<rect class="st0" width="88" height="88"/>
<g>
	<defs>
		<rect id="SVGID_3_" width="88" height="88"/>
	</defs>
	<clipPath id="SVGID_4_">
		<use xlink:href="#SVGID_3_"  style="overflow:visible;"/>
	</clipPath>
	<g class="st1">
		<circle class="st2" cx="44" cy="83.6" r="44.2"/>
	</g>
</g>
<path class="st3" d="M67,46.2c5.5-2.3,9.5-3.8,9.5-3.8c-4.7-0.5-9.2-2.1-13.2-4.6c2.1-1.1,4.4-2.3,6.8-3.4c3.6-1.7,5.4-6.4-0.1-12.1
	c-4.4-4.4-9.8-3.8-13-1c-4.4,4-9,7.7-14,10.9c-1.3,0.8-2.6,1.7-4.1,2.6c-4.8,2.9-9.7,5.6-14.8,8c-1.3,0.6-2.6,1.2-3.9,1.8
	c-0.6,0.2-1.2,0.5-1.8,0.8l0,0c-4.2,2-7,6.3-7,11c0,1.5,0.3,3.1,0.9,4.5c0.8,2,2.1,3.8,3.8,5.1l0,0c5.5,4.5,13.6,3.6,18.1-1.9
	c0.4-0.4,0.7-0.9,1-1.4c2.7-2.7,9.2-6.2,16.3-9.6c2.6,3.1,5.7,6,9.1,7.5l-2.6-5.7c0,0,4,1.8,6.1,1.7c0,0-2.5-1.1-7.2-5.9l1.3-0.6
	c5.1,1.6,11.5,2.8,16.5,1.4L69,48.7c0,0,4.2-1.1,5.8-2.5C74.8,46.2,72.6,46.8,67,46.2L67,46.2z"/>
<path class="st4" d="M34.9,63L34.9,63l-0.1,0.2v-0.1c0.1-0.4,0.2-0.8,0.2-1.3c0.3-2.3,0.1-4.7-0.7-6.9l-4,3.5
	c-1.1-4.5-5.6-7.2-10.1-6.1s-7.2,5.6-6.1,10.1c0.3,1.3,1,2.6,1.9,3.6c5.5,4.5,13.6,3.6,18.1-1.9c0.4-0.5,0.7-0.9,1-1.4
	C35.1,62.8,35.1,62.8,34.9,63L34.9,63L34.9,63z"/>
<path class="st5" d="M22.3,52.1c3.8,0,7.2,2.6,8.1,6.3l4-3.5c-1.8-5.1-6.3-8.8-11.7-9.6c-1.4-0.2-2.8-0.2-4.2,0c-4.2,2-7,6.3-7,11
	c0,1.5,0.3,3.1,0.9,4.5c0.8,2,2.1,3.8,3.8,5.1l0,0c-3.1-3.4-2.8-8.7,0.6-11.7C18.3,52.9,20.3,52.1,22.3,52.1L22.3,52.1z"/>
<path class="st5" d="M53.4,43.8c4.5,1.2,9,2,13.6,2.5c5.5-2.3,9.5-3.8,9.5-3.8c-4.7-0.5-9.2-2.1-13.2-4.6c-2.9,1.6-5.6,3.1-8,4.7
	L53.4,43.8L53.4,43.8z"/>
<path class="st5" d="M36.2,60.8l-0.4,0.7l-0.1,0.2c-0.1,0.2-0.2,0.4-0.3,0.5s-0.2,0.4-0.4,0.7c0.1-0.1,0.1-0.1,0.2-0.2
	c2.7-2.7,9.2-6.2,16.3-9.6c-1.3-1.6-2.6-3.3-3.7-5.1C43.3,51.6,39.3,55.9,36.2,60.8z"/>
<path class="st5" d="M56.8,50.7l1.3-0.6c-1-0.3-1.9-0.6-2.7-0.9C55.9,49.7,56.4,50.2,56.8,50.7z"/>
<path class="st6" d="M49.4,46.7L47.8,48c1.1,1.8,2.4,3.5,3.7,5.1c2.6,3.1,5.7,6,9.1,7.5l-2.6-5.7c0,0,4,1.8,6.1,1.7
	c0,0-2.5-1.1-7.2-5.9c-0.5-0.5-0.9-1-1.4-1.5C53.4,48.5,51.4,47.6,49.4,46.7L49.4,46.7z"/>
<path class="st7" d="M67,46.2c-4.6-0.5-9.1-1.3-13.6-2.5l1.9-1.3l0,0c-0.6-2-1.5-3.9-2.8-5.5c-2.3-2.9-5.8-4.6-9.6-4.8
	c-1.3,0.8-2.6,1.7-4.1,2.6c1.6,0.3,3.2,0.7,4.7,1.3c0.6,0.2,1.2,0.5,1.7,0.8c1.2,0.6,2.3,1.5,3.2,2.5c1,1.1,1.6,2.3,2,3.7
	c0.1,0.2,0.1,0.4,0.1,0.6c0.1,0.6,0.2,1.3,0.1,1.9l-1.4,1.1c2,0.9,4,1.7,6,2.5c0.8,0.3,1.8,0.6,2.7,0.9c5.1,1.6,11.5,2.8,16.5,1.4
	L69,48.7c0,0,4.2-1.1,5.8-2.5C74.8,46.2,72.6,46.8,67,46.2L67,46.2z"/>
<path class="st8" d="M22.7,45.4c8,1.1,13.5,8.5,12.4,16.4c0,0,0,0,0,0c-0.1,0.4-0.1,0.9-0.2,1.3v0.1L35,63l0,0l0-0.1
	c0.1-0.2,0.3-0.4,0.4-0.7c0.1-0.2,0.2-0.3,0.3-0.5l0.1-0.2l0.4-0.7c3.2-4.9,7.1-9.2,11.6-12.8l1.6-1.3l1.4-1.1
	c0.1-0.6,0-1.3-0.1-1.9c0-0.2-0.1-0.4-0.1-0.6c-0.4-1.4-1-2.6-2-3.7c-0.9-1-2-1.8-3.2-2.4c-0.6-0.3-1.1-0.6-1.7-0.8
	c-1.5-0.6-3.1-1-4.7-1.3c-4.8,2.9-9.7,5.6-14.8,8c-1.3,0.6-2.6,1.2-3.9,1.8c-0.6,0.2-1.2,0.5-1.8,0.8l0,0
	C19.8,45.2,21.3,45.2,22.7,45.4L22.7,45.4z"/>
<path class="st8" d="M52.6,37c1.3,1.6,2.2,3.5,2.8,5.5l0,0c2.4-1.6,5.1-3.1,8-4.7c2.1-1.1,4.4-2.3,6.8-3.4c3.6-1.7,5.4-6.4-0.2-12.1
	c-4.4-4.4-9.8-3.8-13-1c-4.4,4-9,7.7-14,10.9C46.7,32.4,50.2,34.1,52.6,37z"/>
</svg>
