{
    "endpoint": "opendata_jumlah_pendapatan_lain_yang_sah_jawa_barat",
    "model": [
        {
            "column": "pendapatan_daerah",
            "data_type": "String(255)",
            "is_primary": false
        },
        {
            "column": "jenis_pendapatan",
            "data_type": "String(255)",
            "is_primary": false
        },
        {
            "column": "jumlah",
            "data_type": "Integer",
            "is_primary": false
        },
        {
            "column": "satuan",
            "data_type": "String(255)",
            "is_primary": false
        },
        {
            "column": "tahun",
            "data_type": "String(255)",
            "is_primary": false
        },
        {
            "column": "id",
            "data_type": "Integer",
            "is_primary": true
        }
    ],
    "opd": "bpkad",
    "table_name": "opendata_jumlah_pendapatan_lain_yang_sah_jawa_barat"
}