{
    "endpoint": "opendata_luas_tanaman_semusim_perkebunan_negara_tebu",
    "model": [
        {
            "column": "provinsi",
            "data_type": "String(255)",
            "is_primary": false
        },
        {
            "column": "kode_kabupaten_kota",
            "data_type": "Integer",
            "is_primary": false
        },
        {
            "column": "nama_kabupaten_kota",
            "data_type": "String(255)",
            "is_primary": false
        },
        {
            "column": "kategori_kegiatan",
            "data_type": "String(255)",
            "is_primary": false
        },
        {
            "column": "luas_tanaman",
            "data_type": "String(255)",
            "is_primary": false
        },
        {
            "column": "satuan",
            "data_type": "String(255)",
            "is_primary": false
        },
        {
            "column": "tahun",
            "data_type": "String(255)",
            "is_primary": false
        },
        {
            "column": "id",
            "data_type": "Integer",
            "is_primary": true
        }
    ],
    "opd": "disbun",
    "table_name": "opendata_luas_tanaman_semusim_perkebunan_negara_tebu"
}