{
    "endpoint": "opendata_proyeksi_jumlah_penduduk_provinsi_jawa_barat",
    "model": [
        {
            "column": "provinsi",
            "data_type": "String(255)",
            "is_primary": false
        },
        {
            "column": "kode_kota_kabupaten",
            "data_type": "Integer",
            "is_primary": false
        },
        {
            "column": "nama_kota_kabupaten",
            "data_type": "String(255)",
            "is_primary": false
        },
        {
            "column": "kelompok_usia",
            "data_type": "String(255)",
            "is_primary": false
        },
        {
            "column": "proyeksi_jumlah_penduduk",
            "data_type": "String(255)",
            "is_primary": false
        },
        {
            "column": "satuan",
            "data_type": "String(255)",
            "is_primary": false
        },
        {
            "column": "tahun",
            "data_type": "String(255)",
            "is_primary": false
        },
        {
            "column": "id",
            "data_type": "Integer",
            "is_primary": true
        }
    ],
    "opd": "bps",
    "table_name": "opendata_proyeksi_jumlah_penduduk_provinsi_jawa_barat"
}