{
    "endpoint": "bulan",
    "model": [
        {
            "column": "id",
            "data_type": "Integer",
            "is_primary": true
        },
        {
            "column": "nama",
            "data_type": "String(255)",
            "is_primary": false
        }
    ],
    "opd": "bapenda",
    "table_name": "bulan"
}