{
    "endpoint": "wilayah_merge_kemendagri_2017_bps_2018_kabupaten",
    "model": [
        {
            "column": "id",
            "data_type": "Integer",
            "is_primary": true
        },
        {
            "column": "kemendagri_provinsi_kode",
            "data_type": "String(255)",
            "is_primary": false
        },
        {
            "column": "kemendagri_kabupaten_kode",
            "data_type": "String(255)",
            "is_primary": false
        },
        {
            "column": "kemendagri_provinsi_nama",
            "data_type": "String(255)",
            "is_primary": false
        },
        {
            "column": "kemendagri_kabupaten_nama",
            "data_type": "String(255)",
            "is_primary": false
        },
        {
            "column": "bps_provinsi_kode",
            "data_type": "String(255)",
            "is_primary": false
        },
        {
            "column": "bps_kabupaten_kode",
            "data_type": "String(255)",
            "is_primary": false
        },
        {
            "column": "bps_provinsi_nama",
            "data_type": "String(255)",
            "is_primary": false
        },
        {
            "column": "bps_kabupaten_nama",
            "data_type": "String(255)",
            "is_primary": false
        },
        {
            "column": "latitude",
            "data_type": "String(255)",
            "is_primary": false
        },
        {
            "column": "longitude",
            "data_type": "String(255)",
            "is_primary": false
        },
        {
            "column": "polygon_json",
            "data_type": "String(255)",
            "is_primary": false
        }
    ],
    "opd": "master",
    "table_name": "wilayah_merge_kemendagri_2017_bps_2018_kabupaten"
}