{
    "endpoint": "opendata_pengeluaran_perkapita_berdasarkan_provinsi",
    "model": [
        {
            "column": "kode_provinsi",
            "data_type": "Integer",
            "is_primary": false
        },
        {
            "column": "provinsi",
            "data_type": "String(255)",
            "is_primary": false
        },
        {
            "column": "pengeluaran_perkapita",
            "data_type": "String(255)",
            "is_primary": false
        },
        {
            "column": "satuan",
            "data_type": "String(255)",
            "is_primary": false
        },
        {
            "column": "tahun",
            "data_type": "String(255)",
            "is_primary": false
        },
        {
            "column": "id",
            "data_type": "Integer",
            "is_primary": true
        }
    ],
    "opd": "bps",
    "table_name": "opendata_pengeluaran_perkapita_berdasarkan_provinsi"
}