{
    "endpoint": "dashboard_kategori",
    "model": [
        {
            "column": "id",
            "data_type": "Integer",
            "is_primary": true
        },
        {
            "column": "namakategori",
            "data_type": "String(255)",
            "is_primary": false
        },
        {
            "column": "description",
            "data_type": "String(255)",
            "is_primary": false
        }
    ],
    "opd": "pbj",
    "table_name": "dashboard_kategori"
}