{
    "endpoint": "dim_program",
    "model": [
        {
            "column": "idprogram",
            "data_type": "Integer",
            "is_primary": false
        },
        {
            "column": "tahun",
            "data_type": "Integer",
            "is_primary": false
        },
        {
            "column": "iddaerah",
            "data_type": "Integer",
            "is_primary": false
        },
        {
            "column": "idurusan",
            "data_type": "Integer",
            "is_primary": false
        },
        {
            "column": "kodeprogram",
            "data_type": "String(255)",
            "is_primary": false
        },
        {
            "column": "namaprogram",
            "data_type": "String(255)",
            "is_primary": false
        },
        {
            "column": "noprogram",
            "data_type": "String(255)",
            "is_primary": false
        },
        {
            "column": "islocked",
            "data_type": "Integer",
            "is_primary": false
        },
        {
            "column": "id",
            "data_type": "Integer",
            "is_primary": true
        }
    ],
    "opd": "pbj",
    "table_name": "dim_program"
}