{
    "endpoint": "opendata_luas_daerah_irigasi_tambak_ws_citarum_dan_permen",
    "model": [
        {
            "column": "provinsi",
            "data_type": "String(255)",
            "is_primary": false
        },
        {
            "column": "daerah_irigasi",
            "data_type": "String(255)",
            "is_primary": false
        },
        {
            "column": "kode_kota_kabupaten",
            "data_type": "Integer",
            "is_primary": false
        },
        {
            "column": "lokasi_kota_kabupaten",
            "data_type": "String(255)",
            "is_primary": false
        },
        {
            "column": "luas_permen_pupr",
            "data_type": "Integer",
            "is_primary": false
        },
        {
            "column": "satuan",
            "data_type": "String(255)",
            "is_primary": false
        },
        {
            "column": "tahun",
            "data_type": "String(255)",
            "is_primary": false
        },
        {
            "column": "id",
            "data_type": "Integer",
            "is_primary": true
        }
    ],
    "opd": "psda",
    "table_name": "opendata_luas_daerah_irigasi_tambak_ws_citarum_dan_permen"
}