{
    "endpoint": "opendata_produksi_tanaman_semusim_perkebunan_rakyat",
    "model": [
        {
            "column": "provinsi",
            "data_type": "String(255)",
            "is_primary": false
        },
        {
            "column": "kode_kabupaten_atau_kota",
            "data_type": "Integer",
            "is_primary": false
        },
        {
            "column": "kabupaten_atau_kota",
            "data_type": "String(255)",
            "is_primary": false
        },
        {
            "column": "jenis_komoditi",
            "data_type": "String(255)",
            "is_primary": false
        },
        {
            "column": "jumlah_produksi",
            "data_type": "String(255)",
            "is_primary": false
        },
        {
            "column": "satuan",
            "data_type": "String(255)",
            "is_primary": false
        },
        {
            "column": "tahun",
            "data_type": "String(255)",
            "is_primary": false
        },
        {
            "column": "id",
            "data_type": "Integer",
            "is_primary": true
        }
    ],
    "opd": "disbun",
    "table_name": "opendata_produksi_tanaman_semusim_perkebunan_rakyat"
}