{
    "endpoint": "opendata_persentase_cakupan_pelayanan_air_minum_provinsi_jawa",
    "model": [
        {
            "column": "provinsi",
            "data_type": "String(255)",
            "is_primary": false
        },
        {
            "column": "kode_kota_kabupaten",
            "data_type": "Integer",
            "is_primary": false
        },
        {
            "column": "nama_kota_kabupaten",
            "data_type": "String(255)",
            "is_primary": false
        },
        {
            "column": "cakupan",
            "data_type": "String(255)",
            "is_primary": false
        },
        {
            "column": "presentase",
            "data_type": "String(255)",
            "is_primary": false
        },
        {
            "column": "satuan",
            "data_type": "String(255)",
            "is_primary": false
        },
        {
            "column": "tahun",
            "data_type": "String(255)",
            "is_primary": false
        },
        {
            "column": "id",
            "data_type": "Integer",
            "is_primary": true
        }
    ],
    "opd": "disperkim",
    "table_name": "opendata_persentase_cakupan_pelayanan_air_minum_provinsi_jawa"
}