{
    "endpoint": "opendata_sungai_non_lintas_provinsi_jawa_barat",
    "model": [
        {
            "column": "provinsi",
            "data_type": "String(255)",
            "is_primary": false
        },
        {
            "column": "kode_kota_kabupaten",
            "data_type": "Integer",
            "is_primary": false
        },
        {
            "column": "nama_kota_kabupaten",
            "data_type": "String(255)",
            "is_primary": false
        },
        {
            "column": "sungai_non_lintas",
            "data_type": "String(255)",
            "is_primary": false
        },
        {
            "column": "jumlah_sungai",
            "data_type": "Integer",
            "is_primary": false
        },
        {
            "column": "satuan",
            "data_type": "String(255)",
            "is_primary": false
        },
        {
            "column": "tahun",
            "data_type": "String(255)",
            "is_primary": false
        },
        {
            "column": "id",
            "data_type": "Integer",
            "is_primary": true
        }
    ],
    "opd": "psda",
    "table_name": "opendata_sungai_non_lintas_provinsi_jawa_barat"
}