{
    "endpoint": "opendata_pos_duga_air_ws_citanduy",
    "model": [
        {
            "column": "provinsi",
            "data_type": "String(255)",
            "is_primary": false
        },
        {
            "column": "desa",
            "data_type": "String(255)",
            "is_primary": false
        },
        {
            "column": "kecamatan",
            "data_type": "String(255)",
            "is_primary": false
        },
        {
            "column": "kode_kota_kabupaten",
            "data_type": "Integer",
            "is_primary": false
        },
        {
            "column": "kota_kabupaten",
            "data_type": "String(255)",
            "is_primary": false
        },
        {
            "column": "sungai",
            "data_type": "String(255)",
            "is_primary": false
        },
        {
            "column": "das",
            "data_type": "String(255)",
            "is_primary": false
        },
        {
            "column": "nama_pos",
            "data_type": "String(255)",
            "is_primary": false
        },
        {
            "column": "nomor_pos",
            "data_type": "String(255)",
            "is_primary": false
        },
        {
            "column": "luas",
            "data_type": "String(255)",
            "is_primary": false
        },
        {
            "column": "satuan",
            "data_type": "String(255)",
            "is_primary": false
        },
        {
            "column": "tahun",
            "data_type": "String(255)",
            "is_primary": false
        },
        {
            "column": "id",
            "data_type": "Integer",
            "is_primary": true
        }
    ],
    "opd": "psda",
    "table_name": "opendata_pos_duga_air_ws_citanduy"
}