{
    "endpoint": "dim_satker",
    "model": [
        {
            "column": "kd_satker",
            "data_type": "Float",
            "is_primary": false
        },
        {
            "column": "nama_lpse",
            "data_type": "String(255)",
            "is_primary": false
        },
        {
            "column": "nama_satker",
            "data_type": "String(255)",
            "is_primary": false
        },
        {
            "column": "id",
            "data_type": "Integer",
            "is_primary": true
        }
    ],
    "opd": "pbj",
    "table_name": "dim_satker"
}