{
    "endpoint": "dim_giat_bl",
    "model": [
        {
            "column": "idgiat",
            "data_type": "Integer",
            "is_primary": false
        },
        {
            "column": "idbl",
            "data_type": "Integer",
            "is_primary": false
        },
        {
            "column": "id",
            "data_type": "Integer",
            "is_primary": true
        }
    ],
    "opd": "pbj",
    "table_name": "dim_giat_bl"
}