{
    "endpoint": "opendata_jumlah_kepala_sekolah_dan_guru_smk_status_sekolah",
    "model": [
        {
            "column": "provinsi",
            "data_type": "String(255)",
            "is_primary": false
        },
        {
            "column": "kode_kota_kabupaten",
            "data_type": "Integer",
            "is_primary": false
        },
        {
            "column": "nama_kota_kabupaten",
            "data_type": "String(255)",
            "is_primary": false
        },
        {
            "column": "jenis_kelamin",
            "data_type": "String(255)",
            "is_primary": false
        },
        {
            "column": "status_sekolah",
            "data_type": "String(255)",
            "is_primary": false
        },
        {
            "column": "jumlah",
            "data_type": "Integer",
            "is_primary": false
        },
        {
            "column": "satuan",
            "data_type": "String(255)",
            "is_primary": false
        },
        {
            "column": "tahun",
            "data_type": "String(255)",
            "is_primary": false
        },
        {
            "column": "id",
            "data_type": "Integer",
            "is_primary": true
        }
    ],
    "opd": "disdik",
    "table_name": "opendata_jumlah_kepala_sekolah_dan_guru_smk_status_sekolah"
}