{
    "endpoint": "opendata_kode_wilayah_kota_kabupaten",
    "model": [
        {
            "column": "id",
            "data_type": "Integer",
            "is_primary": false
        },
        {
            "column": "kemendagri_provinsi_kode",
            "data_type": "Integer",
            "is_primary": false
        },
        {
            "column": "kemendagri_kabupaten_kode",
            "data_type": "String(255)",
            "is_primary": false
        },
        {
            "column": "kemendagri_provinsi_nama",
            "data_type": "String(255)",
            "is_primary": false
        },
        {
            "column": "kemendagri_kabupaten_nama",
            "data_type": "String(255)",
            "is_primary": false
        },
        {
            "column": "bps_provinsi_kode",
            "data_type": "Integer",
            "is_primary": false
        },
        {
            "column": "bps_kabupaten_kode",
            "data_type": "Integer",
            "is_primary": false
        },
        {
            "column": "bps_provinsi_nama",
            "data_type": "String(255)",
            "is_primary": false
        },
        {
            "column": "bps_kabupaten_nama",
            "data_type": "String(255)",
            "is_primary": false
        },
        {
            "column": "latitude",
            "data_type": "String(255)",
            "is_primary": false
        },
        {
            "column": "longitude",
            "data_type": "String(255)",
            "is_primary": false
        },
        {
            "column": "geojson",
            "data_type": "String(255)",
            "is_primary": false
        },
        {
            "column": "tahun",
            "data_type": "String(255)",
            "is_primary": false
        },
        {
            "column": "id_serial",
            "data_type": "Integer",
            "is_primary": true
        }
    ],
    "opd": "jds",
    "table_name": "opendata_kode_wilayah_kota_kabupaten"
}