{
    "endpoint": "opendata_jumlah_pengeluaran_ayam_buras_ke_provinsi_jawa",
    "model": [
        {
            "column": "provinsi",
            "data_type": "String(255)",
            "is_primary": false
        },
        {
            "column": "kode_kota_kabupaten",
            "data_type": "Integer",
            "is_primary": false
        },
        {
            "column": "nama_kota_kabupaten",
            "data_type": "String(255)",
            "is_primary": false
        },
        {
            "column": "jumlah",
            "data_type": "Integer",
            "is_primary": false
        },
        {
            "column": "satuan",
            "data_type": "String(255)",
            "is_primary": false
        },
        {
            "column": "tahun",
            "data_type": "String(255)",
            "is_primary": false
        },
        {
            "column": "id",
            "data_type": "Integer",
            "is_primary": true
        }
    ],
    "opd": "dkpp",
    "table_name": "opendata_jumlah_pengeluaran_ayam_buras_ke_provinsi_jawa"
}