{
    "endpoint": "spse_dim_paket",
    "model": [
        {
            "column": "kd_paket",
            "data_type": "Float",
            "is_primary": true
        },
        {
            "column": "nama_paket",
            "data_type": "String(255)",
            "is_primary": false
        }
    ],
    "opd": "pbj",
    "table_name": "spse_dim_paket"
}