{
    "components": {
        "schemas": {
            "ModelPodes201832KabupatenKetBody": {
                "properties": {
                    "Kategori_Isian": {
                        "type": "string"
                    },
                    "Keterangan": {
                        "type": "string"
                    },
                    "Nama_Variabel": {
                        "type": "string"
                    },
                    "No": {
                        "type": "integer"
                    }
                },
                "type": "object"
            },
            "ModelPodes201832KabupatenKetResponse": {
                "properties": {
                    "Kategori_Isian": {
                        "type": "string"
                    },
                    "Keterangan": {
                        "type": "string"
                    },
                    "Nama_Variabel": {
                        "type": "string"
                    },
                    "No": {
                        "type": "integer"
                    },
                    "id": {
                        "type": "integer"
                    }
                },
                "type": "object"
            }
        },
        "securitySchemes": {
            "bearerAuth": {
                "bearerFormat": "JWT",
                "scheme": "bearer",
                "type": "http"
            }
        }
    },
    "info": {
        "contact": {
            "email": "data.jabardigitalservice@gmail.com"
        },
        "description": "This is Core Data Jawa Barat API Documentation, <br>Made with \u2764 by Jabar Digital Service.",
        "license": {
            "name": "MIT",
            "url": "https://opensource.org/licenses/MIT"
        },
        "title": "Core Data Jawa Barat API Documentation",
        "version": "1.0.0"
    },
    "openapi": "3.0.0",
    "paths": {
        "/podes2018_32_kabupaten_ket": {
            "get": {
                "parameters": [
                    {
                        "description": "Limit value is number. ex : ?limit=100",
                        "in": "query",
                        "name": "limit",
                        "required": false,
                        "schema": {
                            "type": "integer"
                        }
                    },
                    {
                        "description": "Skip value is number. ex : ?skip=100",
                        "in": "query",
                        "name": "skip",
                        "required": false,
                        "schema": {
                            "type": "integer"
                        }
                    },
                    {
                        "description": "Sort value is string with rule column-name:order. ex : ?sort=id:asc",
                        "in": "query",
                        "name": "sort",
                        "required": false,
                        "schema": {
                            "type": "string"
                        }
                    },
                    {
                        "description": "Where value is object. ex : ?where={'name':'john', 'dob':'1990-12-31'}",
                        "in": "query",
                        "name": "where",
                        "required": false,
                        "schema": {
                            "type": "object"
                        }
                    },
                    {
                        "description": "Count value is boolean. ex : ?count=true",
                        "in": "query",
                        "name": "count",
                        "required": false,
                        "schema": {
                            "type": "boolean"
                        }
                    },
                    {
                        "description": "Search value is string. ex : ?search=education",
                        "in": "query",
                        "name": "search",
                        "required": false,
                        "schema": {
                            "type": "string"
                        }
                    },
                    {
                        "description": "Exclude value is array string separated by comma. ex : ?exclude=polygon_json,latitude,longitude",
                        "in": "query",
                        "name": "exclude",
                        "required": false,
                        "schema": {
                            "type": "string"
                        }
                    },
                    {
                        "description": "Download value is string, pick one of : csv or pdf. ex : ?download=csv",
                        "in": "query",
                        "name": "download",
                        "required": false,
                        "schema": {
                            "type": "string"
                        }
                    }
                ],
                "responses": {
                    "200": {
                        "content": {
                            "application/json": {
                                "schema": {
                                    "properties": {
                                        "data": {
                                            "$ref": "#/components/schemas/ModelPodes201832KabupatenKetResponse"
                                        },
                                        "error": {
                                            "type": "integer"
                                        },
                                        "message": {
                                            "type": "string"
                                        },
                                        "metadata": {
                                            "type": "object"
                                        }
                                    },
                                    "type": "object"
                                }
                            }
                        },
                        "description": "OK"
                    }
                },
                "security": [
                    {
                        "bearerAuth": []
                    }
                ],
                "tags": [
                    "Podes201832KabupatenKet"
                ]
            }
        },
        "/podes2018_32_kabupaten_ket/{id}": {
            "get": {
                "parameters": [
                    {
                        "in": "path",
                        "name": "id",
                        "required": true,
                        "schema": {
                            "type": "integer"
                        }
                    },
                    {
                        "in": "query",
                        "name": "exclude",
                        "required": false,
                        "schema": {
                            "type": "string"
                        }
                    }
                ],
                "responses": {
                    "200": {
                        "content": {
                            "application/json": {
                                "schema": {
                                    "properties": {
                                        "data": {
                                            "$ref": "#/components/schemas/ModelPodes201832KabupatenKetResponse"
                                        },
                                        "error": {
                                            "type": "integer"
                                        },
                                        "message": {
                                            "type": "string"
                                        }
                                    },
                                    "type": "object"
                                }
                            }
                        },
                        "description": "OK"
                    }
                },
                "security": [
                    {
                        "bearerAuth": []
                    }
                ],
                "tags": [
                    "Podes201832KabupatenKet"
                ]
            }
        }
    },
    "servers": [
        {
            "url": "/bps/"
        }
    ]
}