{
    "endpoint": "kependudukan",
    "model": [
        {
            "column": "nokabupaten",
            "data_type": "String(255)",
            "is_primary": false
        },
        {
            "column": "kodekabupaten",
            "data_type": "String(255)",
            "is_primary": false
        },
        {
            "column": "kodekabupaten1",
            "data_type": "String(255)",
            "is_primary": false
        },
        {
            "column": "namakabupaten",
            "data_type": "String(255)",
            "is_primary": false
        },
        {
            "column": "nokecamatan",
            "data_type": "String(255)",
            "is_primary": false
        },
        {
            "column": "kodekecamatan",
            "data_type": "String(255)",
            "is_primary": false
        },
        {
            "column": "namakecamatan",
            "data_type": "String(255)",
            "is_primary": false
        },
        {
            "column": "nokelurahan",
            "data_type": "String(255)",
            "is_primary": false
        },
        {
            "column": "kodekelurahan",
            "data_type": "String(255)",
            "is_primary": false
        },
        {
            "column": "namakelurahan",
            "data_type": "String(255)",
            "is_primary": false
        },
        {
            "column": "norw",
            "data_type": "Integer",
            "is_primary": false
        },
        {
            "column": "nort",
            "data_type": "Integer",
            "is_primary": false
        },
        {
            "column": "jumlah_kk",
            "data_type": "Integer",
            "is_primary": false
        },
        {
            "column": "lakilaki",
            "data_type": "Integer",
            "is_primary": false
        },
        {
            "column": "perempuan",
            "data_type": "Integer",
            "is_primary": false
        },
        {
            "column": "total",
            "data_type": "Integer",
            "is_primary": false
        },
        {
            "column": "id",
            "data_type": "Integer",
            "is_primary": true
        }
    ],
    "opd": "disdukcapil",
    "table_name": "kependudukan"
}