{
    "endpoint": "dashboard_paket",
    "model": [
        {
            "column": "idrup",
            "data_type": "Integer",
            "is_primary": false
        },
        {
            "column": "idlelang",
            "data_type": "Integer",
            "is_primary": false
        },
        {
            "column": "namapaket",
            "data_type": "String(255)",
            "is_primary": false
        },
        {
            "column": "pagu",
            "data_type": "Float",
            "is_primary": false
        },
        {
            "column": "kodekegiatan",
            "data_type": "String",
            "is_primary": false
        },
        {
            "column": "idmetodepemilihan",
            "data_type": "Integer",
            "is_primary": false
        },
        {
            "column": "idkategori",
            "data_type": "Integer",
            "is_primary": false
        },
        {
            "column": "idtahapan",
            "data_type": "Integer",
            "is_primary": false
        },
        {
            "column": "idpenyedia",
            "data_type": "Integer",
            "is_primary": false
        },
        {
            "column": "idsatker",
            "data_type": "Integer",
            "is_primary": false
        },
        {
            "column": "tahun",
            "data_type": "Integer",
            "is_primary": false
        },
        {
            "column": "isselesai",
            "data_type": "Boolean",
            "is_primary": false
        },
        {
            "column": "start_date",
            "data_type": "DateTime(True)",
            "is_primary": false
        },
        {
            "column": "end_date",
            "data_type": "DateTime(True)",
            "is_primary": false
        },
        {
            "column": "updated_date",
            "data_type": "DateTime(True)",
            "is_primary": false
        },
        {
            "column": "hps",
            "data_type": "Float",
            "is_primary": false
        },
        {
            "column": "pagu_selesai",
            "data_type": "Float",
            "is_primary": false
        },
        {
            "column": "isactive",
            "data_type": "Boolean",
            "is_primary": false
        },
        {
            "column": "isumumkan",
            "data_type": "Boolean",
            "is_primary": false
        },
        {
            "column": "id",
            "data_type": "Integer",
            "is_primary": true
        }
    ],
    "opd": "pbj",
    "table_name": "dashboard_paket"
}