{
    "endpoint": "dashboard_subskpd",
    "model": [
        {
            "column": "id",
            "data_type": "Integer",
            "is_primary": true
        },
        {
            "column": "kodesubskpd",
            "data_type": "String(255)",
            "is_primary": false
        },
        {
            "column": "namasubskpd",
            "data_type": "String(255)",
            "is_primary": false
        },
        {
            "column": "idskpd",
            "data_type": "Integer",
            "is_primary": false
        }
    ],
    "opd": "pbj",
    "table_name": "dashboard_subskpd"
}