{
    "endpoint": "podes2014_32_kabupaten",
    "model": [
        {
            "column": "LEVEL_WILA",
            "data_type": "String(1)",
            "is_primary": false
        },
        {
            "column": "R101",
            "data_type": "String(2)",
            "is_primary": false
        },
        {
            "column": "R101N",
            "data_type": "String(200)",
            "is_primary": false
        },
        {
            "column": "R102",
            "data_type": "String(2)",
            "is_primary": false
        },
        {
            "column": "R102N",
            "data_type": "String(200)",
            "is_primary": false
        },
        {
            "column": "KBR401AK2",
            "data_type": "Integer",
            "is_primary": false
        },
        {
            "column": "KBR401BK2",
            "data_type": "Integer",
            "is_primary": false
        },
        {
            "column": "KBR402",
            "data_type": "Integer",
            "is_primary": false
        },
        {
            "column": "KBR501AK2",
            "data_type": "String(1)",
            "is_primary": false
        },
        {
            "column": "KBR501AK3",
            "data_type": "Integer",
            "is_primary": false
        },
        {
            "column": "KBR501BK2",
            "data_type": "String(1)",
            "is_primary": false
        },
        {
            "column": "KBR501BK3",
            "data_type": "Integer",
            "is_primary": false
        },
        {
            "column": "KBR501CK2",
            "data_type": "String(1)",
            "is_primary": false
        },
        {
            "column": "KBR501CK3",
            "data_type": "Integer",
            "is_primary": false
        },
        {
            "column": "KBR501DK2",
            "data_type": "String(1)",
            "is_primary": false
        },
        {
            "column": "KBR501DK3",
            "data_type": "Integer",
            "is_primary": false
        },
        {
            "column": "KBR501EK2",
            "data_type": "String(1)",
            "is_primary": false
        },
        {
            "column": "KBR501EK3",
            "data_type": "Integer",
            "is_primary": false
        },
        {
            "column": "KBR601A",
            "data_type": "String(1)",
            "is_primary": false
        },
        {
            "column": "KBR601B",
            "data_type": "Integer",
            "is_primary": false
        },
        {
            "column": "KBR602",
            "data_type": "Integer",
            "is_primary": false
        },
        {
            "column": "KBR701AK2",
            "data_type": "String(1)",
            "is_primary": false
        },
        {
            "column": "KBR701AK3",
            "data_type": "Integer",
            "is_primary": false
        },
        {
            "column": "KBR701BK2",
            "data_type": "String(1)",
            "is_primary": false
        },
        {
            "column": "KBR701BK3",
            "data_type": "Integer",
            "is_primary": false
        },
        {
            "column": "KBR701CK2",
            "data_type": "String(1)",
            "is_primary": false
        },
        {
            "column": "KBR701CK3",
            "data_type": "Integer",
            "is_primary": false
        },
        {
            "column": "KBR701DK2",
            "data_type": "String(1)",
            "is_primary": false
        },
        {
            "column": "KBR701DK3",
            "data_type": "Integer",
            "is_primary": false
        },
        {
            "column": "KBR702A",
            "data_type": "String(1)",
            "is_primary": false
        },
        {
            "column": "KBR702B",
            "data_type": "String(4)",
            "is_primary": false
        },
        {
            "column": "KBR702C1",
            "data_type": "Integer",
            "is_primary": false
        },
        {
            "column": "KBR702C2",
            "data_type": "Integer",
            "is_primary": false
        },
        {
            "column": "KBR702C3",
            "data_type": "Integer",
            "is_primary": false
        },
        {
            "column": "KBR801A",
            "data_type": "String(1)",
            "is_primary": false
        },
        {
            "column": "KBR801B",
            "data_type": "String(1)",
            "is_primary": false
        },
        {
            "column": "KBR901AK2",
            "data_type": "String(1)",
            "is_primary": false
        },
        {
            "column": "KBR901AK3",
            "data_type": "Integer",
            "is_primary": false
        },
        {
            "column": "KBR901AK4",
            "data_type": "String(1)",
            "is_primary": false
        },
        {
            "column": "KBR901AK5",
            "data_type": "String(1)",
            "is_primary": false
        },
        {
            "column": "KBR901BK2",
            "data_type": "String(1)",
            "is_primary": false
        },
        {
            "column": "KBR901BK3",
            "data_type": "Integer",
            "is_primary": false
        },
        {
            "column": "KBR901BK4",
            "data_type": "String(1)",
            "is_primary": false
        },
        {
            "column": "KBR901BK5",
            "data_type": "String(1)",
            "is_primary": false
        },
        {
            "column": "KBR901CK2",
            "data_type": "String(1)",
            "is_primary": false
        },
        {
            "column": "KBR901CK3",
            "data_type": "Integer",
            "is_primary": false
        },
        {
            "column": "KBR901CK4",
            "data_type": "String(1)",
            "is_primary": false
        },
        {
            "column": "KBR901CK5",
            "data_type": "String(1)",
            "is_primary": false
        },
        {
            "column": "FILTER__",
            "data_type": "Integer",
            "is_primary": false
        },
        {
            "column": "id",
            "data_type": "Integer",
            "is_primary": true
        }
    ],
    "opd": "bps",
    "table_name": "podes2014_32_kabupaten"
}