{
    "endpoint": "opendata_jumlah_pengeluaran_sapi_potong_ke_provinsi_jawa_barat",
    "model": [
        {
            "column": "provinsi",
            "data_type": "String(20)",
            "is_primary": false
        },
        {
            "column": "kode_kota_kabupaten",
            "data_type": "Integer",
            "is_primary": false
        },
        {
            "column": "nama_kota_kabupaten",
            "data_type": "String(50)",
            "is_primary": false
        },
        {
            "column": "jenis",
            "data_type": "String(40)",
            "is_primary": false
        },
        {
            "column": "jumlah",
            "data_type": "Integer",
            "is_primary": false
        },
        {
            "column": "satuan",
            "data_type": "String(5)",
            "is_primary": false
        },
        {
            "column": "tahun",
            "data_type": "Integer",
            "is_primary": false
        },
        {
            "column": "id",
            "data_type": "Integer",
            "is_primary": true
        }
    ],
    "opd": "dkpp",
    "table_name": "opendata_jumlah_pengeluaran_sapi_potong_ke_provinsi_jawa_barat"
}