{
    "endpoint": "opendata_fasilitas_kesehatan",
    "model": [
        {
            "column": "id",
            "data_type": "Integer",
            "is_primary": true
        },
        {
            "column": "id_tipe_faskes",
            "data_type": "Integer",
            "is_primary": false
        },
        {
            "column": "kode_unit_dinkes",
            "data_type": "String(50)",
            "is_primary": false
        },
        {
            "column": "nama_faskes",
            "data_type": "String(400)",
            "is_primary": false
        },
        {
            "column": "kode_kab_bps",
            "data_type": "String(100)",
            "is_primary": false
        },
        {
            "column": "nama_kab",
            "data_type": "String(200)",
            "is_primary": false
        },
        {
            "column": "nama_kec",
            "data_type": "String(200)",
            "is_primary": false
        },
        {
            "column": "nama_kel",
            "data_type": "String(200)",
            "is_primary": false
        },
        {
            "column": "alamat",
            "data_type": "String(600)",
            "is_primary": false
        },
        {
            "column": "longitude",
            "data_type": "Float",
            "is_primary": false
        },
        {
            "column": "latitude",
            "data_type": "Float",
            "is_primary": false
        },
        {
            "column": "nomor_rujukan_covid19",
            "data_type": "Integer",
            "is_primary": false
        }
    ],
    "opd": "diskes",
    "table_name": "opendata_fasilitas_kesehatan"
}