<svg width="32" height="24" viewBox="0 0 32 24" fill="none" xmlns="http://www.w3.org/2000/svg">
<g clip-path="url(#clip0_404_6868)">
<path d="M31.293 4.25937C31.1095 3.58107 30.7514 2.96268 30.2546 2.46578C29.7577 1.96889 29.1393 1.61083 28.461 1.42725C25.9778 0.75 15.9835 0.75 15.9835 0.75C15.9835 0.75 5.98878 0.7705 3.50553 1.44775C2.82722 1.63134 2.20883 1.98942 1.71196 2.48634C1.21509 2.98326 0.857057 3.60167 0.67353 4.28C-0.0775951 8.69225 -0.36897 15.4155 0.694155 19.6512C0.877701 20.3296 1.23574 20.9479 1.73261 21.4448C2.22948 21.9417 2.84786 22.2998 3.52615 22.4834C6.0094 23.1606 16.0039 23.1606 16.0039 23.1606C16.0039 23.1606 25.9983 23.1606 28.4814 22.4834C29.1597 22.2998 29.7781 21.9418 30.275 21.4449C30.7719 20.948 31.13 20.3296 31.3135 19.6512C32.1058 15.2327 32.3499 8.51375 31.293 4.2595V4.25937Z" fill="black"/>
<path d="M12.8025 16.7576L21.0936 11.9553L12.8026 7.15308L12.8025 16.7576Z" fill="white"/>
</g>
<defs>
<clipPath id="clip0_404_6868">
<rect width="32" height="22.5" fill="white" transform="translate(0 0.75)"/>
</clipPath>
</defs>
</svg>
