<svg width="24" height="24" viewBox="0 0 24 24" fill="none" xmlns="http://www.w3.org/2000/svg">
<rect x="0.5" y="0.5" width="23" height="23" rx="5.5" fill="white"/>
<path d="M13.4018 7.6087C12.9995 8.30501 12.8382 9.11466 12.943 9.91201C13.0478 10.7094 13.4129 11.4498 13.9815 12.0185C14.5502 12.5871 15.2906 12.9522 16.088 13.057C16.8853 13.1618 17.695 13.0005 18.3913 12.5982V16.7391C18.3913 17.0757 18.1235 17.3484 17.7814 17.3484H5.60991C5.52982 17.3486 5.45049 17.3329 5.37646 17.3024C5.30243 17.2718 5.23516 17.227 5.1785 17.1704C5.12184 17.1138 5.07691 17.0465 5.04628 16.9725C5.01565 16.8985 4.99992 16.8192 5 16.7391V8.21739C5 7.88139 5.26783 7.6087 5.60991 7.6087H13.4012H13.4018ZM16.5652 11.8696C15.9195 11.8696 15.3002 11.613 14.8436 11.1564C14.387 10.6998 14.1304 10.0805 14.1304 9.43478C14.1304 8.78904 14.387 8.16974 14.8436 7.71313C15.3002 7.25652 15.9195 7 16.5652 7C17.211 7 17.8303 7.25652 18.2869 7.71313C18.7435 8.16974 19 8.78904 19 9.43478C19 10.0805 18.7435 10.6998 18.2869 11.1564C17.8303 11.613 17.211 11.8696 16.5652 11.8696ZM16.5652 10.6522C16.8881 10.6522 17.1977 10.5239 17.426 10.2956C17.6543 10.0673 17.7826 9.75765 17.7826 9.43478C17.7826 9.11191 17.6543 8.80226 17.426 8.57396C17.1977 8.34565 16.8881 8.21739 16.5652 8.21739C16.2423 8.21739 15.9327 8.34565 15.7044 8.57396C15.4761 8.80226 15.3478 9.11191 15.3478 9.43478C15.3478 9.75765 15.4761 10.0673 15.7044 10.2956C15.9327 10.5239 16.2423 10.6522 16.5652 10.6522ZM15.9565 14.3043V16.1304H17.1739V14.3043H15.9565Z" fill="url(#paint0_linear_475_9294)"/>
<rect x="0.5" y="0.5" width="23" height="23" rx="5.5" stroke="#1E88E5"/>
<defs>
<linearGradient id="paint0_linear_475_9294" x1="12" y1="7" x2="12" y2="17.3484" gradientUnits="userSpaceOnUse">
<stop stop-color="#0272AB"/>
<stop offset="1" stop-color="#41B4EF"/>
</linearGradient>
</defs>
</svg>
