<svg width="1440" height="384" viewBox="0 0 1440 384" fill="none" xmlns="http://www.w3.org/2000/svg">
<path d="M0 234.695V0H1440V234.182C1260.56 326.331 1004.17 384 719.5 384C435.358 384 179.389 326.545 0 234.695Z" fill="#2D76F9" fill-opacity="0.05"/>
</svg>
