<svg width="24" height="24" viewBox="0 0 24 24" fill="none" xmlns="http://www.w3.org/2000/svg">
<rect x="0.5" y="0.5" width="23" height="23" rx="5.5" fill="white"/>
<path d="M12.2898 7.4H18.3C18.4857 7.4 18.6637 7.47375 18.795 7.60503C18.9263 7.7363 19 7.91435 19 8.1V17.9C19 18.0856 18.9263 18.2637 18.795 18.395C18.6637 18.5262 18.4857 18.6 18.3 18.6H5.7C5.51435 18.6 5.3363 18.5262 5.20503 18.395C5.07375 18.2637 5 18.0856 5 17.9V6.7C5 6.51435 5.07375 6.3363 5.20503 6.20503C5.3363 6.07375 5.51435 6 5.7 6H10.8898L12.2898 7.4ZM11.3 10.2V11.6H12.7V10.2H11.3ZM11.3 12.3V15.8H12.7V12.3H11.3Z" fill="url(#paint0_linear_475_9303)"/>
<rect x="0.5" y="0.5" width="23" height="23" rx="5.5" stroke="#16A75C"/>
<defs>
<linearGradient id="paint0_linear_475_9303" x1="12" y1="6" x2="12" y2="18.6" gradientUnits="userSpaceOnUse">
<stop stop-color="#0676B0"/>
<stop offset="1" stop-color="#41B4EF"/>
</linearGradient>
</defs>
</svg>
