﻿provinsi,kode_kota_kabupaten,kota_kabupaten,bulan,jumlah,satuan
JAWA BARAT,3204,KAB. BANDUNG,JANUARI,1280,RIT
JAWA BARAT,3204,KAB. BANDUNG,FEBRUARI,1195,RIT
JAWA BARAT,3204,KAB. BANDUNG,MARET,1470,RIT
JAWA BARAT,3204,KAB. BANDUNG,APRIL,1235,RIT
JAWA BARAT,3204,KAB. BANDUNG,MEI,1463,RIT
JAWA BARAT,3204,KAB. BANDUNG,JUNI,1243,RIT
JAWA BARAT,3204,KAB. BANDUNG,JULI,1473,RIT
JAWA BARAT,3204,KAB. BANDUNG,AGUSTUS,1594,RIT
JAWA BARAT,3204,KAB. BANDUNG,SEPTEMBER,1348,RIT
JAWA BARAT,3204,KAB. BANDUNG,OKTOBER,1483,RIT
JAWA BARAT,3204,KAB. BANDUNG,NOVEMBER,1488,RIT
JAWA BARAT,3204,KAB. BANDUNG,DESEMBER,1534,RIT
JAWA BARAT,3217,KAB. BANDUNG BARAT,JANUARI,1123,RIT
JAWA BARAT,3217,KAB. BANDUNG BARAT,FEBRUARI,976,RIT
JAWA BARAT,3217,KAB. BANDUNG BARAT,MARET,1189,RIT
JAWA BARAT,3217,KAB. BANDUNG BARAT,APRIL,1169,RIT
JAWA BARAT,3217,KAB. BANDUNG BARAT,MEI,1136,RIT
JAWA BARAT,3217,KAB. BANDUNG BARAT,JUNI,1031,RIT
JAWA BARAT,3217,KAB. BANDUNG BARAT,JULI,1170,RIT
JAWA BARAT,3217,KAB. BANDUNG BARAT,AGUSTUS,1177,RIT
JAWA BARAT,3217,KAB. BANDUNG BARAT,SEPTEMBER,1087,RIT
JAWA BARAT,3217,KAB. BANDUNG BARAT,OKTOBER,1125,RIT
JAWA BARAT,3217,KAB. BANDUNG BARAT,NOVEMBER,1074,RIT
JAWA BARAT,3217,KAB. BANDUNG BARAT,DESEMBER,1102,RIT
JAWA BARAT,3273,KOTA BANDUNG,JANUARI,6901,RIT
JAWA BARAT,3273,KOTA BANDUNG,FEBRUARI,6065,RIT
JAWA BARAT,3273,KOTA BANDUNG,MARET,6653,RIT
JAWA BARAT,3273,KOTA BANDUNG,APRIL,6264,RIT
JAWA BARAT,3273,KOTA BANDUNG,MEI,6761,RIT
JAWA BARAT,3273,KOTA BANDUNG,JUNI,6598,RIT
JAWA BARAT,3273,KOTA BANDUNG,JULI,7271,RIT
JAWA BARAT,3273,KOTA BANDUNG,AGUSTUS,7355,RIT
JAWA BARAT,3273,KOTA BANDUNG,SEPTEMBER,7161,RIT
JAWA BARAT,3273,KOTA BANDUNG,OKTOBER,7472,RIT
JAWA BARAT,3273,KOTA BANDUNG,NOVEMBER,7201,RIT
JAWA BARAT,3273,KOTA BANDUNG,DESEMBER,7371,RIT
JAWA BARAT,3277,KOTA CIMAHI,JANUARI,1590,RIT
JAWA BARAT,3277,KOTA CIMAHI,FEBRUARI,1455,RIT
JAWA BARAT,3277,KOTA CIMAHI,MARET,1608,RIT
JAWA BARAT,3277,KOTA CIMAHI,APRIL,1572,RIT
JAWA BARAT,3277,KOTA CIMAHI,MEI,1582,RIT
JAWA BARAT,3277,KOTA CIMAHI,JUNI,1533,RIT
JAWA BARAT,3277,KOTA CIMAHI,JULI,1728,RIT
JAWA BARAT,3277,KOTA CIMAHI,AGUSTUS,1595,RIT
JAWA BARAT,3277,KOTA CIMAHI,SEPTEMBER,1585,RIT
JAWA BARAT,3277,KOTA CIMAHI,OKTOBER,1690,RIT
JAWA BARAT,3277,KOTA CIMAHI,NOVEMBER,1511,RIT
JAWA BARAT,3277,KOTA CIMAHI,DESEMBER,1711,RIT
