﻿provinsi,kode_kota_kabupaten,nama_kota_kabupaten,jumlah,satuan
JAWA BARAT,3204,KAB. BANDUNG,0,EKOR
JAWA BARAT,3217,KAB. BANDUNG BARAT,0,EKOR
JAWA BARAT,3216,KAB. BEKASI,140108,EKOR
JAWA BARAT,3201,KAB. BOGOR,2048539,EKOR
JAWA BARAT,3207,KAB. CIAMIS,0,EKOR
JAWA BARAT,3203,KAB. CIANJUR,0,EKOR
JAWA BARAT,3209,KAB. CIREBON,1460,EKOR
JAWA BARAT,3205,KAB. GARUT,0,EKOR
JAWA BARAT,3212,KAB. INDRAMAYU,0,EKOR
JAWA BARAT,3215,KAB. KARAWANG,0,EKOR
JAWA BARAT,3208,KAB. KUNINGAN,0,EKOR
JAWA BARAT,3210,KAB. MAJALENGKA,0,EKOR
JAWA BARAT,3218,KAB. PANGANDARAN,38362,EKOR
JAWA BARAT,3214,KAB. PURWAKARTA,0,EKOR
JAWA BARAT,3213,KAB. SUBANG,14389,EKOR
JAWA BARAT,3202,KAB. SUKABUMI,0,EKOR
JAWA BARAT,3211,KAB. SUMEDANG,0,EKOR
JAWA BARAT,3206,KAB. TASIKMALAYA,471700,EKOR
JAWA BARAT,3273,KOTA BANDUNG,0,EKOR
JAWA BARAT,3279,KOTA BANJAR,0,EKOR
JAWA BARAT,3275,KOTA BEKASI,0,EKOR
JAWA BARAT,3271,KOTA BOGOR,0,EKOR
JAWA BARAT,3277,KOTA CIMAHI,0,EKOR
JAWA BARAT,3274,KOTA CIREBON,0,EKOR
JAWA BARAT,3276,KOTA DEPOK,0,EKOR
JAWA BARAT,3272,KOTA SUKABUMI,2126274,EKOR
JAWA BARAT,3278,KOTA TASIKMALAYA,44385,EKOR
