sektor_usaha ;manajer_perempuan ;satuan 
Pertanian, Kehutanan dan Perikanan ;15;orang
Pertambangan dan Pengganlian;0;orang
Industri Pengolahan;0;orang
Pengadaan Listrik dan Gas;0;orang
Pengadaan Air, Peng Sampah;0;orang
Konstruksi;0;orang
Perdagangan Besar dan Eceran;14;orang
Transportasi dan Pergudangan;4;orang
Penyediaan Akomodasi dan Makanan;7;orang
Informasi dan Komunikasi;1;orang
Jasa Keuangan dan Asuransi;250;orang
Real Estat;0;orang
Jasa Perusahaan ;2;orang
Jasa Pendidikan;0;orang
Jasa Kesehatan dan Kegiatan Sosial;0;orang
Jasa Lainnya;9;orang
