provinsi,kode_kota_kabupaten,kota_kabupaten,jumlah,satuan
JAWA BARAT,3204,KAB. BANDUNG,100,ORANG
JAWA BARAT,3217,KAB. BANDUNG BARAT,500,ORANG
JAWA BARAT,3201,KAB. BOGOR,20,ORANG
JAWA BARAT,3216,KAB. BEKASI,20,ORANG
JAWA BARAT,3211,KAB. SUMEDANG,30,ORANG
JAWA BARAT,3205,KAB. GARUT,30,ORANG
JAWA BARAT,3210,KAB. MAJALENGKA,990,ORANG
JAWA BARAT,3209,KAB. CIREBON,1080,ORANG
JAWA BARAT,3212,KAB. INDRAMAYU,120,ORANG
JAWA BARAT,3271,KOTA BOGOR,20,ORANG
JAWA BARAT,3207,KAB. CIAMIS,20,ORANG
JAWA BARAT,3214,KAB. PURWAKARTA,20,ORANG
JAWA BARAT,3273,KOTA BANDUNG,1510,ORANG
