﻿provinsi,kode_kota_kabupaten,nama_kota_kabupaten,hotel,jumlah,satuan
JAWA BARAT,3204,KAB. BANDUNG,MELATI 1,133,UNIT
JAWA BARAT,3204,KAB. BANDUNG,MELATI 2,106,UNIT
JAWA BARAT,3204,KAB. BANDUNG,MELATI 3,426,UNIT
JAWA BARAT,3204,KAB. BANDUNG,NON MELATI,0,UNIT
JAWA BARAT,3217,KAB. BANDUNG BARAT,MELATI 1,18,UNIT
JAWA BARAT,3217,KAB. BANDUNG BARAT,MELATI 2,56,UNIT
JAWA BARAT,3217,KAB. BANDUNG BARAT,MELATI 3,530,UNIT
JAWA BARAT,3217,KAB. BANDUNG BARAT,NON MELATI,0,UNIT
JAWA BARAT,3216,KAB. BEKASI,MELATI 1,43,UNIT
JAWA BARAT,3216,KAB. BEKASI,MELATI 2,302,UNIT
JAWA BARAT,3216,KAB. BEKASI,MELATI 3,81,UNIT
JAWA BARAT,3216,KAB. BEKASI,NON MELATI,0,UNIT
JAWA BARAT,3201,KAB. BOGOR,MELATI 1,53,UNIT
JAWA BARAT,3201,KAB. BOGOR,MELATI 2,22,UNIT
JAWA BARAT,3201,KAB. BOGOR,MELATI 3,55,UNIT
JAWA BARAT,3207,KAB. CIAMIS,MELATI 1,258,UNIT
JAWA BARAT,3207,KAB. CIAMIS,MELATI 2,134,UNIT
JAWA BARAT,3207,KAB. CIAMIS,MELATI 3,118,UNIT
JAWA BARAT,3207,KAB. CIAMIS,NON MELATI,4,UNIT
JAWA BARAT,3203,KAB. CIANJUR,MELATI 1,474,UNIT
JAWA BARAT,3203,KAB. CIANJUR,MELATI 2,1260,UNIT
JAWA BARAT,3203,KAB. CIANJUR,MELATI 3,2796,UNIT
JAWA BARAT,3209,KAB. CIREBON,MELATI 1,144,UNIT
JAWA BARAT,3209,KAB. CIREBON,MELATI 2,38,UNIT
JAWA BARAT,3209,KAB. CIREBON,MELATI 3,97,UNIT
JAWA BARAT,3209,KAB. CIREBON,NON MELATI,0,UNIT
JAWA BARAT,3205,KAB. GARUT,MELATI 1,1539,UNIT
JAWA BARAT,3205,KAB. GARUT,MELATI 2,113,UNIT
JAWA BARAT,3205,KAB. GARUT,MELATI 3,182,UNIT
JAWA BARAT,3205,KAB. GARUT,NON MELATI,0,UNIT
JAWA BARAT,3212,KAB. INDRAMAYU,MELATI 1,248,UNIT
JAWA BARAT,3212,KAB. INDRAMAYU,MELATI 2,0,UNIT
JAWA BARAT,3212,KAB. INDRAMAYU,MELATI 3,60,UNIT
JAWA BARAT,3212,KAB. INDRAMAYU,NON MELATI,0,UNIT
JAWA BARAT,3215,KAB. KARAWANG,MELATI 1,52,UNIT
JAWA BARAT,3215,KAB. KARAWANG,MELATI 2,125,UNIT
JAWA BARAT,3215,KAB. KARAWANG,MELATI 3,312,UNIT
JAWA BARAT,3215,KAB. KARAWANG,NON MELATI,0,UNIT
JAWA BARAT,3208,KAB. KUNINGAN,MELATI 1,132,UNIT
JAWA BARAT,3208,KAB. KUNINGAN,MELATI 2,473,UNIT
JAWA BARAT,3208,KAB. KUNINGAN,MELATI 3,347,UNIT
JAWA BARAT,3208,KAB. KUNINGAN,NON MELATI,45,UNIT
JAWA BARAT,3210,KAB. MAJALENGKA,MELATI 1,314,UNIT
JAWA BARAT,3210,KAB. MAJALENGKA,MELATI 2,0,UNIT
JAWA BARAT,3210,KAB. MAJALENGKA,MELATI 3,0,UNIT
JAWA BARAT,3210,KAB. MAJALENGKA,NON MELATI,0,UNIT
JAWA BARAT,3218,KAB. PANGANDARAN,MELATI 1,0,UNIT
JAWA BARAT,3218,KAB. PANGANDARAN,MELATI 2,0,UNIT
JAWA BARAT,3218,KAB. PANGANDARAN,MELATI 3,0,UNIT
JAWA BARAT,3218,KAB. PANGANDARAN,NON MELATI,0,UNIT
JAWA BARAT,3214,KAB. PURWAKARTA,MELATI 1,0,UNIT
JAWA BARAT,3214,KAB. PURWAKARTA,MELATI 2,0,UNIT
JAWA BARAT,3214,KAB. PURWAKARTA,MELATI 3,0,UNIT
JAWA BARAT,3214,KAB. PURWAKARTA,NON MELATI,1534,UNIT
JAWA BARAT,3213,KAB. SUBANG,MELATI 1,0,UNIT
JAWA BARAT,3213,KAB. SUBANG,MELATI 2,0,UNIT
JAWA BARAT,3213,KAB. SUBANG,MELATI 3,0,UNIT
JAWA BARAT,3213,KAB. SUBANG,NON MELATI,0,UNIT
JAWA BARAT,3202,KAB. SUKABUMI,MELATI 1,240,UNIT
JAWA BARAT,3202,KAB. SUKABUMI,MELATI 2,742,UNIT
JAWA BARAT,3202,KAB. SUKABUMI,MELATI 3,2444,UNIT
JAWA BARAT,3202,KAB. SUKABUMI,NON MELATI,0,UNIT
JAWA BARAT,3211,KAB. SUMEDANG,NON MELATI,0,UNIT
JAWA BARAT,3206,KAB. TASIKMALAYA,MELATI 1,0,UNIT
JAWA BARAT,3206,KAB. TASIKMALAYA,MELATI 2,0,UNIT
JAWA BARAT,3206,KAB. TASIKMALAYA,MELATI 3,0,UNIT
JAWA BARAT,3206,KAB. TASIKMALAYA,NON MELATI,0,UNIT
JAWA BARAT,3273,KOTA BANDUNG,MELATI 1,1602,UNIT
JAWA BARAT,3273,KOTA BANDUNG,MELATI 2,1901,UNIT
JAWA BARAT,3273,KOTA BANDUNG,MELATI 3,3676,UNIT
JAWA BARAT,3273,KOTA BANDUNG,NON MELATI,0,UNIT
JAWA BARAT,3279,KOTA BANJAR,MELATI 1,0,UNIT
JAWA BARAT,3279,KOTA BANJAR,MELATI 2,0,UNIT
JAWA BARAT,3279,KOTA BANJAR,MELATI 3,0,UNIT
JAWA BARAT,3279,KOTA BANJAR,NON MELATI,0,UNIT
JAWA BARAT,3275,KOTA BEKASI,NON MELATI,0,UNIT
JAWA BARAT,3271,KOTA BOGOR,NON MELATI,2215,UNIT
JAWA BARAT,3277,KOTA CIMAHI,MELATI 1,76,UNIT
JAWA BARAT,3277,KOTA CIMAHI,MELATI 2,0,UNIT
JAWA BARAT,3277,KOTA CIMAHI,MELATI 3,0,UNIT
JAWA BARAT,3277,KOTA CIMAHI,NON MELATI,98,UNIT
JAWA BARAT,3274,KOTA CIREBON,MELATI 1,133,UNIT
JAWA BARAT,3274,KOTA CIREBON,MELATI 2,435,UNIT
JAWA BARAT,3274,KOTA CIREBON,MELATI 3,1191,UNIT
JAWA BARAT,3274,KOTA CIREBON,NON MELATI,0,UNIT
JAWA BARAT,3276,KOTA DEPOK,MELATI 1,42,UNIT
JAWA BARAT,3276,KOTA DEPOK,MELATI 2,63,UNIT
JAWA BARAT,3276,KOTA DEPOK,MELATI 3,89,UNIT
JAWA BARAT,3276,KOTA DEPOK,NON MELATI,15,UNIT
JAWA BARAT,3272,KOTA SUKABUMI,MELATI 1,212,UNIT
JAWA BARAT,3272,KOTA SUKABUMI,MELATI 2,252,UNIT
JAWA BARAT,3272,KOTA SUKABUMI,MELATI 3,448,UNIT
JAWA BARAT,3272,KOTA SUKABUMI,NON MELATI,0,UNIT
JAWA BARAT,3278,KOTA TASIKMALAYA,MELATI 1,99,UNIT
JAWA BARAT,3278,KOTA TASIKMALAYA,MELATI 2,167,UNIT
JAWA BARAT,3278,KOTA TASIKMALAYA,MELATI 3,396,UNIT
JAWA BARAT,3278,KOTA TASIKMALAYA,NON MELATI,0,UNIT
