﻿provinsi,kode_kota_kabupaten,nama_kota_kabupaten,penduduk_usia_7-12_tahun,satuan
JAWA BARAT,3204,KAB. BANDUNG,297400,JIWA
JAWA BARAT,3217,KAB. BANDUNG BARAT,192019,JIWA
JAWA BARAT,3216,KAB. BEKASI,114642,JIWA
JAWA BARAT,3201,KAB. BOGOR,582812,JIWA
JAWA BARAT,3207,KAB. CIAMIS,148930,JIWA
JAWA BARAT,3203,KAB. CIANJUR,267394,JIWA
JAWA BARAT,3209,KAB. CIREBON,103968,JIWA
JAWA BARAT,3205,KAB. GARUT,237963,JIWA
JAWA BARAT,3212,KAB. INDRAMAYU,118758,JIWA
JAWA BARAT,3215,KAB. KARAWANG,177038,JIWA
JAWA BARAT,3208,KAB. KUNINGAN,392004,JIWA
JAWA BARAT,3210,KAB. MAJALENGKA,304183,JIWA
JAWA BARAT,3218,KAB. PANGANDARAN,33901,JIWA
JAWA BARAT,3214,KAB. PURWAKARTA,103787,JIWA
JAWA BARAT,3213,KAB. SUBANG,198249,JIWA
JAWA BARAT,3202,KAB. SUKABUMI,279051,JIWA
JAWA BARAT,3211,KAB. SUMEDANG,185438,JIWA
JAWA BARAT,3206,KAB. TASIKMALAYA,101824,JIWA
JAWA BARAT,3273,KOTA BANDUNG,32412,JIWA
JAWA BARAT,3279,KOTA BANJAR,17634,JIWA
JAWA BARAT,3275,KOTA BEKASI,242261,JIWA
JAWA BARAT,3271,KOTA BOGOR,223428,JIWA
JAWA BARAT,3277,KOTA CIMAHI,72557,JIWA
JAWA BARAT,3274,KOTA CIREBON,35860,JIWA
JAWA BARAT,3276,KOTA DEPOK,180010,JIWA
JAWA BARAT,3272,KOTA SUKABUMI,97587,JIWA
JAWA BARAT,3278,KOTA TASIKMALAYA,51800,JIWA
