kode_kota_kabupaten,kota_kabupaten,jumlah_tanaman_alpukat,satuan
3204,kab. bandung,303568,pohon
3217,kab. bandung barat,104007,pohon
3216,kab. bekasi,155,pohon
3201,kab. bogor,119931,pohon
3207,kab. ciamis,158807,pohon
3203,kab. cianjur,136280,pohon
3209,kab. cirebon,2744,pohon
3205,kab. garut,488889,pohon
3212,kab. indramayu,428,pohon
3215,kab. karawang,3718,pohon
3208,kab. kuningan,31423,pohon
3210,kab. majalengka,195948,pohon
3218,kab. pangandaran,11902,pohon
3214,kab. purwakarta,13169,pohon
3213,kab. subang,16898,pohon
3202,kab. sukabumi,82597,pohon
3211,kab. sumedang,265113,pohon
3206,kab. tasikmalaya,217144,pohon
3273,kota bandung,7392,pohon
3279,kota banjar,1874,pohon
3275,kota bekasi,1437,pohon
3271,kota bogor,8729,pohon
3277,kota cimahi,192,pohon
3274,kota cirebon,407,pohon
3276,kota depok,1022,pohon
3272,kota sukabumi,281,pohon
3278,kota tasikmalaya,3349,pohon
