daerah_penghasil,sumber_daya,jumlah_produksi,satuan
Provinsi (4-12 mil),minyak,3381.7,ribu barrel
Provinsi (4-12 mil),gas,34940.91,mmbtu
Indramayu,minyak,1730.67,ribu barrel
Indramayu,gas,11902.85,mmbtu
Karawang,minyak,747.45,ribu barrel
Karawang,gas,51600.53,mmbtu
Majalengka,minyak,82.47,ribu barrel
Majalengka,gas,678.01,mmbtu
Subang,minyak,189.5,ribu barrel
Subang,gas,68789.07,mmbtu
Bekasi,minyak,5139.18,ribu barrel
Bekasi,gas,9235.05,mmbtu
