﻿kode_provinsi,provinsi,indeks_pembangunan_manusia,satuan
1100,ACEH,67.09201612,POIN
1200,SUMATERA UTARA,67.08724094,POIN
1300,SUMATERA BARAT,67.25481566,POIN
1400,RIAU,68.65376409,POIN
1500,JAMBI,65.38762344,POIN
1600,SUMATERA SELATAN,64.43628165,POIN
1700,BENGKULU,65.35287498,POIN
1800,LAMPUNG,63.71468597,POIN
1900,KEP. BANGKA BELITUNG,66.01801392,POIN
2100,KEPULAUAN RIAU,71.13359392,POIN
3100,DKI JAKARTA,76.314559,POIN
3200,JAWA BARAT,66.14706047,POIN
3300,JAWA TENGAH,66.08344295,POIN
3400,D I YOGYAKARTA,75.36611925,POIN
3500,JAWA TIMUR,65.36184011,POIN
3600,BANTEN,67.54099113,POIN
5100,BALI,70.10351343,POIN
5200,NUSA TENGGARA BARAT,61.1644156,POIN
5300,NUSA TENGGARA TIMUR,59.20711802,POIN
6100,KALIMANTAN BARAT,61.96523461,POIN
6200,KALIMANTAN TENGAH,65.95840944,POIN
6300,KALIMANTAN SELATAN,65.19973928,POIN
6400,KALIMANTAN TIMUR,71.30719509,POIN
6500,KALIMANTAN UTARA,,POIN
7100,SULAWESI UTARA,67.83175542,POIN
7200,SULAWESI TENGAH,63.29343119,POIN
7300,SULAWESI SELATAN,66.00431856,POIN
7400,SULAWESI TENGGARA,65.99425131,POIN
7500,GORONTALO,62.64823618,POIN
7600,SULAWESI BARAT,59.73579341,POIN
8100,MALUKU,64.27023316,POIN
8200,MALUKU UTARA,62.78851577,POIN
9100,PAPUA BARAT,59.60241735,POIN
9400,PAPUA,54.44658532,POIN
