﻿provinsi,kode_kota_kabupaten,nama_kota_kabupaten,jenis,jumlah,satuan
JAWA BARAT,3204,KAB. BANDUNG,BAKALAN,0,EKOR
JAWA BARAT,3204,KAB. BANDUNG,BIBIT BETINA,0,EKOR
JAWA BARAT,3204,KAB. BANDUNG,BIBIT JANTAN,0,EKOR
JAWA BARAT,3204,KAB. BANDUNG,SIAP POTONG,0,EKOR
JAWA BARAT,3217,KAB. BANDUNG BARAT,BAKALAN,2937,EKOR
JAWA BARAT,3217,KAB. BANDUNG BARAT,BIBIT BETINA,13,EKOR
JAWA BARAT,3217,KAB. BANDUNG BARAT,BIBIT JANTAN,20,EKOR
JAWA BARAT,3217,KAB. BANDUNG BARAT,SIAP POTONG,46,EKOR
JAWA BARAT,3216,KAB. BEKASI,BAKALAN,0,EKOR
JAWA BARAT,3216,KAB. BEKASI,BIBIT BETINA,2252,EKOR
JAWA BARAT,3216,KAB. BEKASI,BIBIT JANTAN,0,EKOR
JAWA BARAT,3216,KAB. BEKASI,SIAP POTONG,3710,EKOR
JAWA BARAT,3201,KAB. BOGOR,BAKALAN,2293,EKOR
JAWA BARAT,3201,KAB. BOGOR,BIBIT BETINA,2364,EKOR
JAWA BARAT,3201,KAB. BOGOR,BIBIT JANTAN,2519,EKOR
JAWA BARAT,3201,KAB. BOGOR,SIAP POTONG,14270,EKOR
JAWA BARAT,3207,KAB. CIAMIS,BAKALAN,0,EKOR
JAWA BARAT,3207,KAB. CIAMIS,BIBIT BETINA,0,EKOR
JAWA BARAT,3207,KAB. CIAMIS,BIBIT JANTAN,0,EKOR
JAWA BARAT,3207,KAB. CIAMIS,SIAP POTONG,0,EKOR
JAWA BARAT,3203,KAB. CIANJUR,BAKALAN,52,EKOR
JAWA BARAT,3203,KAB. CIANJUR,BIBIT BETINA,0,EKOR
JAWA BARAT,3203,KAB. CIANJUR,BIBIT JANTAN,0,EKOR
JAWA BARAT,3203,KAB. CIANJUR,SIAP POTONG,0,EKOR
JAWA BARAT,3209,KAB. CIREBON,BAKALAN,527,EKOR
JAWA BARAT,3209,KAB. CIREBON,BIBIT BETINA,123,EKOR
JAWA BARAT,3209,KAB. CIREBON,BIBIT JANTAN,0,EKOR
JAWA BARAT,3209,KAB. CIREBON,SIAP POTONG,13003,EKOR
JAWA BARAT,3205,KAB. GARUT,BAKALAN,1609,EKOR
JAWA BARAT,3205,KAB. GARUT,BIBIT BETINA,0,EKOR
JAWA BARAT,3205,KAB. GARUT,BIBIT JANTAN,0,EKOR
JAWA BARAT,3205,KAB. GARUT,SIAP POTONG,3302,EKOR
JAWA BARAT,3212,KAB. INDRAMAYU,BAKALAN,134,EKOR
JAWA BARAT,3212,KAB. INDRAMAYU,BIBIT BETINA,124,EKOR
JAWA BARAT,3212,KAB. INDRAMAYU,BIBIT JANTAN,24,EKOR
JAWA BARAT,3212,KAB. INDRAMAYU,SIAP POTONG,10637,EKOR
JAWA BARAT,3215,KAB. KARAWANG,BAKALAN,0,EKOR
JAWA BARAT,3215,KAB. KARAWANG,BIBIT BETINA,11,EKOR
JAWA BARAT,3215,KAB. KARAWANG,BIBIT JANTAN,5,EKOR
JAWA BARAT,3215,KAB. KARAWANG,SIAP POTONG,3033,EKOR
JAWA BARAT,3208,KAB. KUNINGAN,BAKALAN,0,EKOR
JAWA BARAT,3208,KAB. KUNINGAN,BIBIT BETINA,0,EKOR
JAWA BARAT,3208,KAB. KUNINGAN,BIBIT JANTAN,0,EKOR
JAWA BARAT,3208,KAB. KUNINGAN,SIAP POTONG,0,EKOR
JAWA BARAT,3210,KAB. MAJALENGKA,BAKALAN,0,EKOR
JAWA BARAT,3210,KAB. MAJALENGKA,BIBIT BETINA,0,EKOR
JAWA BARAT,3210,KAB. MAJALENGKA,BIBIT JANTAN,0,EKOR
JAWA BARAT,3210,KAB. MAJALENGKA,SIAP POTONG,881,EKOR
JAWA BARAT,3218,KAB. PANGANDARAN,BAKALAN,0,EKOR
JAWA BARAT,3218,KAB. PANGANDARAN,BIBIT BETINA,136,EKOR
JAWA BARAT,3218,KAB. PANGANDARAN,BIBIT JANTAN,0,EKOR
JAWA BARAT,3218,KAB. PANGANDARAN,SIAP POTONG,468,EKOR
JAWA BARAT,3214,KAB. PURWAKARTA,BAKALAN,28080,EKOR
JAWA BARAT,3214,KAB. PURWAKARTA,BIBIT BETINA,23,EKOR
JAWA BARAT,3214,KAB. PURWAKARTA,BIBIT JANTAN,371,EKOR
JAWA BARAT,3214,KAB. PURWAKARTA,SIAP POTONG,1506,EKOR
JAWA BARAT,3213,KAB. SUBANG,BAKALAN,0,EKOR
JAWA BARAT,3213,KAB. SUBANG,BIBIT BETINA,4385,EKOR
JAWA BARAT,3213,KAB. SUBANG,BIBIT JANTAN,14973,EKOR
JAWA BARAT,3213,KAB. SUBANG,SIAP POTONG,1366,EKOR
JAWA BARAT,3202,KAB. SUKABUMI,BAKALAN,3367,EKOR
JAWA BARAT,3202,KAB. SUKABUMI,BIBIT BETINA,0,EKOR
JAWA BARAT,3202,KAB. SUKABUMI,BIBIT JANTAN,0,EKOR
JAWA BARAT,3202,KAB. SUKABUMI,SIAP POTONG,1369,EKOR
JAWA BARAT,3211,KAB. SUMEDANG,BAKALAN,2048,EKOR
JAWA BARAT,3211,KAB. SUMEDANG,BIBIT BETINA,204,EKOR
JAWA BARAT,3211,KAB. SUMEDANG,BIBIT JANTAN,4470,EKOR
JAWA BARAT,3211,KAB. SUMEDANG,SIAP POTONG,6172,EKOR
JAWA BARAT,3206,KAB. TASIKMALAYA,BAKALAN,1514,EKOR
JAWA BARAT,3206,KAB. TASIKMALAYA,BIBIT BETINA,195,EKOR
JAWA BARAT,3206,KAB. TASIKMALAYA,BIBIT JANTAN,0,EKOR
JAWA BARAT,3206,KAB. TASIKMALAYA,SIAP POTONG,5190,EKOR
JAWA BARAT,3273,KOTA BANDUNG,BAKALAN,0,EKOR
JAWA BARAT,3273,KOTA BANDUNG,BIBIT BETINA,0,EKOR
JAWA BARAT,3273,KOTA BANDUNG,BIBIT JANTAN,0,EKOR
JAWA BARAT,3273,KOTA BANDUNG,SIAP POTONG,27341,EKOR
JAWA BARAT,3279,KOTA BANJAR,BAKALAN,0,EKOR
JAWA BARAT,3279,KOTA BANJAR,BIBIT BETINA,0,EKOR
JAWA BARAT,3279,KOTA BANJAR,BIBIT JANTAN,0,EKOR
JAWA BARAT,3279,KOTA BANJAR,SIAP POTONG,0,EKOR
JAWA BARAT,3275,KOTA BEKASI,BAKALAN,0,EKOR
JAWA BARAT,3275,KOTA BEKASI,BIBIT BETINA,0,EKOR
JAWA BARAT,3275,KOTA BEKASI,BIBIT JANTAN,0,EKOR
JAWA BARAT,3275,KOTA BEKASI,SIAP POTONG,20260,EKOR
JAWA BARAT,3271,KOTA BOGOR,BAKALAN,0,EKOR
JAWA BARAT,3271,KOTA BOGOR,BIBIT BETINA,0,EKOR
JAWA BARAT,3271,KOTA BOGOR,BIBIT JANTAN,0,EKOR
JAWA BARAT,3271,KOTA BOGOR,SIAP POTONG,3753,EKOR
JAWA BARAT,3277,KOTA CIMAHI,BAKALAN,0,EKOR
JAWA BARAT,3277,KOTA CIMAHI,BIBIT BETINA,0,EKOR
JAWA BARAT,3277,KOTA CIMAHI,BIBIT JANTAN,0,EKOR
JAWA BARAT,3277,KOTA CIMAHI,SIAP POTONG,0,EKOR
JAWA BARAT,3274,KOTA CIREBON,BAKALAN,0,EKOR
JAWA BARAT,3274,KOTA CIREBON,BIBIT BETINA,3,EKOR
JAWA BARAT,3274,KOTA CIREBON,BIBIT JANTAN,0,EKOR
JAWA BARAT,3274,KOTA CIREBON,SIAP POTONG,1036,EKOR
JAWA BARAT,3276,KOTA DEPOK,BAKALAN,173,EKOR
JAWA BARAT,3276,KOTA DEPOK,BIBIT BETINA,0,EKOR
JAWA BARAT,3276,KOTA DEPOK,BIBIT JANTAN,0,EKOR
JAWA BARAT,3276,KOTA DEPOK,SIAP POTONG,23004,EKOR
JAWA BARAT,3272,KOTA SUKABUMI,BAKALAN,0,EKOR
JAWA BARAT,3272,KOTA SUKABUMI,BIBIT BETINA,0,EKOR
JAWA BARAT,3272,KOTA SUKABUMI,BIBIT JANTAN,0,EKOR
JAWA BARAT,3272,KOTA SUKABUMI,SIAP POTONG,0,EKOR
JAWA BARAT,3278,KOTA TASIKMALAYA,BAKALAN,934,EKOR
JAWA BARAT,3278,KOTA TASIKMALAYA,BIBIT BETINA,174,EKOR
JAWA BARAT,3278,KOTA TASIKMALAYA,BIBIT JANTAN,1728,EKOR
JAWA BARAT,3278,KOTA TASIKMALAYA,SIAP POTONG,1774,EKOR
