﻿provinsi,kode_kota_kabupaten,nama_kota_kabupaten,cafe,jumlah,satuan
JAWA BARAT,3204,KAB. BANDUNG,JUMLAH CAFÉ,25,UNIT
JAWA BARAT,3204,KAB. BANDUNG,MEJA CAFÉ,371,UNIT
JAWA BARAT,3204,KAB. BANDUNG,KURSI CAFÉ,1556,UNIT
JAWA BARAT,3217,KAB. BANDUNG BARAT,JUMLAH CAFÉ,17,UNIT
JAWA BARAT,3217,KAB. BANDUNG BARAT,MEJA CAFÉ,202,UNIT
JAWA BARAT,3217,KAB. BANDUNG BARAT,KURSI CAFÉ,743,UNIT
JAWA BARAT,3216,KAB. BEKASI,JUMLAH CAFÉ,3,UNIT
JAWA BARAT,3216,KAB. BEKASI,MEJA CAFÉ,53,UNIT
JAWA BARAT,3216,KAB. BEKASI,KURSI CAFÉ,212,UNIT
JAWA BARAT,3201,KAB. BOGOR,JUMLAH CAFÉ,2,UNIT
JAWA BARAT,3201,KAB. BOGOR,MEJA CAFÉ,0,UNIT
JAWA BARAT,3201,KAB. BOGOR,KURSI CAFÉ,0,UNIT
JAWA BARAT,3207,KAB. CIAMIS,JUMLAH CAFÉ,34,UNIT
JAWA BARAT,3207,KAB. CIAMIS,MEJA CAFÉ,67,UNIT
JAWA BARAT,3207,KAB. CIAMIS,KURSI CAFÉ,554,UNIT
JAWA BARAT,3203,KAB. CIANJUR,JUMLAH CAFÉ,19,UNIT
JAWA BARAT,3203,KAB. CIANJUR,MEJA CAFÉ,137,UNIT
JAWA BARAT,3203,KAB. CIANJUR,KURSI CAFÉ,547,UNIT
JAWA BARAT,3209,KAB. CIREBON,JUMLAH CAFÉ,2,UNIT
JAWA BARAT,3209,KAB. CIREBON,MEJA CAFÉ,34,UNIT
JAWA BARAT,3209,KAB. CIREBON,KURSI CAFÉ,170,UNIT
JAWA BARAT,3205,KAB. GARUT,JUMLAH CAFÉ,5,UNIT
JAWA BARAT,3205,KAB. GARUT,MEJA CAFÉ,117,UNIT
JAWA BARAT,3205,KAB. GARUT,KURSI CAFÉ,271,UNIT
JAWA BARAT,3212,KAB. INDRAMAYU,JUMLAH CAFÉ,0,UNIT
JAWA BARAT,3212,KAB. INDRAMAYU,MEJA CAFÉ,0,UNIT
JAWA BARAT,3212,KAB. INDRAMAYU,KURSI CAFÉ,0,UNIT
JAWA BARAT,3215,KAB. KARAWANG,JUMLAH CAFÉ,13,UNIT
JAWA BARAT,3215,KAB. KARAWANG,MEJA CAFÉ,145,UNIT
JAWA BARAT,3215,KAB. KARAWANG,KURSI CAFÉ,600,UNIT
JAWA BARAT,3208,KAB. KUNINGAN,JUMLAH CAFÉ,14,UNIT
JAWA BARAT,3210,KAB. MAJALENGKA,JUMLAH CAFÉ,1,UNIT
JAWA BARAT,3210,KAB. MAJALENGKA,MEJA CAFÉ,8,UNIT
JAWA BARAT,3210,KAB. MAJALENGKA,KURSI CAFÉ,24,UNIT
JAWA BARAT,3214,KAB. PURWAKARTA,JUMLAH CAFÉ,10,UNIT
JAWA BARAT,3214,KAB. PURWAKARTA,MEJA CAFÉ,54,UNIT
JAWA BARAT,3214,KAB. PURWAKARTA,KURSI CAFÉ,216,UNIT
JAWA BARAT,3213,KAB. SUBANG,JUMLAH CAFÉ,0,UNIT
JAWA BARAT,3213,KAB. SUBANG,MEJA CAFÉ,0,UNIT
JAWA BARAT,3213,KAB. SUBANG,KURSI CAFÉ,0,UNIT
JAWA BARAT,3202,KAB. SUKABUMI,JUMLAH CAFÉ,0,UNIT
JAWA BARAT,3202,KAB. SUKABUMI,MEJA CAFÉ,0,UNIT
JAWA BARAT,3202,KAB. SUKABUMI,KURSI CAFÉ,0,UNIT
JAWA BARAT,3211,KAB. SUMEDANG,JUMLAH CAFÉ,2,UNIT
JAWA BARAT,3211,KAB. SUMEDANG,MEJA CAFÉ,16,UNIT
JAWA BARAT,3211,KAB. SUMEDANG,KURSI CAFÉ,68,UNIT
JAWA BARAT,3206,KAB. TASIKMALAYA,JUMLAH CAFÉ,0,UNIT
JAWA BARAT,3206,KAB. TASIKMALAYA,MEJA CAFÉ,0,UNIT
JAWA BARAT,3206,KAB. TASIKMALAYA,KURSI CAFÉ,0,UNIT
JAWA BARAT,3273,KOTA BANDUNG,JUMLAH CAFÉ,0,UNIT
JAWA BARAT,3273,KOTA BANDUNG,MEJA CAFÉ,0,UNIT
JAWA BARAT,3273,KOTA BANDUNG,KURSI CAFÉ,0,UNIT
JAWA BARAT,3279,KOTA BANJAR,JUMLAH CAFÉ,5,UNIT
JAWA BARAT,3279,KOTA BANJAR,MEJA CAFÉ,12,UNIT
JAWA BARAT,3279,KOTA BANJAR,KURSI CAFÉ,133,UNIT
JAWA BARAT,3275,KOTA BEKASI,JUMLAH CAFÉ,0,UNIT
JAWA BARAT,3275,KOTA BEKASI,MEJA CAFÉ,0,UNIT
JAWA BARAT,3275,KOTA BEKASI,KURSI CAFÉ,0,UNIT
JAWA BARAT,3271,KOTA BOGOR,JUMLAH CAFÉ,0,UNIT
JAWA BARAT,3271,KOTA BOGOR,MEJA CAFÉ,0,UNIT
JAWA BARAT,3271,KOTA BOGOR,KURSI CAFÉ,0,UNIT
JAWA BARAT,3277,KOTA CIMAHI,JUMLAH CAFÉ,3,UNIT
JAWA BARAT,3277,KOTA CIMAHI,MEJA CAFÉ,20,UNIT
JAWA BARAT,3277,KOTA CIMAHI,KURSI CAFÉ,80,UNIT
JAWA BARAT,3274,KOTA CIREBON,JUMLAH CAFÉ,8,UNIT
JAWA BARAT,3274,KOTA CIREBON,MEJA CAFÉ,71,UNIT
JAWA BARAT,3274,KOTA CIREBON,KURSI CAFÉ,344,UNIT
JAWA BARAT,3276,KOTA DEPOK,JUMLAH CAFÉ,2,UNIT
JAWA BARAT,3272,KOTA SUKABUMI,JUMLAH CAFÉ,6,UNIT
JAWA BARAT,3272,KOTA SUKABUMI,MEJA CAFÉ,64,UNIT
JAWA BARAT,3272,KOTA SUKABUMI,KURSI CAFÉ,290,UNIT
JAWA BARAT,3278,KOTA TASIKMALAYA,JUMLAH CAFÉ,0,UNIT
JAWA BARAT,3278,KOTA TASIKMALAYA,MEJA CAFÉ,0,UNIT
JAWA BARAT,3278,KOTA TASIKMALAYA,KURSI CAFÉ,0,UNIT
