kode_kota_kabupaten;kota_kabupaten;jumlah_penduduk_perdesaan_terlayani;satuan;;;;
3204;Kabupaten Bandung; 302.555 ; orang ;;;;
3217;Kabupaten Bandung Barat; 194.622 ; orang ;;;;
3216;Kabupaten Bekasi; 120.454 ; orang ;;;;
3201;Kabupaten Bogor; 339.748 ; orang ;;;;
3207;Kabupaten Ciamis; 196.940 ; orang ;;;;
3203;Kabupaten Cianjur; 113.686 ; orang ;;;;
3209;Kabupaten Cirebon; 443.926 ; orang ;;;;
3205;Kabupaten Garut; 286.490 ; orang ;;;;
3212;Kabupaten Indramayu; 98.044 ; orang ;;;;
3215;Kabupaten Karawang; 91.351 ; orang ;;;;
3208;Kabupaten Kuningan; 70.851 ; orang ;;;;
3210;Kabupaten Majalengka; 117.033 ; orang ;;;;
3214;Kabupaten Purwakarta; 104.106 ; orang ;;;;
3213;Kabupaten Subang; 140.540 ; orang ;;;;
3202;Kabupaten Sukabumi; 179.026 ; orang ;;;;
3211;Kabupaten Sumedang; 152.134 ; orang ;;;;
3206;Kabupaten Tasikmalaya; 298.921 ; orang ;;;;
3273;Kota Bandung;; orang ;;;;
3279;Kota Banjar;; orang ;;;;
3275;Kota Bekasi;; orang ;;;;
3271;Kota Bogor;; orang ;;;;
3277;Kota Cimahi;; orang ;;;;
3274;Kota Cirebon;; orang ;;;;
3276;Kota Depok;; orang ;;;;
3272;Kota Sukabumi;; orang ;;;;
3278;Kota Tasikmalaya;; orang ;;;;
;;;;;;;
;;;;;;;
;;;;;;;
;;;;;;;
;;;;;;;
