provinsi,kode_kota_kabupaten,nama_kota_kabupaten,produktivitas,satuan
jawa barat,3201,kab. bogor,1172,kuintal
jawa barat,3202,kab. sukabumi,1562,kuintal
jawa barat,3203,kab. cianjur,1607,kuintal
jawa barat,3204,kab. bandung,1741,kuintal
jawa barat,3205,kab. garut,1715,kuintal
jawa barat,3206,kab. tasikmalaya,1555,kuintal
jawa barat,3207,kab. ciamis,1711,kuintal
jawa barat,3208,kab. kuningan,1582,kuintal
jawa barat,3209,kab. cirebon,179,kuintal
jawa barat,3210,kab. majalengka,1776,kuintal
jawa barat,3211,kab. sumedang,1422,kuintal
jawa barat,3212,kab. indramayu,1763,kuintal
jawa barat,3213,kab. subang,1318,kuintal
jawa barat,3214,kab. purwakarta,1733,kuintal
jawa barat,3215,kab. karawang,1765,kuintal
jawa barat,3216,kab. bekasi,0,kuintal
jawa barat,3217,kab. bandung barat,1672,kuintal
jawa barat,3218,kab. pangandaran,1764,kuintal
jawa barat,3271,kota bogor,0,kuintal
jawa barat,3272,kota sukabumi,0,kuintal
jawa barat,3273,kota bandung,0,kuintal
jawa barat,3274,kota cirebon,0,kuintal
jawa barat,3275,kota bekasi,0,kuintal
jawa barat,3276,kota depok,0,kuintal
jawa barat,3277,kota cimahi,0,kuintal
jawa barat,3278,kota tasikmalaya,1338,kuintal
jawa barat,3279,kota banjar,1713,kuintal
