kode_kota_kabupaten;kota_kabupaten;jumlah_kepala_keluarga;satuan;;;;
3204;Kabupaten Bandung; 871.257 ; kepala keluarga ;;;;
3217;Kabupaten Bandung Barat; 417.154 ; kepala keluarga ;;;;
3216;Kabupaten Bekasi; 759.003 ; kepala keluarga ;;;;
3201;Kabupaten Bogor; 1.224.870 ; kepala keluarga ;;;;
3207;Kabupaten Ciamis; 505.911 ; kepala keluarga ;;;;
3203;Kabupaten Cianjur; 674.365 ; kepala keluarga ;;;;
3209;Kabupaten Cirebon; 638.789 ; kepala keluarga ;;;;
3205;Kabupaten Garut; 691.185 ; kepala keluarga ;;;;
3212;Kabupaten Indramayu; 581.386 ; kepala keluarga ;;;;
3215;Kabupaten Karawang; 670.417 ; kepala keluarga ;;;;
3208;Kabupaten Kuningan; 305.341 ; kepala keluarga ;;;;
3210;Kabupaten Majalengka; 397.298 ; kepala keluarga ;;;;
3214;Kabupaten Purwakarta; 257.422 ; kepala keluarga ;;;;
3213;Kabupaten Subang; 467.708 ; kepala keluarga ;;;;
3202;Kabupaten Sukabumi; 702.595 ; kepala keluarga ;;;;
3211;Kabupaten Sumedang; 354.635 ; kepala keluarga ;;;;
3206;Kabupaten Tasikmalaya; 538.170 ; kepala keluarga ;;;;
3273;Kota Bandung; 558.443 ; kepala keluarga ;;;;
3279;Kota Banjar; 52.785 ; kepala keluarga ;;;;
3275;Kota Bekasi; 537.943 ; kepala keluarga ;;;;
3271;Kota Bogor; 227.588 ; kepala keluarga ;;;;
3277;Kota Cimahi; 137.959 ; kepala keluarga ;;;;
3274;Kota Cirebon; 72.288 ; kepala keluarga ;;;;
3276;Kota Depok; 382.036 ; kepala keluarga ;;;;
3272;Kota Sukabumi; 73.285 ; kepala keluarga ;;;;
3278;Kota Tasikmalaya; 175.658 ; kepala keluarga ;;;;
;;;;;;;
;;;;;;;
;;;;;;;
;;;;;;;
;;;;;;;
