﻿provinsi,kode_kota_kabupaten,nama_kota_kabupaten,sarana_sosial,jumlah,satuan
JAWA BARAT,3204,KAB. BANDUNG,PANTI SOSIAL ASUHAN ANAK,92,UNIT
JAWA BARAT,3204,KAB. BANDUNG,PANTI PENYANDANG CACAT DISABILITAS,0,UNIT
JAWA BARAT,3204,KAB. BANDUNG,PANTI SOSIAL TRESNA WERDHA,24,UNIT
JAWA BARAT,3204,KAB. BANDUNG,BALAI / PANTI LAINNYA MILIK PEMERINTAHsatuan,0,UNIT
JAWA BARAT,3217,KAB. BANDUNG BARAT,PANTI SOSIAL ASUHAN ANAK,32,UNIT
JAWA BARAT,3217,KAB. BANDUNG BARAT,PANTI PENYANDANG CACAT DISABILITAS,0,UNIT
JAWA BARAT,3217,KAB. BANDUNG BARAT,PANTI SOSIAL TRESNA WERDHA,32,UNIT
JAWA BARAT,3217,KAB. BANDUNG BARAT,BALAI / PANTI LAINNYA MILIK PEMERINTAHsatuan,0,UNIT
JAWA BARAT,3216,KAB. BEKASI,PANTI SOSIAL ASUHAN ANAK,71,UNIT
JAWA BARAT,3216,KAB. BEKASI,PANTI PENYANDANG CACAT DISABILITAS,2,UNIT
JAWA BARAT,3216,KAB. BEKASI,PANTI SOSIAL TRESNA WERDHA,69,UNIT
JAWA BARAT,3216,KAB. BEKASI,BALAI / PANTI LAINNYA MILIK PEMERINTAHsatuan,0,UNIT
JAWA BARAT,3201,KAB. BOGOR,PANTI SOSIAL ASUHAN ANAK,139,UNIT
JAWA BARAT,3201,KAB. BOGOR,PANTI PENYANDANG CACAT DISABILITAS,5,UNIT
JAWA BARAT,3201,KAB. BOGOR,PANTI SOSIAL TRESNA WERDHA,18,UNIT
JAWA BARAT,3201,KAB. BOGOR,BALAI / PANTI LAINNYA MILIK PEMERINTAHsatuan,0,UNIT
JAWA BARAT,3207,KAB. CIAMIS,PANTI SOSIAL ASUHAN ANAK,135,UNIT
JAWA BARAT,3207,KAB. CIAMIS,PANTI PENYANDANG CACAT DISABILITAS,4,UNIT
JAWA BARAT,3207,KAB. CIAMIS,PANTI SOSIAL TRESNA WERDHA,42,UNIT
JAWA BARAT,3207,KAB. CIAMIS,BALAI / PANTI LAINNYA MILIK PEMERINTAHsatuan,0,UNIT
JAWA BARAT,3203,KAB. CIANJUR,PANTI SOSIAL ASUHAN ANAK,42,UNIT
JAWA BARAT,3203,KAB. CIANJUR,PANTI PENYANDANG CACAT DISABILITAS,1,UNIT
JAWA BARAT,3203,KAB. CIANJUR,PANTI SOSIAL TRESNA WERDHA,15,UNIT
JAWA BARAT,3203,KAB. CIANJUR,BALAI / PANTI LAINNYA MILIK PEMERINTAHsatuan,0,UNIT
JAWA BARAT,3209,KAB. CIREBON,PANTI SOSIAL ASUHAN ANAK,83,UNIT
JAWA BARAT,3209,KAB. CIREBON,PANTI PENYANDANG CACAT DISABILITAS,2,UNIT
JAWA BARAT,3209,KAB. CIREBON,PANTI SOSIAL TRESNA WERDHA,9,UNIT
JAWA BARAT,3209,KAB. CIREBON,BALAI / PANTI LAINNYA MILIK PEMERINTAHsatuan,2,UNIT
JAWA BARAT,3205,KAB. GARUT,PANTI SOSIAL ASUHAN ANAK,112,UNIT
JAWA BARAT,3205,KAB. GARUT,PANTI PENYANDANG CACAT DISABILITAS,4,UNIT
JAWA BARAT,3205,KAB. GARUT,PANTI SOSIAL TRESNA WERDHA,22,UNIT
JAWA BARAT,3205,KAB. GARUT,BALAI / PANTI LAINNYA MILIK PEMERINTAHsatuan,2,UNIT
JAWA BARAT,3212,KAB. INDRAMAYU,PANTI SOSIAL ASUHAN ANAK,43,UNIT
JAWA BARAT,3212,KAB. INDRAMAYU,PANTI PENYANDANG CACAT DISABILITAS,0,UNIT
JAWA BARAT,3212,KAB. INDRAMAYU,PANTI SOSIAL TRESNA WERDHA,16,UNIT
JAWA BARAT,3212,KAB. INDRAMAYU,BALAI / PANTI LAINNYA MILIK PEMERINTAHsatuan,0,UNIT
JAWA BARAT,3215,KAB. KARAWANG,PANTI SOSIAL ASUHAN ANAK,56,UNIT
JAWA BARAT,3215,KAB. KARAWANG,PANTI PENYANDANG CACAT DISABILITAS,0,UNIT
JAWA BARAT,3215,KAB. KARAWANG,PANTI SOSIAL TRESNA WERDHA,55,UNIT
JAWA BARAT,3215,KAB. KARAWANG,BALAI / PANTI LAINNYA MILIK PEMERINTAHsatuan,1,UNIT
JAWA BARAT,3208,KAB. KUNINGAN,PANTI SOSIAL ASUHAN ANAK,41,UNIT
JAWA BARAT,3208,KAB. KUNINGAN,PANTI PENYANDANG CACAT DISABILITAS,3,UNIT
JAWA BARAT,3208,KAB. KUNINGAN,PANTI SOSIAL TRESNA WERDHA,0,UNIT
JAWA BARAT,3208,KAB. KUNINGAN,BALAI / PANTI LAINNYA MILIK PEMERINTAHsatuan,0,UNIT
JAWA BARAT,3210,KAB. MAJALENGKA,PANTI SOSIAL ASUHAN ANAK,96,UNIT
JAWA BARAT,3210,KAB. MAJALENGKA,PANTI PENYANDANG CACAT DISABILITAS,2,UNIT
JAWA BARAT,3210,KAB. MAJALENGKA,PANTI SOSIAL TRESNA WERDHA,35,UNIT
JAWA BARAT,3210,KAB. MAJALENGKA,BALAI / PANTI LAINNYA MILIK PEMERINTAHsatuan,0,UNIT
JAWA BARAT,3218,KAB. PANGANDARAN,PANTI SOSIAL ASUHAN ANAK,23,UNIT
JAWA BARAT,3218,KAB. PANGANDARAN,PANTI PENYANDANG CACAT DISABILITAS,1,UNIT
JAWA BARAT,3218,KAB. PANGANDARAN,PANTI SOSIAL TRESNA WERDHA,23,UNIT
JAWA BARAT,3218,KAB. PANGANDARAN,BALAI / PANTI LAINNYA MILIK PEMERINTAHsatuan,1,UNIT
JAWA BARAT,3214,KAB. PURWAKARTA,PANTI SOSIAL ASUHAN ANAK,52,UNIT
JAWA BARAT,3214,KAB. PURWAKARTA,PANTI PENYANDANG CACAT DISABILITAS,4,UNIT
JAWA BARAT,3214,KAB. PURWAKARTA,PANTI SOSIAL TRESNA WERDHA,52,UNIT
JAWA BARAT,3214,KAB. PURWAKARTA,BALAI / PANTI LAINNYA MILIK PEMERINTAHsatuan,0,UNIT
JAWA BARAT,3213,KAB. SUBANG,PANTI SOSIAL ASUHAN ANAK,24,UNIT
JAWA BARAT,3213,KAB. SUBANG,PANTI PENYANDANG CACAT DISABILITAS,0,UNIT
JAWA BARAT,3213,KAB. SUBANG,PANTI SOSIAL TRESNA WERDHA,6,UNIT
JAWA BARAT,3213,KAB. SUBANG,BALAI / PANTI LAINNYA MILIK PEMERINTAHsatuan,2,UNIT
JAWA BARAT,3202,KAB. SUKABUMI,PANTI SOSIAL ASUHAN ANAK,53,UNIT
JAWA BARAT,3202,KAB. SUKABUMI,PANTI PENYANDANG CACAT DISABILITAS,0,UNIT
JAWA BARAT,3202,KAB. SUKABUMI,PANTI SOSIAL TRESNA WERDHA,20,UNIT
JAWA BARAT,3202,KAB. SUKABUMI,BALAI / PANTI LAINNYA MILIK PEMERINTAHsatuan,2,UNIT
JAWA BARAT,3211,KAB. SUMEDANG,PANTI SOSIAL ASUHAN ANAK,27,UNIT
JAWA BARAT,3211,KAB. SUMEDANG,PANTI PENYANDANG CACAT DISABILITAS,4,UNIT
JAWA BARAT,3211,KAB. SUMEDANG,PANTI SOSIAL TRESNA WERDHA,26,UNIT
JAWA BARAT,3211,KAB. SUMEDANG,BALAI / PANTI LAINNYA MILIK PEMERINTAHsatuan,0,UNIT
JAWA BARAT,3206,KAB. TASIKMALAYA,PANTI SOSIAL ASUHAN ANAK,207,UNIT
JAWA BARAT,3206,KAB. TASIKMALAYA,PANTI PENYANDANG CACAT DISABILITAS,2,UNIT
JAWA BARAT,3206,KAB. TASIKMALAYA,PANTI SOSIAL TRESNA WERDHA,206,UNIT
JAWA BARAT,3206,KAB. TASIKMALAYA,BALAI / PANTI LAINNYA MILIK PEMERINTAHsatuan,0,UNIT
JAWA BARAT,3273,KOTA BANDUNG,PANTI SOSIAL ASUHAN ANAK,135,UNIT
JAWA BARAT,3273,KOTA BANDUNG,PANTI PENYANDANG CACAT DISABILITAS,2,UNIT
JAWA BARAT,3273,KOTA BANDUNG,PANTI SOSIAL TRESNA WERDHA,115,UNIT
JAWA BARAT,3273,KOTA BANDUNG,BALAI / PANTI LAINNYA MILIK PEMERINTAHsatuan,1,UNIT
JAWA BARAT,3279,KOTA BANJAR,PANTI SOSIAL ASUHAN ANAK,7,UNIT
JAWA BARAT,3279,KOTA BANJAR,PANTI PENYANDANG CACAT DISABILITAS,0,UNIT
JAWA BARAT,3279,KOTA BANJAR,PANTI SOSIAL TRESNA WERDHA,7,UNIT
JAWA BARAT,3279,KOTA BANJAR,BALAI / PANTI LAINNYA MILIK PEMERINTAHsatuan,0,UNIT
JAWA BARAT,3275,KOTA BEKASI,PANTI SOSIAL ASUHAN ANAK,117,UNIT
JAWA BARAT,3275,KOTA BEKASI,PANTI PENYANDANG CACAT DISABILITAS,2,UNIT
JAWA BARAT,3275,KOTA BEKASI,PANTI SOSIAL TRESNA WERDHA,14,UNIT
JAWA BARAT,3275,KOTA BEKASI,BALAI / PANTI LAINNYA MILIK PEMERINTAHsatuan,0,UNIT
JAWA BARAT,3271,KOTA BOGOR,PANTI SOSIAL ASUHAN ANAK,47,UNIT
JAWA BARAT,3271,KOTA BOGOR,PANTI PENYANDANG CACAT DISABILITAS,0,UNIT
JAWA BARAT,3271,KOTA BOGOR,PANTI SOSIAL TRESNA WERDHA,46,UNIT
JAWA BARAT,3271,KOTA BOGOR,BALAI / PANTI LAINNYA MILIK PEMERINTAHsatuan,1,UNIT
JAWA BARAT,3277,KOTA CIMAHI,PANTI SOSIAL ASUHAN ANAK,26,UNIT
JAWA BARAT,3277,KOTA CIMAHI,PANTI PENYANDANG CACAT DISABILITAS,1,UNIT
JAWA BARAT,3277,KOTA CIMAHI,PANTI SOSIAL TRESNA WERDHA,2,UNIT
JAWA BARAT,3277,KOTA CIMAHI,BALAI / PANTI LAINNYA MILIK PEMERINTAHsatuan,0,UNIT
JAWA BARAT,3274,KOTA CIREBON,PANTI SOSIAL ASUHAN ANAK,32,UNIT
JAWA BARAT,3274,KOTA CIREBON,PANTI PENYANDANG CACAT DISABILITAS,1,UNIT
JAWA BARAT,3274,KOTA CIREBON,PANTI SOSIAL TRESNA WERDHA,8,UNIT
JAWA BARAT,3274,KOTA CIREBON,BALAI / PANTI LAINNYA MILIK PEMERINTAHsatuan,0,UNIT
JAWA BARAT,3276,KOTA DEPOK,PANTI SOSIAL ASUHAN ANAK,50,UNIT
JAWA BARAT,3276,KOTA DEPOK,PANTI PENYANDANG CACAT DISABILITAS,2,UNIT
JAWA BARAT,3276,KOTA DEPOK,PANTI SOSIAL TRESNA WERDHA,48,UNIT
JAWA BARAT,3276,KOTA DEPOK,BALAI / PANTI LAINNYA MILIK PEMERINTAHsatuan,0,UNIT
JAWA BARAT,3272,KOTA SUKABUMI,PANTI SOSIAL ASUHAN ANAK,15,UNIT
JAWA BARAT,3272,KOTA SUKABUMI,PANTI PENYANDANG CACAT DISABILITAS,0,UNIT
JAWA BARAT,3272,KOTA SUKABUMI,PANTI SOSIAL TRESNA WERDHA,15,UNIT
JAWA BARAT,3272,KOTA SUKABUMI,BALAI / PANTI LAINNYA MILIK PEMERINTAHsatuan,0,UNIT
JAWA BARAT,3278,KOTA TASIKMALAYA,PANTI SOSIAL ASUHAN ANAK,207,UNIT
JAWA BARAT,3278,KOTA TASIKMALAYA,PANTI PENYANDANG CACAT DISABILITAS,0,UNIT
JAWA BARAT,3278,KOTA TASIKMALAYA,PANTI SOSIAL TRESNA WERDHA,114,UNIT
JAWA BARAT,3278,KOTA TASIKMALAYA,BALAI / PANTI LAINNYA MILIK PEMERINTAHsatuan,0,UNIT
