﻿provinsi,kode_kota_kabupaten,nama_kota_kabupaten,jumlah,satuan
JAWA BARAT,3204,KAB. BANDUNG,,KELOMPOK
JAWA BARAT,3217,KAB. BANDUNG BARAT,,KELOMPOK
JAWA BARAT,3216,KAB. BEKASI,,KELOMPOK
JAWA BARAT,3201,KAB. BOGOR,,KELOMPOK
JAWA BARAT,3207,KAB. CIAMIS,124,KELOMPOK
JAWA BARAT,3203,KAB. CIANJUR,,KELOMPOK
JAWA BARAT,3209,KAB. CIREBON,,KELOMPOK
JAWA BARAT,3205,KAB. GARUT,6,KELOMPOK
JAWA BARAT,3212,KAB. INDRAMAYU,,KELOMPOK
JAWA BARAT,3215,KAB. KARAWANG,,KELOMPOK
JAWA BARAT,3208,KAB. KUNINGAN,,KELOMPOK
JAWA BARAT,3210,KAB. MAJALENGKA,,KELOMPOK
JAWA BARAT,3218,KAB. PANGANDARAN,19,KELOMPOK
JAWA BARAT,3214,KAB. PURWAKARTA,,KELOMPOK
JAWA BARAT,3213,KAB. SUBANG,14,KELOMPOK
JAWA BARAT,3202,KAB. SUKABUMI,,KELOMPOK
JAWA BARAT,3211,KAB. SUMEDANG,,KELOMPOK
JAWA BARAT,3206,KAB. TASIKMALAYA,,KELOMPOK
JAWA BARAT,3273,KOTA BANDUNG,,KELOMPOK
JAWA BARAT,3279,KOTA BANJAR,,KELOMPOK
JAWA BARAT,3275,KOTA BEKASI,,KELOMPOK
JAWA BARAT,3271,KOTA BOGOR,,KELOMPOK
JAWA BARAT,3277,KOTA CIMAHI,,KELOMPOK
JAWA BARAT,3274,KOTA CIREBON,,KELOMPOK
JAWA BARAT,3276,KOTA DEPOK,,KELOMPOK
JAWA BARAT,3272,KOTA SUKABUMI,,KELOMPOK
JAWA BARAT,3278,KOTA TASIKMALAYA,,KELOMPOK
