provinsi,kode_kota_kabupaten,kota_kabupaten,jenis_komoditi,jumlah ,satuan
Jawa Barat,3204,kab. bandung,alpukat,338794,pohon
Jawa Barat,3217,kab. bandung barat,alpukat,170754,pohon
Jawa Barat,3216,kab. bekasi,alpukat,145,pohon
Jawa Barat,3201,kab. bogor,alpukat,95824,pohon
Jawa Barat,3207,kab. ciamis,alpukat,171617,pohon
Jawa Barat,3203,kab. cianjur,alpukat,145343,pohon
Jawa Barat,3209,kab. cirebon,alpukat,2808,pohon
Jawa Barat,3205,kab. garut,alpukat,491927,pohon
Jawa Barat,3212,kab. indramayu,alpukat,201,pohon
Jawa Barat,3215,kab. karawang,alpukat,2507,pohon
Jawa Barat,3208,kab. kuningan,alpukat,32397,pohon
Jawa Barat,3210,kab. majalengka,alpukat,197105,pohon
Jawa Barat,3218,kab. pangandaran,alpukat,,pohon
Jawa Barat,3214,kab. purwakarta,alpukat,16375,pohon
Jawa Barat,3213,kab. subang,alpukat,17241,pohon
Jawa Barat,3202,kab. sukabumi,alpukat,84328,pohon
Jawa Barat,3211,kab. sumedang,alpukat,275052,pohon
Jawa Barat,3206,kab. tasikmalaya,alpukat,197834,pohon
Jawa Barat,3273,kota bandung,alpukat,7444,pohon
Jawa Barat,3279,kota banjar,alpukat,2169,pohon
Jawa Barat,3275,kota bekasi,alpukat,1332,pohon
Jawa Barat,3271,kota bogor,alpukat,8084,pohon
Jawa Barat,3277,kota cimahi,alpukat,632,pohon
Jawa Barat,3274,kota cirebon,alpukat,482,pohon
Jawa Barat,3276,kota depok,alpukat,1023,pohon
Jawa Barat,3272,kota sukabumi,alpukat,1004,pohon
Jawa Barat,3278,kota tasikmalaya,alpukat,3669,pohon
Jawa Barat,3204,kab. bandung,anggur,28,pohon
Jawa Barat,3217,kab. bandung barat,anggur,0,pohon
Jawa Barat,3216,kab. bekasi,anggur,100,pohon
Jawa Barat,3201,kab. bogor,anggur,0,pohon
Jawa Barat,3207,kab. ciamis,anggur,12,pohon
Jawa Barat,3203,kab. cianjur,anggur,0,pohon
Jawa Barat,3209,kab. cirebon,anggur,0,pohon
Jawa Barat,3205,kab. garut,anggur,0,pohon
Jawa Barat,3212,kab. indramayu,anggur,154,pohon
Jawa Barat,3215,kab. karawang,anggur,0,pohon
Jawa Barat,3208,kab. kuningan,anggur,49,pohon
Jawa Barat,3210,kab. majalengka,anggur,0,pohon
Jawa Barat,3218,kab. pangandaran,anggur,,pohon
Jawa Barat,3214,kab. purwakarta,anggur,664,pohon
Jawa Barat,3213,kab. subang,anggur,0,pohon
Jawa Barat,3202,kab. sukabumi,anggur,0,pohon
Jawa Barat,3211,kab. sumedang,anggur,0,pohon
Jawa Barat,3206,kab. tasikmalaya,anggur,0,pohon
Jawa Barat,3273,kota bandung,anggur,0,pohon
Jawa Barat,3279,kota banjar,anggur,0,pohon
Jawa Barat,3275,kota bekasi,anggur,0,pohon
Jawa Barat,3271,kota bogor,anggur,0,pohon
Jawa Barat,3277,kota cimahi,anggur,0,pohon
Jawa Barat,3274,kota cirebon,anggur,15,pohon
Jawa Barat,3276,kota depok,anggur,0,pohon
Jawa Barat,3272,kota sukabumi,anggur,0,pohon
Jawa Barat,3278,kota tasikmalaya,anggur,0,pohon
Jawa Barat,3204,kab. bandung,belimbing,16791,pohon
Jawa Barat,3217,kab. bandung barat,belimbing,9220,pohon
Jawa Barat,3216,kab. bekasi,belimbing,8732,pohon
Jawa Barat,3201,kab. bogor,belimbing,39151,pohon
Jawa Barat,3207,kab. ciamis,belimbing,23653,pohon
Jawa Barat,3203,kab. cianjur,belimbing,17565,pohon
Jawa Barat,3209,kab. cirebon,belimbing,5990,pohon
Jawa Barat,3205,kab. garut,belimbing,18753,pohon
Jawa Barat,3212,kab. indramayu,belimbing,18351,pohon
Jawa Barat,3215,kab. karawang,belimbing,27495,pohon
Jawa Barat,3208,kab. kuningan,belimbing,6523,pohon
Jawa Barat,3210,kab. majalengka,belimbing,22693,pohon
Jawa Barat,3218,kab. pangandaran,belimbing,,pohon
Jawa Barat,3214,kab. purwakarta,belimbing,6794,pohon
Jawa Barat,3213,kab. subang,belimbing,11116,pohon
Jawa Barat,3202,kab. sukabumi,belimbing,17113,pohon
Jawa Barat,3211,kab. sumedang,belimbing,8270,pohon
Jawa Barat,3206,kab. tasikmalaya,belimbing,34467,pohon
Jawa Barat,3273,kota bandung,belimbing,3442,pohon
Jawa Barat,3279,kota banjar,belimbing,955,pohon
Jawa Barat,3275,kota bekasi,belimbing,8430,pohon
Jawa Barat,3271,kota bogor,belimbing,4454,pohon
Jawa Barat,3277,kota cimahi,belimbing,800,pohon
Jawa Barat,3274,kota cirebon,belimbing,2321,pohon
Jawa Barat,3276,kota depok,belimbing,33994,pohon
Jawa Barat,3272,kota sukabumi,belimbing,109,pohon
Jawa Barat,3278,kota tasikmalaya,belimbing,1766,pohon
Jawa Barat,3204,kab. bandung,dukuh langsat,1119,pohon
Jawa Barat,3217,kab. bandung barat,dukuh langsat,5415,pohon
Jawa Barat,3216,kab. bekasi,dukuh langsat,82883,pohon
Jawa Barat,3201,kab. bogor,dukuh langsat,178821,pohon
Jawa Barat,3207,kab. ciamis,dukuh langsat,163774,pohon
Jawa Barat,3203,kab. cianjur,dukuh langsat,30787,pohon
Jawa Barat,3209,kab. cirebon,dukuh langsat,1344,pohon
Jawa Barat,3205,kab. garut,dukuh langsat,20195,pohon
Jawa Barat,3212,kab. indramayu,dukuh langsat,0,pohon
Jawa Barat,3215,kab. karawang,dukuh langsat,0,pohon
Jawa Barat,3208,kab. kuningan,dukuh langsat,3825,pohon
Jawa Barat,3210,kab. majalengka,dukuh langsat,3025,pohon
Jawa Barat,3218,kab. pangandaran,dukuh langsat,,pohon
Jawa Barat,3214,kab. purwakarta,dukuh langsat,9647,pohon
Jawa Barat,3213,kab. subang,dukuh langsat,4192,pohon
Jawa Barat,3202,kab. sukabumi,dukuh langsat,17667,pohon
Jawa Barat,3211,kab. sumedang,dukuh langsat,14420,pohon
Jawa Barat,3206,kab. tasikmalaya,dukuh langsat,112418,pohon
Jawa Barat,3273,kota bandung,dukuh langsat,0,pohon
Jawa Barat,3279,kota banjar,dukuh langsat,4502,pohon
Jawa Barat,3275,kota bekasi,dukuh langsat,6726,pohon
Jawa Barat,3271,kota bogor,dukuh langsat,2476,pohon
Jawa Barat,3277,kota cimahi,dukuh langsat,30,pohon
Jawa Barat,3274,kota cirebon,dukuh langsat,0,pohon
Jawa Barat,3276,kota depok,dukuh langsat,2616,pohon
Jawa Barat,3272,kota sukabumi,dukuh langsat,0,pohon
Jawa Barat,3278,kota tasikmalaya,dukuh langsat,6039,pohon
Jawa Barat,3204,kab. bandung,durian,90413,pohon
Jawa Barat,3217,kab. bandung barat,durian,110398,pohon
Jawa Barat,3216,kab. bekasi,durian,22126,pohon
Jawa Barat,3201,kab. bogor,durian,409889,pohon
Jawa Barat,3207,kab. ciamis,durian,379940,pohon
Jawa Barat,3203,kab. cianjur,durian,234377,pohon
Jawa Barat,3209,kab. cirebon,durian,14405,pohon
Jawa Barat,3205,kab. garut,durian,102996,pohon
Jawa Barat,3212,kab. indramayu,durian,421,pohon
Jawa Barat,3215,kab. karawang,durian,166354,pohon
Jawa Barat,3208,kab. kuningan,durian,168828,pohon
Jawa Barat,3210,kab. majalengka,durian,219450,pohon
Jawa Barat,3218,kab. pangandaran,durian,,pohon
Jawa Barat,3214,kab. purwakarta,durian,108423,pohon
Jawa Barat,3213,kab. subang,durian,130118,pohon
Jawa Barat,3202,kab. sukabumi,durian,177506,pohon
Jawa Barat,3211,kab. sumedang,durian,245554,pohon
Jawa Barat,3206,kab. tasikmalaya,durian,528665,pohon
Jawa Barat,3273,kota bandung,durian,1949,pohon
Jawa Barat,3279,kota banjar,durian,56559,pohon
Jawa Barat,3275,kota bekasi,durian,7573,pohon
Jawa Barat,3271,kota bogor,durian,10395,pohon
Jawa Barat,3277,kota cimahi,durian,1545,pohon
Jawa Barat,3274,kota cirebon,durian,215,pohon
Jawa Barat,3276,kota depok,durian,5791,pohon
Jawa Barat,3272,kota sukabumi,durian,2543,pohon
Jawa Barat,3278,kota tasikmalaya,durian,40241,pohon
Jawa Barat,3204,kab. bandung,jambu air ,49257,pohon
Jawa Barat,3217,kab. bandung barat,jambu air ,14696,pohon
Jawa Barat,3216,kab. bekasi,jambu air ,43841,pohon
Jawa Barat,3201,kab. bogor,jambu air ,58039,pohon
Jawa Barat,3207,kab. ciamis,jambu air ,90596,pohon
Jawa Barat,3203,kab. cianjur,jambu air ,53748,pohon
Jawa Barat,3209,kab. cirebon,jambu air ,42002,pohon
Jawa Barat,3205,kab. garut,jambu air ,28524,pohon
Jawa Barat,3212,kab. indramayu,jambu air ,36865,pohon
Jawa Barat,3215,kab. karawang,jambu air ,60654,pohon
Jawa Barat,3208,kab. kuningan,jambu air ,14901,pohon
Jawa Barat,3210,kab. majalengka,jambu air ,62727,pohon
Jawa Barat,3218,kab. pangandaran,jambu air ,,pohon
Jawa Barat,3214,kab. purwakarta,jambu air ,22567,pohon
Jawa Barat,3213,kab. subang,jambu air ,19841,pohon
Jawa Barat,3202,kab. sukabumi,jambu air ,59969,pohon
Jawa Barat,3211,kab. sumedang,jambu air ,17800,pohon
Jawa Barat,3206,kab. tasikmalaya,jambu air ,46109,pohon
Jawa Barat,3273,kota bandung,jambu air ,8312,pohon
Jawa Barat,3279,kota banjar,jambu air ,3915,pohon
Jawa Barat,3275,kota bekasi,jambu air ,15378,pohon
Jawa Barat,3271,kota bogor,jambu air ,27416,pohon
Jawa Barat,3277,kota cimahi,jambu air ,1546,pohon
Jawa Barat,3274,kota cirebon,jambu air ,10533,pohon
Jawa Barat,3276,kota depok,jambu air ,1835,pohon
Jawa Barat,3272,kota sukabumi,jambu air ,569,pohon
Jawa Barat,3278,kota tasikmalaya,jambu air ,2734,pohon
Jawa Barat,3204,kab. bandung,jambu biji,135472,pohon
Jawa Barat,3217,kab. bandung barat,jambu biji,85232,pohon
Jawa Barat,3216,kab. bekasi,jambu biji,64805,pohon
Jawa Barat,3201,kab. bogor,jambu biji,179925,pohon
Jawa Barat,3207,kab. ciamis,jambu biji,120234,pohon
Jawa Barat,3203,kab. cianjur,jambu biji,150394,pohon
Jawa Barat,3209,kab. cirebon,jambu biji,95627,pohon
Jawa Barat,3205,kab. garut,jambu biji,106390,pohon
Jawa Barat,3212,kab. indramayu,jambu biji,56807,pohon
Jawa Barat,3215,kab. karawang,jambu biji,82608,pohon
Jawa Barat,3208,kab. kuningan,jambu biji,132205,pohon
Jawa Barat,3210,kab. majalengka,jambu biji,163267,pohon
Jawa Barat,3218,kab. pangandaran,jambu biji,,pohon
Jawa Barat,3214,kab. purwakarta,jambu biji,22591,pohon
Jawa Barat,3213,kab. subang,jambu biji,53394,pohon
Jawa Barat,3202,kab. sukabumi,jambu biji,110306,pohon
Jawa Barat,3211,kab. sumedang,jambu biji,117726,pohon
Jawa Barat,3206,kab. tasikmalaya,jambu biji,133144,pohon
Jawa Barat,3273,kota bandung,jambu biji,7329,pohon
Jawa Barat,3279,kota banjar,jambu biji,4196,pohon
Jawa Barat,3275,kota bekasi,jambu biji,21589,pohon
Jawa Barat,3271,kota bogor,jambu biji,51687,pohon
Jawa Barat,3277,kota cimahi,jambu biji,2767,pohon
Jawa Barat,3274,kota cirebon,jambu biji,18056,pohon
Jawa Barat,3276,kota depok,jambu biji,21876,pohon
Jawa Barat,3272,kota sukabumi,jambu biji,201,pohon
Jawa Barat,3278,kota tasikmalaya,jambu biji,10358,pohon
Jawa Barat,3204,kab. bandung,jengkol,9971,pohon
Jawa Barat,3217,kab. bandung barat,jengkol,24614,pohon
Jawa Barat,3216,kab. bekasi,jengkol,3398,pohon
Jawa Barat,3201,kab. bogor,jengkol,40254,pohon
Jawa Barat,3207,kab. ciamis,jengkol,232948,pohon
Jawa Barat,3203,kab. cianjur,jengkol,19783,pohon
Jawa Barat,3209,kab. cirebon,jengkol,635,pohon
Jawa Barat,3205,kab. garut,jengkol,18949,pohon
Jawa Barat,3212,kab. indramayu,jengkol,492,pohon
Jawa Barat,3215,kab. karawang,jengkol,42850,pohon
Jawa Barat,3208,kab. kuningan,jengkol,22342,pohon
Jawa Barat,3210,kab. majalengka,jengkol,7125,pohon
Jawa Barat,3218,kab. pangandaran,jengkol,,pohon
Jawa Barat,3214,kab. purwakarta,jengkol,31627,pohon
Jawa Barat,3213,kab. subang,jengkol,17645,pohon
Jawa Barat,3202,kab. sukabumi,jengkol,25799,pohon
Jawa Barat,3211,kab. sumedang,jengkol,24314,pohon
Jawa Barat,3206,kab. tasikmalaya,jengkol,153111,pohon
Jawa Barat,3273,kota bandung,jengkol,618,pohon
Jawa Barat,3279,kota banjar,jengkol,8675,pohon
Jawa Barat,3275,kota bekasi,jengkol,100,pohon
Jawa Barat,3271,kota bogor,jengkol,2225,pohon
Jawa Barat,3277,kota cimahi,jengkol,0,pohon
Jawa Barat,3274,kota cirebon,jengkol,970,pohon
Jawa Barat,3276,kota depok,jengkol,0,pohon
Jawa Barat,3272,kota sukabumi,jengkol,0,pohon
Jawa Barat,3278,kota tasikmalaya,jengkol,350,pohon
Jawa Barat,3204,kab. bandung,jeruk,54964,pohon
Jawa Barat,3217,kab. bandung barat,jeruk,122263,pohon
Jawa Barat,3216,kab. bekasi,jeruk,2192,pohon
Jawa Barat,3201,kab. bogor,jeruk,32101,pohon
Jawa Barat,3207,kab. ciamis,jeruk,113142,pohon
Jawa Barat,3203,kab. cianjur,jeruk,59066,pohon
Jawa Barat,3209,kab. cirebon,jeruk,11653,pohon
Jawa Barat,3205,kab. garut,jeruk,631845,pohon
Jawa Barat,3212,kab. indramayu,jeruk,4038,pohon
Jawa Barat,3215,kab. karawang,jeruk,45047,pohon
Jawa Barat,3208,kab. kuningan,jeruk,21863,pohon
Jawa Barat,3210,kab. majalengka,jeruk,80600,pohon
Jawa Barat,3218,kab. pangandaran,jeruk,,pohon
Jawa Barat,3214,kab. purwakarta,jeruk,15399,pohon
Jawa Barat,3213,kab. subang,jeruk,93084,pohon
Jawa Barat,3202,kab. sukabumi,jeruk,67553,pohon
Jawa Barat,3211,kab. sumedang,jeruk,157903,pohon
Jawa Barat,3206,kab. tasikmalaya,jeruk,231161,pohon
Jawa Barat,3273,kota bandung,jeruk,4545,pohon
Jawa Barat,3279,kota banjar,jeruk,1647,pohon
Jawa Barat,3275,kota bekasi,jeruk,1373,pohon
Jawa Barat,3271,kota bogor,jeruk,5545,pohon
Jawa Barat,3277,kota cimahi,jeruk,150,pohon
Jawa Barat,3274,kota cirebon,jeruk,2020,pohon
Jawa Barat,3276,kota depok,jeruk,858,pohon
Jawa Barat,3272,kota sukabumi,jeruk,1119,pohon
Jawa Barat,3278,kota tasikmalaya,jeruk,1566,pohon
Jawa Barat,3204,kab. bandung,jeruk besar,22919,pohon
Jawa Barat,3217,kab. bandung barat,jeruk besar,6265,pohon
Jawa Barat,3216,kab. bekasi,jeruk besar,67,pohon
Jawa Barat,3201,kab. bogor,jeruk besar,2632,pohon
Jawa Barat,3207,kab. ciamis,jeruk besar,38335,pohon
Jawa Barat,3203,kab. cianjur,jeruk besar,9268,pohon
Jawa Barat,3209,kab. cirebon,jeruk besar,208,pohon
Jawa Barat,3205,kab. garut,jeruk besar,3234,pohon
Jawa Barat,3212,kab. indramayu,jeruk besar,184,pohon
Jawa Barat,3215,kab. karawang,jeruk besar,377,pohon
Jawa Barat,3208,kab. kuningan,jeruk besar,1419,pohon
Jawa Barat,3210,kab. majalengka,jeruk besar,3491,pohon
Jawa Barat,3218,kab. pangandaran,jeruk besar,,pohon
Jawa Barat,3214,kab. purwakarta,jeruk besar,4038,pohon
Jawa Barat,3213,kab. subang,jeruk besar,903,pohon
Jawa Barat,3202,kab. sukabumi,jeruk besar,8617,pohon
Jawa Barat,3211,kab. sumedang,jeruk besar,114116,pohon
Jawa Barat,3206,kab. tasikmalaya,jeruk besar,14526,pohon
Jawa Barat,3273,kota bandung,jeruk besar,2560,pohon
Jawa Barat,3279,kota banjar,jeruk besar,276,pohon
Jawa Barat,3275,kota bekasi,jeruk besar,832,pohon
Jawa Barat,3271,kota bogor,jeruk besar,1054,pohon
Jawa Barat,3277,kota cimahi,jeruk besar,50,pohon
Jawa Barat,3274,kota cirebon,jeruk besar,0,pohon
Jawa Barat,3276,kota depok,jeruk besar,365,pohon
Jawa Barat,3272,kota sukabumi,jeruk besar,0,pohon
Jawa Barat,3278,kota tasikmalaya,jeruk besar,8,pohon
Jawa Barat,3204,kab. bandung,jeruk siam keprok,32045,pohon
Jawa Barat,3217,kab. bandung barat,jeruk siam keprok,115998,pohon
Jawa Barat,3216,kab. bekasi,jeruk siam keprok,2125,pohon
Jawa Barat,3201,kab. bogor,jeruk siam keprok,29469,pohon
Jawa Barat,3207,kab. ciamis,jeruk siam keprok,74807,pohon
Jawa Barat,3203,kab. cianjur,jeruk siam keprok,49798,pohon
Jawa Barat,3209,kab. cirebon,jeruk siam keprok,11445,pohon
Jawa Barat,3205,kab. garut,jeruk siam keprok,628611,pohon
Jawa Barat,3212,kab. indramayu,jeruk siam keprok,3854,pohon
Jawa Barat,3215,kab. karawang,jeruk siam keprok,44670,pohon
Jawa Barat,3208,kab. kuningan,jeruk siam keprok,20444,pohon
Jawa Barat,3210,kab. majalengka,jeruk siam keprok,77109,pohon
Jawa Barat,3218,kab. pangandaran,jeruk siam keprok,,pohon
Jawa Barat,3214,kab. purwakarta,jeruk siam keprok,11361,pohon
Jawa Barat,3213,kab. subang,jeruk siam keprok,92181,pohon
Jawa Barat,3202,kab. sukabumi,jeruk siam keprok,58936,pohon
Jawa Barat,3211,kab. sumedang,jeruk siam keprok,43787,pohon
Jawa Barat,3206,kab. tasikmalaya,jeruk siam keprok,216635,pohon
Jawa Barat,3273,kota bandung,jeruk siam keprok,1985,pohon
Jawa Barat,3279,kota banjar,jeruk siam keprok,1371,pohon
Jawa Barat,3275,kota bekasi,jeruk siam keprok,541,pohon
Jawa Barat,3271,kota bogor,jeruk siam keprok,4491,pohon
Jawa Barat,3277,kota cimahi,jeruk siam keprok,100,pohon
Jawa Barat,3274,kota cirebon,jeruk siam keprok,2020,pohon
Jawa Barat,3276,kota depok,jeruk siam keprok,493,pohon
Jawa Barat,3272,kota sukabumi,jeruk siam keprok,1119,pohon
Jawa Barat,3278,kota tasikmalaya,jeruk siam keprok,1558,pohon
Jawa Barat,3204,kab. bandung,mangga,124766,pohon
Jawa Barat,3217,kab. bandung barat,mangga,86575,pohon
Jawa Barat,3216,kab. bekasi,mangga,176989,pohon
Jawa Barat,3201,kab. bogor,mangga,128354,pohon
Jawa Barat,3207,kab. ciamis,mangga,311599,pohon
Jawa Barat,3203,kab. cianjur,mangga,291159,pohon
Jawa Barat,3209,kab. cirebon,mangga,867707,pohon
Jawa Barat,3205,kab. garut,mangga,387671,pohon
Jawa Barat,3212,kab. indramayu,mangga,917073,pohon
Jawa Barat,3215,kab. karawang,mangga,437491,pohon
Jawa Barat,3208,kab. kuningan,mangga,752257,pohon
Jawa Barat,3210,kab. majalengka,mangga,1083559,pohon
Jawa Barat,3218,kab. pangandaran,mangga,,pohon
Jawa Barat,3214,kab. purwakarta,mangga,116102,pohon
Jawa Barat,3213,kab. subang,mangga,828103,pohon
Jawa Barat,3202,kab. sukabumi,mangga,262125,pohon
Jawa Barat,3211,kab. sumedang,mangga,763420,pohon
Jawa Barat,3206,kab. tasikmalaya,mangga,386794,pohon
Jawa Barat,3273,kota bandung,mangga,28431,pohon
Jawa Barat,3279,kota banjar,mangga,53458,pohon
Jawa Barat,3275,kota bekasi,mangga,22633,pohon
Jawa Barat,3271,kota bogor,mangga,13204,pohon
Jawa Barat,3277,kota cimahi,mangga,3485,pohon
Jawa Barat,3274,kota cirebon,mangga,112564,pohon
Jawa Barat,3276,kota depok,mangga,5186,pohon
Jawa Barat,3272,kota sukabumi,mangga,2517,pohon
Jawa Barat,3278,kota tasikmalaya,mangga,60853,pohon
Jawa Barat,3204,kab. bandung,manggis,25236,pohon
Jawa Barat,3217,kab. bandung barat,manggis,23510,pohon
Jawa Barat,3216,kab. bekasi,manggis,1644,pohon
Jawa Barat,3201,kab. bogor,manggis,215695,pohon
Jawa Barat,3207,kab. ciamis,manggis,220699,pohon
Jawa Barat,3203,kab. cianjur,manggis,30588,pohon
Jawa Barat,3209,kab. cirebon,manggis,0,pohon
Jawa Barat,3205,kab. garut,manggis,15317,pohon
Jawa Barat,3212,kab. indramayu,manggis,0,pohon
Jawa Barat,3215,kab. karawang,manggis,9484,pohon
Jawa Barat,3208,kab. kuningan,manggis,2848,pohon
Jawa Barat,3210,kab. majalengka,manggis,6793,pohon
Jawa Barat,3218,kab. pangandaran,manggis,,pohon
Jawa Barat,3214,kab. purwakarta,manggis,151170,pohon
Jawa Barat,3213,kab. subang,manggis,84533,pohon
Jawa Barat,3202,kab. sukabumi,manggis,122348,pohon
Jawa Barat,3211,kab. sumedang,manggis,20956,pohon
Jawa Barat,3206,kab. tasikmalaya,manggis,735970,pohon
Jawa Barat,3273,kota bandung,manggis,600,pohon
Jawa Barat,3279,kota banjar,manggis,639,pohon
Jawa Barat,3275,kota bekasi,manggis,159,pohon
Jawa Barat,3271,kota bogor,manggis,1621,pohon
Jawa Barat,3277,kota cimahi,manggis,51,pohon
Jawa Barat,3274,kota cirebon,manggis,41,pohon
Jawa Barat,3276,kota depok,manggis,244,pohon
Jawa Barat,3272,kota sukabumi,manggis,434,pohon
Jawa Barat,3278,kota tasikmalaya,manggis,8001,pohon
Jawa Barat,3204,kab. bandung,markisa konyal,2170,pohon
Jawa Barat,3217,kab. bandung barat,markisa konyal,130,pohon
Jawa Barat,3216,kab. bekasi,markisa konyal,0,pohon
Jawa Barat,3201,kab. bogor,markisa konyal,160,pohon
Jawa Barat,3207,kab. ciamis,markisa konyal,3359,pohon
Jawa Barat,3203,kab. cianjur,markisa konyal,127,pohon
Jawa Barat,3209,kab. cirebon,markisa konyal,0,pohon
Jawa Barat,3205,kab. garut,markisa konyal,3673,pohon
Jawa Barat,3212,kab. indramayu,markisa konyal,142,pohon
Jawa Barat,3215,kab. karawang,markisa konyal,0,pohon
Jawa Barat,3208,kab. kuningan,markisa konyal,0,pohon
Jawa Barat,3210,kab. majalengka,markisa konyal,74,pohon
Jawa Barat,3218,kab. pangandaran,markisa konyal,,pohon
Jawa Barat,3214,kab. purwakarta,markisa konyal,257,pohon
Jawa Barat,3213,kab. subang,markisa konyal,0,pohon
Jawa Barat,3202,kab. sukabumi,markisa konyal,1123,pohon
Jawa Barat,3211,kab. sumedang,markisa konyal,0,pohon
Jawa Barat,3206,kab. tasikmalaya,markisa konyal,758,pohon
Jawa Barat,3273,kota bandung,markisa konyal,240,pohon
Jawa Barat,3279,kota banjar,markisa konyal,0,pohon
Jawa Barat,3275,kota bekasi,markisa konyal,0,pohon
Jawa Barat,3271,kota bogor,markisa konyal,0,pohon
Jawa Barat,3277,kota cimahi,markisa konyal,0,pohon
Jawa Barat,3274,kota cirebon,markisa konyal,0,pohon
Jawa Barat,3276,kota depok,markisa konyal,0,pohon
Jawa Barat,3272,kota sukabumi,markisa konyal,32,pohon
Jawa Barat,3278,kota tasikmalaya,markisa konyal,0,pohon
Jawa Barat,3204,kab. bandung,melinjo,39667,pohon
Jawa Barat,3217,kab. bandung barat,melinjo,32440,pohon
Jawa Barat,3216,kab. bekasi,melinjo,45792,pohon
Jawa Barat,3201,kab. bogor,melinjo,78658,pohon
Jawa Barat,3207,kab. ciamis,melinjo,126565,pohon
Jawa Barat,3203,kab. cianjur,melinjo,80115,pohon
Jawa Barat,3209,kab. cirebon,melinjo,85701,pohon
Jawa Barat,3205,kab. garut,melinjo,50954,pohon
Jawa Barat,3212,kab. indramayu,melinjo,117330,pohon
Jawa Barat,3215,kab. karawang,melinjo,54375,pohon
Jawa Barat,3208,kab. kuningan,melinjo,673070,pohon
Jawa Barat,3210,kab. majalengka,melinjo,569496,pohon
Jawa Barat,3218,kab. pangandaran,melinjo,,pohon
Jawa Barat,3214,kab. purwakarta,melinjo,63226,pohon
Jawa Barat,3213,kab. subang,melinjo,125454,pohon
Jawa Barat,3202,kab. sukabumi,melinjo,17858,pohon
Jawa Barat,3211,kab. sumedang,melinjo,206136,pohon
Jawa Barat,3206,kab. tasikmalaya,melinjo,129125,pohon
Jawa Barat,3273,kota bandung,melinjo,2333,pohon
Jawa Barat,3279,kota banjar,melinjo,74766,pohon
Jawa Barat,3275,kota bekasi,melinjo,20905,pohon
Jawa Barat,3271,kota bogor,melinjo,2196,pohon
Jawa Barat,3277,kota cimahi,melinjo,465,pohon
Jawa Barat,3274,kota cirebon,melinjo,11129,pohon
Jawa Barat,3276,kota depok,melinjo,4000,pohon
Jawa Barat,3272,kota sukabumi,melinjo,982,pohon
Jawa Barat,3278,kota tasikmalaya,melinjo,10312,pohon
Jawa Barat,3204,kab. bandung,nangka cempedak,102367,pohon
Jawa Barat,3217,kab. bandung barat,nangka cempedak,90867,pohon
Jawa Barat,3216,kab. bekasi,nangka cempedak,43499,pohon
Jawa Barat,3201,kab. bogor,nangka cempedak,159688,pohon
Jawa Barat,3207,kab. ciamis,nangka cempedak,149091,pohon
Jawa Barat,3203,kab. cianjur,nangka cempedak,109002,pohon
Jawa Barat,3209,kab. cirebon,nangka cempedak,27354,pohon
Jawa Barat,3205,kab. garut,nangka cempedak,93693,pohon
Jawa Barat,3212,kab. indramayu,nangka cempedak,45934,pohon
Jawa Barat,3215,kab. karawang,nangka cempedak,97828,pohon
Jawa Barat,3208,kab. kuningan,nangka cempedak,88474,pohon
Jawa Barat,3210,kab. majalengka,nangka cempedak,148681,pohon
Jawa Barat,3218,kab. pangandaran,nangka cempedak,,pohon
Jawa Barat,3214,kab. purwakarta,nangka cempedak,29486,pohon
Jawa Barat,3213,kab. subang,nangka cempedak,35934,pohon
Jawa Barat,3202,kab. sukabumi,nangka cempedak,106760,pohon
Jawa Barat,3211,kab. sumedang,nangka cempedak,189317,pohon
Jawa Barat,3206,kab. tasikmalaya,nangka cempedak,144477,pohon
Jawa Barat,3273,kota bandung,nangka cempedak,13571,pohon
Jawa Barat,3279,kota banjar,nangka cempedak,11138,pohon
Jawa Barat,3275,kota bekasi,nangka cempedak,8194,pohon
Jawa Barat,3271,kota bogor,nangka cempedak,5051,pohon
Jawa Barat,3277,kota cimahi,nangka cempedak,540,pohon
Jawa Barat,3274,kota cirebon,nangka cempedak,4694,pohon
Jawa Barat,3276,kota depok,nangka cempedak,5663,pohon
Jawa Barat,3272,kota sukabumi,nangka cempedak,1798,pohon
Jawa Barat,3278,kota tasikmalaya,nangka cempedak,29505,pohon
Jawa Barat,3204,kab. bandung,nenas,1802,pohon
Jawa Barat,3217,kab. bandung barat,nenas,461206,pohon
Jawa Barat,3216,kab. bekasi,nenas,0,pohon
Jawa Barat,3201,kab. bogor,nenas,2742796,pohon
Jawa Barat,3207,kab. ciamis,nenas,242876,pohon
Jawa Barat,3203,kab. cianjur,nenas,313292,pohon
Jawa Barat,3209,kab. cirebon,nenas,0,pohon
Jawa Barat,3205,kab. garut,nenas,31205,pohon
Jawa Barat,3212,kab. indramayu,nenas,0,pohon
Jawa Barat,3215,kab. karawang,nenas,20071,pohon
Jawa Barat,3208,kab. kuningan,nenas,18488,pohon
Jawa Barat,3210,kab. majalengka,nenas,28910,pohon
Jawa Barat,3218,kab. pangandaran,nenas,,pohon
Jawa Barat,3214,kab. purwakarta,nenas,67351,pohon
Jawa Barat,3213,kab. subang,nenas,62710994,pohon
Jawa Barat,3202,kab. sukabumi,nenas,94630,pohon
Jawa Barat,3211,kab. sumedang,nenas,79358,pohon
Jawa Barat,3206,kab. tasikmalaya,nenas,406476,pohon
Jawa Barat,3273,kota bandung,nenas,0,pohon
Jawa Barat,3279,kota banjar,nenas,644,pohon
Jawa Barat,3275,kota bekasi,nenas,103,pohon
Jawa Barat,3271,kota bogor,nenas,7806,pohon
Jawa Barat,3277,kota cimahi,nenas,0,pohon
Jawa Barat,3274,kota cirebon,nenas,0,pohon
Jawa Barat,3276,kota depok,nenas,900,pohon
Jawa Barat,3272,kota sukabumi,nenas,0,pohon
Jawa Barat,3278,kota tasikmalaya,nenas,969,pohon
Jawa Barat,3204,kab. bandung,pepaya,43226,pohon
Jawa Barat,3217,kab. bandung barat,pepaya,26169,pohon
Jawa Barat,3216,kab. bekasi,pepaya,20976,pohon
Jawa Barat,3201,kab. bogor,pepaya,212120,pohon
Jawa Barat,3207,kab. ciamis,pepaya,227847,pohon
Jawa Barat,3203,kab. cianjur,pepaya,76611,pohon
Jawa Barat,3209,kab. cirebon,pepaya,42129,pohon
Jawa Barat,3205,kab. garut,pepaya,154270,pohon
Jawa Barat,3212,kab. indramayu,pepaya,22847,pohon
Jawa Barat,3215,kab. karawang,pepaya,72303,pohon
Jawa Barat,3208,kab. kuningan,pepaya,62064,pohon
Jawa Barat,3210,kab. majalengka,pepaya,59277,pohon
Jawa Barat,3218,kab. pangandaran,pepaya,,pohon
Jawa Barat,3214,kab. purwakarta,pepaya,25206,pohon
Jawa Barat,3213,kab. subang,pepaya,90840,pohon
Jawa Barat,3202,kab. sukabumi,pepaya,356242,pohon
Jawa Barat,3211,kab. sumedang,pepaya,95075,pohon
Jawa Barat,3206,kab. tasikmalaya,pepaya,306959,pohon
Jawa Barat,3273,kota bandung,pepaya,6111,pohon
Jawa Barat,3279,kota banjar,pepaya,122213,pohon
Jawa Barat,3275,kota bekasi,pepaya,39215,pohon
Jawa Barat,3271,kota bogor,pepaya,13628,pohon
Jawa Barat,3277,kota cimahi,pepaya,2710,pohon
Jawa Barat,3274,kota cirebon,pepaya,3026,pohon
Jawa Barat,3276,kota depok,pepaya,24291,pohon
Jawa Barat,3272,kota sukabumi,pepaya,2865,pohon
Jawa Barat,3278,kota tasikmalaya,pepaya,4494,pohon
Jawa Barat,3204,kab. bandung,petai,130615,pohon
Jawa Barat,3217,kab. bandung barat,petai,55891,pohon
Jawa Barat,3216,kab. bekasi,petai,17402,pohon
Jawa Barat,3201,kab. bogor,petai,203855,pohon
Jawa Barat,3207,kab. ciamis,petai,613374,pohon
Jawa Barat,3203,kab. cianjur,petai,225219,pohon
Jawa Barat,3209,kab. cirebon,petai,16506,pohon
Jawa Barat,3205,kab. garut,petai,166093,pohon
Jawa Barat,3212,kab. indramayu,petai,54632,pohon
Jawa Barat,3215,kab. karawang,petai,138041,pohon
Jawa Barat,3208,kab. kuningan,petai,253953,pohon
Jawa Barat,3210,kab. majalengka,petai,273796,pohon
Jawa Barat,3218,kab. pangandaran,petai,,pohon
Jawa Barat,3214,kab. purwakarta,petai,154004,pohon
Jawa Barat,3213,kab. subang,petai,51552,pohon
Jawa Barat,3202,kab. sukabumi,petai,91535,pohon
Jawa Barat,3211,kab. sumedang,petai,455425,pohon
Jawa Barat,3206,kab. tasikmalaya,petai,361066,pohon
Jawa Barat,3273,kota bandung,petai,2622,pohon
Jawa Barat,3279,kota banjar,petai,22601,pohon
Jawa Barat,3275,kota bekasi,petai,2281,pohon
Jawa Barat,3271,kota bogor,petai,3263,pohon
Jawa Barat,3277,kota cimahi,petai,5475,pohon
Jawa Barat,3274,kota cirebon,petai,10286,pohon
Jawa Barat,3276,kota depok,petai,50,pohon
Jawa Barat,3272,kota sukabumi,petai,1396,pohon
Jawa Barat,3278,kota tasikmalaya,petai,38831,pohon
Jawa Barat,3204,kab. bandung,pisang,662435,pohon
Jawa Barat,3217,kab. bandung barat,pisang,2169975,pohon
Jawa Barat,3216,kab. bekasi,pisang,874714,pohon
Jawa Barat,3201,kab. bogor,pisang,1865046,pohon
Jawa Barat,3207,kab. ciamis,pisang,10128593,pohon
Jawa Barat,3203,kab. cianjur,pisang,8288131,pohon
Jawa Barat,3209,kab. cirebon,pisang,369429,pohon
Jawa Barat,3205,kab. garut,pisang,2722583,pohon
Jawa Barat,3212,kab. indramayu,pisang,409266,pohon
Jawa Barat,3215,kab. karawang,pisang,338845,pohon
Jawa Barat,3208,kab. kuningan,pisang,1830075,pohon
Jawa Barat,3210,kab. majalengka,pisang,1524538,pohon
Jawa Barat,3218,kab. pangandaran,pisang,,pohon
Jawa Barat,3214,kab. purwakarta,pisang,2909912,pohon
Jawa Barat,3213,kab. subang,pisang,2829522,pohon
Jawa Barat,3202,kab. sukabumi,pisang,4540558,pohon
Jawa Barat,3211,kab. sumedang,pisang,3393884,pohon
Jawa Barat,3206,kab. tasikmalaya,pisang,6219380,pohon
Jawa Barat,3273,kota bandung,pisang,26199,pohon
Jawa Barat,3279,kota banjar,pisang,498241,pohon
Jawa Barat,3275,kota bekasi,pisang,36909,pohon
Jawa Barat,3271,kota bogor,pisang,39815,pohon
Jawa Barat,3277,kota cimahi,pisang,5545,pohon
Jawa Barat,3274,kota cirebon,pisang,25673,pohon
Jawa Barat,3276,kota depok,pisang,18415,pohon
Jawa Barat,3272,kota sukabumi,pisang,955,pohon
Jawa Barat,3278,kota tasikmalaya,pisang,76976,pohon
Jawa Barat,3204,kab. bandung,rambutan,34440,pohon
Jawa Barat,3217,kab. bandung barat,rambutan,90332,pohon
Jawa Barat,3216,kab. bekasi,rambutan,146952,pohon
Jawa Barat,3201,kab. bogor,rambutan,537223,pohon
Jawa Barat,3207,kab. ciamis,rambutan,367831,pohon
Jawa Barat,3203,kab. cianjur,rambutan,106798,pohon
Jawa Barat,3209,kab. cirebon,rambutan,19511,pohon
Jawa Barat,3205,kab. garut,rambutan,94869,pohon
Jawa Barat,3212,kab. indramayu,rambutan,1664,pohon
Jawa Barat,3215,kab. karawang,rambutan,247776,pohon
Jawa Barat,3208,kab. kuningan,rambutan,199380,pohon
Jawa Barat,3210,kab. majalengka,rambutan,106091,pohon
Jawa Barat,3218,kab. pangandaran,rambutan,,pohon
Jawa Barat,3214,kab. purwakarta,rambutan,336177,pohon
Jawa Barat,3213,kab. subang,rambutan,790570,pohon
Jawa Barat,3202,kab. sukabumi,rambutan,152437,pohon
Jawa Barat,3211,kab. sumedang,rambutan,261791,pohon
Jawa Barat,3206,kab. tasikmalaya,rambutan,688883,pohon
Jawa Barat,3273,kota bandung,rambutan,5695,pohon
Jawa Barat,3279,kota banjar,rambutan,109512,pohon
Jawa Barat,3275,kota bekasi,rambutan,56339,pohon
Jawa Barat,3271,kota bogor,rambutan,10391,pohon
Jawa Barat,3277,kota cimahi,rambutan,1625,pohon
Jawa Barat,3274,kota cirebon,rambutan,1244,pohon
Jawa Barat,3276,kota depok,rambutan,16131,pohon
Jawa Barat,3272,kota sukabumi,rambutan,1002,pohon
Jawa Barat,3278,kota tasikmalaya,rambutan,120218,pohon
Jawa Barat,3204,kab. bandung,salak,10343,pohon
Jawa Barat,3217,kab. bandung barat,salak,76541,pohon
Jawa Barat,3216,kab. bekasi,salak,39210,pohon
Jawa Barat,3201,kab. bogor,salak,82776,pohon
Jawa Barat,3207,kab. ciamis,salak,997857,pohon
Jawa Barat,3203,kab. cianjur,salak,119531,pohon
Jawa Barat,3209,kab. cirebon,salak,4749,pohon
Jawa Barat,3205,kab. garut,salak,9006,pohon
Jawa Barat,3212,kab. indramayu,salak,5000,pohon
Jawa Barat,3215,kab. karawang,salak,235,pohon
Jawa Barat,3208,kab. kuningan,salak,145878,pohon
Jawa Barat,3210,kab. majalengka,salak,23343,pohon
Jawa Barat,3218,kab. pangandaran,salak,,pohon
Jawa Barat,3214,kab. purwakarta,salak,8966,pohon
Jawa Barat,3213,kab. subang,salak,32348,pohon
Jawa Barat,3202,kab. sukabumi,salak,32549,pohon
Jawa Barat,3211,kab. sumedang,salak,1438637,pohon
Jawa Barat,3206,kab. tasikmalaya,salak,16057437,pohon
Jawa Barat,3273,kota bandung,salak,0,pohon
Jawa Barat,3279,kota banjar,salak,5615,pohon
Jawa Barat,3275,kota bekasi,salak,0,pohon
Jawa Barat,3271,kota bogor,salak,1741,pohon
Jawa Barat,3277,kota cimahi,salak,70,pohon
Jawa Barat,3274,kota cirebon,salak,0,pohon
Jawa Barat,3276,kota depok,salak,72,pohon
Jawa Barat,3272,kota sukabumi,salak,0,pohon
Jawa Barat,3278,kota tasikmalaya,salak,557605,pohon
Jawa Barat,3204,kab. bandung,sawo,27026,pohon
Jawa Barat,3217,kab. bandung barat,sawo,15926,pohon
Jawa Barat,3216,kab. bekasi,sawo,4139,pohon
Jawa Barat,3201,kab. bogor,sawo,15561,pohon
Jawa Barat,3207,kab. ciamis,sawo,137241,pohon
Jawa Barat,3203,kab. cianjur,sawo,39737,pohon
Jawa Barat,3209,kab. cirebon,sawo,12760,pohon
Jawa Barat,3205,kab. garut,sawo,30438,pohon
Jawa Barat,3212,kab. indramayu,sawo,11631,pohon
Jawa Barat,3215,kab. karawang,sawo,8426,pohon
Jawa Barat,3208,kab. kuningan,sawo,3011,pohon
Jawa Barat,3210,kab. majalengka,sawo,13523,pohon
Jawa Barat,3218,kab. pangandaran,sawo,,pohon
Jawa Barat,3214,kab. purwakarta,sawo,8617,pohon
Jawa Barat,3213,kab. subang,sawo,8588,pohon
Jawa Barat,3202,kab. sukabumi,sawo,34362,pohon
Jawa Barat,3211,kab. sumedang,sawo,134303,pohon
Jawa Barat,3206,kab. tasikmalaya,sawo,72109,pohon
Jawa Barat,3273,kota bandung,sawo,2547,pohon
Jawa Barat,3279,kota banjar,sawo,6515,pohon
Jawa Barat,3275,kota bekasi,sawo,4814,pohon
Jawa Barat,3271,kota bogor,sawo,2041,pohon
Jawa Barat,3277,kota cimahi,sawo,125,pohon
Jawa Barat,3274,kota cirebon,sawo,2029,pohon
Jawa Barat,3276,kota depok,sawo,995,pohon
Jawa Barat,3272,kota sukabumi,sawo,33,pohon
Jawa Barat,3278,kota tasikmalaya,sawo,656,pohon
Jawa Barat,3204,kab. bandung,sirsak,22702,pohon
Jawa Barat,3217,kab. bandung barat,sirsak,18607,pohon
Jawa Barat,3216,kab. bekasi,sirsak,4293,pohon
Jawa Barat,3201,kab. bogor,sirsak,38377,pohon
Jawa Barat,3207,kab. ciamis,sirsak,73452,pohon
Jawa Barat,3203,kab. cianjur,sirsak,78238,pohon
Jawa Barat,3209,kab. cirebon,sirsak,8847,pohon
Jawa Barat,3205,kab. garut,sirsak,60717,pohon
Jawa Barat,3212,kab. indramayu,sirsak,9754,pohon
Jawa Barat,3215,kab. karawang,sirsak,38758,pohon
Jawa Barat,3208,kab. kuningan,sirsak,21933,pohon
Jawa Barat,3210,kab. majalengka,sirsak,30990,pohon
Jawa Barat,3218,kab. pangandaran,sirsak,,pohon
Jawa Barat,3214,kab. purwakarta,sirsak,16504,pohon
Jawa Barat,3213,kab. subang,sirsak,25946,pohon
Jawa Barat,3202,kab. sukabumi,sirsak,71200,pohon
Jawa Barat,3211,kab. sumedang,sirsak,15181,pohon
Jawa Barat,3206,kab. tasikmalaya,sirsak,214037,pohon
Jawa Barat,3273,kota bandung,sirsak,3799,pohon
Jawa Barat,3279,kota banjar,sirsak,3244,pohon
Jawa Barat,3275,kota bekasi,sirsak,2884,pohon
Jawa Barat,3271,kota bogor,sirsak,4116,pohon
Jawa Barat,3277,kota cimahi,sirsak,160,pohon
Jawa Barat,3274,kota cirebon,sirsak,2194,pohon
Jawa Barat,3276,kota depok,sirsak,383,pohon
Jawa Barat,3272,kota sukabumi,sirsak,33,pohon
Jawa Barat,3278,kota tasikmalaya,sirsak,1818,pohon
Jawa Barat,3204,kab. bandung,sukun,97385,pohon
Jawa Barat,3217,kab. bandung barat,sukun,40010,pohon
Jawa Barat,3216,kab. bekasi,sukun,26020,pohon
Jawa Barat,3201,kab. bogor,sukun,33265,pohon
Jawa Barat,3207,kab. ciamis,sukun,104999,pohon
Jawa Barat,3203,kab. cianjur,sukun,32387,pohon
Jawa Barat,3209,kab. cirebon,sukun,8118,pohon
Jawa Barat,3205,kab. garut,sukun,28324,pohon
Jawa Barat,3212,kab. indramayu,sukun,33595,pohon
Jawa Barat,3215,kab. karawang,sukun,33683,pohon
Jawa Barat,3208,kab. kuningan,sukun,97900,pohon
Jawa Barat,3210,kab. majalengka,sukun,70779,pohon
Jawa Barat,3218,kab. pangandaran,sukun,,pohon
Jawa Barat,3214,kab. purwakarta,sukun,19682,pohon
Jawa Barat,3213,kab. subang,sukun,16662,pohon
Jawa Barat,3202,kab. sukabumi,sukun,51120,pohon
Jawa Barat,3211,kab. sumedang,sukun,46137,pohon
Jawa Barat,3206,kab. tasikmalaya,sukun,125941,pohon
Jawa Barat,3273,kota bandung,sukun,23745,pohon
Jawa Barat,3279,kota banjar,sukun,1868,pohon
Jawa Barat,3275,kota bekasi,sukun,2234,pohon
Jawa Barat,3271,kota bogor,sukun,3144,pohon
Jawa Barat,3277,kota cimahi,sukun,3540,pohon
Jawa Barat,3274,kota cirebon,sukun,3292,pohon
Jawa Barat,3276,kota depok,sukun,51,pohon
Jawa Barat,3272,kota sukabumi,sukun,1039,pohon
Jawa Barat,3278,kota tasikmalaya,sukun,26740,pohon
