kode_kota_kabupaten,kota_kabupaten,luas_areal_tanam_kubis,satuan
3204,kab. bandung,3075,hektar
3217,kab. bandung barat,166,hektar
3216,kab. bekasi,0,hektar
3201,kab. bogor,20,hektar
3207,kab. ciamis,0,hektar
3203,kab. cianjur,1256,hektar
3209,kab. cirebon,0,hektar
3205,kab. garut,6336,hektar
3212,kab. indramayu,0,hektar
3215,kab. karawang,0,hektar
3208,kab. kuningan,140,hektar
3210,kab. majalengka,272,hektar
3218,kab. pangandaran,0,hektar
3214,kab. purwakarta,2,hektar
3213,kab. subang,108,hektar
3202,kab. sukabumi,227,hektar
3211,kab. sumedang,428,hektar
3206,kab. tasikmalaya,211,hektar
3273,kota bandung,9,hektar
3279,kota banjar,0,hektar
3275,kota bekasi,0,hektar
3271,kota bogor,0,hektar
3277,kota cimahi,0,hektar
3274,kota cirebon,0,hektar
3276,kota depok,0,hektar
3272,kota sukabumi,0,hektar
3278,kota tasikmalaya,0,hektar
