﻿provinsi,kode_kota_kabupaten,nama_kota_kabupaten,pemancingan,jumlah,satuan
JAWA BARAT,3204,KAB. BANDUNG,KOLAM PEMANCINGAN,140,UNIT
JAWA BARAT,3204,KAB. BANDUNG,LAPAK,800,UNIT
JAWA BARAT,3217,KAB. BANDUNG BARAT,KOLAM PEMANCINGAN,37,UNIT
JAWA BARAT,3217,KAB. BANDUNG BARAT,LAPAK,406,UNIT
JAWA BARAT,3216,KAB. BEKASI,KOLAM PEMANCINGAN,2,UNIT
JAWA BARAT,3216,KAB. BEKASI,LAPAK,200,UNIT
JAWA BARAT,3201,KAB. BOGOR,KOLAM PEMANCINGAN,9,UNIT
JAWA BARAT,3201,KAB. BOGOR,LAPAK,100,UNIT
JAWA BARAT,3209,KAB. CIREBON,KOLAM PEMANCINGAN,2,UNIT
JAWA BARAT,3209,KAB. CIREBON,LAPAK,46,UNIT
JAWA BARAT,3205,KAB. GARUT,KOLAM PEMANCINGAN,11,UNIT
JAWA BARAT,3205,KAB. GARUT,LAPAK,113,UNIT
JAWA BARAT,3212,KAB. INDRAMAYU,KOLAM PEMANCINGAN,3,UNIT
JAWA BARAT,3215,KAB. KARAWANG,KOLAM PEMANCINGAN,9,UNIT
JAWA BARAT,3215,KAB. KARAWANG,LAPAK,0,UNIT
JAWA BARAT,3208,KAB. KUNINGAN,KOLAM PEMANCINGAN,4,UNIT
JAWA BARAT,3208,KAB. KUNINGAN,LAPAK,48,UNIT
JAWA BARAT,3210,KAB. MAJALENGKA,KOLAM PEMANCINGAN,0,UNIT
JAWA BARAT,3210,KAB. MAJALENGKA,LAPAK,0,UNIT
JAWA BARAT,3214,KAB. PURWAKARTA,KOLAM PEMANCINGAN,14,UNIT
JAWA BARAT,3214,KAB. PURWAKARTA,LAPAK,648,UNIT
JAWA BARAT,3213,KAB. SUBANG,KOLAM PEMANCINGAN,4,UNIT
JAWA BARAT,3213,KAB. SUBANG,LAPAK,157,UNIT
JAWA BARAT,3202,KAB. SUKABUMI,KOLAM PEMANCINGAN,2,UNIT
JAWA BARAT,3202,KAB. SUKABUMI,LAPAK,3,UNIT
JAWA BARAT,3211,KAB. SUMEDANG,KOLAM PEMANCINGAN,3,UNIT
JAWA BARAT,3211,KAB. SUMEDANG,LAPAK,100,UNIT
JAWA BARAT,3206,KAB. TASIKMALAYA,KOLAM PEMANCINGAN,1,UNIT
JAWA BARAT,3206,KAB. TASIKMALAYA,LAPAK,0,UNIT
JAWA BARAT,3279,KOTA BANJAR,LAPAK,0,UNIT
JAWA BARAT,3275,KOTA BEKASI,KOLAM PEMANCINGAN,2,UNIT
JAWA BARAT,3275,KOTA BEKASI,LAPAK,80,UNIT
JAWA BARAT,3271,KOTA BOGOR,KOLAM PEMANCINGAN,6,UNIT
JAWA BARAT,3271,KOTA BOGOR,LAPAK,6,UNIT
JAWA BARAT,3277,KOTA CIMAHI,KOLAM PEMANCINGAN,0,UNIT
JAWA BARAT,3277,KOTA CIMAHI,LAPAK,0,UNIT
JAWA BARAT,3276,KOTA DEPOK,KOLAM PEMANCINGAN,7,UNIT
JAWA BARAT,3278,KOTA TASIKMALAYA,KOLAM PEMANCINGAN,0,UNIT
JAWA BARAT,3278,KOTA TASIKMALAYA,LAPAK,0,UNIT
