﻿kode_provinsi,provinsi,angka_harapan_lama_sekolah,satuan
1100,ACEH,13.35753507,TAHUN
1200,SUMATERA UTARA,12.40551441,TAHUN
1300,SUMATERA BARAT,13.15590476,TAHUN
1400,RIAU,12.272723,TAHUN
1500,JAMBI,12.17398657,TAHUN
1600,SUMATERA SELATAN,11.45898055,TAHUN
1700,BENGKULU,12.78061017,TAHUN
1800,LAMPUNG,11.89665791,TAHUN
1900,KEP. BANGKA BELITUNG,10.95513259,TAHUN
2100,KEPULAUAN RIAU,12.2567766,TAHUN
3100,DKI JAKARTA,12.24460106,TAHUN
3200,JAWA BARAT,11.8108881,TAHUN
3300,JAWA TENGAH,11.88867914,TAHUN
3400,D I YOGYAKARTA,14.66738543,TAHUN
3500,JAWA TIMUR,12.16513282,TAHUN
3600,BANTEN,12.04561618,TAHUN
5100,BALI,12.40221,TAHUN
5200,NUSA TENGGARA BARAT,12.45554699,TAHUN
5300,NUSA TENGGARA TIMUR,12.26805023,TAHUN
6100,KALIMANTAN BARAT,11.60323077,TAHUN
6200,KALIMANTAN TENGAH,11.71492529,TAHUN
6300,KALIMANTAN SELATAN,11.67226646,TAHUN
6400,KALIMANTAN TIMUR,12.85021351,TAHUN
6500,KALIMANTAN UTARA,12.30463249,TAHUN
7100,SULAWESI UTARA,11.87990672,TAHUN
7200,SULAWESI TENGAH,12.35697252,TAHUN
7300,SULAWESI SELATAN,12.52441503,TAHUN
7400,SULAWESI TENGGARA,12.44710472,TAHUN
7500,GORONTALO,12.1286281,TAHUN
7600,SULAWESI BARAT,11.46413265,TAHUN
8100,MALUKU,13.35089742,TAHUN
8200,MALUKU UTARA,12.48288162,TAHUN
9100,PAPUA BARAT,11.67263359,TAHUN
9400,PAPUA,9.57919895,TAHUN
