jam_kerja,penduduk_yang_bekerja,satuan
0*),441833,jiwa
1-9,244131,jiwa
10-14,463993,jiwa
15-24,1555138,jiwa
25-34,1910573,jiwa
35-44,4058704,jiwa
45-59,6166520,jiwa
60+,2613889,jiwa
,,
*) sementara tidak bekerja,,
