kode_kota_kabupaten,kota_kabupaten,jenis_kelamin,jumlah_penduduk_usia_19-24,satuan
3201,BOGOR,laki-laki,268455,jiwa
3201,BOGOR,perempuan,252496,jiwa
3202,SUKABUMI,laki-laki,130922,jiwa
3202,SUKABUMI,perempuan,126120,jiwa
3203,CIANJUR,laki-laki,119297,jiwa
3203,CIANJUR,perempuan,108980,jiwa
3204,BANDUNG,laki-laki,189072,jiwa
3204,BANDUNG,perempuan,181102,jiwa
3205,GARUT,laki-laki,126458,jiwa
3205,GARUT,perempuan,119157,jiwa
3206,TASIKMALAYA,laki-laki,88680,jiwa
3206,TASIKMALAYA,perempuan,82383,jiwa
3207,CIAMIS,laki-laki,60922,jiwa
3207,CIAMIS,perempuan,57334,jiwa
3208,KUNINGAN,laki-laki,55730,jiwa
3208,KUNINGAN,perempuan,53623,jiwa
3209,CIREBON,laki-laki,116812,jiwa
3209,CIREBON,perempuan,115030,jiwa
3210,MAJALENGKA,laki-laki,57864,jiwa
3210,MAJALENGKA,perempuan,55910,jiwa
3210,SUMEDANG,laki-laki,57656,jiwa
3210,SUMEDANG,perempuan,54237,jiwa
3212,INDRAMAYU,laki-laki,100780,jiwa
3212,INDRAMAYU,perempuan,93714,jiwa
3213,SUBANG,laki-laki,77707,jiwa
3213,SUBANG,perempuan,76244,jiwa
3214,PURWAKARTA,laki-laki,47892,jiwa
3214,PURWAKARTA,perempuan,47142,jiwa
3215,KARAWANG,laki-laki,116723,jiwa
3215,KARAWANG,perempuan,112583,jiwa
3216,BEKASI,laki-laki,131267,jiwa
3216,BEKASI,perempuan,126695,jiwa
3217,BANDUNG BARAT,laki-laki,82405,jiwa
3217,BANDUNG BARAT,perempuan,77681,jiwa
3218,PANGANDARAN,laki-laki,19702,jiwa
3218,PANGANDARAN,perempuan,19058,jiwa
3271,KOTA BOGOR,laki-laki,50142,jiwa
3271,KOTA BOGOR,perempuan,49724,jiwa
3272,KOTA SUKABUMI,laki-laki,16975,jiwa
3272,KOTA SUKABUMI,perempuan,16831,jiwa
3273,KOTA BANDUNG,laki-laki,112442,jiwa
3273,KOTA BANDUNG,perempuan,110324,jiwa
3274,KOTA CIREBON,laki-laki,17238,jiwa
3274,KOTA CIREBON,perempuan,16720,jiwa
3275,KOTA BEKASI,laki-laki,123884,jiwa
3275,KOTA BEKASI,perempuan,120093,jiwa
3276,KOTA DEPOK,laki-laki,89644,jiwa
3276,KOTA DEPOK,perempuan,85401,jiwa
3277,KOTA CIMAHI,laki-laki,27574,jiwa
3277,KOTA CIMAHI,perempuan,26512,jiwa
3278,KOTA TASIKMALAYA,laki-laki,36552,jiwa
3278,KOTA TASIKMALAYA,perempuan,35514,jiwa
3279,KOTA BANJAR,laki-laki,10697,jiwa
3279,KOTA BANJAR,perempuan,10220,jiwa
