﻿provinsi,kode_kota_kabupaten,nama_kota_kabupaten,proyeksi_jumlah_penduduk,satuan
JAWA BARAT,3204,KAB. BANDUNG,208.1,RIBU JIWA
JAWA BARAT,3217,KAB. BANDUNG BARAT,98.51,RIBU JIWA
JAWA BARAT,3216,KAB. BEKASI,178.19,RIBU JIWA
JAWA BARAT,3201,KAB. BOGOR,308,RIBU JIWA
JAWA BARAT,3207,KAB. CIAMIS,88.76,RIBU JIWA
JAWA BARAT,3203,KAB. CIANJUR,142.82,RIBU JIWA
JAWA BARAT,3209,KAB. CIREBON,124.59,RIBU JIWA
JAWA BARAT,3205,KAB. GARUT,148.45,RIBU JIWA
JAWA BARAT,3212,KAB. INDRAMAYU,113.86,RIBU JIWA
JAWA BARAT,3215,KAB. KARAWANG,140.77,RIBU JIWA
JAWA BARAT,3208,KAB. KUNINGAN,70.29,RIBU JIWA
JAWA BARAT,3210,KAB. MAJALENGKA,82.32,RIBU JIWA
JAWA BARAT,3218,KAB. PANGANDARAN,31.32,RIBU JIWA
JAWA BARAT,3214,KAB. PURWAKARTA,55.21,RIBU JIWA
JAWA BARAT,3213,KAB. SUBANG,108.38,RIBU JIWA
JAWA BARAT,3202,KAB. SUKABUMI,154.22,RIBU JIWA
JAWA BARAT,3211,KAB. SUMEDANG,77.41,RIBU JIWA
JAWA BARAT,3206,KAB. TASIKMALAYA,122.8,RIBU JIWA
JAWA BARAT,3273,KOTA BANDUNG,154.92,RIBU JIWA
JAWA BARAT,3279,KOTA BANJAR,13.33,RIBU JIWA
JAWA BARAT,3275,KOTA BEKASI,188.54,RIBU JIWA
JAWA BARAT,3271,KOTA BOGOR,65.94,RIBU JIWA
JAWA BARAT,3277,KOTA CIMAHI,36.59,RIBU JIWA
JAWA BARAT,3274,KOTA CIREBON,20.05,RIBU JIWA
JAWA BARAT,3276,KOTA DEPOK,140,RIBU JIWA
JAWA BARAT,3272,KOTA SUKABUMI,20.5,RIBU JIWA
JAWA BARAT,3278,KOTA TASIKMALAYA,41.54,RIBU JIWA
