﻿provinsi,kode_kota_kabupaten,nama_kota_kabupaten,status_kesejahteraan,jumlah,satuan
JAWA BARAT,3204,KAB. BANDUNG,DESIL I,445,KK
JAWA BARAT,3204,KAB. BANDUNG,DESIL II,75536,KK
JAWA BARAT,3204,KAB. BANDUNG,DESIL III,115076,KK
JAWA BARAT,3204,KAB. BANDUNG,DESIL IV,91919,KK
JAWA BARAT,3217,KAB. BANDUNG BARAT,DESIL I,7011,KK
JAWA BARAT,3217,KAB. BANDUNG BARAT,DESIL II,57707,KK
JAWA BARAT,3217,KAB. BANDUNG BARAT,DESIL III,9114,KK
JAWA BARAT,3217,KAB. BANDUNG BARAT,DESIL IV,5091,KK
JAWA BARAT,3216,KAB. BEKASI,DESIL I,57086,KK
JAWA BARAT,3216,KAB. BEKASI,DESIL II,50418,KK
JAWA BARAT,3216,KAB. BEKASI,DESIL III,48312,KK
JAWA BARAT,3216,KAB. BEKASI,DESIL IV,3036,KK
JAWA BARAT,3201,KAB. BOGOR,DESIL I,6941,KK
JAWA BARAT,3201,KAB. BOGOR,DESIL II,9033,KK
JAWA BARAT,3201,KAB. BOGOR,DESIL III,150267,KK
JAWA BARAT,3201,KAB. BOGOR,DESIL IV,9008,KK
JAWA BARAT,3207,KAB. CIAMIS,DESIL I,41027,KK
JAWA BARAT,3207,KAB. CIAMIS,DESIL II,53986,KK
JAWA BARAT,3207,KAB. CIAMIS,DESIL III,43658,KK
JAWA BARAT,3207,KAB. CIAMIS,DESIL IV,1246,KK
JAWA BARAT,3203,KAB. CIANJUR,DESIL I,78188,KK
JAWA BARAT,3203,KAB. CIANJUR,DESIL II,101879,KK
JAWA BARAT,3203,KAB. CIANJUR,DESIL III,90946,KK
JAWA BARAT,3203,KAB. CIANJUR,DESIL IV,33429,KK
JAWA BARAT,3209,KAB. CIREBON,DESIL I,72345,KK
JAWA BARAT,3209,KAB. CIREBON,DESIL II,86896,KK
JAWA BARAT,3209,KAB. CIREBON,DESIL III,70726,KK
JAWA BARAT,3209,KAB. CIREBON,DESIL IV,19834,KK
JAWA BARAT,3205,KAB. GARUT,DESIL I,81729,KK
JAWA BARAT,3205,KAB. GARUT,DESIL II,108624,KK
JAWA BARAT,3205,KAB. GARUT,DESIL III,105073,KK
JAWA BARAT,3205,KAB. GARUT,DESIL IV,19982,KK
JAWA BARAT,3212,KAB. INDRAMAYU,DESIL I,93822,KK
JAWA BARAT,3212,KAB. INDRAMAYU,DESIL II,76488,KK
JAWA BARAT,3212,KAB. INDRAMAYU,DESIL III,5864,KK
JAWA BARAT,3212,KAB. INDRAMAYU,DESIL IV,8451,KK
JAWA BARAT,3215,KAB. KARAWANG,DESIL I,59787,KK
JAWA BARAT,3215,KAB. KARAWANG,DESIL II,68031,KK
JAWA BARAT,3215,KAB. KARAWANG,DESIL III,57986,KK
JAWA BARAT,3215,KAB. KARAWANG,DESIL IV,33851,KK
JAWA BARAT,3208,KAB. KUNINGAN,DESIL I,17976,KK
JAWA BARAT,3208,KAB. KUNINGAN,DESIL II,20282,KK
JAWA BARAT,3208,KAB. KUNINGAN,DESIL III,42559,KK
JAWA BARAT,3208,KAB. KUNINGAN,DESIL IV,27915,KK
JAWA BARAT,3210,KAB. MAJALENGKA,DESIL I,107728,KK
JAWA BARAT,3210,KAB. MAJALENGKA,DESIL II,19207,KK
JAWA BARAT,3210,KAB. MAJALENGKA,DESIL III,7156,KK
JAWA BARAT,3210,KAB. MAJALENGKA,DESIL IV,3926,KK
JAWA BARAT,3218,KAB. PANGANDARAN,DESIL I,841,KK
JAWA BARAT,3218,KAB. PANGANDARAN,DESIL II,1541,KK
JAWA BARAT,3218,KAB. PANGANDARAN,DESIL III,14956,KK
JAWA BARAT,3218,KAB. PANGANDARAN,DESIL IV,4651,KK
JAWA BARAT,3214,KAB. PURWAKARTA,DESIL I,10685,KK
JAWA BARAT,3214,KAB. PURWAKARTA,DESIL II,13287,KK
JAWA BARAT,3214,KAB. PURWAKARTA,DESIL III,17458,KK
JAWA BARAT,3214,KAB. PURWAKARTA,DESIL IV,1822,KK
JAWA BARAT,3213,KAB. SUBANG,DESIL I,9999,KK
JAWA BARAT,3213,KAB. SUBANG,DESIL II,31362,KK
JAWA BARAT,3213,KAB. SUBANG,DESIL III,43884,KK
JAWA BARAT,3213,KAB. SUBANG,DESIL IV,45656,KK
JAWA BARAT,3202,KAB. SUKABUMI,DESIL I,25052,KK
JAWA BARAT,3202,KAB. SUKABUMI,DESIL II,49514,KK
JAWA BARAT,3202,KAB. SUKABUMI,DESIL III,75996,KK
JAWA BARAT,3202,KAB. SUKABUMI,DESIL IV,84923,KK
JAWA BARAT,3211,KAB. SUMEDANG,DESIL I,10247,KK
JAWA BARAT,3211,KAB. SUMEDANG,DESIL II,23583,KK
JAWA BARAT,3211,KAB. SUMEDANG,DESIL III,35357,KK
JAWA BARAT,3211,KAB. SUMEDANG,DESIL IV,27734,KK
JAWA BARAT,3206,KAB. TASIKMALAYA,DESIL I,72474,KK
JAWA BARAT,3206,KAB. TASIKMALAYA,DESIL II,91711,KK
JAWA BARAT,3206,KAB. TASIKMALAYA,DESIL III,42169,KK
JAWA BARAT,3206,KAB. TASIKMALAYA,DESIL IV,5452,KK
JAWA BARAT,3273,KOTA BANDUNG,DESIL I,26423,KK
JAWA BARAT,3273,KOTA BANDUNG,DESIL II,4329,KK
JAWA BARAT,3273,KOTA BANDUNG,DESIL III,29609,KK
JAWA BARAT,3273,KOTA BANDUNG,DESIL IV,17889,KK
JAWA BARAT,3279,KOTA BANJAR,DESIL I,1685,KK
JAWA BARAT,3279,KOTA BANJAR,DESIL II,2421,KK
JAWA BARAT,3279,KOTA BANJAR,DESIL III,6612,KK
JAWA BARAT,3279,KOTA BANJAR,DESIL IV,1116,KK
JAWA BARAT,3275,KOTA BEKASI,DESIL I,55146,KK
JAWA BARAT,3275,KOTA BEKASI,DESIL II,23586,KK
JAWA BARAT,3275,KOTA BEKASI,DESIL III,8656,KK
JAWA BARAT,3275,KOTA BEKASI,DESIL IV,8126,KK
JAWA BARAT,3271,KOTA BOGOR,DESIL I,29818,KK
JAWA BARAT,3271,KOTA BOGOR,DESIL II,25666,KK
JAWA BARAT,3271,KOTA BOGOR,DESIL III,14504,KK
JAWA BARAT,3271,KOTA BOGOR,DESIL IV,1318,KK
JAWA BARAT,3277,KOTA CIMAHI,DESIL I,118,KK
JAWA BARAT,3277,KOTA CIMAHI,DESIL II,7808,KK
JAWA BARAT,3277,KOTA CIMAHI,DESIL III,2697,KK
JAWA BARAT,3277,KOTA CIMAHI,DESIL IV,3262,KK
JAWA BARAT,3274,KOTA CIREBON,DESIL I,11586,KK
JAWA BARAT,3274,KOTA CIREBON,DESIL II,10733,KK
JAWA BARAT,3274,KOTA CIREBON,DESIL III,2355,KK
JAWA BARAT,3274,KOTA CIREBON,DESIL IV,1496,KK
JAWA BARAT,3276,KOTA DEPOK,DESIL I,37552,KK
JAWA BARAT,3276,KOTA DEPOK,DESIL II,2702,KK
JAWA BARAT,3276,KOTA DEPOK,DESIL III,714,KK
JAWA BARAT,3276,KOTA DEPOK,DESIL IV,2565,KK
JAWA BARAT,3272,KOTA SUKABUMI,DESIL I,18413,KK
JAWA BARAT,3272,KOTA SUKABUMI,DESIL II,2535,KK
JAWA BARAT,3272,KOTA SUKABUMI,DESIL III,1055,KK
JAWA BARAT,3272,KOTA SUKABUMI,DESIL IV,585,KK
JAWA BARAT,3278,KOTA TASIKMALAYA,DESIL I,37267,KK
JAWA BARAT,3278,KOTA TASIKMALAYA,DESIL II,22993,KK
JAWA BARAT,3278,KOTA TASIKMALAYA,DESIL III,3172,KK
JAWA BARAT,3278,KOTA TASIKMALAYA,DESIL IV,3303,KK
