﻿provinsi,kode_kota_kabupaten,nama_kota_kabupaten,pengeluaran_perkapita,satuan
JAWA BARAT,3204,KAB. BANDUNG,9375.208535,RIBU RUPIAH
JAWA BARAT,3217,KAB. BANDUNG BARAT,7522.14125,RIBU RUPIAH
JAWA BARAT,3216,KAB. BEKASI,10322.50335,RIBU RUPIAH
JAWA BARAT,3201,KAB. BOGOR,9368.391954,RIBU RUPIAH
JAWA BARAT,3207,KAB. CIAMIS,8295.756591,RIBU RUPIAH
JAWA BARAT,3203,KAB. CIANJUR,6876.624242,RIBU RUPIAH
JAWA BARAT,3209,KAB. CIREBON,9261.296149,RIBU RUPIAH
JAWA BARAT,3205,KAB. GARUT,6875.093006,RIBU RUPIAH
JAWA BARAT,3212,KAB. INDRAMAYU,8768.971228,RIBU RUPIAH
JAWA BARAT,3215,KAB. KARAWANG,10216.84819,RIBU RUPIAH
JAWA BARAT,3208,KAB. KUNINGAN,8516.096765,RIBU RUPIAH
JAWA BARAT,3210,KAB. MAJALENGKA,8477.139913,RIBU RUPIAH
JAWA BARAT,3218,KAB. PANGANDARAN,8265.020798,RIBU RUPIAH
JAWA BARAT,3214,KAB. PURWAKARTA,10549.5764,RIBU RUPIAH
JAWA BARAT,3213,KAB. SUBANG,9830.958264,RIBU RUPIAH
JAWA BARAT,3202,KAB. SUKABUMI,7848.532276,RIBU RUPIAH
JAWA BARAT,3211,KAB. SUMEDANG,9279.32352,RIBU RUPIAH
JAWA BARAT,3206,KAB. TASIKMALAYA,6934.275071,RIBU RUPIAH
JAWA BARAT,3273,KOTA BANDUNG,15608.84548,RIBU RUPIAH
JAWA BARAT,3279,KOTA BANJAR,9475.596443,RIBU RUPIAH
JAWA BARAT,3275,KOTA BEKASI,15115.83293,RIBU RUPIAH
JAWA BARAT,3271,KOTA BOGOR,10576.3744,RIBU RUPIAH
JAWA BARAT,3277,KOTA CIMAHI,11011.88129,RIBU RUPIAH
JAWA BARAT,3274,KOTA CIREBON,10732.45378,RIBU RUPIAH
JAWA BARAT,3276,KOTA DEPOK,14424.49103,RIBU RUPIAH
JAWA BARAT,3272,KOTA SUKABUMI,9729.441321,RIBU RUPIAH
JAWA BARAT,3278,KOTA TASIKMALAYA,8784.812383,RIBU RUPIAH
