﻿provinsi,kode_kota_kabupaten,kota_kabupaten,cabang_pelayanan,bbnkb,jumlah,satuan
JAWA BARAT,3217,KAB. BANDUNG BARAT, KAB. BANDUNG BARAT PDLG   ,BBNKB 1 POKOK,1.62715E+11,Rp
JAWA BARAT,3217,KAB. BANDUNG BARAT, KAB. BANDUNG BARAT PDLG   ,BBNKB 1 DENDA,115170500,Rp
JAWA BARAT,3217,KAB. BANDUNG BARAT, KAB. BANDUNG BARAT PDLG   ,BBNKB 2 POKOK,4313315600,Rp
JAWA BARAT,3217,KAB. BANDUNG BARAT, KAB. BANDUNG BARAT PDLG   ,BBNKB 2 DENDA,202777900,Rp
JAWA BARAT,3204,KAB. BANDUNG, KAB. BANDUNG I RC.EKEK    ,BBNKB 1 POKOK,1.34182E+11,Rp
JAWA BARAT,3204,KAB. BANDUNG, KAB. BANDUNG I RC.EKEK    ,BBNKB 1 DENDA,76292500,Rp
JAWA BARAT,3204,KAB. BANDUNG, KAB. BANDUNG I RC.EKEK    ,BBNKB 2 POKOK,3413946000,Rp
JAWA BARAT,3204,KAB. BANDUNG, KAB. BANDUNG I RC.EKEK    ,BBNKB 2 DENDA,159619000,Rp
JAWA BARAT,3204,KAB. BANDUNG, KAB. BANDUNG II SOREANG   ,BBNKB 1 POKOK,1.36127E+11,Rp
JAWA BARAT,3204,KAB. BANDUNG, KAB. BANDUNG II SOREANG   ,BBNKB 1 DENDA,95345000,Rp
JAWA BARAT,3204,KAB. BANDUNG, KAB. BANDUNG II SOREANG   ,BBNKB 2 POKOK,3926873000,Rp
JAWA BARAT,3204,KAB. BANDUNG, KAB. BANDUNG II SOREANG   ,BBNKB 2 DENDA,193312500,Rp
JAWA BARAT,3216,KAB. BEKASI, KAB. BEKASI CKRG          ,BBNKB 1 POKOK,5.53418E+11,Rp
JAWA BARAT,3216,KAB. BEKASI, KAB. BEKASI CKRG          ,BBNKB 1 DENDA,444742500,Rp
JAWA BARAT,3216,KAB. BEKASI, KAB. BEKASI CKRG          ,BBNKB 2 POKOK,19367092200,Rp
JAWA BARAT,3216,KAB. BEKASI, KAB. BEKASI CKRG          ,BBNKB 2 DENDA,376646200,Rp
JAWA BARAT,3201,KAB. BOGOR, KAB. BOGOR (CIBINONG)     ,BBNKB 1 POKOK,4.66944E+11,Rp
JAWA BARAT,3201,KAB. BOGOR, KAB. BOGOR (CIBINONG)     ,BBNKB 1 DENDA,566595000,Rp
JAWA BARAT,3201,KAB. BOGOR, KAB. BOGOR (CIBINONG)     ,BBNKB 2 POKOK,11838445000,Rp
JAWA BARAT,3201,KAB. BOGOR, KAB. BOGOR (CIBINONG)     ,BBNKB 2 DENDA,849875500,Rp
JAWA BARAT,3207,KAB. CIAMIS, KAB. CIAMIS I             ,BBNKB 1 POKOK,40880480000,Rp
JAWA BARAT,3207,KAB. CIAMIS, KAB. CIAMIS I             ,BBNKB 1 DENDA,30645000,Rp
JAWA BARAT,3207,KAB. CIAMIS, KAB. CIAMIS I             ,BBNKB 2 POKOK,2200044000,Rp
JAWA BARAT,3207,KAB. CIAMIS, KAB. CIAMIS I             ,BBNKB 2 DENDA,147194100,Rp
JAWA BARAT,3203,KAB. CIANJUR, KAB. CIANJUR              ,BBNKB 1 POKOK,87051240000,Rp
JAWA BARAT,3203,KAB. CIANJUR, KAB. CIANJUR              ,BBNKB 1 DENDA,28622500,Rp
JAWA BARAT,3203,KAB. CIANJUR, KAB. CIANJUR              ,BBNKB 2 POKOK,2469224000,Rp
JAWA BARAT,3203,KAB. CIANJUR, KAB. CIANJUR              ,BBNKB 2 DENDA,241186500,Rp
JAWA BARAT,3209,KAB. CIREBON, KAB. CIREBON I SBR        ,BBNKB 1 POKOK,1.07388E+11,Rp
JAWA BARAT,3209,KAB. CIREBON, KAB. CIREBON I SBR        ,BBNKB 1 DENDA,11352500,Rp
JAWA BARAT,3209,KAB. CIREBON, KAB. CIREBON I SBR        ,BBNKB 2 POKOK,3112291000,Rp
JAWA BARAT,3209,KAB. CIREBON, KAB. CIREBON I SBR        ,BBNKB 2 DENDA,194671500,Rp
JAWA BARAT,3209,KAB. CIREBON, KAB. CIREBON II CLDG      ,BBNKB 1 POKOK,42019090000,Rp
JAWA BARAT,3209,KAB. CIREBON, KAB. CIREBON II CLDG      ,BBNKB 1 DENDA,6107500,Rp
JAWA BARAT,3209,KAB. CIREBON, KAB. CIREBON II CLDG      ,BBNKB 2 POKOK,1176874500,Rp
JAWA BARAT,3209,KAB. CIREBON, KAB. CIREBON II CLDG      ,BBNKB 2 DENDA,75118400,Rp
JAWA BARAT,3205,KAB. GARUT, KAB. GARUT                ,BBNKB 1 POKOK,85101620000,Rp
JAWA BARAT,3205,KAB. GARUT, KAB. GARUT                ,BBNKB 1 DENDA,30165000,Rp
JAWA BARAT,3205,KAB. GARUT, KAB. GARUT                ,BBNKB 2 POKOK,2278605000,Rp
JAWA BARAT,3205,KAB. GARUT, KAB. GARUT                ,BBNKB 2 DENDA,95006200,Rp
JAWA BARAT,3212,KAB. INDRAMAYU, KAB. INDRAMAYU I          ,BBNKB 1 POKOK,81917040000,Rp
JAWA BARAT,3212,KAB. INDRAMAYU, KAB. INDRAMAYU I          ,BBNKB 1 DENDA,59467500,Rp
JAWA BARAT,3212,KAB. INDRAMAYU, KAB. INDRAMAYU I          ,BBNKB 2 POKOK,2051128000,Rp
JAWA BARAT,3212,KAB. INDRAMAYU, KAB. INDRAMAYU I          ,BBNKB 2 DENDA,135630800,Rp
JAWA BARAT,3212,KAB. INDRAMAYU, KAB. INDRAMAYU II HRGLS   ,BBNKB 1 POKOK,35917610000,Rp
JAWA BARAT,3212,KAB. INDRAMAYU, KAB. INDRAMAYU II HRGLS   ,BBNKB 1 DENDA,17802500,Rp
JAWA BARAT,3212,KAB. INDRAMAYU, KAB. INDRAMAYU II HRGLS   ,BBNKB 2 POKOK,495790000,Rp
JAWA BARAT,3212,KAB. INDRAMAYU, KAB. INDRAMAYU II HRGLS   ,BBNKB 2 DENDA,37014400,Rp
JAWA BARAT,3215,KAB. KARAWANG, KAB. KARAWANG             ,BBNKB 1 POKOK,2.49793E+11,Rp
JAWA BARAT,3215,KAB. KARAWANG, KAB. KARAWANG             ,BBNKB 1 DENDA,76895000,Rp
JAWA BARAT,3215,KAB. KARAWANG, KAB. KARAWANG             ,BBNKB 2 POKOK,4715372100,Rp
JAWA BARAT,3215,KAB. KARAWANG, KAB. KARAWANG             ,BBNKB 2 DENDA,319833600,Rp
JAWA BARAT,3208,KAB. KUNINGAN, KAB. KUNINGAN             ,BBNKB 1 POKOK,54164110000,Rp
JAWA BARAT,3208,KAB. KUNINGAN, KAB. KUNINGAN             ,BBNKB 1 DENDA,10332500,Rp
JAWA BARAT,3208,KAB. KUNINGAN, KAB. KUNINGAN             ,BBNKB 2 POKOK,2413920600,Rp
JAWA BARAT,3208,KAB. KUNINGAN, KAB. KUNINGAN             ,BBNKB 2 DENDA,156458600,Rp
JAWA BARAT,3210,KAB. MAJALENGKA, KAB. MAJALENGKA           ,BBNKB 1 POKOK,58631270000,Rp
JAWA BARAT,3210,KAB. MAJALENGKA, KAB. MAJALENGKA           ,BBNKB 1 DENDA,83737500,Rp
JAWA BARAT,3210,KAB. MAJALENGKA, KAB. MAJALENGKA           ,BBNKB 2 POKOK,2429965000,Rp
JAWA BARAT,3210,KAB. MAJALENGKA, KAB. MAJALENGKA           ,BBNKB 2 DENDA,118655600,Rp
JAWA BARAT,3218,KAB. PANGANDARAN, KAB. PANGANDARAN          ,BBNKB 1 POKOK,13111830000,Rp
JAWA BARAT,3218,KAB. PANGANDARAN, KAB. PANGANDARAN          ,BBNKB 1 DENDA,73862500,Rp
JAWA BARAT,3218,KAB. PANGANDARAN, KAB. PANGANDARAN          ,BBNKB 2 POKOK,808174000,Rp
JAWA BARAT,3218,KAB. PANGANDARAN, KAB. PANGANDARAN          ,BBNKB 2 DENDA,75482900,Rp
JAWA BARAT,3214,KAB. PURWAKARTA, KAB. PURWAKARTA           ,BBNKB 1 POKOK,77417210000,Rp
JAWA BARAT,3214,KAB. PURWAKARTA, KAB. PURWAKARTA           ,BBNKB 1 DENDA,71607500,Rp
JAWA BARAT,3214,KAB. PURWAKARTA, KAB. PURWAKARTA           ,BBNKB 2 POKOK,1835938400,Rp
JAWA BARAT,3214,KAB. PURWAKARTA, KAB. PURWAKARTA           ,BBNKB 2 DENDA,140740400,Rp
JAWA BARAT,3213,KAB. SUBANG, KAB. SUBANG               ,BBNKB 1 POKOK,92586050000,Rp
JAWA BARAT,3213,KAB. SUBANG, KAB. SUBANG               ,BBNKB 1 DENDA,49492500,Rp
JAWA BARAT,3213,KAB. SUBANG, KAB. SUBANG               ,BBNKB 2 POKOK,1601881000,Rp
JAWA BARAT,3213,KAB. SUBANG, KAB. SUBANG               ,BBNKB 2 DENDA,77021800,Rp
JAWA BARAT,3202,KAB. SUKABUMI, KAB. SUKABUMI I CBDK      ,BBNKB 1 POKOK,77601270000,Rp
JAWA BARAT,3202,KAB. SUKABUMI, KAB. SUKABUMI I CBDK      ,BBNKB 1 DENDA,13457500,Rp
JAWA BARAT,3202,KAB. SUKABUMI, KAB. SUKABUMI I CBDK      ,BBNKB 2 POKOK,1710052000,Rp
JAWA BARAT,3202,KAB. SUKABUMI, KAB. SUKABUMI I CBDK      ,BBNKB 2 DENDA,181430400,Rp
JAWA BARAT,3202,KAB. SUKABUMI, KAB. SUKABUMI II P.RATU   ,BBNKB 1 POKOK,29982680000,Rp
JAWA BARAT,3202,KAB. SUKABUMI, KAB. SUKABUMI II P.RATU   ,BBNKB 1 DENDA,9587500,Rp
JAWA BARAT,3202,KAB. SUKABUMI, KAB. SUKABUMI II P.RATU   ,BBNKB 2 POKOK,700035000,Rp
JAWA BARAT,3202,KAB. SUKABUMI, KAB. SUKABUMI II P.RATU   ,BBNKB 2 DENDA,73186600,Rp
JAWA BARAT,3211,KAB. SUMEDANG, KAB. SUMEDANG             ,BBNKB 1 POKOK,52323490000,Rp
JAWA BARAT,3211,KAB. SUMEDANG, KAB. SUMEDANG             ,BBNKB 1 DENDA,14717500,Rp
JAWA BARAT,3211,KAB. SUMEDANG, KAB. SUMEDANG             ,BBNKB 2 POKOK,1756936000,Rp
JAWA BARAT,3211,KAB. SUMEDANG, KAB. SUMEDANG             ,BBNKB 2 DENDA,76145300,Rp
JAWA BARAT,3206,KAB. TASIKMALAYA, KAB. TASIKMALAYA          ,BBNKB 1 POKOK,48446660000,Rp
JAWA BARAT,3206,KAB. TASIKMALAYA, KAB. TASIKMALAYA          ,BBNKB 1 DENDA,23172500,Rp
JAWA BARAT,3206,KAB. TASIKMALAYA, KAB. TASIKMALAYA          ,BBNKB 2 POKOK,1617741000,Rp
JAWA BARAT,3206,KAB. TASIKMALAYA, KAB. TASIKMALAYA          ,BBNKB 2 DENDA,107203700,Rp
JAWA BARAT,3273,KOTA BANDUNG, KOTA BANDUNG I PJJRN      ,BBNKB 1 POKOK,2.31899E+11,Rp
JAWA BARAT,3273,KOTA BANDUNG, KOTA BANDUNG I PJJRN      ,BBNKB 1 DENDA,79675000,Rp
JAWA BARAT,3273,KOTA BANDUNG, KOTA BANDUNG I PJJRN      ,BBNKB 2 POKOK,6756578000,Rp
JAWA BARAT,3273,KOTA BANDUNG, KOTA BANDUNG I PJJRN      ,BBNKB 2 DENDA,358646300,Rp
JAWA BARAT,3273,KOTA BANDUNG, KOTA BANDUNG II KWLYN     ,BBNKB 1 POKOK,2.2712E+11,Rp
JAWA BARAT,3273,KOTA BANDUNG, KOTA BANDUNG II KWLYN     ,BBNKB 1 DENDA,122478000,Rp
JAWA BARAT,3273,KOTA BANDUNG, KOTA BANDUNG II KWLYN     ,BBNKB 2 POKOK,7388788000,Rp
JAWA BARAT,3273,KOTA BANDUNG, KOTA BANDUNG II KWLYN     ,BBNKB 2 DENDA,300875400,Rp
JAWA BARAT,3273,KOTA BANDUNG, KOTA BANDUNG III SOETA    ,BBNKB 1 POKOK,2.18377E+11,Rp
JAWA BARAT,3273,KOTA BANDUNG, KOTA BANDUNG III SOETA    ,BBNKB 1 DENDA,64128500,Rp
JAWA BARAT,3273,KOTA BANDUNG, KOTA BANDUNG III SOETA    ,BBNKB 2 POKOK,7182462800,Rp
JAWA BARAT,3273,KOTA BANDUNG, KOTA BANDUNG III SOETA    ,BBNKB 2 DENDA,356616700,Rp
JAWA BARAT,3279,KOTA BANJAR, KOTA BANJAR               ,BBNKB 1 POKOK,9567770000,Rp
JAWA BARAT,3279,KOTA BANJAR, KOTA BANJAR               ,BBNKB 1 DENDA,7660000,Rp
JAWA BARAT,3279,KOTA BANJAR, KOTA BANJAR               ,BBNKB 2 POKOK,583269000,Rp
JAWA BARAT,3279,KOTA BANJAR, KOTA BANJAR               ,BBNKB 2 DENDA,69044400,Rp
JAWA BARAT,3275,KOTA BEKASI, KOTA BEKASI               ,BBNKB 1 POKOK,7.23373E+11,Rp
JAWA BARAT,3275,KOTA BEKASI, KOTA BEKASI               ,BBNKB 1 DENDA,444687500,Rp
JAWA BARAT,3275,KOTA BEKASI, KOTA BEKASI               ,BBNKB 2 POKOK,27969889000,Rp
JAWA BARAT,3275,KOTA BEKASI, KOTA BEKASI               ,BBNKB 2 DENDA,562944700,Rp
JAWA BARAT,3271,KOTA BOGOR, KOTA BOGOR                ,BBNKB 1 POKOK,1.85347E+11,Rp
JAWA BARAT,3271,KOTA BOGOR, KOTA BOGOR                ,BBNKB 1 DENDA,108175000,Rp
JAWA BARAT,3271,KOTA BOGOR, KOTA BOGOR                ,BBNKB 2 POKOK,5928630000,Rp
JAWA BARAT,3271,KOTA BOGOR, KOTA BOGOR                ,BBNKB 2 DENDA,305427800,Rp
JAWA BARAT,3277,KOTA CIMAHI, KOTA CIMAHI               ,BBNKB 1 POKOK,90628210000,Rp
JAWA BARAT,3277,KOTA CIMAHI, KOTA CIMAHI               ,BBNKB 1 DENDA,46805000,Rp
JAWA BARAT,3277,KOTA CIMAHI, KOTA CIMAHI               ,BBNKB 2 POKOK,2679941500,Rp
JAWA BARAT,3277,KOTA CIMAHI, KOTA CIMAHI               ,BBNKB 2 DENDA,146603200,Rp
JAWA BARAT,3274,KOTA CIREBON, KOTA CIREBON              ,BBNKB 1 POKOK,65438380000,Rp
JAWA BARAT,3274,KOTA CIREBON, KOTA CIREBON              ,BBNKB 1 DENDA,12075000,Rp
JAWA BARAT,3274,KOTA CIREBON, KOTA CIREBON              ,BBNKB 2 POKOK,1947100000,Rp
JAWA BARAT,3274,KOTA CIREBON, KOTA CIREBON              ,BBNKB 2 DENDA,95905700,Rp
JAWA BARAT,3276,KOTA DEPOK, KOTA DEPOK I              ,BBNKB 1 POKOK,2.67286E+11,Rp
JAWA BARAT,3276,KOTA DEPOK, KOTA DEPOK I              ,BBNKB 1 DENDA,242953000,Rp
JAWA BARAT,3276,KOTA DEPOK, KOTA DEPOK I              ,BBNKB 2 POKOK,11462811000,Rp
JAWA BARAT,3276,KOTA DEPOK, KOTA DEPOK I              ,BBNKB 2 DENDA,247903700,Rp
JAWA BARAT,3276,KOTA DEPOK, KOTA DEPOK II CINERE      ,BBNKB 1 POKOK,1.42761E+11,Rp
JAWA BARAT,3276,KOTA DEPOK, KOTA DEPOK II CINERE      ,BBNKB 1 DENDA,77487500,Rp
JAWA BARAT,3276,KOTA DEPOK, KOTA DEPOK II CINERE      ,BBNKB 2 POKOK,5767282000,Rp
JAWA BARAT,3276,KOTA DEPOK, KOTA DEPOK II CINERE      ,BBNKB 2 DENDA,100666900,Rp
JAWA BARAT,3272,KOTA SUKABUMI, KOTA SUKABUMI             ,BBNKB 1 POKOK,36915460000,Rp
JAWA BARAT,3272,KOTA SUKABUMI, KOTA SUKABUMI             ,BBNKB 1 DENDA,22992500,Rp
JAWA BARAT,3272,KOTA SUKABUMI, KOTA SUKABUMI             ,BBNKB 2 POKOK,1096911000,Rp
JAWA BARAT,3272,KOTA SUKABUMI, KOTA SUKABUMI             ,BBNKB 2 DENDA,63048900,Rp
JAWA BARAT,3278,KOTA TASIKMALAYA, KOTA TASIKMALAYA          ,BBNKB 1 POKOK,48989110000,Rp
JAWA BARAT,3278,KOTA TASIKMALAYA, KOTA TASIKMALAYA          ,BBNKB 1 DENDA,29917500,Rp
JAWA BARAT,3278,KOTA TASIKMALAYA, KOTA TASIKMALAYA          ,BBNKB 2 POKOK,2132607000,Rp
JAWA BARAT,3278,KOTA TASIKMALAYA, KOTA TASIKMALAYA          ,BBNKB 2 DENDA,130335000,Rp
