﻿provinsi,kode_kota_kabupaten,nama_kota_kabupaten,LEMBAGA PENELITIAN,jabatan,jumlah,satuan
JAWA BARAT,3204,KAB. BANDUNG,PARIWISATA,ADM,0,ORANG
JAWA BARAT,3204,KAB. BANDUNG,PARIWISATA,PENELITI,0,ORANG
JAWA BARAT,3204,KAB. BANDUNG,KEBUDAYAAN,ADM,0,ORANG
JAWA BARAT,3204,KAB. BANDUNG,KEBUDAYAAN,PENELITI,0,ORANG
JAWA BARAT,3217,KAB. BANDUNG BARAT,PARIWISATA,ADM,0,ORANG
JAWA BARAT,3217,KAB. BANDUNG BARAT,PARIWISATA,PENELITI,0,ORANG
JAWA BARAT,3217,KAB. BANDUNG BARAT,KEBUDAYAAN,ADM,0,ORANG
JAWA BARAT,3217,KAB. BANDUNG BARAT,KEBUDAYAAN,PENELITI,0,ORANG
JAWA BARAT,3216,KAB. BEKASI,PARIWISATA,ADM,0,ORANG
JAWA BARAT,3216,KAB. BEKASI,PARIWISATA,PENELITI,0,ORANG
JAWA BARAT,3216,KAB. BEKASI,KEBUDAYAAN,ADM,0,ORANG
JAWA BARAT,3216,KAB. BEKASI,KEBUDAYAAN,PENELITI,0,ORANG
JAWA BARAT,3201,KAB. BOGOR,PARIWISATA,ADM,0,ORANG
JAWA BARAT,3201,KAB. BOGOR,PARIWISATA,PENELITI,0,ORANG
JAWA BARAT,3201,KAB. BOGOR,KEBUDAYAAN,ADM,0,ORANG
JAWA BARAT,3201,KAB. BOGOR,KEBUDAYAAN,PENELITI,0,ORANG
JAWA BARAT,3207,KAB. CIAMIS,PARIWISATA,ADM,0,ORANG
JAWA BARAT,3207,KAB. CIAMIS,PARIWISATA,PENELITI,0,ORANG
JAWA BARAT,3207,KAB. CIAMIS,KEBUDAYAAN,ADM,0,ORANG
JAWA BARAT,3207,KAB. CIAMIS,KEBUDAYAAN,PENELITI,0,ORANG
JAWA BARAT,3203,KAB. CIANJUR,PARIWISATA,ADM,0,ORANG
JAWA BARAT,3203,KAB. CIANJUR,PARIWISATA,PENELITI,0,ORANG
JAWA BARAT,3203,KAB. CIANJUR,KEBUDAYAAN,ADM,0,ORANG
JAWA BARAT,3203,KAB. CIANJUR,KEBUDAYAAN,PENELITI,0,ORANG
JAWA BARAT,3209,KAB. CIREBON,PARIWISATA,ADM,0,ORANG
JAWA BARAT,3209,KAB. CIREBON,PARIWISATA,PENELITI,0,ORANG
JAWA BARAT,3209,KAB. CIREBON,KEBUDAYAAN,ADM,0,ORANG
JAWA BARAT,3209,KAB. CIREBON,KEBUDAYAAN,PENELITI,0,ORANG
JAWA BARAT,3205,KAB. GARUT,PARIWISATA,ADM,0,ORANG
JAWA BARAT,3205,KAB. GARUT,PARIWISATA,PENELITI,0,ORANG
JAWA BARAT,3205,KAB. GARUT,KEBUDAYAAN,ADM,0,ORANG
JAWA BARAT,3205,KAB. GARUT,KEBUDAYAAN,PENELITI,0,ORANG
JAWA BARAT,3212,KAB. INDRAMAYU,PARIWISATA,ADM,0,ORANG
JAWA BARAT,3212,KAB. INDRAMAYU,PARIWISATA,PENELITI,0,ORANG
JAWA BARAT,3212,KAB. INDRAMAYU,KEBUDAYAAN,ADM,0,ORANG
JAWA BARAT,3212,KAB. INDRAMAYU,KEBUDAYAAN,PENELITI,0,ORANG
JAWA BARAT,3215,KAB. KARAWANG,PARIWISATA,ADM,0,ORANG
JAWA BARAT,3215,KAB. KARAWANG,PARIWISATA,PENELITI,0,ORANG
JAWA BARAT,3215,KAB. KARAWANG,KEBUDAYAAN,ADM,0,ORANG
JAWA BARAT,3215,KAB. KARAWANG,KEBUDAYAAN,PENELITI,0,ORANG
JAWA BARAT,3208,KAB. KUNINGAN,PARIWISATA,ADM,0,ORANG
JAWA BARAT,3208,KAB. KUNINGAN,PARIWISATA,PENELITI,0,ORANG
JAWA BARAT,3208,KAB. KUNINGAN,KEBUDAYAAN,ADM,0,ORANG
JAWA BARAT,3208,KAB. KUNINGAN,KEBUDAYAAN,PENELITI,0,ORANG
JAWA BARAT,3210,KAB. MAJALENGKA,PARIWISATA,ADM,0,ORANG
JAWA BARAT,3210,KAB. MAJALENGKA,PARIWISATA,PENELITI,0,ORANG
JAWA BARAT,3210,KAB. MAJALENGKA,KEBUDAYAAN,ADM,0,ORANG
JAWA BARAT,3210,KAB. MAJALENGKA,KEBUDAYAAN,PENELITI,0,ORANG
JAWA BARAT,3218,KAB. PANGANDARAN,PARIWISATA,ADM,0,ORANG
JAWA BARAT,3218,KAB. PANGANDARAN,PARIWISATA,PENELITI,0,ORANG
JAWA BARAT,3218,KAB. PANGANDARAN,KEBUDAYAAN,ADM,0,ORANG
JAWA BARAT,3218,KAB. PANGANDARAN,KEBUDAYAAN,PENELITI,0,ORANG
JAWA BARAT,3214,KAB. PURWAKARTA,PARIWISATA,ADM,0,ORANG
JAWA BARAT,3214,KAB. PURWAKARTA,PARIWISATA,PENELITI,0,ORANG
JAWA BARAT,3214,KAB. PURWAKARTA,KEBUDAYAAN,ADM,0,ORANG
JAWA BARAT,3214,KAB. PURWAKARTA,KEBUDAYAAN,PENELITI,0,ORANG
JAWA BARAT,3213,KAB. SUBANG,PARIWISATA,ADM,0,ORANG
JAWA BARAT,3213,KAB. SUBANG,PARIWISATA,PENELITI,0,ORANG
JAWA BARAT,3213,KAB. SUBANG,KEBUDAYAAN,ADM,0,ORANG
JAWA BARAT,3213,KAB. SUBANG,KEBUDAYAAN,PENELITI,0,ORANG
JAWA BARAT,3202,KAB. SUKABUMI,PARIWISATA,ADM,0,ORANG
JAWA BARAT,3202,KAB. SUKABUMI,PARIWISATA,PENELITI,0,ORANG
JAWA BARAT,3202,KAB. SUKABUMI,KEBUDAYAAN,ADM,0,ORANG
JAWA BARAT,3202,KAB. SUKABUMI,KEBUDAYAAN,PENELITI,0,ORANG
JAWA BARAT,3206,KAB. TASIKMALAYA,PARIWISATA,ADM,0,ORANG
JAWA BARAT,3206,KAB. TASIKMALAYA,PARIWISATA,PENELITI,0,ORANG
JAWA BARAT,3206,KAB. TASIKMALAYA,KEBUDAYAAN,ADM,0,ORANG
JAWA BARAT,3206,KAB. TASIKMALAYA,KEBUDAYAAN,PENELITI,0,ORANG
JAWA BARAT,3279,KOTA BANJAR,PARIWISATA,ADM,0,ORANG
JAWA BARAT,3279,KOTA BANJAR,PARIWISATA,PENELITI,0,ORANG
JAWA BARAT,3279,KOTA BANJAR,KEBUDAYAAN,ADM,0,ORANG
JAWA BARAT,3279,KOTA BANJAR,KEBUDAYAAN,PENELITI,0,ORANG
JAWA BARAT,3275,KOTA BEKASI,PARIWISATA,ADM,0,ORANG
JAWA BARAT,3275,KOTA BEKASI,PARIWISATA,PENELITI,0,ORANG
JAWA BARAT,3275,KOTA BEKASI,KEBUDAYAAN,ADM,0,ORANG
JAWA BARAT,3275,KOTA BEKASI,KEBUDAYAAN,PENELITI,0,ORANG
JAWA BARAT,3271,KOTA BOGOR,PARIWISATA,ADM,0,ORANG
JAWA BARAT,3271,KOTA BOGOR,PARIWISATA,PENELITI,0,ORANG
JAWA BARAT,3271,KOTA BOGOR,KEBUDAYAAN,ADM,0,ORANG
JAWA BARAT,3271,KOTA BOGOR,KEBUDAYAAN,PENELITI,0,ORANG
JAWA BARAT,3277,KOTA CIMAHI,PARIWISATA,ADM,0,ORANG
JAWA BARAT,3277,KOTA CIMAHI,PARIWISATA,PENELITI,0,ORANG
JAWA BARAT,3277,KOTA CIMAHI,KEBUDAYAAN,ADM,0,ORANG
JAWA BARAT,3277,KOTA CIMAHI,KEBUDAYAAN,PENELITI,0,ORANG
JAWA BARAT,3274,KOTA CIREBON,PARIWISATA,ADM,0,ORANG
JAWA BARAT,3274,KOTA CIREBON,PARIWISATA,PENELITI,0,ORANG
JAWA BARAT,3274,KOTA CIREBON,KEBUDAYAAN,ADM,0,ORANG
JAWA BARAT,3274,KOTA CIREBON,KEBUDAYAAN,PENELITI,0,ORANG
JAWA BARAT,3276,KOTA DEPOK,PARIWISATA,ADM,0,ORANG
JAWA BARAT,3276,KOTA DEPOK,PARIWISATA,PENELITI,0,ORANG
JAWA BARAT,3276,KOTA DEPOK,KEBUDAYAAN,ADM,0,ORANG
JAWA BARAT,3276,KOTA DEPOK,KEBUDAYAAN,PENELITI,0,ORANG
JAWA BARAT,3272,KOTA SUKABUMI,PARIWISATA,ADM,0,ORANG
JAWA BARAT,3272,KOTA SUKABUMI,PARIWISATA,PENELITI,0,ORANG
JAWA BARAT,3272,KOTA SUKABUMI,KEBUDAYAAN,ADM,0,ORANG
JAWA BARAT,3272,KOTA SUKABUMI,KEBUDAYAAN,PENELITI,0,ORANG
JAWA BARAT,3278,KOTA TASIKMALAYA,PARIWISATA,ADM,0,ORANG
JAWA BARAT,3278,KOTA TASIKMALAYA,PARIWISATA,PENELITI,0,ORANG
JAWA BARAT,3278,KOTA TASIKMALAYA,KEBUDAYAAN,ADM,0,ORANG
JAWA BARAT,3278,KOTA TASIKMALAYA,KEBUDAYAAN,PENELITI,0,ORANG
