kelompok_koperasi ;manajer_perempuan ;satuan 
KUD;8;orang
Kop. Pertanian;5;orang
Kop. Perkebunan;1;orang
Kop. Peternakan;2;orang
Kop. Nelayan;0;orang
Kop. Kehutanan;0;orang
Kopti;1;orang
Kopra;0;orang
Koppontren;8;orang
Kopkar;43;orang
Kop. Angkatan ;1;orang
Kop. Angkatan Laut;0;orang
Kop. Angkatan Udara;3;orang
Kop. Kepolisian;0;orang
Kop. Serba Usaha;33;orang
Kop. Pasar;0;orang
Kop. Simpan Pinjam;109;orang
Kop. Angkutan Darat;1;orang
Kop. Angkutan Laut;0;orang
Kop. Wisata;0;orang
Kop. Telkom;1;orang
Kop. Perumahan;1;orang
K.B.P.R;0;orang
Kop. Pegawai Negeri (KPRI);33;orang
Kop.Listrik Pedesaan;0;orang
Koperasi Asuransi Indonesia;0;orang
Kop. Wanita;22;orang
Kop. Profesi;0;orang
Kop. Veteran;1;orang
Kop. Wredatama ;1;orang
Kop. Pepabri;3;orang
Kop. Mahasiswa;6;orang
Kop. Pemuda;0;orang
Kop. Pertambangan;0;orang
Kop.  Pedagang Kaki Lima;0;orang
Kop. Jamu Gendong;0;orang
Kop. Lainnya;1;orang
Kop. Simpan Pinjam  dan Pembiayaan Syariah;17;orang
Kop. Sekunder;1;orang
