﻿provinsi,kode_kota_kabupaten,nama_kota_kabupaten,balita_gizi_buruk,jumlah,satuan
JAWA BARAT,3204,KAB. BANDUNG,LAKI-LAKI,0,JIWA
JAWA BARAT,3204,KAB. BANDUNG,LAKI-LAKI MENDAPAT PERAWATAN,0,JIWA
JAWA BARAT,3204,KAB. BANDUNG,PEREMPUAN,0,JIWA
JAWA BARAT,3204,KAB. BANDUNG,PEREMPUAN MENDAPAT PERAWATAN,0,JIWA
JAWA BARAT,3217,KAB. BANDUNG BARAT,LAKI-LAKI,23261,JIWA
JAWA BARAT,3217,KAB. BANDUNG BARAT,LAKI-LAKI MENDAPAT PERAWATAN,6882,JIWA
JAWA BARAT,3217,KAB. BANDUNG BARAT,PEREMPUAN,22636,JIWA
JAWA BARAT,3217,KAB. BANDUNG BARAT,PEREMPUAN MENDAPAT PERAWATAN,7612,JIWA
JAWA BARAT,3216,KAB. BEKASI,LAKI-LAKI,28606,JIWA
JAWA BARAT,3216,KAB. BEKASI,LAKI-LAKI MENDAPAT PERAWATAN,14423,JIWA
JAWA BARAT,3216,KAB. BEKASI,PEREMPUAN,27903,JIWA
JAWA BARAT,3216,KAB. BEKASI,PEREMPUAN MENDAPAT PERAWATAN,14815,JIWA
JAWA BARAT,3201,KAB. BOGOR,LAKI-LAKI,80549,JIWA
JAWA BARAT,3201,KAB. BOGOR,LAKI-LAKI MENDAPAT PERAWATAN,40976,JIWA
JAWA BARAT,3201,KAB. BOGOR,PEREMPUAN,77156,JIWA
JAWA BARAT,3201,KAB. BOGOR,PEREMPUAN MENDAPAT PERAWATAN,42964,JIWA
JAWA BARAT,3207,KAB. CIAMIS,LAKI-LAKI,15127,JIWA
JAWA BARAT,3207,KAB. CIAMIS,LAKI-LAKI MENDAPAT PERAWATAN,13025,JIWA
JAWA BARAT,3207,KAB. CIAMIS,PEREMPUAN,15015,JIWA
JAWA BARAT,3207,KAB. CIAMIS,PEREMPUAN MENDAPAT PERAWATAN,14344,JIWA
JAWA BARAT,3203,KAB. CIANJUR,LAKI-LAKI,41592,JIWA
JAWA BARAT,3203,KAB. CIANJUR,LAKI-LAKI MENDAPAT PERAWATAN,31072,JIWA
JAWA BARAT,3203,KAB. CIANJUR,PEREMPUAN,39356,JIWA
JAWA BARAT,3203,KAB. CIANJUR,PEREMPUAN MENDAPAT PERAWATAN,31445,JIWA
JAWA BARAT,3209,KAB. CIREBON,LAKI-LAKI,31215,JIWA
JAWA BARAT,3209,KAB. CIREBON,LAKI-LAKI MENDAPAT PERAWATAN,21656,JIWA
JAWA BARAT,3209,KAB. CIREBON,PEREMPUAN,29420,JIWA
JAWA BARAT,3209,KAB. CIREBON,PEREMPUAN MENDAPAT PERAWATAN,24101,JIWA
JAWA BARAT,3205,KAB. GARUT,LAKI-LAKI,52035,JIWA
JAWA BARAT,3205,KAB. GARUT,LAKI-LAKI MENDAPAT PERAWATAN,28599,JIWA
JAWA BARAT,3205,KAB. GARUT,PEREMPUAN,51188,JIWA
JAWA BARAT,3205,KAB. GARUT,PEREMPUAN MENDAPAT PERAWATAN,31960,JIWA
JAWA BARAT,3212,KAB. INDRAMAYU,LAKI-LAKI,0,JIWA
JAWA BARAT,3212,KAB. INDRAMAYU,LAKI-LAKI MENDAPAT PERAWATAN,0,JIWA
JAWA BARAT,3212,KAB. INDRAMAYU,PEREMPUAN,0,JIWA
JAWA BARAT,3212,KAB. INDRAMAYU,PEREMPUAN MENDAPAT PERAWATAN,0,JIWA
JAWA BARAT,3215,KAB. KARAWANG,LAKI-LAKI,30402,JIWA
JAWA BARAT,3215,KAB. KARAWANG,LAKI-LAKI MENDAPAT PERAWATAN,29869,JIWA
JAWA BARAT,3215,KAB. KARAWANG,PEREMPUAN,30402,JIWA
JAWA BARAT,3215,KAB. KARAWANG,PEREMPUAN MENDAPAT PERAWATAN,27813,JIWA
JAWA BARAT,3208,KAB. KUNINGAN,LAKI-LAKI,14585,JIWA
JAWA BARAT,3208,KAB. KUNINGAN,LAKI-LAKI MENDAPAT PERAWATAN,11201,JIWA
JAWA BARAT,3208,KAB. KUNINGAN,PEREMPUAN,14427,JIWA
JAWA BARAT,3208,KAB. KUNINGAN,PEREMPUAN MENDAPAT PERAWATAN,12899,JIWA
JAWA BARAT,3210,KAB. MAJALENGKA,LAKI-LAKI,16181.721,JIWA
JAWA BARAT,3210,KAB. MAJALENGKA,LAKI-LAKI MENDAPAT PERAWATAN,0,JIWA
JAWA BARAT,3210,KAB. MAJALENGKA,PEREMPUAN,16199.379,JIWA
JAWA BARAT,3210,KAB. MAJALENGKA,PEREMPUAN MENDAPAT PERAWATAN,0,JIWA
JAWA BARAT,3218,KAB. PANGANDARAN,LAKI-LAKI,6023,JIWA
JAWA BARAT,3218,KAB. PANGANDARAN,LAKI-LAKI MENDAPAT PERAWATAN,4078,JIWA
JAWA BARAT,3218,KAB. PANGANDARAN,PEREMPUAN,5766,JIWA
JAWA BARAT,3218,KAB. PANGANDARAN,PEREMPUAN MENDAPAT PERAWATAN,4259,JIWA
JAWA BARAT,3214,KAB. PURWAKARTA,LAKI-LAKI,11585,JIWA
JAWA BARAT,3214,KAB. PURWAKARTA,LAKI-LAKI MENDAPAT PERAWATAN,11551,JIWA
JAWA BARAT,3214,KAB. PURWAKARTA,PEREMPUAN,14159,JIWA
JAWA BARAT,3214,KAB. PURWAKARTA,PEREMPUAN MENDAPAT PERAWATAN,12066,JIWA
JAWA BARAT,3213,KAB. SUBANG,LAKI-LAKI,21529.908,JIWA
JAWA BARAT,3213,KAB. SUBANG,LAKI-LAKI MENDAPAT PERAWATAN,9887,JIWA
JAWA BARAT,3213,KAB. SUBANG,PEREMPUAN,21103.578,JIWA
JAWA BARAT,3213,KAB. SUBANG,PEREMPUAN MENDAPAT PERAWATAN,11802,JIWA
JAWA BARAT,3202,KAB. SUKABUMI,LAKI-LAKI,37645,JIWA
JAWA BARAT,3202,KAB. SUKABUMI,LAKI-LAKI MENDAPAT PERAWATAN,20844,JIWA
JAWA BARAT,3202,KAB. SUKABUMI,PEREMPUAN,36932,JIWA
JAWA BARAT,3202,KAB. SUKABUMI,PEREMPUAN MENDAPAT PERAWATAN,21650,JIWA
JAWA BARAT,3211,KAB. SUMEDANG,LAKI-LAKI,57229,JIWA
JAWA BARAT,3211,KAB. SUMEDANG,LAKI-LAKI MENDAPAT PERAWATAN,10078,JIWA
JAWA BARAT,3211,KAB. SUMEDANG,PEREMPUAN,57762,JIWA
JAWA BARAT,3211,KAB. SUMEDANG,PEREMPUAN MENDAPAT PERAWATAN,12358,JIWA
JAWA BARAT,3206,KAB. TASIKMALAYA,LAKI-LAKI,87357,JIWA
JAWA BARAT,3206,KAB. TASIKMALAYA,LAKI-LAKI MENDAPAT PERAWATAN,13784,JIWA
JAWA BARAT,3206,KAB. TASIKMALAYA,PEREMPUAN,84016,JIWA
JAWA BARAT,3206,KAB. TASIKMALAYA,PEREMPUAN MENDAPAT PERAWATAN,14949,JIWA
JAWA BARAT,3273,KOTA BANDUNG,LAKI-LAKI,40904,JIWA
JAWA BARAT,3273,KOTA BANDUNG,LAKI-LAKI MENDAPAT PERAWATAN,29200,JIWA
JAWA BARAT,3273,KOTA BANDUNG,PEREMPUAN,40216,JIWA
JAWA BARAT,3273,KOTA BANDUNG,PEREMPUAN MENDAPAT PERAWATAN,30311,JIWA
JAWA BARAT,3279,KOTA BANJAR,LAKI-LAKI,2435.481,JIWA
JAWA BARAT,3279,KOTA BANJAR,LAKI-LAKI MENDAPAT PERAWATAN,3013,JIWA
JAWA BARAT,3279,KOTA BANJAR,PEREMPUAN,2500.632,JIWA
JAWA BARAT,3279,KOTA BANJAR,PEREMPUAN MENDAPAT PERAWATAN,3213,JIWA
JAWA BARAT,3275,KOTA BEKASI,LAKI-LAKI,40037,JIWA
JAWA BARAT,3275,KOTA BEKASI,LAKI-LAKI MENDAPAT PERAWATAN,10728,JIWA
JAWA BARAT,3275,KOTA BEKASI,PEREMPUAN,39443,JIWA
JAWA BARAT,3275,KOTA BEKASI,PEREMPUAN MENDAPAT PERAWATAN,9977,JIWA
JAWA BARAT,3271,KOTA BOGOR,LAKI-LAKI,15012,JIWA
JAWA BARAT,3271,KOTA BOGOR,LAKI-LAKI MENDAPAT PERAWATAN,11603,JIWA
JAWA BARAT,3271,KOTA BOGOR,PEREMPUAN,14602,JIWA
JAWA BARAT,3271,KOTA BOGOR,PEREMPUAN MENDAPAT PERAWATAN,12759,JIWA
JAWA BARAT,3277,KOTA CIMAHI,LAKI-LAKI,5784,JIWA
JAWA BARAT,3277,KOTA CIMAHI,LAKI-LAKI MENDAPAT PERAWATAN,4844,JIWA
JAWA BARAT,3277,KOTA CIMAHI,PEREMPUAN,5680,JIWA
JAWA BARAT,3277,KOTA CIMAHI,PEREMPUAN MENDAPAT PERAWATAN,5529,JIWA
JAWA BARAT,3274,KOTA CIREBON,LAKI-LAKI,7738,JIWA
JAWA BARAT,3274,KOTA CIREBON,LAKI-LAKI MENDAPAT PERAWATAN,6806,JIWA
JAWA BARAT,3274,KOTA CIREBON,PEREMPUAN,7690,JIWA
JAWA BARAT,3274,KOTA CIREBON,PEREMPUAN MENDAPAT PERAWATAN,7181,JIWA
JAWA BARAT,3276,KOTA DEPOK,LAKI-LAKI,31674,JIWA
JAWA BARAT,3276,KOTA DEPOK,LAKI-LAKI MENDAPAT PERAWATAN,14186,JIWA
JAWA BARAT,3276,KOTA DEPOK,PEREMPUAN,31245,JIWA
JAWA BARAT,3276,KOTA DEPOK,PEREMPUAN MENDAPAT PERAWATAN,14974,JIWA
JAWA BARAT,3272,KOTA SUKABUMI,LAKI-LAKI,4548,JIWA
JAWA BARAT,3272,KOTA SUKABUMI,LAKI-LAKI MENDAPAT PERAWATAN,2864,JIWA
JAWA BARAT,3272,KOTA SUKABUMI,PEREMPUAN,4471,JIWA
JAWA BARAT,3272,KOTA SUKABUMI,PEREMPUAN MENDAPAT PERAWATAN,3273,JIWA
JAWA BARAT,3278,KOTA TASIKMALAYA,LAKI-LAKI,8960,JIWA
JAWA BARAT,3278,KOTA TASIKMALAYA,LAKI-LAKI MENDAPAT PERAWATAN,6521,JIWA
JAWA BARAT,3278,KOTA TASIKMALAYA,PEREMPUAN,8686,JIWA
JAWA BARAT,3278,KOTA TASIKMALAYA,PEREMPUAN MENDAPAT PERAWATAN,6916,JIWA
