kode_kota_kabupaten;kota_kabupaten;akses_air_minum_pompa;Jumlah penduduk perkotaan terlayani (KK);Cakupan pelayanan perkotaan (%);Jumlah penduduk perdesaan terlayani (jKK);Cakupan pelayanan perdesaan (%);satuan;;;;;;;;;;;;;
3204;Kabupaten Bandung; 215.740 ;#REF!;#REF!;#REF!;#REF!;kepala keluarga;;;;;;;;;;;;;
3217;Kabupaten Bandung Barat; 4.513 ;#REF!;#REF!;#REF!;#REF!;kepala keluarga;;;;;;;;;;;;;
3216;Kabupaten Bekasi; 177.509 ;#REF!;#REF!;#REF!;#REF!;kepala keluarga;;;;;;;;;;;;;
3201;Kabupaten Bogor; 75.550 ;#REF!;#REF!;#REF!;#REF!;kepala keluarga;;;;;;;;;;;;;
3207;Kabupaten Ciamis; 10.138 ;#REF!;#REF!;#REF!;#REF!;kepala keluarga;;;;;;;;;;;;;
3203;Kabupaten Cianjur; 36.296 ;#REF!;#REF!;#REF!;#REF!;kepala keluarga;;;;;;;;;;;;;
3209;Kabupaten Cirebon; 198.300 ;#REF!;#REF!;#REF!;#REF!;kepala keluarga;;;;;;;;;;;;;
3205;Kabupaten Garut; 61.905 ;#REF!;#REF!;#REF!;#REF!;kepala keluarga;;;;;;;;;;;;;
3212;Kabupaten Indramayu; 179.291 ;#REF!;#REF!;#REF!;#REF!;kepala keluarga;;;;;;;;;;;;;
3215;Kabupaten Karawang; 81.730 ;#REF!;#REF!;#REF!;#REF!;kepala keluarga;;;;;;;;;;;;;
3208;Kabupaten Kuningan; 87.126 ;#REF!;#REF!;#REF!;#REF!;kepala keluarga;;;;;;;;;;;;;
3210;Kabupaten Majalengka; 55.226 ;#REF!;#REF!;#REF!;#REF!;kepala keluarga;;;;;;;;;;;;;
3218;Kabupaten Pangandaran; 949 ;#REF!;#REF!;#REF!;#REF!;kepala keluarga;;;;;;;;;;;;;
3214;Kabupaten Purwakarta; 25.541 ;#REF!;#REF!;#REF!;#REF!;kepala keluarga;;;;;;;;;;;;;
3213;Kabupaten Subang; 121.236 ;#REF!;#REF!;#REF!;#REF!;kepala keluarga;;;;;;;;;;;;;
3202;Kabupaten Sukabumi; 33.796 ;#REF!;#REF!;#REF!;#REF!;kepala keluarga;;;;;;;;;;;;;
3211;Kabupaten Sumedang; 18.097 ;#REF!;#REF!;#REF!;#REF!;kepala keluarga;;;;;;;;;;;;;
3206;Kabupaten Tasikmalaya; 322.921 ;#REF!;#REF!;#REF!;#REF!;kepala keluarga;;;;;;;;;;;;;
3273;Kota Bandung; 102.124 ;#REF!;#REF!;#REF!;#REF!;kepala keluarga;;;;;;;;;;;;;
3279;Kota Banjar; 2.033 ;#REF!;#REF!;#REF!;#REF!;kepala keluarga;;;;;;;;;;;;;
3275;Kota Bekasi; 361.946 ;#REF!;#REF!;#REF!;#REF!;kepala keluarga;;;;;;;;;;;;;
3271;Kota Bogor; 10.643 ;#REF!;#REF!;#REF!;#REF!;kepala keluarga;;;;;;;;;;;;;
3277;Kota Cimahi; 3.857 ;#REF!;#REF!;#REF!;#REF!;kepala keluarga;;;;;;;;;;;;;
3274;Kota Cirebon; 8.225 ;#REF!;#REF!;#REF!;#REF!;kepala keluarga;;;;;;;;;;;;;
3276;Kota Depok; 185.111 ;#REF!;#REF!;#REF!;#REF!;kepala keluarga;;;;;;;;;;;;;
3272;Kota Sukabumi; 1.849 ;#REF!;#REF!;#REF!;#REF!;kepala keluarga;;;;;;;;;;;;;
3278;Kota Tasikmalaya; 48.254 ;#REF!;#REF!;#REF!;#REF!;kepala keluarga;;;;;;;;;;;;;
