﻿provinsi,kode_kota_kabupaten,nama_kota_kabupaten,indeks_pembangunan_manusia,satuan
JAWA BARAT,3204,KAB. BANDUNG,70.69,POIN
JAWA BARAT,3217,KAB. BANDUNG BARAT,65.81,POIN
JAWA BARAT,3216,KAB. BEKASI,71.83,POIN
JAWA BARAT,3201,KAB. BOGOR,68.32,POIN
JAWA BARAT,3207,KAB. CIAMIS,68.45,POIN
JAWA BARAT,3203,KAB. CIANJUR,62.92,POIN
JAWA BARAT,3209,KAB. CIREBON,66.7,POIN
JAWA BARAT,3205,KAB. GARUT,63.64,POIN
JAWA BARAT,3212,KAB. INDRAMAYU,64.78,POIN
JAWA BARAT,3215,KAB. KARAWANG,68.19,POIN
JAWA BARAT,3208,KAB. KUNINGAN,67.51,POIN
JAWA BARAT,3210,KAB. MAJALENGKA,65.25,POIN
JAWA BARAT,3218,KAB. PANGANDARAN,65.79,POIN
JAWA BARAT,3214,KAB. PURWAKARTA,68.56,POIN
JAWA BARAT,3213,KAB. SUBANG,67.14,POIN
JAWA BARAT,3202,KAB. SUKABUMI,65.13,POIN
JAWA BARAT,3211,KAB. SUMEDANG,69.45,POIN
JAWA BARAT,3206,KAB. TASIKMALAYA,63.57,POIN
JAWA BARAT,3273,KOTA BANDUNG,80.13,POIN
JAWA BARAT,3279,KOTA BANJAR,70.09,POIN
JAWA BARAT,3275,KOTA BEKASI,79.95,POIN
JAWA BARAT,3271,KOTA BOGOR,74.5,POIN
JAWA BARAT,3277,KOTA CIMAHI,76.69,POIN
JAWA BARAT,3274,KOTA CIREBON,73.7,POIN
JAWA BARAT,3276,KOTA DEPOK,79.6,POIN
JAWA BARAT,3272,KOTA SUKABUMI,72.33,POIN
JAWA BARAT,3278,KOTA TASIKMALAYA,70.58,POIN
