﻿sub_unit_pelayanan_llasdp,penumpang,jumlah,satuan
CIRATA,NAIK,445834,ORANG
CIRATA,TURUN,445819,ORANG
JATILUHUR,NAIK,34619,ORANG
JATILUHUR,TURUN,33624,ORANG
KALIPUCANG,NAIK,9345,ORANG
KALIPUCANG,TURUN,8395,ORANG
MAJINGKLAK,NAIK,6342,ORANG
MAJINGKLAK,TURUN,5912,ORANG
MUARA GEMBONG,NAIK,14432,ORANG
MUARA GEMBONG,TURUN,14486,ORANG
SAGULING,NAIK,14097,ORANG
SAGULING,TURUN,14325,ORANG
