daerah_penghasil,sumber_daya,jumlah_produksi,satuan
Provinsi (4-12 mil),minyak,1938.1,ribu barrel
Provinsi (4-12 mil),gas,15327.77,mmbtu
Indramayu,minyak,888.78,ribu barrel
Indramayu,gas,6116.19,mmbtu
Karawang,minyak,295.46,ribu barrel
Karawang,gas,26021.77,mmbtu
Majalengka,minyak,85.02,ribu barrel
Majalengka,gas,338.75,mmbtu
Subang,minyak,67.98,ribu barrel
Subang,gas,33358.39,mmbtu
Bekasi,minyak,2802.98,ribu barrel
Bekasi,gas,4875.47,mmbtu
