peluang_usaha*);penduduk_yang_bekerja;satuan
1;3154509;jiwa
2;113601;jiwa
3;3940038;jiwa
4;34217;jiwa
5;70957;jiwa
6;1424529;jiwa
7;4316193;jiwa
8;974004;jiwa
9;1195754;jiwa
10;172108;jiwa
11;444918;jiwa
12;65947;jiwa
13;298649;jiwa
14;709929;jiwa
15;1011073;jiwa
16;249189;jiwa
17;1026423;jiwa
