kelompok_koperasi ;volume_usaha 
KUD;3,18046E+11
Kop. Pertanian;55294915213
Kop. Perkebunan;1472661251
Kop. Peternakan;2,9233E+11
Kop. Nelayan;8080719376
Kop. Kehutanan;83721150
Kopti;2,73024E+11
Kopra;0
Kopinkra;27990018934
Koppontren;84573567573
Kopkar;4,1916E+12
Kop. Angkatan ;2,82658E+11
Kop. Angkatan Laut;12805368294
Kop. Angkatan Udara;17976993106
Kop. Kepolisian;2,74848E+11
Kop. Serba Usaha;1,41649E+12
Kop. Pasar;46934158323
Kop. Simpan Pinjam;4,94801E+12
Kop. Angkutan Darat;8933981378
Kop. Angkutan Laut;0
Kop. Wisata;488211500
Kop. Telkom;1,49791E+11
Kop. Perumahan;55611282728
K.B.P.R;240590000
Kop. Pegawai Negeri (KPRI);2,00184E+12
Kop.Listrik Pedesaan;16450600
Koperasi Asuransi Indonesia;0
Kop. Wanita;1,45604E+11
Kop. Profesi;13855337773
Kop. Veteran;11225776039
Kop. Wredatama ;44582164507
Kop. Pepabri;12573091467
Kop. Mahasiswa;9003701343
Kop. Pemuda;9585603700
Kop. Pertambangan;7259831855
Kop.  Pedagang Kaki Lima;0
Kop. Jamu Gendong;0
Kop. Lainnya;2,43104E+11
Kop. Simpan Pinjam  dan Pembiayaan Syariah;4,00245E+11
Kop. Sekunder;76340246478
