﻿judul_penelitian,peneliti
Kajian Adopsi Teknologi Percepatan Pembenihan Kentang Dengan Stek Berakar,"Ir. Agus Ruswandi , M.Si."
Strategi Optimalisasi Peran Posyantek dan Wartek Dalam Pengembangan Pemanfaatan Teknologi di Pedesaan,"Dewi Gartika, S.Si., M.Si."
Analisis Transformasi Struktural Ekonomi dan Ketimpangan Antar Daerah di Provinsi Jawa Barat,"Yudha Hadian Nur, S.E., M.T."
Pola Penyediaan Infrastruktur Perumahan dan Permukiman yang Diinisiasi oleh Sektor Swasta di Kawasan Peri-Urban Metropolitan Bandung Raya,"Anita Vitriana, S.T., M.T."
Perspektif Para Pemangku Kepentingan Dalam Rangka Penataan Ruang Publik di Kawasan Metropolitan Bandung,"Ni Made Gilang Wargyawati, S.T., M.Sc."
Pemberdayaan Sebaya dalam Promosi Kesehatan Reproduksi Remaja,"Juariah, S.Si., M.A."
