jenis_pekerjaan_atau_jabatan,penduduk_yang_bekerja,satuan
"Tenaga profesional, teknisi dan yang sejenis ",1611492,orang
Tenaga kepemimpinan dan ketatalaksanaan ,309239,orang
Tenaga tata usaha dan yang sejenis,1323912,orang
Tenaga usaha penjualan ,4660997,orang
Tenaga usaha jasa ,1478400,orang
"Tenaga usaha pertanian, kehutanan, perburuan, dan perikanan ",3010938,orang
"Tenaga produksi, operator alat-alat angkutan dan pekerja kasar, Lainnya",8156597,orang
