kelompok_koperasi ;modal_sendiri ;satuan 
K.B.P.R;409826879;rupiah
Kop.Angkatan Darat;2,67016E+11;rupiah
Kop.Angkatan Laut;3373280437;rupiah
Kop.Angkatan Udara;10449005138;rupiah
Kop.Angkutan Darat;19515111764;rupiah
Kop.Angkutan Laut;0;rupiah
Kop.Jamu Gendong;0;rupiah
Kop.Kehutanan;40040000;rupiah
Kop.Kepolisian;80802671719;rupiah
Kop.Lainnya;52570771283;rupiah
Kop.Mahasiswa;2510824387;rupiah
Kop. Nelayan;13462978499;rupiah
Kop.Pasar;54283140630;rupiah
Kop.Pedagang kaki Lima;88570100;rupiah
Kop.Pegawai Negeri (KPRI);1,9139E+12;rupiah
Kop.Pemuda;3244272281;rupiah
Kop.Pepabri;13388631414;rupiah
KUD;743672730,6;rupiah
Kop.Pertanian;27328609000;rupiah
Kop.Perkebunan;1428778914;rupiah
Kop. Peternakan;33676124336;rupiah
Kopti;35669102,06;rupiah
Kopra/Kopsis;14590426,83;rupiah
Kopinkra;67456136,03;rupiah
Koppontren;47315788,69;rupiah
Kopkar;12537401159;rupiah
Kop.Serba Usaha;2,67266E+11;rupiah
Kop.Simpan Pinjam;8,64102E+11;rupiah
Kop.Simpan Pinjam dan Pembiayaan Syariah;88767809823;rupiah
Kop.Wisata;12538260,61;rupiah
Kop. Telkom;18503456954;rupiah
Kop.Perumahan;32830727892;rupiah
Kop.Listrik Pedesaan;20125000;rupiah
Kop.Wanita;251699213,7;rupiah
Kop.Profesi;6016403533;rupiah
Kop.Veteran;1553389790;rupiah
Kop.Wredatama;66340364,28;rupiah
Kop.Pertambangan;895867899;rupiah
Kop. Sekunder Kab./Kota;16499708856;rupiah
