golongan_umur;penduduk_yang_bekerja_paruh_waktu;satuan
15-19;94355;orang
20-24;180883;orang
25-29;253765;orang
30-34;278563;orang
35-39;352838;orang
40-44;351386;orang
45-49;358974;orang
50-54;297952;orang
55-59;302978;orang
60+;648837;orang
