nama_kota_kabupaten,luas_areal_wortel
kab. bandung,2448
kab. bandung barat,70
kab. bekasi,0
kab. bogor,170
kab. ciamis,0
kab. cianjur,2440
kab. cirebon,0
kab. garut,2080
kab. indramayu,0
kab. karawang,0
kab. kuningan,32
kab. majalengka,20
kab. pangandaran,0
kab. purwakarta,0
kab. subang,0
kab. sukabumi,160
kab. sumedang,3
kab. tasikmalaya,0
kota bandung,0
kota banjar,0
kota bekasi,0
kota bogor,0
kota cimahi,0
kota cirebon,0
kota depok,0
kota sukabumi,0
kota tasikmalaya,0
