nama_kota_kabupaten,luas_areal_terung
kab. bandung,174
kab. bandung barat,161
kab. bekasi,87
kab. bogor,490
kab. ciamis,131
kab. cianjur,545
kab. cirebon,183
kab. garut,940
kab. indramayu,168
kab. karawang,168
kab. kuningan,7
kab. majalengka,77
kab. pangandaran,25
kab. purwakarta,189
kab. subang,150
kab. sukabumi,594
kab. sumedang,55
kab. tasikmalaya,274
kota bandung,0
kota banjar,14
kota bekasi,7
kota bogor,18
kota cimahi,15
kota cirebon,0
kota depok,47
kota sukabumi,13
kota tasikmalaya,4
