﻿provinsi,kode_kota_kabupaten,nama_kota_kabupaten,odtw,jumlah,satuan
JAWA BARAT,3204,KAB. BANDUNG,ALAM,39,LOKASI
JAWA BARAT,3204,KAB. BANDUNG,BUDAYA,14,LOKASI
JAWA BARAT,3204,KAB. BANDUNG,MINAT KHUSUS,0,LOKASI
JAWA BARAT,3217,KAB. BANDUNG BARAT,ALAM,26,LOKASI
JAWA BARAT,3217,KAB. BANDUNG BARAT,BUDAYA,10,LOKASI
JAWA BARAT,3217,KAB. BANDUNG BARAT,MINAT KHUSUS,3,LOKASI
JAWA BARAT,3216,KAB. BEKASI,ALAM,4,LOKASI
JAWA BARAT,3216,KAB. BEKASI,BUDAYA,3,LOKASI
JAWA BARAT,3216,KAB. BEKASI,MINAT KHUSUS,3,LOKASI
JAWA BARAT,3201,KAB. BOGOR,ALAM,38,LOKASI
JAWA BARAT,3201,KAB. BOGOR,BUDAYA,3,LOKASI
JAWA BARAT,3201,KAB. BOGOR,MINAT KHUSUS,4,LOKASI
JAWA BARAT,3207,KAB. CIAMIS,ALAM,11,LOKASI
JAWA BARAT,3207,KAB. CIAMIS,BUDAYA,6,LOKASI
JAWA BARAT,3207,KAB. CIAMIS,MINAT KHUSUS,6,LOKASI
JAWA BARAT,3203,KAB. CIANJUR,ALAM,12,LOKASI
JAWA BARAT,3203,KAB. CIANJUR,BUDAYA,4,LOKASI
JAWA BARAT,3203,KAB. CIANJUR,MINAT KHUSUS,1,LOKASI
JAWA BARAT,3209,KAB. CIREBON,ALAM,7,LOKASI
JAWA BARAT,3209,KAB. CIREBON,BUDAYA,4,LOKASI
JAWA BARAT,3209,KAB. CIREBON,MINAT KHUSUS,0,LOKASI
JAWA BARAT,3205,KAB. GARUT,ALAM,28,LOKASI
JAWA BARAT,3205,KAB. GARUT,BUDAYA,5,LOKASI
JAWA BARAT,3205,KAB. GARUT,MINAT KHUSUS,6,LOKASI
JAWA BARAT,3212,KAB. INDRAMAYU,ALAM,4,LOKASI
JAWA BARAT,3212,KAB. INDRAMAYU,BUDAYA,1,LOKASI
JAWA BARAT,3212,KAB. INDRAMAYU,MINAT KHUSUS,0,LOKASI
JAWA BARAT,3215,KAB. KARAWANG,ALAM,12,LOKASI
JAWA BARAT,3215,KAB. KARAWANG,BUDAYA,9,LOKASI
JAWA BARAT,3215,KAB. KARAWANG,MINAT KHUSUS,3,LOKASI
JAWA BARAT,3208,KAB. KUNINGAN,ALAM,19,LOKASI
JAWA BARAT,3208,KAB. KUNINGAN,BUDAYA,6,LOKASI
JAWA BARAT,3208,KAB. KUNINGAN,MINAT KHUSUS,3,LOKASI
JAWA BARAT,3210,KAB. MAJALENGKA,ALAM,11,LOKASI
JAWA BARAT,3210,KAB. MAJALENGKA,BUDAYA,0,LOKASI
JAWA BARAT,3210,KAB. MAJALENGKA,MINAT KHUSUS,2,LOKASI
JAWA BARAT,3214,KAB. PURWAKARTA,ALAM,9,LOKASI
JAWA BARAT,3214,KAB. PURWAKARTA,BUDAYA,7,LOKASI
JAWA BARAT,3214,KAB. PURWAKARTA,MINAT KHUSUS,8,LOKASI
JAWA BARAT,3213,KAB. SUBANG,ALAM,31,LOKASI
JAWA BARAT,3213,KAB. SUBANG,BUDAYA,11,LOKASI
JAWA BARAT,3213,KAB. SUBANG,MINAT KHUSUS,25,LOKASI
JAWA BARAT,3202,KAB. SUKABUMI,ALAM,36,LOKASI
JAWA BARAT,3202,KAB. SUKABUMI,BUDAYA,7,LOKASI
JAWA BARAT,3202,KAB. SUKABUMI,MINAT KHUSUS,7,LOKASI
JAWA BARAT,3211,KAB. SUMEDANG,ALAM,14,LOKASI
JAWA BARAT,3211,KAB. SUMEDANG,BUDAYA,7,LOKASI
JAWA BARAT,3211,KAB. SUMEDANG,MINAT KHUSUS,8,LOKASI
JAWA BARAT,3206,KAB. TASIKMALAYA,ALAM,10,LOKASI
JAWA BARAT,3206,KAB. TASIKMALAYA,BUDAYA,2,LOKASI
JAWA BARAT,3206,KAB. TASIKMALAYA,MINAT KHUSUS,1,LOKASI
JAWA BARAT,3273,KOTA BANDUNG,ALAM,3,LOKASI
JAWA BARAT,3273,KOTA BANDUNG,BUDAYA,3,LOKASI
JAWA BARAT,3273,KOTA BANDUNG,MINAT KHUSUS,8,LOKASI
JAWA BARAT,3279,KOTA BANJAR,ALAM,1,LOKASI
JAWA BARAT,3279,KOTA BANJAR,BUDAYA,0,LOKASI
JAWA BARAT,3279,KOTA BANJAR,MINAT KHUSUS,0,LOKASI
JAWA BARAT,3275,KOTA BEKASI,ALAM,0,LOKASI
JAWA BARAT,3275,KOTA BEKASI,BUDAYA,0,LOKASI
JAWA BARAT,3275,KOTA BEKASI,MINAT KHUSUS,0,LOKASI
JAWA BARAT,3271,KOTA BOGOR,ALAM,0,LOKASI
JAWA BARAT,3271,KOTA BOGOR,BUDAYA,2,LOKASI
JAWA BARAT,3271,KOTA BOGOR,MINAT KHUSUS,55,LOKASI
JAWA BARAT,3277,KOTA CIMAHI,ALAM,0,LOKASI
JAWA BARAT,3277,KOTA CIMAHI,BUDAYA,0,LOKASI
JAWA BARAT,3277,KOTA CIMAHI,MINAT KHUSUS,0,LOKASI
JAWA BARAT,3274,KOTA CIREBON,ALAM,1,LOKASI
JAWA BARAT,3274,KOTA CIREBON,BUDAYA,8,LOKASI
JAWA BARAT,3274,KOTA CIREBON,MINAT KHUSUS,1,LOKASI
JAWA BARAT,3276,KOTA DEPOK,ALAM,6,LOKASI
JAWA BARAT,3276,KOTA DEPOK,BUDAYA,0,LOKASI
JAWA BARAT,3276,KOTA DEPOK,MINAT KHUSUS,0,LOKASI
JAWA BARAT,3272,KOTA SUKABUMI,ALAM,2,LOKASI
JAWA BARAT,3272,KOTA SUKABUMI,BUDAYA,0,LOKASI
JAWA BARAT,3272,KOTA SUKABUMI,MINAT KHUSUS,0,LOKASI
JAWA BARAT,3278,KOTA TASIKMALAYA,ALAM,3,LOKASI
JAWA BARAT,3278,KOTA TASIKMALAYA,BUDAYA,4,LOKASI
JAWA BARAT,3278,KOTA TASIKMALAYA,MINAT KHUSUS,0,LOKASI
