nama_pengembangan_kompetensi;lulusan_pengembangan_kompetensi;satuan
Kegiatan Diklat Kepemimpinan Tingkat II; 60 ;Orang
Kegiatan Diklat Kepemimpinan Tingkat III; 85 ;Orang
Kegiatan Diklat Kepemimpinan Tingkat IV; 118 ;Orang
Kegiatan Diklat Prajabatan/Pelatihan Dasar CPNS; 2.344 ;Orang
Diklat Fungsional Analis Kepegawaian Tingkat Terampil ;;Orang
Diklat Fungsional P2UPD;;Orang
Diklat Fungsional Perencana Muda; 22 ;Orang
TOF Widyaiswara; 50 ;Orang
Diklat Fungsional Calon Widyaiswara;;Orang
Diklat TOT Substantif Diklatpim III dan IV;;Orang
Pengembangan Kapasitas Penyelenggara dan Widyaiswara melalui Kerjasama Internasional;;Orang
Diklat Fungsional Auditor;;Orang
Diklat Pengelolaan Barang Daerah; 60 ;Orang
Diklat Penatausahaan Keuangan ; 60 ;Orang
Diklat Teknis Manajemen Kearsipan; 60 ;Orang
Diklat Pengadaan Barang dan Jasa Pemerintah; 39 ;Orang
Diklat Penyusunan Kontrak dan Dokumen;;Orang
Diklat Akuntansi Pemerintah Berbasis Akrual; 30 ;Orang
Diklat Administrasi Kepegawaian; 30 ;Orang
Diklat Teknis Substantif Pendidikan Bidang Karya Tulis Ilmiah (KTI) dan Penetapan Angka Kredit (PAK);;Orang
Diklat Teknis Substantif Pertanian Bidang Perlindungan TP & Holtikultura;;Orang
Diklat Teknis Substantif Kesehatan Bidang Manajemen Badan Layanan Umum Daerah (BLUD);;Orang
Diklat Teknis Substantif Pariwisata;;Orang
Diklat Teknis Substantif Kesbangpol;;Orang
Diklat Kebinamargaan Bidang Teknisi Laboratorium Aspal; 30 ;Orang
Diklat Kebinamargaan Bidang Teknis Laboratorium Beton; 30 ;Orang
Diklat Pendidikan bidang PKG dan PKB; 30 ;Orang
Diklat Pertanian bidang Perubahan Iklim; 30 ;Orang
Diklat Kebinamargaan Bidang Mekanika Tanah; 30 ;Orang
Diklat Legal Drafter; 30 ;Orang
Diklat Pertanian Bidang Padi dan Palawija; 30 ;Orang
Diklat Manajemen KUMKM;;Orang
Diklat Pendidikan Khusus Profesi Advokasi (PKPA);;Orang
Diklat Kesekretariatan DPRD;;Orang
Diklat Perikanan dan Kelautan;;Orang
Diklat Pendapatan Bidang Kesamsatan;;Orang
Diklat Training Officer Course (TOC) ;;Orang
Diklat Teknis Substantif SoftSkill bagi Pejabat Pemerintah Provinsi Jawa Barat;;Orang
Diklat TOT Substantif Diklatpim III dan IV;;Orang
Diklat Teknis Substantif Management of Training (MOT);;Orang
Diklat Teknis Substantif Aparatur Pembina Koperasi;;Orang
Pengembangan Kompetensi Bagi Tenaga Pengembangan Kompetensi;;Orang
Diklat Teknis Pariwisata;;Orang
Diklat Teknis Sosial;;Orang
Diklat Teknis Tanaman Pangan;;Orang
Diklat Teknis Pemberdayaan Masyarakat Desa;;Orang
Diklat Teknis TOC;;Orang
Diklat Teknis Penanggulangan Bencana;;Orang
Diklat Teknis AKIP/LAKIP;;Orang
Diklat Teknis Administrasi Keuangan;;Orang
Pengembangan Kompetensi Integritas PNS;;Orang
Diklat Pengembangan Kepemimpinan melalui Komunikasi Publik yang Efektif;;Orang
Pengembangan Kepribadian Aparatur;;Orang
Manajemen Konflik;;Orang
Legislatif Drafting Bagi Anggota DPRD;;Orang
Kepemimpinan Visioner Kepala Daerah;;Orang
Tata Cara Pemerintahan Desa/Manajemen Pemerintah Desa;;Orang
