daerah_penghasil,jumlah_produksi,satuan
Provinsi (4-12 mil),3381.7,ribu barrel
Indramayu,1730.67,ribu barrel
Karawang,747.45,ribu barrel
Majalengka,82.47,ribu barrel
Subang,189.5,ribu barrel
Bekasi,5139.18,ribu barrel
