dana_perimbangan;murni;perubahan;realisasi;satuan
dana bagi hasil pajak/bagi hasil bukan pajak;1054356759263;1185070089100;1494604220017;rupiah
dana alokasi umum;1687686386000;1687686386000;1687686386000;rupiah
dana alokasi khusus;78215030000;78215030000;78215030000;rupiah
