provinsi,kode_kota Kabupaten,nama_kota_kabupaten,jenis_komoditi,luas_tanam,satuan
jawa barat,3204,kab. bandung,Kacang Hijau,0,hektar
jawa barat,3204,kab. bandung,Kacang Tanah,401,hektar
jawa barat,3204,kab. bandung,Kedelai,775,hektar
jawa barat,3217,kab. bandung barat,Kacang Hijau,30,hektar
jawa barat,3217,kab. bandung barat,Kacang Tanah,211,hektar
jawa barat,3217,kab. bandung barat,Kedelai,544,hektar
jawa barat,3216,kab. bekasi,Kacang Hijau,3,hektar
jawa barat,3216,kab. bekasi,Kacang Tanah,90,hektar
jawa barat,3216,kab. bekasi,Kedelai,7,hektar
jawa barat,3201,kab. bogor,Kacang Hijau,202,hektar
jawa barat,3201,kab. bogor,Kacang Tanah,834,hektar
jawa barat,3201,kab. bogor,Kedelai,230,hektar
jawa barat,3207,kab. ciamis,Kacang Hijau,964,hektar
jawa barat,3207,kab. ciamis,Kacang Tanah,472,hektar
jawa barat,3207,kab. ciamis,Kedelai,1051,hektar
jawa barat,3203,kab. cianjur,Kacang Hijau,175,hektar
jawa barat,3203,kab. cianjur,Kacang Tanah,4112,hektar
jawa barat,3203,kab. cianjur,Kedelai,3001,hektar
jawa barat,3209,kab. cirebon,Kacang Hijau,1817,hektar
jawa barat,3209,kab. cirebon,Kacang Tanah,58,hektar
jawa barat,3209,kab. cirebon,Kedelai,163,hektar
jawa barat,3205,kab. garut,Kacang Hijau,1113,hektar
jawa barat,3205,kab. garut,Kacang Tanah,13465,hektar
jawa barat,3205,kab. garut,Kedelai,6163,hektar
jawa barat,3212,kab. indramayu,Kacang Hijau,786,hektar
jawa barat,3212,kab. indramayu,Kacang Tanah,42,hektar
jawa barat,3212,kab. indramayu,Kedelai,5344,hektar
jawa barat,3215,kab. karawang,Kacang Hijau,299,hektar
jawa barat,3215,kab. karawang,Kacang Tanah,52,hektar
jawa barat,3215,kab. karawang,Kedelai,1403,hektar
jawa barat,3208,kab. kuningan,Kacang Hijau,23,hektar
jawa barat,3208,kab. kuningan,Kacang Tanah,428,hektar
jawa barat,3208,kab. kuningan,Kedelai,191,hektar
jawa barat,3210,kab. majalengka,Kacang Hijau,1631,hektar
jawa barat,3210,kab. majalengka,Kacang Tanah,447,hektar
jawa barat,3210,kab. majalengka,Kedelai,540,hektar
jawa barat,3218,kab. pangandaran,Kacang Hijau,518,hektar
jawa barat,3218,kab. pangandaran,Kacang Tanah,228,hektar
jawa barat,3218,kab. pangandaran,Kedelai,672,hektar
jawa barat,3214,kab. purwakarta,Kacang Hijau,83,hektar
jawa barat,3214,kab. purwakarta,Kacang Tanah,192,hektar
jawa barat,3214,kab. purwakarta,Kedelai,66,hektar
jawa barat,3213,kab. subang,Kacang Hijau,10,hektar
jawa barat,3213,kab. subang,Kacang Tanah,131,hektar
jawa barat,3213,kab. subang,Kedelai,211,hektar
jawa barat,3202,kab. sukabumi,Kacang Hijau,8,hektar
jawa barat,3202,kab. sukabumi,Kacang Tanah,1875,hektar
jawa barat,3202,kab. sukabumi,Kedelai,2551,hektar
jawa barat,3211,kab. sumedang,Kacang Hijau,128,hektar
jawa barat,3211,kab. sumedang,Kacang Tanah,3232,hektar
jawa barat,3211,kab. sumedang,Kedelai,730,hektar
jawa barat,3206,kab. tasikmalaya,Kacang Hijau,6,hektar
jawa barat,3206,kab. tasikmalaya,Kacang Tanah,2479,hektar
jawa barat,3206,kab. tasikmalaya,Kedelai,4329,hektar
jawa barat,3273,kota bandung,Kacang Hijau,0,hektar
jawa barat,3273,kota bandung,Kacang Tanah,13,hektar
jawa barat,3273,kota bandung,Kedelai,0,hektar
jawa barat,3279,kota banjar,Kacang Hijau,42,hektar
jawa barat,3279,kota banjar,Kacang Tanah,69,hektar
jawa barat,3279,kota banjar,Kedelai,161,hektar
jawa barat,3275,kota bekasi,Kacang Hijau,0,hektar
jawa barat,3275,kota bekasi,Kacang Tanah,0,hektar
jawa barat,3275,kota bekasi,Kedelai,1,hektar
jawa barat,3271,kota bogor,Kacang Hijau,0,hektar
jawa barat,3271,kota bogor,Kacang Tanah,49,hektar
jawa barat,3271,kota bogor,Kedelai,0,hektar
jawa barat,3277,kota cimahi,Kacang Hijau,0,hektar
jawa barat,3277,kota cimahi,Kacang Tanah,6,hektar
jawa barat,3277,kota cimahi,Kedelai,0,hektar
jawa barat,3274,kota cirebon,Kacang Hijau,2,hektar
jawa barat,3274,kota cirebon,Kacang Tanah,2,hektar
jawa barat,3274,kota cirebon,Kedelai,0,hektar
jawa barat,3276,kota depok,Kacang Hijau,0,hektar
jawa barat,3276,kota depok,Kacang Tanah,21,hektar
jawa barat,3276,kota depok,Kedelai,0,hektar
jawa barat,3272,kota sukabumi,Kacang Hijau,0,hektar
jawa barat,3272,kota sukabumi,Kacang Tanah,3,hektar
jawa barat,3272,kota sukabumi,Kedelai,0,hektar
jawa barat,3278,kota tasik,Kacang Hijau,0,hektar
jawa barat,3278,kota tasik,Kacang Tanah,70,hektar
jawa barat,3278,kota tasik,Kedelai,310,hektar
