peluang_usaha*);penduduk_yang_bekerja;satuan
1;3082506;jiwa
2;134837;jiwa
3;4253595;jiwa
4;62069;jiwa
5;97808;jiwa
6;1542800;jiwa
7;4684325;jiwa
8;1072447;jiwa
9;1459769;jiwa
10;203458;jiwa
11;383082;jiwa
12;95906;jiwa
13;355753;jiwa
14;612028;jiwa
15;977563;jiwa
16;285485;jiwa
17;1248144;jiwa
