﻿provinsi,kode_kota_kabupaten,kota_kabupaten,cabang_pelayanan,nama_bank,pkb,satuan
JAWA BARAT,3217,KAB. BANDUNG BARAT, KAB. BANDUNG BARAT PDLG   ,BJB,89336900,Rp
JAWA BARAT,3204,KAB. BANDUNG, KAB. BANDUNG I RC.EKEK    ,BJB,68179700,Rp
JAWA BARAT,3204,KAB. BANDUNG, KAB. BANDUNG II SOREANG   ,BJB,33827100,Rp
JAWA BARAT,3216,KAB. BEKASI, KAB. BEKASI CKRG          ,BJB,290910800,Rp
JAWA BARAT,3201,KAB. BOGOR, KAB. BOGOR (CIBINONG)     ,BJB,131341000,Rp
JAWA BARAT,3207,KAB. CIAMIS, KAB. CIAMIS I             ,BJB,27389900,Rp
JAWA BARAT,3203,KAB. CIANJUR, KAB. CIANJUR              ,BJB,35525100,Rp
JAWA BARAT,3209,KAB. CIREBON, KAB. CIREBON I SBR        ,BJB,31773500,Rp
JAWA BARAT,3209,KAB. CIREBON, KAB. CIREBON II CLDG      ,BJB,11467800,Rp
JAWA BARAT,3205,KAB. GARUT, KAB. GARUT                ,BJB,45248700,Rp
JAWA BARAT,3212,KAB. INDRAMAYU, KAB. INDRAMAYU I          ,BJB,20966400,Rp
JAWA BARAT,3212,KAB. INDRAMAYU, KAB. INDRAMAYU II HRGLS   ,BJB,4964400,Rp
JAWA BARAT,3215,KAB. KARAWANG, KAB. KARAWANG             ,BJB,12808700,Rp
JAWA BARAT,3208,KAB. KUNINGAN, KAB. KUNINGAN             ,BJB,105284300,Rp
JAWA BARAT,3210,KAB. MAJALENGKA, KAB. MAJALENGKA           ,BJB,203743600,Rp
JAWA BARAT,3218,KAB. PANGANDARAN, KAB. PANGANDARAN          ,BJB,25400500,Rp
JAWA BARAT,3214,KAB. PURWAKARTA, KAB. PURWAKARTA           ,BJB,339317100,Rp
JAWA BARAT,3213,KAB. SUBANG, KAB. SUBANG               ,BJB,342822400,Rp
JAWA BARAT,3202,KAB. SUKABUMI, KAB. SUKABUMI I CBDK      ,BJB,37264500,Rp
JAWA BARAT,3202,KAB. SUKABUMI, KAB. SUKABUMI II P.RATU   ,BJB,29849000,Rp
JAWA BARAT,3211,KAB. SUMEDANG, KAB. SUMEDANG             ,BJB,41313800,Rp
JAWA BARAT,3206,KAB. TASIKMALAYA, KAB. TASIKMALAYA          ,BJB,312875600,Rp
JAWA BARAT,3273,KOTA BANDUNG, KOTA BANDUNG I PJJRN      ,BJB,117591500,Rp
JAWA BARAT,3273,KOTA BANDUNG, KOTA BANDUNG II KWLYN     ,BJB,160388600,Rp
JAWA BARAT,3273,KOTA BANDUNG, KOTA BANDUNG III SOETA    ,BJB,270216900,Rp
JAWA BARAT,3279,KOTA BANJAR, KOTA BANJAR               ,BJB,28633000,Rp
JAWA BARAT,3275,KOTA BEKASI, KOTA BEKASI               ,BJB,69854700,Rp
JAWA BARAT,3271,KOTA BOGOR, KOTA BOGOR                ,BJB,251511100,Rp
JAWA BARAT,3277,KOTA CIMAHI, KOTA CIMAHI               ,BJB,87284100,Rp
JAWA BARAT,3274,KOTA CIREBON, KOTA CIREBON              ,BJB,27957900,Rp
JAWA BARAT,3276,KOTA DEPOK, KOTA DEPOK I              ,BJB,50309700,Rp
JAWA BARAT,3276,KOTA DEPOK, KOTA DEPOK II CINERE      ,BJB,104794900,Rp
JAWA BARAT,3272,KOTA SUKABUMI, KOTA SUKABUMI             ,BJB,143490300,Rp
JAWA BARAT,3278,KOTA TASIKMALAYA, KOTA TASIKMALAYA          ,BJB,24921300,Rp
JAWA BARAT,3217,KAB. BANDUNG BARAT, KAB. BANDUNG BARAT PDLG   ,BCA,50780800,Rp
JAWA BARAT,3204,KAB. BANDUNG, KAB. BANDUNG I RC.EKEK    ,BCA,56336800,Rp
JAWA BARAT,3204,KAB. BANDUNG, KAB. BANDUNG II SOREANG   ,BCA,23676500,Rp
JAWA BARAT,3216,KAB. BEKASI, KAB. BEKASI CKRG          ,BCA,70511300,Rp
JAWA BARAT,3201,KAB. BOGOR, KAB. BOGOR (CIBINONG)     ,BCA,205750700,Rp
JAWA BARAT,3207,KAB. CIAMIS, KAB. CIAMIS I             ,BCA,4074800,Rp
JAWA BARAT,3203,KAB. CIANJUR, KAB. CIANJUR              ,BCA,15076800,Rp
JAWA BARAT,3209,KAB. CIREBON, KAB. CIREBON I SBR        ,BCA,7820900,Rp
JAWA BARAT,3209,KAB. CIREBON, KAB. CIREBON II CLDG      ,BCA,5661200,Rp
JAWA BARAT,3205,KAB. GARUT, KAB. GARUT                ,BCA,12983900,Rp
JAWA BARAT,3212,KAB. INDRAMAYU, KAB. INDRAMAYU I          ,BCA,6042000,Rp
JAWA BARAT,3212,KAB. INDRAMAYU, KAB. INDRAMAYU II HRGLS   ,BCA,189000,Rp
JAWA BARAT,3215,KAB. KARAWANG, KAB. KARAWANG             ,BCA,27999500,Rp
JAWA BARAT,3208,KAB. KUNINGAN, KAB. KUNINGAN             ,BCA,5975500,Rp
JAWA BARAT,3210,KAB. MAJALENGKA, KAB. MAJALENGKA           ,BCA,4937000,Rp
JAWA BARAT,3218,KAB. PANGANDARAN, KAB. PANGANDARAN          ,BCA,490000,Rp
JAWA BARAT,3214,KAB. PURWAKARTA, KAB. PURWAKARTA           ,BCA,31115900,Rp
JAWA BARAT,3213,KAB. SUBANG, KAB. SUBANG               ,BCA,38890200,Rp
JAWA BARAT,3202,KAB. SUKABUMI, KAB. SUKABUMI I CBDK      ,BCA,35035000,Rp
JAWA BARAT,3202,KAB. SUKABUMI, KAB. SUKABUMI II P.RATU   ,BCA,22623500,Rp
JAWA BARAT,3211,KAB. SUMEDANG, KAB. SUMEDANG             ,BCA,3502900,Rp
JAWA BARAT,3206,KAB. TASIKMALAYA, KAB. TASIKMALAYA          ,BCA,24294000,Rp
JAWA BARAT,3273,KOTA BANDUNG, KOTA BANDUNG I PJJRN      ,BCA,129257400,Rp
JAWA BARAT,3273,KOTA BANDUNG, KOTA BANDUNG II KWLYN     ,BCA,159728700,Rp
JAWA BARAT,3273,KOTA BANDUNG, KOTA BANDUNG III SOETA    ,BCA,143365200,Rp
JAWA BARAT,3279,KOTA BANJAR, KOTA BANJAR               ,BCA,323800,Rp
JAWA BARAT,3275,KOTA BEKASI, KOTA BEKASI               ,BCA,163935600,Rp
JAWA BARAT,3271,KOTA BOGOR, KOTA BOGOR                ,BCA,163836200,Rp
JAWA BARAT,3277,KOTA CIMAHI, KOTA CIMAHI               ,BCA,63262600,Rp
JAWA BARAT,3274,KOTA CIREBON, KOTA CIREBON              ,BCA,18671100,Rp
JAWA BARAT,3276,KOTA DEPOK, KOTA DEPOK I              ,BCA,110058200,Rp
JAWA BARAT,3276,KOTA DEPOK, KOTA DEPOK II CINERE      ,BCA,128179200,Rp
JAWA BARAT,3272,KOTA SUKABUMI, KOTA SUKABUMI             ,BCA,192248600,Rp
JAWA BARAT,3278,KOTA TASIKMALAYA, KOTA TASIKMALAYA          ,BCA,47754000,Rp
JAWA BARAT,3217,KAB. BANDUNG BARAT, KAB. BANDUNG BARAT PDLG   ,BNI,35935700,Rp
JAWA BARAT,3204,KAB. BANDUNG, KAB. BANDUNG I RC.EKEK    ,BNI,61416900,Rp
JAWA BARAT,3204,KAB. BANDUNG, KAB. BANDUNG II SOREANG   ,BNI,36382100,Rp
JAWA BARAT,3216,KAB. BEKASI, KAB. BEKASI CKRG          ,BNI,53508800,Rp
JAWA BARAT,3201,KAB. BOGOR, KAB. BOGOR (CIBINONG)     ,BNI,151735000,Rp
JAWA BARAT,3207,KAB. CIAMIS, KAB. CIAMIS I             ,BNI,11525500,Rp
JAWA BARAT,3203,KAB. CIANJUR, KAB. CIANJUR              ,BNI,7777000,Rp
JAWA BARAT,3209,KAB. CIREBON, KAB. CIREBON I SBR        ,BNI,64381300,Rp
JAWA BARAT,3209,KAB. CIREBON, KAB. CIREBON II CLDG      ,BNI,12124000,Rp
JAWA BARAT,3205,KAB. GARUT, KAB. GARUT                ,BNI,15837600,Rp
JAWA BARAT,3212,KAB. INDRAMAYU, KAB. INDRAMAYU I          ,BNI,4336500,Rp
JAWA BARAT,3212,KAB. INDRAMAYU, KAB. INDRAMAYU II HRGLS   ,BNI,2180700,Rp
JAWA BARAT,3215,KAB. KARAWANG, KAB. KARAWANG             ,BNI,20553700,Rp
JAWA BARAT,3208,KAB. KUNINGAN, KAB. KUNINGAN             ,BNI,12050300,Rp
JAWA BARAT,3210,KAB. MAJALENGKA, KAB. MAJALENGKA           ,BNI,84531900,Rp
JAWA BARAT,3218,KAB. PANGANDARAN, KAB. PANGANDARAN          ,BNI,3387500,Rp
JAWA BARAT,3214,KAB. PURWAKARTA, KAB. PURWAKARTA           ,BNI,33143800,Rp
JAWA BARAT,3213,KAB. SUBANG, KAB. SUBANG               ,BNI,30271000,Rp
JAWA BARAT,3202,KAB. SUKABUMI, KAB. SUKABUMI I CBDK      ,BNI,32655900,Rp
JAWA BARAT,3202,KAB. SUKABUMI, KAB. SUKABUMI II P.RATU   ,BNI,7257900,Rp
JAWA BARAT,3211,KAB. SUMEDANG, KAB. SUMEDANG             ,BNI,22155800,Rp
JAWA BARAT,3206,KAB. TASIKMALAYA, KAB. TASIKMALAYA          ,BNI,17885200,Rp
JAWA BARAT,3273,KOTA BANDUNG, KOTA BANDUNG I PJJRN      ,BNI,75962900,Rp
JAWA BARAT,3273,KOTA BANDUNG, KOTA BANDUNG II KWLYN     ,BNI,204132600,Rp
JAWA BARAT,3273,KOTA BANDUNG, KOTA BANDUNG III SOETA    ,BNI,179990900,Rp
JAWA BARAT,3279,KOTA BANJAR, KOTA BANJAR               ,BNI,1771000,Rp
JAWA BARAT,3275,KOTA BEKASI, KOTA BEKASI               ,BNI,102075100,Rp
JAWA BARAT,3271,KOTA BOGOR, KOTA BOGOR                ,BNI,59623700,Rp
JAWA BARAT,3277,KOTA CIMAHI, KOTA CIMAHI               ,BNI,55724900,Rp
JAWA BARAT,3274,KOTA CIREBON, KOTA CIREBON              ,BNI,41051100,Rp
JAWA BARAT,3276,KOTA DEPOK, KOTA DEPOK I              ,BNI,51097000,Rp
JAWA BARAT,3276,KOTA DEPOK, KOTA DEPOK II CINERE      ,BNI,37016300,Rp
JAWA BARAT,3272,KOTA SUKABUMI, KOTA SUKABUMI             ,BNI,58818800,Rp
JAWA BARAT,3278,KOTA TASIKMALAYA, KOTA TASIKMALAYA          ,BNI,24225000,Rp
JAWA BARAT,3217,KAB. BANDUNG BARAT, KAB. BANDUNG BARAT PDLG   ,BRI,12012200,Rp
JAWA BARAT,3204,KAB. BANDUNG, KAB. BANDUNG I RC.EKEK    ,BRI,39627300,Rp
JAWA BARAT,3204,KAB. BANDUNG, KAB. BANDUNG II SOREANG   ,BRI,13162700,Rp
JAWA BARAT,3216,KAB. BEKASI, KAB. BEKASI CKRG          ,BRI,19042200,Rp
JAWA BARAT,3201,KAB. BOGOR, KAB. BOGOR (CIBINONG)     ,BRI,66256700,Rp
JAWA BARAT,3207,KAB. CIAMIS, KAB. CIAMIS I             ,BRI,14879400,Rp
JAWA BARAT,3203,KAB. CIANJUR, KAB. CIANJUR              ,BRI,913600,Rp
JAWA BARAT,3209,KAB. CIREBON, KAB. CIREBON I SBR        ,BRI,56005700,Rp
JAWA BARAT,3209,KAB. CIREBON, KAB. CIREBON II CLDG      ,BRI,10797600,Rp
JAWA BARAT,3205,KAB. GARUT, KAB. GARUT                ,BRI,7254700,Rp
JAWA BARAT,3212,KAB. INDRAMAYU, KAB. INDRAMAYU I          ,BRI,7930300,Rp
JAWA BARAT,3212,KAB. INDRAMAYU, KAB. INDRAMAYU II HRGLS   ,BRI,9503600,Rp
JAWA BARAT,3215,KAB. KARAWANG, KAB. KARAWANG             ,BRI,23966500,Rp
JAWA BARAT,3208,KAB. KUNINGAN, KAB. KUNINGAN             ,BRI,40711000,Rp
JAWA BARAT,3210,KAB. MAJALENGKA, KAB. MAJALENGKA           ,BRI,13811700,Rp
JAWA BARAT,3218,KAB. PANGANDARAN, KAB. PANGANDARAN          ,BRI,890900,Rp
JAWA BARAT,3214,KAB. PURWAKARTA, KAB. PURWAKARTA           ,BRI,20687200,Rp
JAWA BARAT,3213,KAB. SUBANG, KAB. SUBANG               ,BRI,27808000,Rp
JAWA BARAT,3202,KAB. SUKABUMI, KAB. SUKABUMI I CBDK      ,BRI,9798800,Rp
JAWA BARAT,3202,KAB. SUKABUMI, KAB. SUKABUMI II P.RATU   ,BRI,427000,Rp
JAWA BARAT,3211,KAB. SUMEDANG, KAB. SUMEDANG             ,BRI,10220800,Rp
JAWA BARAT,3206,KAB. TASIKMALAYA, KAB. TASIKMALAYA          ,BRI,165240300,Rp
JAWA BARAT,3273,KOTA BANDUNG, KOTA BANDUNG I PJJRN      ,BRI,44238600,Rp
JAWA BARAT,3273,KOTA BANDUNG, KOTA BANDUNG II KWLYN     ,BRI,44265300,Rp
JAWA BARAT,3273,KOTA BANDUNG, KOTA BANDUNG III SOETA    ,BRI,72137300,Rp
JAWA BARAT,3279,KOTA BANJAR, KOTA BANJAR               ,BRI,3565800,Rp
JAWA BARAT,3275,KOTA BEKASI, KOTA BEKASI               ,BRI,25234700,Rp
JAWA BARAT,3271,KOTA BOGOR, KOTA BOGOR                ,BRI,22364900,Rp
JAWA BARAT,3277,KOTA CIMAHI, KOTA CIMAHI               ,BRI,26095400,Rp
JAWA BARAT,3274,KOTA CIREBON, KOTA CIREBON              ,BRI,21648000,Rp
JAWA BARAT,3276,KOTA DEPOK, KOTA DEPOK I              ,BRI,19182900,Rp
JAWA BARAT,3276,KOTA DEPOK, KOTA DEPOK II CINERE      ,BRI,13293400,Rp
JAWA BARAT,3272,KOTA SUKABUMI, KOTA SUKABUMI             ,BRI,6788400,Rp
JAWA BARAT,3278,KOTA TASIKMALAYA, KOTA TASIKMALAYA          ,BRI,10699900,Rp
JAWA BARAT,3217,KAB. BANDUNG BARAT, KAB. BANDUNG BARAT PDLG   ,PERMATA,0,Rp
JAWA BARAT,3204,KAB. BANDUNG, KAB. BANDUNG I RC.EKEK    ,PERMATA,0,Rp
JAWA BARAT,3204,KAB. BANDUNG, KAB. BANDUNG II SOREANG   ,PERMATA,0,Rp
JAWA BARAT,3216,KAB. BEKASI, KAB. BEKASI CKRG          ,PERMATA,0,Rp
JAWA BARAT,3201,KAB. BOGOR, KAB. BOGOR (CIBINONG)     ,PERMATA,560000,Rp
JAWA BARAT,3207,KAB. CIAMIS, KAB. CIAMIS I             ,PERMATA,0,Rp
JAWA BARAT,3203,KAB. CIANJUR, KAB. CIANJUR              ,PERMATA,0,Rp
JAWA BARAT,3209,KAB. CIREBON, KAB. CIREBON I SBR        ,PERMATA,0,Rp
JAWA BARAT,3209,KAB. CIREBON, KAB. CIREBON II CLDG      ,PERMATA,0,Rp
JAWA BARAT,3205,KAB. GARUT, KAB. GARUT                ,PERMATA,0,Rp
JAWA BARAT,3212,KAB. INDRAMAYU, KAB. INDRAMAYU I          ,PERMATA,0,Rp
JAWA BARAT,3212,KAB. INDRAMAYU, KAB. INDRAMAYU II HRGLS   ,PERMATA,0,Rp
JAWA BARAT,3215,KAB. KARAWANG, KAB. KARAWANG             ,PERMATA,0,Rp
JAWA BARAT,3208,KAB. KUNINGAN, KAB. KUNINGAN             ,PERMATA,0,Rp
JAWA BARAT,3210,KAB. MAJALENGKA, KAB. MAJALENGKA           ,PERMATA,0,Rp
JAWA BARAT,3218,KAB. PANGANDARAN, KAB. PANGANDARAN          ,PERMATA,0,Rp
JAWA BARAT,3214,KAB. PURWAKARTA, KAB. PURWAKARTA           ,PERMATA,0,Rp
JAWA BARAT,3213,KAB. SUBANG, KAB. SUBANG               ,PERMATA,0,Rp
JAWA BARAT,3202,KAB. SUKABUMI, KAB. SUKABUMI I CBDK      ,PERMATA,0,Rp
JAWA BARAT,3202,KAB. SUKABUMI, KAB. SUKABUMI II P.RATU   ,PERMATA,0,Rp
JAWA BARAT,3211,KAB. SUMEDANG, KAB. SUMEDANG             ,PERMATA,0,Rp
JAWA BARAT,3206,KAB. TASIKMALAYA, KAB. TASIKMALAYA          ,PERMATA,0,Rp
JAWA BARAT,3273,KOTA BANDUNG, KOTA BANDUNG I PJJRN      ,PERMATA,0,Rp
JAWA BARAT,3273,KOTA BANDUNG, KOTA BANDUNG II KWLYN     ,PERMATA,0,Rp
JAWA BARAT,3273,KOTA BANDUNG, KOTA BANDUNG III SOETA    ,PERMATA,0,Rp
JAWA BARAT,3279,KOTA BANJAR, KOTA BANJAR               ,PERMATA,0,Rp
JAWA BARAT,3275,KOTA BEKASI, KOTA BEKASI               ,PERMATA,0,Rp
JAWA BARAT,3271,KOTA BOGOR, KOTA BOGOR                ,PERMATA,0,Rp
JAWA BARAT,3277,KOTA CIMAHI, KOTA CIMAHI               ,PERMATA,0,Rp
JAWA BARAT,3274,KOTA CIREBON, KOTA CIREBON              ,PERMATA,0,Rp
JAWA BARAT,3276,KOTA DEPOK, KOTA DEPOK I              ,PERMATA,0,Rp
JAWA BARAT,3276,KOTA DEPOK, KOTA DEPOK II CINERE      ,PERMATA,0,Rp
JAWA BARAT,3272,KOTA SUKABUMI, KOTA SUKABUMI             ,PERMATA,0,Rp
JAWA BARAT,3278,KOTA TASIKMALAYA, KOTA TASIKMALAYA          ,PERMATA,0,Rp
JAWA BARAT,3217,KAB. BANDUNG BARAT, KAB. BANDUNG BARAT PDLG   ,NIAGA,0,Rp
JAWA BARAT,3204,KAB. BANDUNG, KAB. BANDUNG I RC.EKEK    ,NIAGA,154000,Rp
JAWA BARAT,3204,KAB. BANDUNG, KAB. BANDUNG II SOREANG   ,NIAGA,5584500,Rp
JAWA BARAT,3216,KAB. BEKASI, KAB. BEKASI CKRG          ,NIAGA,0,Rp
JAWA BARAT,3201,KAB. BOGOR, KAB. BOGOR (CIBINONG)     ,NIAGA,1835400,Rp
JAWA BARAT,3207,KAB. CIAMIS, KAB. CIAMIS I             ,NIAGA,0,Rp
JAWA BARAT,3203,KAB. CIANJUR, KAB. CIANJUR              ,NIAGA,1427700,Rp
JAWA BARAT,3209,KAB. CIREBON, KAB. CIREBON I SBR        ,NIAGA,211800,Rp
JAWA BARAT,3209,KAB. CIREBON, KAB. CIREBON II CLDG      ,NIAGA,0,Rp
JAWA BARAT,3205,KAB. GARUT, KAB. GARUT                ,NIAGA,0,Rp
JAWA BARAT,3212,KAB. INDRAMAYU, KAB. INDRAMAYU I          ,NIAGA,0,Rp
JAWA BARAT,3212,KAB. INDRAMAYU, KAB. INDRAMAYU II HRGLS   ,NIAGA,0,Rp
JAWA BARAT,3215,KAB. KARAWANG, KAB. KARAWANG             ,NIAGA,0,Rp
JAWA BARAT,3208,KAB. KUNINGAN, KAB. KUNINGAN             ,NIAGA,152300,Rp
JAWA BARAT,3210,KAB. MAJALENGKA, KAB. MAJALENGKA           ,NIAGA,0,Rp
JAWA BARAT,3218,KAB. PANGANDARAN, KAB. PANGANDARAN          ,NIAGA,0,Rp
JAWA BARAT,3214,KAB. PURWAKARTA, KAB. PURWAKARTA           ,NIAGA,3270800,Rp
JAWA BARAT,3213,KAB. SUBANG, KAB. SUBANG               ,NIAGA,0,Rp
JAWA BARAT,3202,KAB. SUKABUMI, KAB. SUKABUMI I CBDK      ,NIAGA,0,Rp
JAWA BARAT,3202,KAB. SUKABUMI, KAB. SUKABUMI II P.RATU   ,NIAGA,0,Rp
JAWA BARAT,3211,KAB. SUMEDANG, KAB. SUMEDANG             ,NIAGA,0,Rp
JAWA BARAT,3206,KAB. TASIKMALAYA, KAB. TASIKMALAYA          ,NIAGA,0,Rp
JAWA BARAT,3273,KOTA BANDUNG, KOTA BANDUNG I PJJRN      ,NIAGA,7314900,Rp
JAWA BARAT,3273,KOTA BANDUNG, KOTA BANDUNG II KWLYN     ,NIAGA,5218800,Rp
JAWA BARAT,3273,KOTA BANDUNG, KOTA BANDUNG III SOETA    ,NIAGA,1449900,Rp
JAWA BARAT,3279,KOTA BANJAR, KOTA BANJAR               ,NIAGA,0,Rp
JAWA BARAT,3275,KOTA BEKASI, KOTA BEKASI               ,NIAGA,528600,Rp
JAWA BARAT,3271,KOTA BOGOR, KOTA BOGOR                ,NIAGA,148800,Rp
JAWA BARAT,3277,KOTA CIMAHI, KOTA CIMAHI               ,NIAGA,4926300,Rp
JAWA BARAT,3274,KOTA CIREBON, KOTA CIREBON              ,NIAGA,4649000,Rp
JAWA BARAT,3276,KOTA DEPOK, KOTA DEPOK I              ,NIAGA,0,Rp
JAWA BARAT,3276,KOTA DEPOK, KOTA DEPOK II CINERE      ,NIAGA,0,Rp
JAWA BARAT,3272,KOTA SUKABUMI, KOTA SUKABUMI             ,NIAGA,0,Rp
JAWA BARAT,3278,KOTA TASIKMALAYA, KOTA TASIKMALAYA          ,NIAGA,210000,Rp
