nama_kota_kabupaten,luas_areal_petsai_sawi
kab. bandung,3689
kab. bandung barat,238
kab. bekasi,79
kab. bogor,706
kab. ciamis,46
kab. cianjur,893
kab. cirebon,0
kab. garut,3701
kab. indramayu,49
kab. karawang,48
kab. kuningan,137
kab. majalengka,208
kab. pangandaran,0
kab. purwakarta,56
kab. subang,62
kab. sukabumi,1492
kab. sumudang,163
kab. tasikmalaya,168
kota bandung,16
kota banjar,28
kota bekasi,296
kota bogor,48
kota cimahi,47
kota cirebon,0
kota depok,0
kota sukabumi,0
kota tasikmalaya,14
