umur,jumlah_penduduk,satuan
00-04,0,jiwa
05-09,0,jiwa
10-14,24,jiwa
15-19,869,jiwa
20-24,14319,jiwa
25-29,42515,jiwa
30-34,70757,jiwa
35-39,102729,jiwa
40-44,107081,jiwa
45-49,102268,jiwa
50-54,81899,jiwa
55-59,63346,jiwa
60-64,44428,jiwa
65-69,29441,jiwa
70-74,18265,jiwa
> 75,23584,jiwa
