﻿provinsi,kode_kota_kabupaten,nama_kota_kabupaten,sektor,jumlah,satuan
JAWA BARAT,3204,KAB. BANDUNG,USAHA JASA IMPRESARIAT,2,SEKTOR
JAWA BARAT,3216,KAB. BEKASI,USAHA JASA IMPRESARIAT,3,SEKTOR
JAWA BARAT,3216,KAB. BEKASI,KEGIATAN KESENIAN,3,SEKTOR
JAWA BARAT,3201,KAB. BOGOR,USAHA JASA IMPRESARIAT,2,SEKTOR
JAWA BARAT,3214,KAB. PURWAKARTA,USAHA JASA IMPRESARIAT,1,SEKTOR
JAWA BARAT,3214,KAB. PURWAKARTA,KEGIATAN KESENIAN,1,SEKTOR
JAWA BARAT,3271,KOTA BOGOR,USAHA JASA IMPRESARIAT,10,SEKTOR
JAWA BARAT,3271,KOTA BOGOR,KEGIATAN KESENIAN,5,SEKTOR
JAWA BARAT,3276,KOTA DEPOK,USAHA JASA IMPRESARIAT,4,SEKTOR
JAWA BARAT,3276,KOTA DEPOK,KEGIATAN KESENIAN,4,SEKTOR
