﻿provinsi,kode_kota_kabupaten,nama_kota_kabupaten,angka_harapan_lama_sekolah,satuan
JAWA BARAT,3204,KAB. BANDUNG,10.81730443,TAHUN
JAWA BARAT,3217,KAB. BANDUNG BARAT,9.675093281,TAHUN
JAWA BARAT,3216,KAB. BEKASI,10.53745164,TAHUN
JAWA BARAT,3201,KAB. BOGOR,10.27738877,TAHUN
JAWA BARAT,3207,KAB. CIAMIS,11.74535036,TAHUN
JAWA BARAT,3203,KAB. CIANJUR,9.620175888,TAHUN
JAWA BARAT,3209,KAB. CIREBON,10.66060634,TAHUN
JAWA BARAT,3205,KAB. GARUT,10.35709063,TAHUN
JAWA BARAT,3212,KAB. INDRAMAYU,10.45499335,TAHUN
JAWA BARAT,3215,KAB. KARAWANG,10.75718053,TAHUN
JAWA BARAT,3208,KAB. KUNINGAN,10.83953726,TAHUN
JAWA BARAT,3210,KAB. MAJALENGKA,11.00200234,TAHUN
JAWA BARAT,3218,KAB. PANGANDARAN,,TAHUN
JAWA BARAT,3214,KAB. PURWAKARTA,10.16326225,TAHUN
JAWA BARAT,3213,KAB. SUBANG,10.58511428,TAHUN
JAWA BARAT,3202,KAB. SUKABUMI,10.08193,TAHUN
JAWA BARAT,3211,KAB. SUMEDANG,10.89823582,TAHUN
JAWA BARAT,3206,KAB. TASIKMALAYA,10.76443025,TAHUN
JAWA BARAT,3273,KOTA BANDUNG,12.40903481,TAHUN
JAWA BARAT,3279,KOTA BANJAR,11.89541357,TAHUN
JAWA BARAT,3275,KOTA BEKASI,12.12838542,TAHUN
JAWA BARAT,3271,KOTA BOGOR,11.72386768,TAHUN
JAWA BARAT,3277,KOTA CIMAHI,12.240345,TAHUN
JAWA BARAT,3274,KOTA CIREBON,11.69892399,TAHUN
JAWA BARAT,3276,KOTA DEPOK,12.45270448,TAHUN
JAWA BARAT,3272,KOTA SUKABUMI,11.55014628,TAHUN
JAWA BARAT,3278,KOTA TASIKMALAYA,11.84951273,TAHUN
