﻿provinsi,kode_kota_kabupaten,nama_kota_kabupaten,jumlah,satuan
JAWA BARAT,3204,KAB. BANDUNG,9,UNIT
JAWA BARAT,3217,KAB. BANDUNG BARAT,,UNIT
JAWA BARAT,3216,KAB. BEKASI,10,UNIT
JAWA BARAT,3201,KAB. BOGOR,4,UNIT
JAWA BARAT,3207,KAB. CIAMIS,6,UNIT
JAWA BARAT,3203,KAB. CIANJUR,,UNIT
JAWA BARAT,3209,KAB. CIREBON,4,UNIT
JAWA BARAT,3205,KAB. GARUT,4,UNIT
JAWA BARAT,3212,KAB. INDRAMAYU,4,UNIT
JAWA BARAT,3215,KAB. KARAWANG,6,UNIT
JAWA BARAT,3208,KAB. KUNINGAN,6,UNIT
JAWA BARAT,3210,KAB. MAJALENGKA,,UNIT
JAWA BARAT,3218,KAB. PANGANDARAN,,UNIT
JAWA BARAT,3214,KAB. PURWAKARTA,2,UNIT
JAWA BARAT,3213,KAB. SUBANG,3,UNIT
JAWA BARAT,3202,KAB. SUKABUMI,5,UNIT
JAWA BARAT,3211,KAB. SUMEDANG,,UNIT
JAWA BARAT,3206,KAB. TASIKMALAYA,,UNIT
JAWA BARAT,3273,KOTA BANDUNG,47,UNIT
JAWA BARAT,3279,KOTA BANJAR,3,UNIT
JAWA BARAT,3275,KOTA BEKASI,9,UNIT
JAWA BARAT,3271,KOTA BOGOR,8,UNIT
JAWA BARAT,3277,KOTA CIMAHI,11,UNIT
JAWA BARAT,3274,KOTA CIREBON,2,UNIT
JAWA BARAT,3276,KOTA DEPOK,17,UNIT
JAWA BARAT,3272,KOTA SUKABUMI,3,UNIT
JAWA BARAT,3278,KOTA TASIKMALAYA,8,UNIT
