nama_kota_kabupaten,luas_areal_melon
kab. bandung,0
kab. bandung barat,0
kab. bekasi,0
kab. bogor,0
kab. ciamis,0
kab. cianjur,0
kab. cirebon,0
kab. garut,0
kab. indramayu,0
kab. karawang,0
kab. kuningan,0
kab. majalengka,0
kab. pangandaran,0
kab. purwakarta,0
kab. subang,0
kab. sukabumi,0
kab. sumedang,0
kab. tasikmalaya,1
kota bandung,0
kota banjar,0
kota bekasi,0
kota bogor,0
kota cimahi,0
kota cirebon,0
kota depok,0
kota sukabumi,0
kota tasikmalaya,0
