kelompok_pekerjaan,jenis_kelamin,jumlah_pekerja,satuan
Tidak/Belum Bekerja,laki-laki,126006,orang
Tidak/Belum Bekerja,perempuan,96482,orang
Mengurus Rumah Tangga,laki-laki,6486,orang
Mengurus Rumah Tangga,perempuan,1491197,orang
Pelajar/Mahasiswa ,laki-laki,36365,orang
Pelajar/Mahasiswa ,perempuan,28082,orang
Pensiunan,laki-laki,214657,orang
Pensiunan,perempuan,53980,orang
PNS/TNI/POLRI,laki-laki,415096,orang
PNS/TNI/POLRI,perempuan,32350,orang
Karyawan,laki-laki,2611666,orang
Karyawan,perempuan,129110,orang
Buruh/Tukang/industri/Konstruksi,laki-laki,3170155,orang
Buruh/Tukang/industri/Konstruksi,perempuan,128727,orang
Kelompok Profesi,laki-laki,646744,orang
Kelompok Profesi,perempuan,46784,orang
Bidang Pendidikan dan Kesehatan,laki-laki,101854,orang
Bidang Pendidikan dan Kesehatan,perempuan,18208,orang
Rohaniawan,laki-laki,15581,orang
Rohaniawan,perempuan,327,orang
Pertania/Perikanan/Perternakan,laki-laki,1068979,orang
Pertania/Perikanan/Perternakan,perempuan,88455,orang
Pejabat Negra/Daerah/Dewan/Pemerintahan,laki-laki,31.29,orang
Pejabat Negra/Daerah/Dewan/Pemerintahan,perempuan,728,orang
Wiraswasta,laki-laki,3549849,orang
Wiraswasta,perempuan,118502,orang
Lainnya,laki-laki,7951,orang
Lainnya,perempuan,2308,orang
