kegiatan,penduduk_usia_kerja,satuan
ANGKATAN KERJA,20150094,orang
BEKERJA,18321108,orang
PENGANGGUR,1828986,orang
BUKAN ANGKATAN KERJA,11444047,orang
SEKOLAH,2541018,orang
MENGURUS RUMAH TANGGA,7343026,orang
LAINNYA,1560003,orang
