kegiatan,penduduk_usia_kerja,satuan
ANGKATAN KERJA,21075899,orang
BEKERJA,19202038,orang
PENGANGGUR,1873861,orang
BUKAN ANGKATAN KERJA,13671419,orang
SEKOLAH,3136149,orang
MENGURUS RUMAH TANGGA,8725263,orang
LAINNYA,1810007,orang
