provinsi,kode_kota_kabupaten,kota_kabupaten,jumlah_tanaman_mangga,satuan
Jawa Barat,3204,kab. bandung,121172,pohon
Jawa Barat,3217,kab. bandung barat,67703,pohon
Jawa Barat,3216,kab. bekasi,141205,pohon
Jawa Barat,3201,kab. bogor,120112,pohon
Jawa Barat,3207,kab. ciamis,238685,pohon
Jawa Barat,3203,kab. cianjur,293742,pohon
Jawa Barat,3209,kab. cirebon,939207,pohon
Jawa Barat,3205,kab. garut,382741,pohon
Jawa Barat,3212,kab. indramayu,858655,pohon
Jawa Barat,3215,kab. karawang,425010,pohon
Jawa Barat,3208,kab. kuningan,751069,pohon
Jawa Barat,3210,kab. majalengka,1109102,pohon
Jawa Barat,3218,kab. pangandaran,73543,pohon
Jawa Barat,3214,kab. purwakarta,110204,pohon
Jawa Barat,3213,kab. subang,264271,pohon
Jawa Barat,3202,kab. sukabumi,281732,pohon
Jawa Barat,3211,kab. sumedang,760438,pohon
Jawa Barat,3206,kab. tasikmalaya,409514,pohon
Jawa Barat,3273,kota bandung,22231,pohon
Jawa Barat,3279,kota banjar,52223,pohon
Jawa Barat,3275,kota bekasi,19749,pohon
Jawa Barat,3271,kota bogor,14741,pohon
Jawa Barat,3277,kota cimahi,290,pohon
Jawa Barat,3274,kota cirebon,104226,pohon
Jawa Barat,3276,kota depok,2656,pohon
Jawa Barat,3272,kota sukabumi,421,pohon
Jawa Barat,3278,kota tasikmalaya,59265,pohon
