﻿belanja;murni;perubahan;realisasi;satuan
belanja tidak langsung;19626961424258;21686438822087;19256280145688;rupiah
belanja pegawai;1750356995858;1778690298085;1671229142927;rupiah
belanja bunga;0;0;0;rupiah
belanja subsidi;10000000000;20000000000;18990870500;rupiah
belanja hibah;7154144995000;7643860862000;6826862952000;rupiah
belanja bantuan sosial;12000000000;17000000000;3048750000;rupiah
belanja bagi hasil;6134790633400;6597238772635;6406192657944;rupiah
belanja bantuan keuangan;4448668800000;5544350892459;4329955772317;rupiah
belanja tidak terduga;117000000000;85297996908;0;rupiah
