pengadilan_agama,cacat badan,satuan 
BANDUNG,,orang
BEKASI,,orang
BOGOR,,orang
CIAMIS,,orang
CIANJUR,,orang
CIBADAK,1,orang
CIBINONG,,orang
CIKARANG,,orang
CIMAHI,,orang
CIREBON,2,orang
DEPOK,2,orang
GARUT,,orang
INDRAMAYU,2,orang
KARAWANG,,orang
KOTA BANJAR,,orang
KOTA TASIKMALAYA,,orang
KUNINGAN,1,orang
MAJALENGKA,2,orang
PURWAKARTA,,orang
SUBANG,,orang
SUKABUMI,,orang
SUMBER,,orang
SUMEDANG,,orang
TASIKMALAYA,2,orang
