golongan_umur;pengangguran_terbuka;satuan
15-19;612197;jiwa
20-24;467226;jiwa
25-29;274981;jiwa
30-34;151609;jiwa
35-39;75773;jiwa
40-44;71245;jiwa
45-49;54647;jiwa
50-54;63567;jiwa
55-59;33798;jiwa
60+;23943;jiwa
