provinsi,kode_kota_kabupaten,nama_kota_kabupaten,jenis_komoditi,luas_tanam,Satuan
jawa barat,3201,kab. bogor,Ubi Jalar,2952,hektar
jawa barat,3201,kab. bogor,Ubi Kayu,4496,hektar
jawa barat,3202,kab. sukabumi,Ubi Jalar,710,hektar
jawa barat,3202,kab. sukabumi,Ubi Kayu,5062,hektar
jawa barat,3203,kab. cianjur,Ubi Jalar,430,hektar
jawa barat,3203,kab. cianjur,Ubi Kayu,4431,hektar
jawa barat,3204,kab. bandung,Ubi Jalar,1541,hektar
jawa barat,3204,kab. bandung,Ubi Kayu,4243,hektar
jawa barat,3205,kab. garut,Ubi Jalar,6656,hektar
jawa barat,3205,kab. garut,Ubi Kayu,25594,hektar
jawa barat,3206,kab. tasikmalaya,Ubi Jalar,1143,hektar
jawa barat,3206,kab. tasikmalaya,Ubi Kayu,4746,hektar
jawa barat,3207,kab. ciamis,Ubi Jalar,309,hektar
jawa barat,3207,kab. ciamis,Ubi Kayu,2612,hektar
jawa barat,3208,kab. kuningan,Ubi Jalar,5320,hektar
jawa barat,3208,kab. kuningan,Ubi Kayu,1825,hektar
jawa barat,3209,kab. cirebon,Ubi Jalar,125,hektar
jawa barat,3209,kab. cirebon,Ubi Kayu,14,hektar
jawa barat,3210,kab. majalengka,Ubi Jalar,523,hektar
jawa barat,3210,kab. majalengka,Ubi Kayu,218,hektar
jawa barat,3211,kab. sumedang,Ubi Jalar,807,hektar
jawa barat,3211,kab. sumedang,Ubi Kayu,7929,hektar
jawa barat,3212,kab. indramayu,Ubi Jalar,3,hektar
jawa barat,3212,kab. indramayu,Ubi Kayu,127,hektar
jawa barat,3213,kab. subang,Ubi Jalar,84,hektar
jawa barat,3213,kab. subang,Ubi Kayu,565,hektar
jawa barat,3214,kab. purwakarta,Ubi Jalar,241,hektar
jawa barat,3214,kab. purwakarta,Ubi Kayu,1318,hektar
jawa barat,3215,kab. karawang,Ubi Jalar,3,hektar
jawa barat,3215,kab. karawang,Ubi Kayu,101,hektar
jawa barat,3216,kab. bekasi,Ubi Jalar,25,hektar
jawa barat,3216,kab. bekasi,Ubi Kayu,95,hektar
jawa barat,3217,kab. bandung barat,Ubi Jalar,326,hektar
jawa barat,3217,kab. bandung barat,Ubi Kayu,2417,hektar
jawa barat,3218,kab. pangandaran,Ubi Jalar,68,hektar
jawa barat,3218,kab. pangandaran,Ubi Kayu,60,hektar
jawa barat,3271,kota bogor,Ubi Jalar,114,hektar
jawa barat,3271,kota bogor,Ubi Kayu,194,hektar
jawa barat,3272,kota sukabumi,Ubi Jalar,24,hektar
jawa barat,3272,kota sukabumi,Ubi Kayu,14,hektar
jawa barat,3273,kota bandung,Ubi Jalar,7,hektar
jawa barat,3273,kota bandung,Ubi Kayu,15,hektar
jawa barat,3274,kota cirebon,Ubi Jalar,0,hektar
jawa barat,3274,kota cirebon,Ubi Kayu,4,hektar
jawa barat,3275,kota bekasi,Ubi Jalar,8,hektar
jawa barat,3275,kota bekasi,Ubi Kayu,22,hektar
jawa barat,3276,kota depok,Ubi Jalar,20,hektar
jawa barat,3276,kota depok,Ubi Kayu,45,hektar
jawa barat,3277,kota cimahi,Ubi Jalar,13,hektar
jawa barat,3277,kota cimahi,Ubi Kayu,30,hektar
jawa barat,3278,kota tasikmalaya,Ubi Jalar,50,hektar
jawa barat,3278,kota tasikmalaya,Ubi Kayu,90,hektar
jawa barat,3279,kota banjar,Ubi Jalar,60,hektar
jawa barat,3279,kota banjar,Ubi Kayu,85,hektar
