﻿provinsi,kode_kota_kabupaten,nama_kota_kabupaten,Attribute,jumlah,satuan
JAWA BARAT,3204,KAB. BANDUNG,KAMPUNG ADAT,7,BUAH
JAWA BARAT,3204,KAB. BANDUNG,BENTUK RUMAH ADAT,0,BUAH
JAWA BARAT,3204,KAB. BANDUNG,TEMPAT TINGGAL,3,BUAH
JAWA BARAT,3204,KAB. BANDUNG,BALAI PERTEMUAN,3,BUAH
JAWA BARAT,3204,KAB. BANDUNG,RUMAH IBADAH,2,BUAH
JAWA BARAT,3204,KAB. BANDUNG,UPACARA ADAT BESAR,5,BUAH
JAWA BARAT,3217,KAB. BANDUNG BARAT,KAMPUNG ADAT,0,BUAH
JAWA BARAT,3217,KAB. BANDUNG BARAT,BENTUK RUMAH ADAT,0,BUAH
JAWA BARAT,3217,KAB. BANDUNG BARAT,TEMPAT TINGGAL,0,BUAH
JAWA BARAT,3217,KAB. BANDUNG BARAT,BALAI PERTEMUAN,0,BUAH
JAWA BARAT,3217,KAB. BANDUNG BARAT,RUMAH IBADAH,0,BUAH
JAWA BARAT,3217,KAB. BANDUNG BARAT,UPACARA ADAT BESAR,0,BUAH
JAWA BARAT,3216,KAB. BEKASI,KAMPUNG ADAT,0,BUAH
JAWA BARAT,3216,KAB. BEKASI,BENTUK RUMAH ADAT,0,BUAH
JAWA BARAT,3216,KAB. BEKASI,TEMPAT TINGGAL,0,BUAH
JAWA BARAT,3216,KAB. BEKASI,BALAI PERTEMUAN,0,BUAH
JAWA BARAT,3216,KAB. BEKASI,RUMAH IBADAH,0,BUAH
JAWA BARAT,3216,KAB. BEKASI,UPACARA ADAT BESAR,0,BUAH
JAWA BARAT,3201,KAB. BOGOR,KAMPUNG ADAT,1,BUAH
JAWA BARAT,3201,KAB. BOGOR,BENTUK RUMAH ADAT,0,BUAH
JAWA BARAT,3201,KAB. BOGOR,TEMPAT TINGGAL,0,BUAH
JAWA BARAT,3201,KAB. BOGOR,BALAI PERTEMUAN,1,BUAH
JAWA BARAT,3201,KAB. BOGOR,RUMAH IBADAH,1,BUAH
JAWA BARAT,3201,KAB. BOGOR,UPACARA ADAT BESAR,2,BUAH
JAWA BARAT,3207,KAB. CIAMIS,KAMPUNG ADAT,4,BUAH
JAWA BARAT,3207,KAB. CIAMIS,TEMPAT TINGGAL,141,BUAH
JAWA BARAT,3207,KAB. CIAMIS,BALAI PERTEMUAN,4,BUAH
JAWA BARAT,3207,KAB. CIAMIS,RUMAH IBADAH,6,BUAH
JAWA BARAT,3207,KAB. CIAMIS,UPACARA ADAT BESAR,2,BUAH
JAWA BARAT,3203,KAB. CIANJUR,KAMPUNG ADAT,0,BUAH
JAWA BARAT,3203,KAB. CIANJUR,BENTUK RUMAH ADAT,0,BUAH
JAWA BARAT,3203,KAB. CIANJUR,TEMPAT TINGGAL,0,BUAH
JAWA BARAT,3203,KAB. CIANJUR,BALAI PERTEMUAN,0,BUAH
JAWA BARAT,3203,KAB. CIANJUR,RUMAH IBADAH,0,BUAH
JAWA BARAT,3203,KAB. CIANJUR,UPACARA ADAT BESAR,1,BUAH
JAWA BARAT,3209,KAB. CIREBON,KAMPUNG ADAT,0,BUAH
JAWA BARAT,3209,KAB. CIREBON,BENTUK RUMAH ADAT,0,BUAH
JAWA BARAT,3209,KAB. CIREBON,TEMPAT TINGGAL,0,BUAH
JAWA BARAT,3209,KAB. CIREBON,BALAI PERTEMUAN,0,BUAH
JAWA BARAT,3209,KAB. CIREBON,RUMAH IBADAH,0,BUAH
JAWA BARAT,3209,KAB. CIREBON,UPACARA ADAT BESAR,1,BUAH
JAWA BARAT,3205,KAB. GARUT,KAMPUNG ADAT,2,BUAH
JAWA BARAT,3205,KAB. GARUT,BENTUK RUMAH ADAT,0,BUAH
JAWA BARAT,3205,KAB. GARUT,TEMPAT TINGGAL,56,BUAH
JAWA BARAT,3205,KAB. GARUT,BALAI PERTEMUAN,1,BUAH
JAWA BARAT,3205,KAB. GARUT,RUMAH IBADAH,2,BUAH
JAWA BARAT,3205,KAB. GARUT,UPACARA ADAT BESAR,2,BUAH
JAWA BARAT,3212,KAB. INDRAMAYU,KAMPUNG ADAT,0,BUAH
JAWA BARAT,3212,KAB. INDRAMAYU,BENTUK RUMAH ADAT,0,BUAH
JAWA BARAT,3212,KAB. INDRAMAYU,TEMPAT TINGGAL,0,BUAH
JAWA BARAT,3212,KAB. INDRAMAYU,BALAI PERTEMUAN,0,BUAH
JAWA BARAT,3212,KAB. INDRAMAYU,RUMAH IBADAH,0,BUAH
JAWA BARAT,3212,KAB. INDRAMAYU,UPACARA ADAT BESAR,4,BUAH
JAWA BARAT,3215,KAB. KARAWANG,KAMPUNG ADAT,0,BUAH
JAWA BARAT,3215,KAB. KARAWANG,BENTUK RUMAH ADAT,0,BUAH
JAWA BARAT,3215,KAB. KARAWANG,TEMPAT TINGGAL,0,BUAH
JAWA BARAT,3215,KAB. KARAWANG,BALAI PERTEMUAN,0,BUAH
JAWA BARAT,3215,KAB. KARAWANG,RUMAH IBADAH,0,BUAH
JAWA BARAT,3215,KAB. KARAWANG,UPACARA ADAT BESAR,3,BUAH
JAWA BARAT,3208,KAB. KUNINGAN,KAMPUNG ADAT,0,BUAH
JAWA BARAT,3208,KAB. KUNINGAN,BENTUK RUMAH ADAT,1,BUAH
JAWA BARAT,3208,KAB. KUNINGAN,TEMPAT TINGGAL,1,BUAH
JAWA BARAT,3208,KAB. KUNINGAN,BALAI PERTEMUAN,0,BUAH
JAWA BARAT,3208,KAB. KUNINGAN,RUMAH IBADAH,0,BUAH
JAWA BARAT,3208,KAB. KUNINGAN,UPACARA ADAT BESAR,4,BUAH
JAWA BARAT,3210,KAB. MAJALENGKA,KAMPUNG ADAT,0,BUAH
JAWA BARAT,3210,KAB. MAJALENGKA,BENTUK RUMAH ADAT,0,BUAH
JAWA BARAT,3210,KAB. MAJALENGKA,TEMPAT TINGGAL,0,BUAH
JAWA BARAT,3210,KAB. MAJALENGKA,BALAI PERTEMUAN,0,BUAH
JAWA BARAT,3210,KAB. MAJALENGKA,RUMAH IBADAH,0,BUAH
JAWA BARAT,3210,KAB. MAJALENGKA,UPACARA ADAT BESAR,0,BUAH
JAWA BARAT,3214,KAB. PURWAKARTA,KAMPUNG ADAT,0,BUAH
JAWA BARAT,3214,KAB. PURWAKARTA,BENTUK RUMAH ADAT,1,BUAH
JAWA BARAT,3214,KAB. PURWAKARTA,TEMPAT TINGGAL,1,BUAH
JAWA BARAT,3214,KAB. PURWAKARTA,BALAI PERTEMUAN,0,BUAH
JAWA BARAT,3214,KAB. PURWAKARTA,RUMAH IBADAH,0,BUAH
JAWA BARAT,3214,KAB. PURWAKARTA,UPACARA ADAT BESAR,1,BUAH
JAWA BARAT,3213,KAB. SUBANG,KAMPUNG ADAT,0,BUAH
JAWA BARAT,3213,KAB. SUBANG,BENTUK RUMAH ADAT,0,BUAH
JAWA BARAT,3213,KAB. SUBANG,TEMPAT TINGGAL,1,BUAH
JAWA BARAT,3213,KAB. SUBANG,BALAI PERTEMUAN,3,BUAH
JAWA BARAT,3213,KAB. SUBANG,RUMAH IBADAH,2,BUAH
JAWA BARAT,3213,KAB. SUBANG,UPACARA ADAT BESAR,1,BUAH
JAWA BARAT,3202,KAB. SUKABUMI,KAMPUNG ADAT,4,BUAH
JAWA BARAT,3202,KAB. SUKABUMI,BENTUK RUMAH ADAT,2,BUAH
JAWA BARAT,3202,KAB. SUKABUMI,TEMPAT TINGGAL,656,BUAH
JAWA BARAT,3202,KAB. SUKABUMI,BALAI PERTEMUAN,4,BUAH
JAWA BARAT,3202,KAB. SUKABUMI,RUMAH IBADAH,4,BUAH
JAWA BARAT,3202,KAB. SUKABUMI,UPACARA ADAT BESAR,3,BUAH
JAWA BARAT,3211,KAB. SUMEDANG,KAMPUNG ADAT,0,BUAH
JAWA BARAT,3211,KAB. SUMEDANG,BENTUK RUMAH ADAT,0,BUAH
JAWA BARAT,3211,KAB. SUMEDANG,TEMPAT TINGGAL,0,BUAH
JAWA BARAT,3211,KAB. SUMEDANG,BALAI PERTEMUAN,0,BUAH
JAWA BARAT,3211,KAB. SUMEDANG,RUMAH IBADAH,0,BUAH
JAWA BARAT,3211,KAB. SUMEDANG,UPACARA ADAT BESAR,0,BUAH
JAWA BARAT,3206,KAB. TASIKMALAYA,KAMPUNG ADAT,1,BUAH
JAWA BARAT,3206,KAB. TASIKMALAYA,BENTUK RUMAH ADAT,0,BUAH
JAWA BARAT,3206,KAB. TASIKMALAYA,TEMPAT TINGGAL,106,BUAH
JAWA BARAT,3206,KAB. TASIKMALAYA,BALAI PERTEMUAN,1,BUAH
JAWA BARAT,3206,KAB. TASIKMALAYA,RUMAH IBADAH,1,BUAH
JAWA BARAT,3206,KAB. TASIKMALAYA,UPACARA ADAT BESAR,7,BUAH
JAWA BARAT,3273,KOTA BANDUNG,KAMPUNG ADAT,0,BUAH
JAWA BARAT,3273,KOTA BANDUNG,BENTUK RUMAH ADAT,0,BUAH
JAWA BARAT,3273,KOTA BANDUNG,TEMPAT TINGGAL,0,BUAH
JAWA BARAT,3273,KOTA BANDUNG,BALAI PERTEMUAN,0,BUAH
JAWA BARAT,3273,KOTA BANDUNG,RUMAH IBADAH,0,BUAH
JAWA BARAT,3273,KOTA BANDUNG,UPACARA ADAT BESAR,0,BUAH
JAWA BARAT,3279,KOTA BANJAR,KAMPUNG ADAT,0,BUAH
JAWA BARAT,3279,KOTA BANJAR,BENTUK RUMAH ADAT,0,BUAH
JAWA BARAT,3279,KOTA BANJAR,TEMPAT TINGGAL,0,BUAH
JAWA BARAT,3279,KOTA BANJAR,BALAI PERTEMUAN,0,BUAH
JAWA BARAT,3279,KOTA BANJAR,RUMAH IBADAH,0,BUAH
JAWA BARAT,3279,KOTA BANJAR,UPACARA ADAT BESAR,0,BUAH
JAWA BARAT,3275,KOTA BEKASI,KAMPUNG ADAT,7,BUAH
JAWA BARAT,3275,KOTA BEKASI,BENTUK RUMAH ADAT,0,BUAH
JAWA BARAT,3275,KOTA BEKASI,TEMPAT TINGGAL,145,BUAH
JAWA BARAT,3275,KOTA BEKASI,BALAI PERTEMUAN,0,BUAH
JAWA BARAT,3275,KOTA BEKASI,RUMAH IBADAH,0,BUAH
JAWA BARAT,3275,KOTA BEKASI,UPACARA ADAT BESAR,0,BUAH
JAWA BARAT,3271,KOTA BOGOR,KAMPUNG ADAT,0,BUAH
JAWA BARAT,3271,KOTA BOGOR,BENTUK RUMAH ADAT,0,BUAH
JAWA BARAT,3271,KOTA BOGOR,TEMPAT TINGGAL,0,BUAH
JAWA BARAT,3271,KOTA BOGOR,BALAI PERTEMUAN,0,BUAH
JAWA BARAT,3271,KOTA BOGOR,RUMAH IBADAH,0,BUAH
JAWA BARAT,3271,KOTA BOGOR,UPACARA ADAT BESAR,0,BUAH
JAWA BARAT,3277,KOTA CIMAHI,KAMPUNG ADAT,1,BUAH
JAWA BARAT,3277,KOTA CIMAHI,BENTUK RUMAH ADAT,0,BUAH
JAWA BARAT,3277,KOTA CIMAHI,TEMPAT TINGGAL,1,BUAH
JAWA BARAT,3277,KOTA CIMAHI,BALAI PERTEMUAN,1,BUAH
JAWA BARAT,3277,KOTA CIMAHI,RUMAH IBADAH,1,BUAH
JAWA BARAT,3277,KOTA CIMAHI,UPACARA ADAT BESAR,0,BUAH
JAWA BARAT,3274,KOTA CIREBON,KAMPUNG ADAT,0,BUAH
JAWA BARAT,3274,KOTA CIREBON,BENTUK RUMAH ADAT,0,BUAH
JAWA BARAT,3274,KOTA CIREBON,TEMPAT TINGGAL,0,BUAH
JAWA BARAT,3274,KOTA CIREBON,BALAI PERTEMUAN,0,BUAH
JAWA BARAT,3274,KOTA CIREBON,RUMAH IBADAH,0,BUAH
JAWA BARAT,3274,KOTA CIREBON,UPACARA ADAT BESAR,2,BUAH
JAWA BARAT,3276,KOTA DEPOK,KAMPUNG ADAT,0,BUAH
JAWA BARAT,3276,KOTA DEPOK,BENTUK RUMAH ADAT,0,BUAH
JAWA BARAT,3276,KOTA DEPOK,TEMPAT TINGGAL,0,BUAH
JAWA BARAT,3276,KOTA DEPOK,BALAI PERTEMUAN,0,BUAH
JAWA BARAT,3276,KOTA DEPOK,RUMAH IBADAH,0,BUAH
JAWA BARAT,3276,KOTA DEPOK,UPACARA ADAT BESAR,0,BUAH
JAWA BARAT,3272,KOTA SUKABUMI,KAMPUNG ADAT,0,BUAH
JAWA BARAT,3272,KOTA SUKABUMI,BENTUK RUMAH ADAT,0,BUAH
JAWA BARAT,3272,KOTA SUKABUMI,TEMPAT TINGGAL,0,BUAH
JAWA BARAT,3272,KOTA SUKABUMI,BALAI PERTEMUAN,0,BUAH
JAWA BARAT,3272,KOTA SUKABUMI,RUMAH IBADAH,0,BUAH
JAWA BARAT,3272,KOTA SUKABUMI,UPACARA ADAT BESAR,0,BUAH
JAWA BARAT,3278,KOTA TASIKMALAYA,KAMPUNG ADAT,0,BUAH
JAWA BARAT,3278,KOTA TASIKMALAYA,BENTUK RUMAH ADAT,0,BUAH
JAWA BARAT,3278,KOTA TASIKMALAYA,TEMPAT TINGGAL,0,BUAH
JAWA BARAT,3278,KOTA TASIKMALAYA,BALAI PERTEMUAN,0,BUAH
JAWA BARAT,3278,KOTA TASIKMALAYA,RUMAH IBADAH,0,BUAH
JAWA BARAT,3278,KOTA TASIKMALAYA,UPACARA ADAT BESAR,0,BUAH
