﻿provinsi,kode_kota_kabupaten,nama_kota_kabupaten,jenis_kelamin,jumlah,satuan
JAWA BARAT,3204,KAB. BANDUNG,LAKI-LAKI,9483,JIWA
JAWA BARAT,3204,KAB. BANDUNG,PEREMPUAN,9854,JIWA
JAWA BARAT,3217,KAB. BANDUNG BARAT,LAKI-LAKI,8483,JIWA
JAWA BARAT,3217,KAB. BANDUNG BARAT,PEREMPUAN,7930,JIWA
JAWA BARAT,3216,KAB. BEKASI,LAKI-LAKI,12198,JIWA
JAWA BARAT,3216,KAB. BEKASI,PEREMPUAN,10479,JIWA
JAWA BARAT,3201,KAB. BOGOR,LAKI-LAKI,26783,JIWA
JAWA BARAT,3201,KAB. BOGOR,PEREMPUAN,25401,JIWA
JAWA BARAT,3207,KAB. CIAMIS,LAKI-LAKI,4191,JIWA
JAWA BARAT,3207,KAB. CIAMIS,PEREMPUAN,3839,JIWA
JAWA BARAT,3203,KAB. CIANJUR,LAKI-LAKI,9624,JIWA
JAWA BARAT,3203,KAB. CIANJUR,PEREMPUAN,9168,JIWA
JAWA BARAT,3209,KAB. CIREBON,LAKI-LAKI,0,JIWA
JAWA BARAT,3209,KAB. CIREBON,PEREMPUAN,0,JIWA
JAWA BARAT,3205,KAB. GARUT,LAKI-LAKI,5435,JIWA
JAWA BARAT,3205,KAB. GARUT,PEREMPUAN,5238,JIWA
JAWA BARAT,3212,KAB. INDRAMAYU,LAKI-LAKI,0,JIWA
JAWA BARAT,3212,KAB. INDRAMAYU,PEREMPUAN,0,JIWA
JAWA BARAT,3215,KAB. KARAWANG,LAKI-LAKI,0,JIWA
JAWA BARAT,3215,KAB. KARAWANG,PEREMPUAN,0,JIWA
JAWA BARAT,3208,KAB. KUNINGAN,LAKI-LAKI,0,JIWA
JAWA BARAT,3208,KAB. KUNINGAN,PEREMPUAN,0,JIWA
JAWA BARAT,3210,KAB. MAJALENGKA,LAKI-LAKI,8119,JIWA
JAWA BARAT,3210,KAB. MAJALENGKA,PEREMPUAN,7762,JIWA
JAWA BARAT,3218,KAB. PANGANDARAN,LAKI-LAKI,2551,JIWA
JAWA BARAT,3218,KAB. PANGANDARAN,PEREMPUAN,2477,JIWA
JAWA BARAT,3214,KAB. PURWAKARTA,LAKI-LAKI,3625,JIWA
JAWA BARAT,3214,KAB. PURWAKARTA,PEREMPUAN,3693,JIWA
JAWA BARAT,3213,KAB. SUBANG,LAKI-LAKI,7126,JIWA
JAWA BARAT,3213,KAB. SUBANG,PEREMPUAN,7566,JIWA
JAWA BARAT,3202,KAB. SUKABUMI,LAKI-LAKI,15458,JIWA
JAWA BARAT,3202,KAB. SUKABUMI,PEREMPUAN,15703,JIWA
JAWA BARAT,3211,KAB. SUMEDANG,LAKI-LAKI,5663,JIWA
JAWA BARAT,3211,KAB. SUMEDANG,PEREMPUAN,5469,JIWA
JAWA BARAT,3206,KAB. TASIKMALAYA,LAKI-LAKI,15851,JIWA
JAWA BARAT,3206,KAB. TASIKMALAYA,PEREMPUAN,15230,JIWA
JAWA BARAT,3273,KOTA BANDUNG,LAKI-LAKI,9587,JIWA
JAWA BARAT,3273,KOTA BANDUNG,PEREMPUAN,8787,JIWA
JAWA BARAT,3279,KOTA BANJAR,LAKI-LAKI,0,JIWA
JAWA BARAT,3279,KOTA BANJAR,PEREMPUAN,0,JIWA
JAWA BARAT,3275,KOTA BEKASI,LAKI-LAKI,4165,JIWA
JAWA BARAT,3275,KOTA BEKASI,PEREMPUAN,4106,JIWA
JAWA BARAT,3271,KOTA BOGOR,LAKI-LAKI,5047,JIWA
JAWA BARAT,3271,KOTA BOGOR,PEREMPUAN,4690,JIWA
JAWA BARAT,3277,KOTA CIMAHI,LAKI-LAKI,980,JIWA
JAWA BARAT,3277,KOTA CIMAHI,PEREMPUAN,900,JIWA
JAWA BARAT,3274,KOTA CIREBON,LAKI-LAKI,1412,JIWA
JAWA BARAT,3274,KOTA CIREBON,PEREMPUAN,1285,JIWA
JAWA BARAT,3276,KOTA DEPOK,LAKI-LAKI,7584,JIWA
JAWA BARAT,3276,KOTA DEPOK,PEREMPUAN,6756,JIWA
JAWA BARAT,3272,KOTA SUKABUMI,LAKI-LAKI,1901,JIWA
JAWA BARAT,3272,KOTA SUKABUMI,PEREMPUAN,1884,JIWA
JAWA BARAT,3278,KOTA TASIKMALAYA,LAKI-LAKI,3254,JIWA
JAWA BARAT,3278,KOTA TASIKMALAYA,PEREMPUAN,3118,JIWA
