
==== export ====
export PGPASSWORD=JabarJuara2019 && pg_dump -O -h localhost -U postgres ckan_default_hack > tmp/2019-09-18-14.26.56-ckan_default_hack.sql
export PGPASSWORD=JabarJuara2019 && pg_dump -O -h localhost -U postgres ckan_default_hack | gzip -9 > tmp/2019-09-18-14.26.56-ckan_default_hack.tar.gz


=== import ===
export PGPASSWORD=JabarJuara2019 &&  psql -h localhost -U postgres test < tmp/2019-09-18-14.26.56-ckan_default.sql 
export PGPASSWORD=password &&  gunzip < postgres/20190919-092443/2019-09-19-09.24.50-test.tar.gz | psql -h localhost -U postgres test

