{
  "connection": "default",
  "collectionName": "dinas",
  "info": {
    "name": "dinas",
    "description": ""
  },
  "options": {
    "increments": true,
    "timestamps": true,
    "comment": ""
  },
  "attributes": {
    "nama": {
      "type": "string"
    },
    "jenis": {
      "type": "string"
    },
    "alamat": {
      "type": "string"
    },
    "web": {
      "type": "string"
    },
    "no_telp": {
      "type": "string"
    },
    "is_deleted": {
      "type": "boolean"
    },
    "kode_skpd": {
      "type": "string"
    }
  }
}