{
  "connection": "default",
  "collectionName": "periodeanggarans",
  "info": {
    "name": "periodeanggaran",
    "description": ""
  },
  "options": {
    "increments": true,
    "timestamps": true,
    "comment": ""
  },
  "attributes": {
    "program": {
      "model": "program"
    },
    "periode": {
      "model": "periode"
    },
    "apbd": {
      "type": "biginteger"
    },
    "sumber": {
      "type": "string"
    },
    "is_deleted": {
      "type": "boolean"
    },
    "keterangan": {
      "type": "text"
    },
    "nonapbd": {
      "type": "biginteger"
    },
    "apbd_detail": {
      "type": "json"
    },
    "nonapbd_detail": {
      "type": "json"
    }
  }
}