{
  "connection": "default",
  "collectionName": "logs",
  "info": {
    "name": "log",
    "description": ""
  },
  "options": {
    "increments": true,
    "timestamps": true,
    "comment": ""
  },
  "attributes": {
    "user": {
      "model": "user",
      "plugin": "users-permissions"
    },
    "program": {
      "model": "program"
    },
    "description": {
      "type": "text"
    },
    "type": {
      "type": "string"
    },
    "type_id": {
      "type": "integer"
    },
    "datetime": {
      "type": "date"
    }
  }
}