{
  "connection": "default",
  "collectionName": "kegiatans",
  "info": {
    "name": "kegiatan",
    "description": ""
  },
  "options": {
    "increments": true,
    "timestamps": true,
    "comment": ""
  },
  "attributes": {
    "kegiatan": {
      "type": "string"
    },
    "anggaran": {
      "type": "biginteger"
    },
    "is_deleted": {
      "type": "boolean"
    },
    "program": {
      "model": "program"
    },
    "periodeanggaran": {
      "model": "periodeanggaran"
    },
    "periode": {
      "model": "periode"
    },
    "keterangan": {
      "type": "text"
    },
    "kode_rekening": {
      "type": "string"
    },
    "kategori": {
      "type": "string"
    },
    "no": {
      "type": "string"
    },
    "kodeskpd": {
      "type": "string"
    },
    "kodeskpdsub": {
      "type": "string"
    },
    "kodeprogram": {
      "type": "string"
    },
    "kodekegiatan": {
      "type": "string"
    },
    "namaskpd": {
      "type": "string"
    },
    "namaskpdsub": {
      "type": "string"
    },
    "namaprogram": {
      "type": "string"
    },
    "namakegiatan": {
      "type": "string"
    },
    "pagu": {
      "type": "biginteger"
    },
    "idbl": {
      "type": "string"
    },
    "non_namakegiatan": {
      "type": "string"
    },
    "non_pagu": {
      "type": "biginteger"
    },
    "non_sumber": {
      "type": "string"
    }
  }
}