{
  "routes": [
    {
      "method": "GET",
      "path": "/ikus",
      "handler": "Iku.find",
      "config": {
        "policies": []
      }
    },
    {
      "method": "GET",
      "path": "/ikus/count",
      "handler": "Iku.count",
      "config": {
        "policies": []
      }
    },
    {
      "method": "GET",
      "path": "/ikus/:id",
      "handler": "Iku.findOne",
      "config": {
        "policies": []
      }
    },
    {
      "method": "POST",
      "path": "/ikus",
      "handler": "Iku.create",
      "config": {
        "policies": []
      }
    },
    {
      "method": "PUT",
      "path": "/ikus/:id",
      "handler": "Iku.update",
      "config": {
        "policies": []
      }
    },
    {
      "method": "DELETE",
      "path": "/ikus/:id",
      "handler": "Iku.destroy",
      "config": {
        "policies": []
      }
    }
  ]
}