{
  "connection": "default",
  "collectionName": "notifications",
  "info": {
    "name": "notification",
    "description": ""
  },
  "options": {
    "increments": true,
    "timestamps": true,
    "comment": ""
  },
  "attributes": {
    "type": {
      "type": "string"
    },
    "type_id": {
      "type": "integer"
    },
    "pengirim": {
      "model": "user",
      "plugin": "users-permissions"
    },
    "penerima": {
      "model": "user",
      "plugin": "users-permissions"
    },
    "text": {
      "type": "text"
    },
    "is_read": {
      "type": "boolean"
    },
    "judul": {
      "type": "text"
    }
  }
}