{
  "name": "icons",
  "$schema": "../../node_modules/nx/schemas/project-schema.json",
  "projectType": "library",
  "sourceRoot": "libs/icons/src",
  "prefix": "jds-bi",
  "targets": {
    "build": {
      "executor": "@nx/angular:package",
      "outputs": ["{workspaceRoot}/dist/{projectRoot}"],
      "options": {
        "project": "libs/icons/ng-package.json"
      },
      "configurations": {
        "production": {
          "tsConfig": "libs/icons/tsconfig.lib.prod.json"
        },
        "development": {
          "tsConfig": "libs/icons/tsconfig.lib.json"
        }
      },
      "defaultConfiguration": "production"
    },
    "test": {
      "executor": "@nx/jest:jest",
      "outputs": ["{workspaceRoot}/coverage/{projectRoot}"],
      "options": {
        "jestConfig": "libs/icons/jest.config.ts"
      }
    },
    "lint": {
      "executor": "@nx/eslint:lint",
      "outputs": ["{options.outputFile}"]
    }
  },
  "tags": ["lib:icons"]
}
