https://gitlab.com/jdsalaro-group/public/sast-superset-ruleset/-/raw/main/one.yml
https://gitlab.com/jdsalaro-group/public/sast-superset-ruleset/-/raw/main/two.yml
https://gitlab.com/jdsalaro-group/public/sast-superset-ruleset/-/raw/main/three.yml
https://gitlab.com/jdsalaro-group/public/sast-superset-ruleset/-/raw/main/four.yml
https://gitlab.com/jdsalaro-group/public/sast-superset-ruleset/-/raw/main/five.yml
