{
  "BurstVersion": "ca476d69-fe22-4646-a548-58dcbc78df4c",
  "Assemblies": [
    {
      "FullName": "Unity.Burst, Version=0.0.0.0, Culture=neutral, PublicKeyToken=null",
      "LastWriteTime": "2022-05-27T00:09:54.5700749Z"
    },
    {
      "FullName": "mscorlib, Version=4.0.0.0, Culture=neutral, PublicKeyToken=b77a5c561934e089",
      "LastWriteTime": "2021-10-13T09:19:28Z"
    },
    {
      "FullName": "UnityEngine.CoreModule, Version=0.0.0.0, Culture=neutral, PublicKeyToken=null",
      "LastWriteTime": "2021-10-13T09:24:42Z"
    },
    {
      "FullName": "Unity.Barracuda, Version=1.0.4.0, Culture=neutral, PublicKeyToken=null",
      "LastWriteTime": "2022-05-27T00:09:56.0217154Z"
    },
    {
      "FullName": "mscorlib, Version=2.0.0.0, Culture=neutral, PublicKeyToken=b77a5c561934e089",
      "LastWriteTime": "2021-10-13T09:19:28Z"
    },
    {
      "FullName": "Unity.Barracuda.BurstBLAS, Version=0.0.0.0, Culture=neutral, PublicKeyToken=null",
      "LastWriteTime": "2022-05-27T00:09:57.2249385Z"
    }
  ],
  "Functions": [
    {
      "FullName": "System.Int32 Unity.Burst.Intrinsics.X86::DoGetCSRTrampoline()",
      "ModuleOptionsHash": 11834165633931345063,
      "ModuleHash": "8f6913f35dd6b1becc27997b546c8327",
      "LinkName": "CDCA4A5193BE5947",
      "AssemblyDependencyIndices": [
        0,
        1
      ]
    },
    {
      "FullName": "System.Void Unity.Burst.Intrinsics.X86::DoSetCSRTrampoline(System.Int32)",
      "ModuleOptionsHash": 11834165633931345063,
      "ModuleHash": "4122d86090472f836e0e6e7c7dc32d7b",
      "LinkName": "801E9A000BB37B05",
      "AssemblyDependencyIndices": [
        0,
        1
      ]
    },
    {
      "FullName": "System.Void Unity.Jobs.IJobExtensions/JobStruct`1<Unity.Barracuda.BurstCPUOps/ZeroBroadcastJob>::Execute(T&,System.IntPtr,System.IntPtr,Unity.Jobs.LowLevel.Unsafe.JobRanges&,System.Int32)",
      "ModuleOptionsHash": 11834165633931345063,
      "ModuleHash": "6dc473554abf87302f2eed8dc7ea911c",
      "LinkName": "910D00C108C9ACD0",
      "AssemblyDependencyIndices": [
        2,
        3,
        4,
        1
      ]
    },
    {
      "FullName": "System.Void Unity.Jobs.IJobExtensions/JobStruct`1<Unity.Barracuda.BurstCPUOps/CopyJob>::Execute(T&,System.IntPtr,System.IntPtr,Unity.Jobs.LowLevel.Unsafe.JobRanges&,System.Int32)",
      "ModuleOptionsHash": 11834165633931345063,
      "ModuleHash": "bcbd98f97b76899034877031eae07ec2",
      "LinkName": "B679BCA8E17D18D0",
      "AssemblyDependencyIndices": [
        2,
        3,
        4,
        1
      ]
    },
    {
      "FullName": "System.Void Unity.Jobs.IJobExtensions/JobStruct`1<Unity.Barracuda.BurstCPUOps/VectorBroadcastJob>::Execute(T&,System.IntPtr,System.IntPtr,Unity.Jobs.LowLevel.Unsafe.JobRanges&,System.Int32)",
      "ModuleOptionsHash": 11834165633931345063,
      "ModuleHash": "e286cf50d47d01a10a456394a8621b9b",
      "LinkName": "D5A0000F5DA19291",
      "AssemblyDependencyIndices": [
        2,
        3,
        4,
        1
      ]
    },
    {
      "FullName": "System.Void Unity.Jobs.IJobParallelForExtensions/ParallelForJobStruct`1<Unity.Barracuda.BurstCPUOps/MatrixMultiplyJob>::Execute(T&,System.IntPtr,System.IntPtr,Unity.Jobs.LowLevel.Unsafe.JobRanges&,System.Int32)",
      "ModuleOptionsHash": 11834165633931345063,
      "ModuleHash": "760986ee7ce2be25241f6a44b002d52c",
      "LinkName": "8D6F6DCD15B44F73",
      "AssemblyDependencyIndices": [
        2,
        3,
        4,
        1
      ]
    },
    {
      "FullName": "System.Void Unity.Jobs.IJobParallelForExtensions/ParallelForJobStruct`1<Unity.Barracuda.BurstCPUOps/Im2ColSliceJob>::Execute(T&,System.IntPtr,System.IntPtr,Unity.Jobs.LowLevel.Unsafe.JobRanges&,System.Int32)",
      "ModuleOptionsHash": 11834165633931345063,
      "ModuleHash": "e74c83d5963011e690cc082b1a33dcea",
      "LinkName": "B824C0B409F58C83",
      "AssemblyDependencyIndices": [
        2,
        3,
        4,
        1
      ]
    },
    {
      "FullName": "System.Void Unity.Jobs.IJobParallelForExtensions/ParallelForJobStruct`1<Unity.Barracuda.BurstCPUOps/MaxPool2DJob>::Execute(T&,System.IntPtr,System.IntPtr,Unity.Jobs.LowLevel.Unsafe.JobRanges&,System.Int32)",
      "ModuleOptionsHash": 11834165633931345063,
      "ModuleHash": "d6b70b7f2b6989f201e44b9bbc0a62af",
      "LinkName": "3394B91F49D06D92",
      "AssemblyDependencyIndices": [
        2,
        3,
        4,
        1
      ]
    },
    {
      "FullName": "System.Void Unity.Jobs.IJobParallelForExtensions/ParallelForJobStruct`1<Unity.Barracuda.BurstCPUOps/AvgPool2DJob>::Execute(T&,System.IntPtr,System.IntPtr,Unity.Jobs.LowLevel.Unsafe.JobRanges&,System.Int32)",
      "ModuleOptionsHash": 11834165633931345063,
      "ModuleHash": "4eb6a2a1ada9252310fe71b42633370f",
      "LinkName": "313A68853B777E5A",
      "AssemblyDependencyIndices": [
        2,
        3,
        4,
        1
      ]
    },
    {
      "FullName": "System.Void Unity.Jobs.IJobParallelForExtensions/ParallelForJobStruct`1<Unity.Barracuda.BurstCPUOps/DepthwiseConv2DJob>::Execute(T&,System.IntPtr,System.IntPtr,Unity.Jobs.LowLevel.Unsafe.JobRanges&,System.Int32)",
      "ModuleOptionsHash": 11834165633931345063,
      "ModuleHash": "e47dfb4f021dc84f1f07e8e5738c6ba4",
      "LinkName": "AA0F871A8BB4A883",
      "AssemblyDependencyIndices": [
        2,
        3,
        4,
        1
      ]
    },
    {
      "FullName": "System.Void Unity.Jobs.IJobParallelForExtensions/ParallelForJobStruct`1<Unity.Barracuda.BurstCPUOps/PReluJob>::Execute(T&,System.IntPtr,System.IntPtr,Unity.Jobs.LowLevel.Unsafe.JobRanges&,System.Int32)",
      "ModuleOptionsHash": 11834165633931345063,
      "ModuleHash": "0f4ca4dc4a34de1cda096385b6ddc03b",
      "LinkName": "24B0918AA5EF1534",
      "AssemblyDependencyIndices": [
        2,
        3,
        4,
        1
      ]
    },
    {
      "FullName": "System.Void Unity.Jobs.IJobParallelForExtensions/ParallelForJobStruct`1<Unity.Barracuda.BurstCPUOps/ReluJob>::Execute(T&,System.IntPtr,System.IntPtr,Unity.Jobs.LowLevel.Unsafe.JobRanges&,System.Int32)",
      "ModuleOptionsHash": 11834165633931345063,
      "ModuleHash": "6be01ec2c1bb981e623fd84fdc7f051d",
      "LinkName": "D29B837DCCC6D22B",
      "AssemblyDependencyIndices": [
        2,
        3,
        4,
        1
      ]
    },
    {
      "FullName": "System.Void Unity.Jobs.IJobParallelForExtensions/ParallelForJobStruct`1<Unity.Barracuda.BurstCPUOps/Relu6Job>::Execute(T&,System.IntPtr,System.IntPtr,Unity.Jobs.LowLevel.Unsafe.JobRanges&,System.Int32)",
      "ModuleOptionsHash": 11834165633931345063,
      "ModuleHash": "e0d4893a8a79d9d0c473e5f5668be095",
      "LinkName": "52A4DDF6AB76E296",
      "AssemblyDependencyIndices": [
        2,
        3,
        4,
        1
      ]
    },
    {
      "FullName": "System.Void Unity.Jobs.IJobParallelForExtensions/ParallelForJobStruct`1<Unity.Barracuda.BurstCPUOps/LeakyReluJob>::Execute(T&,System.IntPtr,System.IntPtr,Unity.Jobs.LowLevel.Unsafe.JobRanges&,System.Int32)",
      "ModuleOptionsHash": 11834165633931345063,
      "ModuleHash": "89ed3e92fe1eb2abf5f1ee698517948d",
      "LinkName": "B9D49DB9D369D1F0",
      "AssemblyDependencyIndices": [
        2,
        3,
        4,
        1
      ]
    },
    {
      "FullName": "System.Void Unity.Jobs.IJobParallelForExtensions/ParallelForJobStruct`1<Unity.Barracuda.BurstCPUOps/TanhJob>::Execute(T&,System.IntPtr,System.IntPtr,Unity.Jobs.LowLevel.Unsafe.JobRanges&,System.Int32)",
      "ModuleOptionsHash": 11834165633931345063,
      "ModuleHash": "ba98e4dda8139ce7f3d47359837eba7d",
      "LinkName": "E336F1255447094F",
      "AssemblyDependencyIndices": [
        2,
        3,
        4,
        1
      ]
    },
    {
      "FullName": "System.Void Unity.Jobs.IJobParallelForExtensions/ParallelForJobStruct`1<Unity.Barracuda.BurstCPUOps/SigmoidJob>::Execute(T&,System.IntPtr,System.IntPtr,Unity.Jobs.LowLevel.Unsafe.JobRanges&,System.Int32)",
      "ModuleOptionsHash": 11834165633931345063,
      "ModuleHash": "c608cedb968974d7844c2a19149492f4",
      "LinkName": "24BB5E262A7A6771",
      "AssemblyDependencyIndices": [
        2,
        3,
        4,
        1
      ]
    },
    {
      "FullName": "System.Void Unity.Jobs.IJobParallelForExtensions/ParallelForJobStruct`1<Unity.Barracuda.BurstCPUOps/EluJob>::Execute(T&,System.IntPtr,System.IntPtr,Unity.Jobs.LowLevel.Unsafe.JobRanges&,System.Int32)",
      "ModuleOptionsHash": 11834165633931345063,
      "ModuleHash": "faeac20dbb2de0482604c086cac8c962",
      "LinkName": "168BEA8744ADAA01",
      "AssemblyDependencyIndices": [
        2,
        3,
        4,
        1
      ]
    },
    {
      "FullName": "System.Void Unity.Jobs.IJobParallelForExtensions/ParallelForJobStruct`1<Unity.Barracuda.BurstCPUOps/SeluJob>::Execute(T&,System.IntPtr,System.IntPtr,Unity.Jobs.LowLevel.Unsafe.JobRanges&,System.Int32)",
      "ModuleOptionsHash": 11834165633931345063,
      "ModuleHash": "7a2859beab4d49619529751ce1ff898d",
      "LinkName": "80A3E748AFAE0D83",
      "AssemblyDependencyIndices": [
        2,
        3,
        4,
        1
      ]
    },
    {
      "FullName": "System.Void Unity.Jobs.IJobParallelForExtensions/ParallelForJobStruct`1<Unity.Barracuda.BurstCPUOps/SwishJob>::Execute(T&,System.IntPtr,System.IntPtr,Unity.Jobs.LowLevel.Unsafe.JobRanges&,System.Int32)",
      "ModuleOptionsHash": 11834165633931345063,
      "ModuleHash": "f4ba7886c1da1266c7bc176512266b42",
      "LinkName": "096BF73F62FE1FA1",
      "AssemblyDependencyIndices": [
        2,
        3,
        4,
        1
      ]
    },
    {
      "FullName": "System.Void Unity.Jobs.IJobParallelForExtensions/ParallelForJobStruct`1<Unity.Barracuda.BurstCPUOps/AbsJob>::Execute(T&,System.IntPtr,System.IntPtr,Unity.Jobs.LowLevel.Unsafe.JobRanges&,System.Int32)",
      "ModuleOptionsHash": 11834165633931345063,
      "ModuleHash": "0b1a1fdd54f06c28f6df0bac5086621f",
      "LinkName": "1596E79BBDF6EDAA",
      "AssemblyDependencyIndices": [
        2,
        3,
        4,
        1
      ]
    },
    {
      "FullName": "System.Void Unity.Jobs.IJobParallelForExtensions/ParallelForJobStruct`1<Unity.Barracuda.BurstCPUOps/NegJob>::Execute(T&,System.IntPtr,System.IntPtr,Unity.Jobs.LowLevel.Unsafe.JobRanges&,System.Int32)",
      "ModuleOptionsHash": 11834165633931345063,
      "ModuleHash": "43ea63bde07734be7517316e278825ab",
      "LinkName": "225270EB7456AFC4",
      "AssemblyDependencyIndices": [
        2,
        3,
        4,
        1
      ]
    },
    {
      "FullName": "System.Void Unity.Jobs.IJobParallelForExtensions/ParallelForJobStruct`1<Unity.Barracuda.BurstCPUOps/CeilJob>::Execute(T&,System.IntPtr,System.IntPtr,Unity.Jobs.LowLevel.Unsafe.JobRanges&,System.Int32)",
      "ModuleOptionsHash": 11834165633931345063,
      "ModuleHash": "21b844b11253aee0d7d1329b60129c0b",
      "LinkName": "DF0A618A96217DB1",
      "AssemblyDependencyIndices": [
        2,
        3,
        4,
        1
      ]
    },
    {
      "FullName": "System.Void Unity.Jobs.IJobParallelForExtensions/ParallelForJobStruct`1<Unity.Barracuda.BurstCPUOps/ClipJob>::Execute(T&,System.IntPtr,System.IntPtr,Unity.Jobs.LowLevel.Unsafe.JobRanges&,System.Int32)",
      "ModuleOptionsHash": 11834165633931345063,
      "ModuleHash": "8ce5aef38574a5df8179378c66731480",
      "LinkName": "AA760BB35BC56CD2",
      "AssemblyDependencyIndices": [
        2,
        3,
        4,
        1
      ]
    },
    {
      "FullName": "System.Void Unity.Jobs.IJobParallelForExtensions/ParallelForJobStruct`1<Unity.Barracuda.BurstCPUOps/FloorJob>::Execute(T&,System.IntPtr,System.IntPtr,Unity.Jobs.LowLevel.Unsafe.JobRanges&,System.Int32)",
      "ModuleOptionsHash": 11834165633931345063,
      "ModuleHash": "43806e773d426c75aeb41552fe506b3d",
      "LinkName": "6459F0003119A3FC",
      "AssemblyDependencyIndices": [
        2,
        3,
        4,
        1
      ]
    },
    {
      "FullName": "System.Void Unity.Jobs.IJobParallelForExtensions/ParallelForJobStruct`1<Unity.Barracuda.BurstCPUOps/ReciprocalJob>::Execute(T&,System.IntPtr,System.IntPtr,Unity.Jobs.LowLevel.Unsafe.JobRanges&,System.Int32)",
      "ModuleOptionsHash": 11834165633931345063,
      "ModuleHash": "74f4095be0150a41a0f2238fe0338059",
      "LinkName": "2BA24D47C373BB20",
      "AssemblyDependencyIndices": [
        2,
        3,
        4,
        1
      ]
    },
    {
      "FullName": "System.Void Unity.Jobs.IJobParallelForExtensions/ParallelForJobStruct`1<Unity.Barracuda.BurstCPUOps/PowJob>::Execute(T&,System.IntPtr,System.IntPtr,Unity.Jobs.LowLevel.Unsafe.JobRanges&,System.Int32)",
      "ModuleOptionsHash": 11834165633931345063,
      "ModuleHash": "b9e5c17693e419bed985dcb4fc1ad825",
      "LinkName": "5EACBCB05AA5B6EA",
      "AssemblyDependencyIndices": [
        2,
        3,
        4,
        1
      ]
    },
    {
      "FullName": "System.Void Unity.Jobs.IJobParallelForExtensions/ParallelForJobStruct`1<Unity.Barracuda.BurstCPUOps/ExpJob>::Execute(T&,System.IntPtr,System.IntPtr,Unity.Jobs.LowLevel.Unsafe.JobRanges&,System.Int32)",
      "ModuleOptionsHash": 11834165633931345063,
      "ModuleHash": "e7108691db614212908911c6242c5f0d",
      "LinkName": "53FE69074E5AFF26",
      "AssemblyDependencyIndices": [
        2,
        3,
        4,
        1
      ]
    },
    {
      "FullName": "System.Void Unity.Jobs.IJobParallelForExtensions/ParallelForJobStruct`1<Unity.Barracuda.BurstCPUOps/LogJob>::Execute(T&,System.IntPtr,System.IntPtr,Unity.Jobs.LowLevel.Unsafe.JobRanges&,System.Int32)",
      "ModuleOptionsHash": 11834165633931345063,
      "ModuleHash": "6eabda798c66b8e0f3986cf973dcd9d9",
      "LinkName": "AEB3E7DD999C9405",
      "AssemblyDependencyIndices": [
        2,
        3,
        4,
        1
      ]
    },
    {
      "FullName": "System.Void Unity.Jobs.IJobParallelForExtensions/ParallelForJobStruct`1<Unity.Barracuda.BurstCPUOps/SqrtJob>::Execute(T&,System.IntPtr,System.IntPtr,Unity.Jobs.LowLevel.Unsafe.JobRanges&,System.Int32)",
      "ModuleOptionsHash": 11834165633931345063,
      "ModuleHash": "53d7527baba4dfe9fc2182deefb5e8ac",
      "LinkName": "F7FC08D6F57C6B4A",
      "AssemblyDependencyIndices": [
        2,
        3,
        4,
        1
      ]
    },
    {
      "FullName": "System.Void Unity.Jobs.IJobParallelForExtensions/ParallelForJobStruct`1<Unity.Barracuda.BurstCPUOps/ElementwiseAddJob>::Execute(T&,System.IntPtr,System.IntPtr,Unity.Jobs.LowLevel.Unsafe.JobRanges&,System.Int32)",
      "ModuleOptionsHash": 11834165633931345063,
      "ModuleHash": "52d641997bf44d66c4defd8ddaabb738",
      "LinkName": "73D837D44C9129F8",
      "AssemblyDependencyIndices": [
        2,
        3,
        4,
        1
      ]
    },
    {
      "FullName": "System.Void Unity.Jobs.IJobParallelForExtensions/ParallelForJobStruct`1<Unity.Barracuda.BurstCPUOps/ElementwiseMulJob>::Execute(T&,System.IntPtr,System.IntPtr,Unity.Jobs.LowLevel.Unsafe.JobRanges&,System.Int32)",
      "ModuleOptionsHash": 11834165633931345063,
      "ModuleHash": "fea254dcaa04a9b46dd60b70412f256c",
      "LinkName": "427F5B21E871F545",
      "AssemblyDependencyIndices": [
        2,
        3,
        4,
        1
      ]
    },
    {
      "FullName": "System.Void Unity.Jobs.IJobParallelForExtensions/ParallelForJobStruct`1<Unity.Barracuda.BurstCPUOps/ElementwiseDivJob>::Execute(T&,System.IntPtr,System.IntPtr,Unity.Jobs.LowLevel.Unsafe.JobRanges&,System.Int32)",
      "ModuleOptionsHash": 11834165633931345063,
      "ModuleHash": "e1a28b3367315cfd0dd94d4926e47fd0",
      "LinkName": "9BEDBF035B3630A9",
      "AssemblyDependencyIndices": [
        2,
        3,
        4,
        1
      ]
    },
    {
      "FullName": "System.Void Unity.Jobs.IJobParallelForExtensions/ParallelForJobStruct`1<Unity.Barracuda.BurstCPUOps/ElementwisePowJob>::Execute(T&,System.IntPtr,System.IntPtr,Unity.Jobs.LowLevel.Unsafe.JobRanges&,System.Int32)",
      "ModuleOptionsHash": 11834165633931345063,
      "ModuleHash": "cc25528cc5224fd9bf5fe50ef03bb05c",
      "LinkName": "EBDC09FD6D23BFE6",
      "AssemblyDependencyIndices": [
        2,
        3,
        4,
        1
      ]
    },
    {
      "FullName": "System.Void Unity.Jobs.IJobParallelForExtensions/ParallelForJobStruct`1<Unity.Barracuda.BurstCPUOps/ElementwiseMaxJob>::Execute(T&,System.IntPtr,System.IntPtr,Unity.Jobs.LowLevel.Unsafe.JobRanges&,System.Int32)",
      "ModuleOptionsHash": 11834165633931345063,
      "ModuleHash": "02d1bd7af1e022fbe02ad0e75004f578",
      "LinkName": "958C0DFC34D3F565",
      "AssemblyDependencyIndices": [
        2,
        3,
        4,
        1
      ]
    },
    {
      "FullName": "System.Void Unity.Jobs.IJobParallelForExtensions/ParallelForJobStruct`1<Unity.Barracuda.BurstCPUOps/ElementwiseMinJob>::Execute(T&,System.IntPtr,System.IntPtr,Unity.Jobs.LowLevel.Unsafe.JobRanges&,System.Int32)",
      "ModuleOptionsHash": 11834165633931345063,
      "ModuleHash": "18a1a515dd12efa275a62b174fc615de",
      "LinkName": "C16D14639DD0F1A5",
      "AssemblyDependencyIndices": [
        2,
        3,
        4,
        1
      ]
    },
    {
      "FullName": "System.Void Unity.Jobs.IJobParallelForExtensions/ParallelForJobStruct`1<Unity.Barracuda.BurstCPUOps/ScalarBroadcastAddJob>::Execute(T&,System.IntPtr,System.IntPtr,Unity.Jobs.LowLevel.Unsafe.JobRanges&,System.Int32)",
      "ModuleOptionsHash": 11834165633931345063,
      "ModuleHash": "e26f85b0ef5b193606f3d8566f56511c",
      "LinkName": "0C2FED748A17D8BA",
      "AssemblyDependencyIndices": [
        2,
        3,
        4,
        1
      ]
    },
    {
      "FullName": "System.Void Unity.Jobs.IJobParallelForExtensions/ParallelForJobStruct`1<Unity.Barracuda.BurstCPUOps/ScalarBroadcastMulJob>::Execute(T&,System.IntPtr,System.IntPtr,Unity.Jobs.LowLevel.Unsafe.JobRanges&,System.Int32)",
      "ModuleOptionsHash": 11834165633931345063,
      "ModuleHash": "8f060ce46e89531a6d0bbad403eb3b26",
      "LinkName": "DCC5777A35090D19",
      "AssemblyDependencyIndices": [
        2,
        3,
        4,
        1
      ]
    },
    {
      "FullName": "System.Void Unity.Jobs.IJobParallelForExtensions/ParallelForJobStruct`1<Unity.Barracuda.BurstCPUOps/ScalarBroadcastDivJob>::Execute(T&,System.IntPtr,System.IntPtr,Unity.Jobs.LowLevel.Unsafe.JobRanges&,System.Int32)",
      "ModuleOptionsHash": 11834165633931345063,
      "ModuleHash": "525fd36f957ea2582b2dae8b2f038c06",
      "LinkName": "AE9993A767C1986F",
      "AssemblyDependencyIndices": [
        2,
        3,
        4,
        1
      ]
    },
    {
      "FullName": "System.Void Unity.Jobs.IJobParallelForExtensions/ParallelForJobStruct`1<Unity.Barracuda.BurstCPUOps/ScalarBroadcastBiasedExpJob>::Execute(T&,System.IntPtr,System.IntPtr,Unity.Jobs.LowLevel.Unsafe.JobRanges&,System.Int32)",
      "ModuleOptionsHash": 11834165633931345063,
      "ModuleHash": "682e16174e8e8d4080638f0ab9074ca3",
      "LinkName": "1C1DEF0231D49606",
      "AssemblyDependencyIndices": [
        2,
        3,
        4,
        1
      ]
    },
    {
      "FullName": "System.Void Unity.Jobs.IJobParallelForExtensions/ParallelForJobStruct`1<Unity.Barracuda.BurstCPUOps/GenericBroadcastJob>::Execute(T&,System.IntPtr,System.IntPtr,Unity.Jobs.LowLevel.Unsafe.JobRanges&,System.Int32)",
      "ModuleOptionsHash": 11834165633931345063,
      "ModuleHash": "f564a53417902d7c294e0de78eb37209",
      "LinkName": "06E4EC6E77A3806F",
      "AssemblyDependencyIndices": [
        2,
        3,
        4,
        1
      ]
    },
    {
      "FullName": "System.Void Unity.Jobs.IJobParallelForExtensions/ParallelForJobStruct`1<Unity.Barracuda.BurstCPUOps/GenericBroadcastAddJob>::Execute(T&,System.IntPtr,System.IntPtr,Unity.Jobs.LowLevel.Unsafe.JobRanges&,System.Int32)",
      "ModuleOptionsHash": 11834165633931345063,
      "ModuleHash": "b897e69f1945a4beb6b0431cca67a9a2",
      "LinkName": "04CBCDACE8954735",
      "AssemblyDependencyIndices": [
        2,
        3,
        4,
        1
      ]
    },
    {
      "FullName": "System.Void Unity.Jobs.IJobParallelForExtensions/ParallelForJobStruct`1<Unity.Barracuda.BurstCPUOps/GenericBroadcastMulJob>::Execute(T&,System.IntPtr,System.IntPtr,Unity.Jobs.LowLevel.Unsafe.JobRanges&,System.Int32)",
      "ModuleOptionsHash": 11834165633931345063,
      "ModuleHash": "ebcdd01b8899f28e734a427664f70185",
      "LinkName": "84244FFDA91F7398",
      "AssemblyDependencyIndices": [
        2,
        3,
        4,
        1
      ]
    },
    {
      "FullName": "System.Void Unity.Jobs.IJobParallelForExtensions/ParallelForJobStruct`1<Unity.Barracuda.BurstCPUOps/VectorBroadcastScaleBiasJob>::Execute(T&,System.IntPtr,System.IntPtr,Unity.Jobs.LowLevel.Unsafe.JobRanges&,System.Int32)",
      "ModuleOptionsHash": 11834165633931345063,
      "ModuleHash": "7d1422db791daee9e23dc50b7db9759a",
      "LinkName": "6EDF14E2D642A22B",
      "AssemblyDependencyIndices": [
        2,
        3,
        4,
        1
      ]
    },
    {
      "FullName": "System.Void Unity.Jobs.IJobParallelForExtensions/ParallelForJobStruct`1<Unity.Barracuda.BurstCPUOps/ChannelReduceMaxJob>::Execute(T&,System.IntPtr,System.IntPtr,Unity.Jobs.LowLevel.Unsafe.JobRanges&,System.Int32)",
      "ModuleOptionsHash": 11834165633931345063,
      "ModuleHash": "35e60cf7d14bf8b4266ac48a07cdff85",
      "LinkName": "6631CC41EDC565AC",
      "AssemblyDependencyIndices": [
        2,
        3,
        4,
        1
      ]
    },
    {
      "FullName": "System.Void Unity.Jobs.IJobParallelForExtensions/ParallelForJobStruct`1<Unity.Barracuda.BurstCPUOps/ChannelReduceSumJob>::Execute(T&,System.IntPtr,System.IntPtr,Unity.Jobs.LowLevel.Unsafe.JobRanges&,System.Int32)",
      "ModuleOptionsHash": 11834165633931345063,
      "ModuleHash": "4d501eba8d0665e7a89f299d3aecc072",
      "LinkName": "5FD03316AA17628C",
      "AssemblyDependencyIndices": [
        2,
        3,
        4,
        1
      ]
    },
    {
      "FullName": "System.Void Unity.Jobs.IJobParallelForExtensions/ParallelForJobStruct`1<Unity.Barracuda.UnsafeMatrixBlockMultiplyUnrolled8xhJob>::Execute(T&,System.IntPtr,System.IntPtr,Unity.Jobs.LowLevel.Unsafe.JobRanges&,System.Int32)",
      "ModuleOptionsHash": 11834165633931345063,
      "ModuleHash": "463a90a78e45ac70fc807a8861447bf2",
      "LinkName": "C1C6C1D457935913",
      "AssemblyDependencyIndices": [
        2,
        5,
        4,
        1,
        3
      ]
    }
  ]
}